##TITLE=1H_CA-8867-1x
 DMSO, 8 sc, 
 2.06.2021
##JCAMPDX= 6.0         $$ Bruker NMR JCAMP-DX V2.0
##DATA TYPE= NMR SPECTRUM
##DATA CLASS= NTUPLES
##ORIGIN= UXNMR, Bruker Analytische Messtechnik GmbH
##OWNER= root
$$ XWIN-NMR		Version 3.5
$$ Wed Jun  2 10:59:02 2021 Russian Standard Time (UT+4h)  she@DPX200
##.OBSERVE FREQUENCY= 200.131506
##.OBSERVE NUCLEUS= ^1H
##.ACQUISITION MODE= SIMULTANEOUS
##.ACQUISITION SCHEME= undefined
##.AVERAGES= 8
##.DIGITISER RES= 18
##SPECTROMETER/DATA SYSTEM= spect
##.PULSE SEQUENCE= zg30
##.SOLVENT NAME= CDCl3
##.SHIFT REFERENCE= (INTERNAL, CDCl3, 0, 15.9937)
##AUDIT TRAIL= $$ (NUMBER, WHEN, WHO, WHERE, WHAT)
$$ ##TITLE= Audit trail, XWIN-NMR		Version 3.5
$$ ##JCAMPDX= 5.01
$$ ##ORIGIN= Bruker BioSpin GmbH
$$ ##OWNER= she
$$ F:/spectra/data/she/nmr/H-F/1/pdata/1/auditp.txt
$$ ##AUDIT TRAIL=  $$ (NUMBER, WHEN, WHO, WHERE, WHAT)
(   1,<2021-06-02 10:57:21.81 +0400>,<she>,<DPX200>,
      <created by zg, POWCHK disabled, PULCHK disabled
       configuration hash MD5:
       00 E9 B6 7A A2 85 ED C7 34 08 36 98 17 FE 4E 26
       data hash MD5: 16K
       29 C0 B1 25 D7 EB 87 E7 8C 73 28 79 12 DC 87 7C>)
(   2,<2021-06-02 10:57:24.15 +0400>,<she>,<DPX200>,
      <Start of raw data processing
       efp BC_mod = 2 LB = 0.24 FT_mod = 6 PKNL = 1 PHC0 = -11571.61 PHC1 = 23.80099 SI = 16K 
       data hash MD5: 16K
       6B 5A A8 53 C2 59 D2 50 F1 56 32 86 FE EA 0B 9A>)
(   3,<2021-06-02 10:58:03.75 +0400>,<she>,<DPX200>,
      <pk PHC0 = 91.81352 PHC1 = -15.8 
       data hash MD5: 16K
       FF 9D F9 12 9F 9F DC 71 3C 2A 27 E1 A7 8F 82 44>)
(   4,<2021-06-02 10:58:07.89 +0400>,<she>,<DPX200>,
      <abs ABSG = 5 
       data hash MD5: 16K
       09 A8 80 39 9F 4C 36 B0 9B 33 48 8C E7 4F 5D 13>)
$$ ##END=
$$ 
$$ hash MD5
$$ B1 94 9B E5 C4 14 2B 5E 42 21 76 A4 A2 50 2E 39
##$RELAX= 
##$RELAX= 
##$RELAX= 
##$RELAX= 
##$RELAX= 
##$RELAX= 
$$ Bruker specific parameters
$$ --------------------------
##$DU= <F:/spectra>
##$EXPNO= 1
##$NAME= <H-F>
##$PROCNO= 1
##$TYPE= <nmr>
##$USER= <she>
##$AMP= (0..31)
100 100 100 100 100 100 100 100 100 100 100 100 100 100 100 100 100 100 
100 100 100 100 100 100 100 100 100 100 100 100 100 100 
##$AQSEQ= 0
##$AQ_mod= 1
##$AUNM= <au_zg>
##$AUTOPOS= <>
##$BF1= 200.13
##$BF2= 200.13
##$BF3= 200.13
##$BF4= 200.13
##$BF5= 200.13
##$BF6= 200.13
##$BF7= 200.13
##$BF8= 200.13
##$BYTORDA= 1
##$CFDGTYP= 0
##$CFRGTYP= 5
##$CHEMSTR= <none>
##$CNST= (0..31)
1 1 145 1 1 1 1 1 1 1 1 1 1 1 1 1 1 1 1 1 1 1 1 1 1 1 1 1 1 1 1 1 
##$CPDPRG= <>
##$CPDPRG1= <>
##$CPDPRG2= <>
##$CPDPRG3= <>
##$CPDPRG4= <mlev>
##$CPDPRG5= <mlev>
##$CPDPRG6= <mlev>
##$CPDPRG7= <mlev>
##$CPDPRG8= <mlev>
##$CPDPRGB= <>
##$CPDPRGT= <>
##$D= (0..31)
0 1.2 0 0 0 0 0 0 0 0.06 0 0.03 0 0 0 0 0.0002 0 0 0 0 0 0 0 0 0 0 0 0 
0 0 0 
##$DATE= 1622617041
##$DBL= (0..7)
120 120 120 120 120 120 120 120 
##$DBP= (0..7)
150 150 150 150 150 150 150 150 
##$DBP07= 0
##$DBPNAM0= <>
##$DBPNAM1= <>
##$DBPNAM2= <>
##$DBPNAM3= <>
##$DBPNAM4= <>
$$ [...]
##$SUBNAM3= <"">
##$SUBNAM4= <"">
##$SUBNAM5= <"">
##$SUBNAM6= <"">
##$SUBNAM7= <"">
##$SUBNAM8= <"">
##$SUBNAM9= <"">
##$SW= 16.9725357007746
##$SWIBOX= (0..15)
0 0 2 0 0 0 0 0 0 0 0 0 0 0 0 0 
##$SW_h= 3396.73913043478
##$TD= 16384
##$TD0= 1
##$TE= 0
##$TE2= 300
##$TE3= 300
##$TEG= 300
##$TL= (0..7)
0 120 120 120 120 120 120 120 
##$TP= (0..7)
150 150 150 150 150 150 150 150 
##$TP07= 0
##$TPNAME0= <>
##$TPNAME1= <>
##$TPNAME2= <>
##$TPNAME3= <>
##$TPNAME4= <>
##$TPNAME5= <>
##$TPNAME6= <>
##$TPNAME7= <>
##$TPOAL= (0..7)
0.5 0.5 0.5 0.5 0.5 0.5 0.5 0.5 
##$TPOFFS= (0..7)
0 0 0 0 0 0 0 0 
##$TUNHIN= 0
##$TUNHOUT= 0
##$TUNXOUT= 0
##$USERA1= <user>
##$USERA2= <user>
##$USERA3= <user>
##$USERA4= <user>
##$USERA5= <user>
##$V9= 5
##$VALIST= <valist>
##$VCLIST= <CCCCCCCCCCCCCCC>
##$VD= 0
##$VDLIST= <DDDDDDDDDDDDDDD>
##$VPLIST= <PPPPPPPPPPPPPPP>
##$VTLIST= <TTTTTTTTTTTTTTT>
##$WBST= 1024
##$WBSW= 4
##$XGAIN= (0..3)
0 0 0 0 
##$XL= 0
##$YL= 0
##$YMAX_a= 154018
##$YMIN_a= -150001
##$ZGOPTNS= <>
##$ZL1= 120
##$ZL2= 120
##$ZL3= 120
##$ZL4= 120
##$ABSF1= 15.97921
##$ABSF2= -0.9934521
##$ABSG= 5
##$ABSL= 3
##$ALPHA= 0
##$AQORDER= 0
##$ASSFAC= 0
##$ASSFACI= 0
##$ASSFACX= 0
##$ASSWID= 0
##$AUNMP= <proc_1d>
##$AZFE= 0.1
##$AZFW= 0.1
##$BCFW= 0
##$BC_mod= 2
##$BYTORDP= 0
##$COROFFS= 0
##$CY= -3
##$DATMOD= 1
##$DC= 0
##$DFILT= <>
##$DTYPP= 0
##$F1P= 0
##$F2P= 0
##$FCOR= 1
##$FTSIZE= 16384
##$FT_mod= 6
##$GAMMA= 0
##$GB= 0
##$INTBC= 1
##$INTSCL= 1.334414e-10
##$ISEN= 128
##$LB= 0.24
##$LEV0= 0
##$LPBIN= 0
##$MAXI= 10000
##$MC2= 0
##$MEAN= 0
##$ME_mod= 0
##$MI= 1.114404
##$NCOEF= 0
##$NC_proc= -8
##$NLEV= 6
##$NOISF1= 3.799351
##$NOISF2= 2.8
##$NSP= 0
##$NTH_PI= 0
##$NZP= 0
##$OFFSET= 15.99371
##$PC= 1
##$PHC0= -11479.8
##$PHC1= 8.000989
##$PH_mod= 1
##$PKNL= yes
##$PPARMOD= 0
##$PSCAL= 0
##$PSIGN= 0
##$REVERSE= no
##$SF= 200.1300035489
##$SI= 16384
##$SIGF1= 3
##$SIGF2= 2
##$SINO= 5.538805
##$SIOLD= 16384
##$SREGLST= <1H.CDCl3>
##$SSB= 0
##$STSI= 16384
##$STSR= 0
##$SW_p= 3396.73913043479
##$SYMM= 0
##$S_DEV= 0
##$TDeff= 16384
##$TDoff= 0
##$TI= <>
##$TILT= no
##$TM1= 0
##$TM2= 0
##$TOPLEV= 0
##$USERP1= <user>
##$USERP2= <user>
##$USERP3= <user>
##$USERP4= <user>
##$USERP5= <user>
##$WDW= 1
##$XDIM= 16384
##$YMAX_p= 277077059
##$YMIN_p= -1157904
$$ End of Bruker specific parameters
$$ ---------------------------------
##NTUPLES= NMR SPECTRUM
##VAR_NAME=  FREQUENCY,     SPECTRUM/REAL,   SPECTRUM/IMAG
##SYMBOL=    X,             R,               I
##VAR_TYPE=  INDEPENDENT,   DEPENDENT,       DEPENDENT
##VAR_FORM=  AFFN,          ASDF,            ASDF
##VAR_DIM=   16384,         16384,           16384
##UNITS=     HZ,            ARBITRARY UNITS, ARBITRARY UNITS
##FACTOR=    0.207333158178282, 1,           1
##FIRST=     3200.82115184522, 0,            0
##LAST=      -195.91797858957, 0,            0
##MIN=       -195.91797858957, -1157904,     0
##MAX=       3200.82115184522, 277077059,    0
$$ Real data points
##PAGE= N=1
##DATA TABLE= (X++(R..R)), XYDATA
$$ [...]
4497A0039450K85072j55164M3925k02637K61088K94040k4513j51890M43893J5358
4487A0848622j08302J34270J22485l0340n3662r5680J54950K05717j37991j5495
4477A1024574K11166M33746J48699k6536k77078o6872N74956J5769Q2555K75672
4467A2396651K55888J97949o9220K27310j03726L17284J24942M21789j4604J80218
4457A3934481j59174J83077N05558O790J71728l503l59429k7898L50716M51541
4447A5053887p8645M03766L20566N52706O8666k49556L36911K16300j70994P8417
4437A6532024N37934k9437J89608P3875r3947M39944K50999M62054M13861J37968
4427A8914883m6501L81873N77296N78984N5343L65162n0130l0767L62175M95594
$$ y = [10039450, 10324522, 10169358, 10213283, 10010646, 10271734, 10565774, 10541261, 10389371, 10833264, 10848622, 10740320, 10874590, 10997075, 10966735, 10913073, 10817393, 10972343, 11178060, 11040069, 11024574, 11235740, 11669486, 11818185, 11791649, 11514571, 11447699, 12022655, 12038424, 12120979, 12396651, 12652539, 12850488, 12781268, 13008578, 12904852, 13222136, 13347078, 13768867, 13754263, 13934481, 13775307, 13958384, 14463942, 14470732, 14642460, 14638957, 14279528, 14251630, 14602346, 15053887, 14975242, 15379008, 15699574, 16252280, 16320946, 16071390, 16408301, 16624601, 16453607, 16532024, 17069958, 17040521, 17230129, 17304004, 17210057, 17650001, 17901000, 18363054, 18776915, 18914883, 18868382, 19250255, 19827551, 20406535, 20461878, 20827040, 20776910, 20746143, 21108318, 21603912]
4417B1603912L42535N7155L60807R5714O33451N73243J28470N66136L89782K82415
4407B5033620P90891N33139Q49173M5221J20480O48865O05377M54589O58646L42155
4397C0082156N60413O10696P09188O63444N25506O70077J000883O89168L93643
4388C5905174O04762R10179N54930Q35586R06917N58171O79144O01081R94178
4379D2550122O97392P38544J370799R45704P16652R11832J188165Q65120Q19960
4370E0804290P32553Q68773J167510J020169O79390J003722J381475J053607R32417
4361E9643906J105738Q47161J139489J139045Q72147Q44119Q06622Q35823P80707
4352F8014757J210125J193691P57996Q05523Q07543N50868L18942M63783Q40849
$$ y = [21603912, 21946447, 22003602, 22364409, 22460123, 23093574, 23666817, 23795287, 24361423, 24751205, 25033620, 25824511, 26357650, 27206823, 27252044, 27372524, 28021389, 28626766, 29081355, 29740001, 30082156, 30642569, 31253265, 31962453, 32625897, 33151403, 33821480, 34822363, 35511531, 35905174, 36509936, 37420115, 37975045, 38810631, 39717548, 40275719, 40954863, 41555944, 42550122, 43247514, 43986058, 45356857, 46302561, 47019213, 47931045, 49119210, 49984330, 50804290, 51536843, 52405616, 53573126, 54593295, 55272685, 56276407, 57657882, 58711489, 59643906, 60749644, 61596805, 62736294, 63875339, 64747486, 65591605, 66398227, 67234050, 68014757, 69224882, 70418573, 71176569, 71982092, 72789635, 73340503, 73659445, 74123228, 74964077]
4343G4964077N87196M18196O62495L15948L95771M26864L02948K69760J8245K29457
4333G8590957L61932j58583L83191R0135j40416R2424j92522J37774m69535m25556
4323G8269801l10770k37483m97232n31357r25768m44398n21355o03935p05512
4314G3491991n17266r37432p38743q01651o62954p24437q34596k79194o24335
4305F7371383n86085n23483p19927m81678j133955p22063m69017p40207o68727
4296F1326241l05212o41947j055818p82863p52138n42200n81468q85219r43038
4287E4836338j86564o67350r96620p08586o63841l87381n64507n38469m86053
4278D9636967m69995j57725q38570m66711o77790m17561k59320k9509j94328m85309
$$ y = [74964077, 75551273, 75969469, 76631964, 76947912, 77343683, 77770547, 78073495, 78343255, 78361500, 78590957, 78952889, 78794306, 79177497, 79267632, 79127216, 79219640, 79027118, 79164892, 78695357, 78269801, 77959031, 77721548, 77224316, 76692959, 75767191, 75322793, 74801438, 74197503, 73491991, 72974725, 72037293, 71298550, 70496899, 69833945, 69109508, 68274912, 67995718, 67371383, 66785298, 66261815, 65541888, 65060210, 63926255, 63204192, 62735175, 61994968, 61326241, 61021029, 60379082, 59323264, 58540401, 57788263, 57246063, 56664595, 55779376, 54836338, 54649774, 53982424, 52985804, 52277218, 51613377, 51225996, 50661489, 50123020, 49636967, 49166972, 49009247, 48170677, 47703966, 47026176, 46608615, 46349295, 46319786, 46125458, 45640149]
4268D5640149k24849m22843m70531m00809k65310K6225N9847l97345o17904m9001
4258D2877629l5226J20446r774j62705m22408r072n20040K04882J60526r1408
4248D2112850k50533n26326j77300m39100q4989m5324J45410J5826k85791o01495
4238C9863228J27739o9576J78781q5401k01932L8098J96149n17717k36129K14073
4228C9507313j16294j50932J18197J86424K05156k1122l89586k98962m43629J04330
4218C8700895j79871K28814l3179l28213J60656k41935l34970L21950q3784k26194
4208C7984169j77791l28169j8841L8838m7241j72855l27311m4625j26737l5591
4198C6743846J69314l40378r3848j44426m6985k74738J05043K08364J3052l25317
$$ y = [45640149, 45415300, 44992457, 44521926, 44121117, 43855807, 43882032, 43941879, 43544534, 42926630, 42877629, 42842403, 42962849, 42953075, 42790370, 42367962, 42358890, 41838850, 42043732, 42204258, 42112850, 41862317, 41335991, 41158691, 40719591, 40634602, 40589278, 40734688, 40750514, 40464723, 39863228, 39990967, 39921391, 40100172, 40014771, 39812839, 39850937, 40047086, 39529369, 39293240, 39507313, 39391019, 39240087, 39358284, 39544708, 39749864, 39728742, 39339156, 39040194, 38596565, 38700895, 38521024, 38749838, 38716659, 38388446, 38549102, 38307167, 37972197, 38294147, 38210363, 37984169, 37806378, 37478209, 37459368, 37498206, 37450965, 37278110, 36950799, 36906174, 36779437, 36743846, 36913160, 36572782, 36478934, 36334508, 36287523, 36012785, 36117828, 36326192, 36339244, 36013927]
4188C6013927m80870J96515L89659j70931k56783k02000j18265j87969n6466j89782
4178C4937035r4999K15971l68698l52057l5758J19563L11658O0231o1821m17520
4168C4313605J73644j81518j92871n3291m3647K48439n40076R7345L62253J01042
4158C4284925N1265n4896l86584o4209L57724k20491k91045n7535m9451j77933
4148C3391770L561L7412k98799N28517j13878k98729J250K30528o3491j41252
4138C3276889j2696k38644L48670j22684P8585j67469K9862L93286j6971l7741
4128C3531087j201j0434L96441l51899k446l61711r6081N6733j23085L36751j68382
4117C3205773r3086k1298r7756k21036L00052p5017J72177j32908L80727k07723
$$ y = [36013927, 35533057, 35729572, 36119231, 35948300, 35691517, 35489517, 35371252, 35183283, 35126817, 34937035, 34842036, 35058007, 34689309, 34337252, 34301494, 34421057, 34732715, 34792946, 34731125, 34313605, 34487249, 34305731, 34112860, 34059569, 34015922, 34264361, 33724285, 33821630, 34183883, 34284925, 34336190, 34281294, 33894710, 33830501, 34188225, 33967734, 33676689, 33619154, 33569703, 33391770, 33395331, 33432743, 33133944, 33662461, 33548583, 33249854, 33251104, 33481632, 33418141, 33276889, 33264193, 33025549, 33374219, 33251535, 33330120, 33162651, 33192513, 33585799, 33568828, 33531087, 33529886, 33519452, 33915893, 33563994, 33561548, 33199837, 33103756, 33160489, 33037404, 33374155, 33205773, 33112687, 33091389, 32993633, 32772597, 33072649, 32997632, 33169809, 33036901, 33417628, 33209905]
4107C3209905j7108J62880R3464N5871K58247j94544K70324L28458m901J37021
4097C4299617J84809L01607J16469K78598J41435L56752K11037K44922P35860
4088C6871106K39119J87229K93656M61700L72994O65422M86989M14222O29267
4079D0621704Q19436M56126N30871N41010J69759O91520R93796J087614J89361
4070D6101197M91833P69303R54292N90692M81233O65253P08883N16806R04971
4061E2184463O19116J124229P43719L13884N25519J118914J126424O81106K76681
4052E8714055P80511P79500J013507M24017J032384Q20194P32071Q49379J2964
4043F5158582O30230O74161L76605M98557N50317J49215q038R8484K33758q5625
$$ y = [33209905, 33192797, 33355677, 33449141, 33505012, 33763259, 33568715, 33839039, 34167497, 34162596, 34299617, 34484426, 34786033, 34902502, 35181100, 35322535, 35679287, 35890324, 36135246, 36871106, 37110225, 37297454, 37591110, 38052810, 38425804, 39091226, 39578215, 39992437, 40621704, 41441140, 41897266, 42428137, 42969147, 43138906, 43830426, 44824222, 45911836, 46101197, 46593030, 47362333, 48316625, 48907317, 49388550, 50053803, 50762686, 51279492, 52184463, 52803579, 53927808, 54671527, 54985411, 55510930, 56629844, 57756268, 58437374, 58714055, 59494566, 60274066, 61287573, 61711590, 62743974, 63564168, 64296239, 65145618, 65158582, 65788812, 66462973, 66839578, 67338135, 67888452, 68037667, 68029629, 68128113, 68361871, 68276246]
4033F8276246M4344o4151r9298k32961J92559P0734l17502N41j37203l15601k35939
4022F7181769K26554k27758m81550O649j52749l86136o70704l64160m75393l06805
4012F4349717l64468m72688o62883o61171k68319n71769n50723k53996n07514
4003F0036186p38870l17019j88017l77377l00817m63000O9642k55546j54507j29146
3993E7181529r6569j73702J47540J7612j9646K03793r4716J84327M0923k90474
3983E7100617J76760K05842K57686J3778j71904j82149J71691K18000q7244p8370
3973E7624707n38862l71344m86645l63262l92370l31522m46841m14078j48265
3964E4131518k18836m60844p89018o42031l94135n02607o90148j38498k50665
$$ y = [68276246, 68320590, 68256439, 68157141, 67924180, 68116739, 68187473, 67869971, 67870512, 67733309, 67417708, 67181769, 67408323, 67180565, 66699015, 66705664, 66552915, 66166779, 65496075, 65131915, 64656522, 64349717, 63985249, 63512561, 62849678, 62188507, 61920188, 61348419, 60797696, 60543700, 60036186, 59297316, 58980297, 58792280, 58414903, 58114086, 57651086, 57720728, 57465182, 57310675, 57181529, 57084960, 56911258, 57058798, 57076410, 57056764, 57260557, 57165841, 57350168, 57391091, 57100617, 57277377, 57483219, 57740905, 57754683, 57582779, 57400630, 57572321, 57790321, 57703077, 57624707, 57085845, 56714501, 56227856, 55864594, 55472224, 55140702, 54693861, 54279783, 54131518, 53912682, 53451838, 52662820, 52020789, 51626654, 51124047, 50433899, 50295401, 50044736]
3955E0044736p53956o95110l25827l60495l31756K58945l68768m82055j07221
3946D6878493m43210m71442m20411o09055L7569m50581n29758m95847j85326p68765
3936D2541667o64472m05985p58794o61095l50109m06945q43239q09506m08034
3927C7233488n54969p61091l78358m71192r90857m55366p4370m38454m1698n52812
3917C2514321q98228o80532n4328J3017p96591q02328Q9038m27801q02700o44617
3907B7509251k10921m42978o22995n50300m28270m36288m97100k85021l86824
3898B3648554n20051M1976j43460m83926k72059n02512k26481m43556l77363j02239
3888B0618883j2849k48713l55467m64535l75231J68257l31542j95668K55958j39789
$$ y = [50044736, 49290780, 48595670, 48269843, 47909348, 47577592, 47836537, 47467769, 46985714, 46878493, 46435283, 45963841, 45543430, 44934375, 44971944, 44521363, 43991605, 43495758, 43310432, 42541667, 41877195, 41471210, 40712416, 40051321, 39701212, 39294267, 38451028, 37641522, 37233488, 36678519, 35917428, 35539070, 35067878, 34077021, 33621655, 33547285, 33108831, 33067133, 32514321, 31616093, 30935561, 30881233, 30894250, 30097659, 29295331, 29384369, 28956568, 28153868, 27509251, 27298330, 26855352, 26232357, 25682057, 25253787, 24817499, 24320399, 24035378, 23648554, 23128503, 23170479, 23027019, 22543093, 22271034, 21768522, 21542041, 21098485, 20721122, 20618883, 20606034, 20357321, 20001854, 19537319, 19162088, 19330345, 18998803, 18803135, 19059093, 18919304]
3878A8919304j81733j58481l282j842k36000m0550j89571k66977j64659k28232
3868A7447977K01144K53382j61073j08179p6167L35073o5707K85744k75343Q0322
3858A7917173K31385q3025l59583j31743R5927m270K87005J94695J67330Q3758
3848A8398652K93497m56747K27489J73821J76490J50542r9925J84086N62070L0642
3838A9640617j57302N87719K31621K49868N38532K82229L17730K41926j43935
3829B1789005M67431L15044O90380N60744k02168L73548N32931Q81921N62955
3820B5971791N77368M28980J63981M36613L04808M95001L43395J77082Q17162
3811B9716181P87024N09738M42542N24164N44657R8140K20058P98111P74945M43384
$$ y = [18919304, 18737571, 18579090, 18575808, 18573966, 18337966, 18297416, 18107845, 17840868, 17676209, 17447977, 17649121, 17902503, 17741430, 17633251, 17557084, 17892157, 17826450, 18112194, 17836851, 17917173, 18148558, 18065533, 17705950, 17574207, 17670134, 17665864, 17952869, 18147564, 18314894, 18398652, 18692149, 18235402, 18462891, 18636712, 18813202, 18963744, 18863819, 19047905, 19609975, 19640617, 19483315, 20071034, 20302655, 20552523, 21091055, 21373284, 21691014, 21932940, 21789005, 22256436, 22571480, 23261860, 23822604, 23620436, 23993984, 24526915, 25408836, 25971791, 26549159, 26978139, 27142120, 27578733, 27883541, 28378542, 28721937, 28899019, 29716181, 30503205, 31012943, 31455485, 31979649, 32524306, 32622446, 32842504, 33640615, 34415560, 34858944]
3801C4858944l75402N88901K31100J10327O99978O45497N76043J99474M87259
3792C8022121Q16420M31379L68153M14431P76719O35948N47532O12543L99073
3783D3024319R40773Q08639L89555P70903R22103P75451J005993J358653J019382
3774E1015771R03122Q61418R41116J558500J002050J206667J464600K033701J810001
3765F2796946J323525J672578K017690J848378J948594K289454K444827K555770
3757G8897762L056790L236027L157491L391243L425697L960420M581490N265844
3749A08972764N520326M961809N547003O450380O986352P079923P372073P142695
3741A60033325P104298P310061P022929O337086N842419M842564L304436J988998
$$ y = [34858944, 34483542, 35072443, 35303543, 35413870, 36113848, 36759345, 37335388, 37534862, 38022121, 38838541, 39269920, 39638073, 40052504, 40829223, 41465171, 42012703, 42625246, 43024319, 43965092, 44773731, 45163286, 45934189, 46856292, 47631743, 48637736, 49996389, 51015771, 51918893, 52780311, 53721427, 55279927, 56281977, 57488644, 58953244, 60986945, 62796946, 64120471, 65793049, 67810739, 69659117, 71607711, 73897165, 76341992, 78897762, 81954552, 85190579, 88348070, 91739313, 95165010, 99125430, 103706920, 108972764, 114493090, 119454899, 125001902, 131452282, 138438634, 145518557, 152890630, 160033325, 167137623, 174447684, 181470613, 187807699, 193650118, 198492682, 201797118, 203786116]
3733B03786116O50854p37082j997917l337420m742677n277636o072533o448433
3725A75823272o901246o978398p084260o785102o666388o420744o014132o296527
3717A22676475n416781n387083m975073m963793m867245l838490l355936l619829
3709H6252245l535734l213511k754107k708385k670212k541547k351354j889658
3701F4587737k413980j999669j812765k013549j876370k011766j289704j407272
3693D9762662j434180j285507j136937j041113j229527j251755j351599j271074
3685C9760970j049552j063920r02876r18606j251847q43193j164690m04004l71228
3676C1791054r05920p40820p04178m20571q10778p31476r36085l74067j32932
$$ y = [203786116, 204436970, 203699888, 201701971, 198364551, 193621874, 188344238, 182271705, 175823272, 168922026, 161943628, 154859368, 148074266, 141407878, 134987134, 128973002, 122676475, 117259694, 111872611, 106897538, 101933745, 97066500, 93228010, 89872074, 86252245, 82716511, 79503000, 76748893, 74040508, 71370296, 68828749, 66477395, 64587737, 62173757, 60174088, 58361323, 56347774, 54471404, 52459638, 51169934, 49762662, 48328482, 47042975, 45906038, 44864925, 43635398, 42383643, 41032044, 39760970, 38711418, 37647498, 36744622, 35826016, 34574169, 33730976, 32566286, 32162282, 31791054, 30885134, 30144314, 29440136, 29019565, 28208787, 27477311, 26541226, 26167159, 26034227]
3667B6034227j033594l12456k97371l56520m39834o09369l72783j31338p78903
3658B1702059o63472k60881j82420q14658m54517J47230m46236q90704o02386
3649A7534015k10393M1581j89813q9267n8394l93024m73150j83828j89044k19901
3639A5568782J60840L1329n07295l57117j27121k38544j98310m02325l85330k927
3629A3541982n7027p0644j02720m47078l27583j47067j13417J42341j86766r0690
3619A2141331o8904k63053J25051j32587p7208j41878K94943m00229m10140J89114
3609A1256440N25572o62746k91092L09061n2770k33875R8020R8101j54172l0177
3599A0862362j37976J01582K72659J48689K63035J92009K45337J65268j46269
$$ y = [26034227, 25000633, 24688177, 24390806, 24034286, 23594452, 22985083, 22612300, 22480962, 21702059, 21038587, 20777706, 20595286, 19780628, 19326111, 19473341, 19027105, 18136401, 17534015, 17323622, 17365203, 17175390, 17086123, 17027729, 16634705, 16161555, 15977727, 15788683, 15568782, 15729622, 15760951, 15253656, 14896539, 14769418, 14530874, 14332564, 13930239, 13544909, 13541982, 13484955, 13414311, 13311591, 12864513, 12536930, 12389863, 12276446, 12418787, 12232021, 12141331, 12072427, 11809374, 11934425, 11801838, 11724630, 11582752, 11877695, 11477466, 11067326, 11256440, 11782012, 11119266, 10828174, 11137235, 11084465, 10850590, 10948610, 11046711, 10892539, 10862362, 10724386, 10825968, 11098627, 11247316, 11510351, 11702360, 11947697, 12112965, 11966696]
3590A1966696O44885Q6711K65760L59490N6318O31706Q30571O38916J54852J60233
3580A5796138P2350k2787l85871l43413l37550n57560m90734m22133o28757m72951
3570A2206732p72234o3043k80203m59305l73864l04349k0789k34988l23506n05388
3560H869063l17068p3633n3061J05061J90722m31362m55024J92858J24075l89582
3550G762049j94683J0413L96586m39969J0781k26003k15938J04988k402Q8022
3540G293844p3896j16931L7134j95009k43423J15530K59418k3350L6084l9646
3530G049755n33338k15370L6850K1610K13445N3745j81393k13543M27681J52699
3520F812141j12074j18257k3400p0255J81583k9897m96208k36910K44958J12094
$$ y = [11966696, 12611581, 12698292, 12964052, 13323542, 13379860, 14011566, 14842137, 15481053, 15635905, 15796138, 15868488, 15845701, 15459830, 15116417, 14778867, 14221307, 13730573, 13308440, 12679683, 12206732, 11434498, 11371455, 11091252, 10631947, 10258083, 9953734, 9932945, 9697957, 9374451, 8869063, 8551995, 8478362, 8425301, 8530362, 8721084, 8289722, 7834698, 8027556, 8151631, 7762049, 7567366, 7577779, 7974365, 7534396, 7545177, 7319174, 7103236, 7208224, 7205822, 7293844, 7219948, 7103017, 7140151, 6945142, 6701719, 6817249, 7076667, 7053317, 7089401, 7049755, 6516417, 6301047, 6337897, 6359507, 6572952, 6626697, 6445304, 6231761, 6659442, 6812141, 6700067, 6581810, 6558410, 6488155, 6669738, 6639841, 6143633, 5906723, 6151681, 6263775]
3510F263775N5274j6927j14076j7732K71712K04338m94055l7600k43251n2041
3500E819417K15367K22368K6079p07j25494J31130J20631L33370k42129k51106
3490F248926J79265j52722K22549l71901k35589M76068J86428j46327j86311j02283
3480F118103k12866j11618P6966L17142N43672P9216n6203J38027l2842m6946
3470F812651M029q0537J38104L41100N54814L2238K7229k15085K95460J58650
3460H068653p3713J32434L5160q8622n7409K95987P7145M24886J4802q2891J70768
3449H917200K60108K33534N06204k75101o3609M90723L93298m2650p4073K40540
3439A0586174L88474J88429K33349L86844K28251K57632j79067L55048M48657
$$ y = [6263775, 6319049, 6302122, 6188046, 6170314, 6442026, 6646364, 6152309, 6114709, 5871458, 5819417, 6034784, 6257152, 6283231, 6282524, 6157030, 6288160, 6408791, 6742161, 6500032, 6248926, 6428191, 6275469, 6498018, 6126117, 5890528, 6366596, 6553024, 6406697, 6220386, 6118103, 5905237, 5793619, 5870585, 6187727, 6731399, 6810615, 6754412, 6892439, 6859597, 6812651, 6816680, 6736143, 6874247, 7215347, 7770161, 7802399, 7829628, 7614543, 7910003, 8068653, 7994940, 8127374, 8162534, 8073912, 8016503, 8312490, 8389635, 8814521, 8829323, 8746432, 8917200, 9177308, 9410842, 9917046, 9641945, 9578336, 10069059, 10462357, 10419707, 10345634, 10586174, 10974648, 11163077, 11396426, 11783270, 12011521, 12269153, 12090086, 12445134, 12893791]
3430A2893791o9444O00226L82767L03541Q5124M0862J88596O27472K20433O4921
3420A5338289K51170N74655Q81068M39331M74116M37596K64372N89899O12670
3411A9863166O10655N29969O56234J135030L50173P57187P26546R03199J188558
3402B6720717J161026Q35340O18130J260838J696997J594836J491829J932337
3394C7312050K118279J959837K245615K443423K561429K719501L225725L425134
3386E8010993L476926L611121M065854M380405M244500M742829M636515M116114
3378I1285257M522436M547251M309914M389868M399507M696531M116399L756734
3370A26023897L621760K710152K467413K223093J754305J405974J356226R56170
$$ y = [12893791, 12824347, 13424573, 13807340, 14110881, 14196005, 14236867, 14425463, 15052935, 15273368, 15338289, 15589459, 16164114, 17045182, 17484513, 17958629, 18396225, 18660597, 19250496, 19863166, 20473821, 21003790, 21660024, 22795054, 23145227, 23902414, 24628960, 25532159, 26720717, 27881743, 28717083, 29335213, 30596051, 32293048, 33887884, 35379713, 37312050, 39430329, 41390166, 43635781, 46079204, 48640633, 51360134, 54585859, 58010993, 61487919, 65099040, 69164894, 73545299, 77789799, 82532628, 87169143, 91285257, 95807693, 100354944, 104664858, 109054726, 113454233, 118150764, 122267163, 126023897, 129645657, 132355809, 134823222, 137046315, 138800620, 140206594, 141562820, 142518990]
3362A42518990J25473q59114j523929j958861k067668k545301k936043l064535
3354A27689012l473457l814522l844518m308719m469774m538019m840513m397344
3346I4002146m480465m130627m348437m509998m296605l975512m021159l761881
3338F0477462l809225k946407l076279l276835k151865k126102k263316j896749
3330C8930684j707926j732279j264117j542181j404003j383886o74288j254755
3322B7967249j102999o54978r38823p40698j077675o17617r41274m98790n51076
3313B0843319q84451r0671o60317p22037o66790O7796p19464p36025J43234l40036
3303A6234558m14695o85218o53104l94942J05712k80787k29626o40429n20312
$$ y = [142518990, 142644463, 141785349, 140261420, 138302559, 136234891, 133689590, 130753547, 127689012, 124215555, 120401033, 116556515, 112247796, 107778022, 103240003, 98399490, 94002146, 89521681, 85391054, 81042617, 76532619, 72236014, 68260502, 64239343, 60477462, 56668237, 53721830, 50645551, 47368716, 45216851, 43090749, 40827433, 38930684, 37222758, 35490479, 34226362, 32684181, 31280178, 29896292, 29222004, 27967249, 26864250, 26209272, 25270449, 24529751, 23452076, 22834459, 21893185, 21394395, 20843319, 19958868, 19868197, 19207880, 18485843, 17819053, 17886849, 17167385, 16431360, 16574594, 16234558, 15819863, 15134645, 14481541, 14086599, 14192311, 13911524, 13681898, 13041469, 12521157]
3294A2521157r7999k53928J50428j36307k95617k80017k48473l56015j50377q661
3284A0844191k22104n99911k73467k70936m33759J71690m91518K06287L96803
3275I327276o1213l3927n98880j41179J12962j82072j88751j07899k0586m41567
3265G664164k97606N5678K14898j18551m95873j51638J91193K9486l87407P789
3255F712133j72710r7145J13620j18746q3408P3973k06240k09463J54752k89671
3245E877095j22140j31548j36441J45228L5725K20805l49244Q7283J00869k01536
3235E526096j95244j65358m58371J44142K62926l39213j64807j15904K16661M39298
3225E150226k96809k56687J24491l67446k40016K24961J17658k16496J67171j90546
$$ y = [12521157, 12423158, 12169230, 12319658, 12183351, 11887734, 11607717, 11359244, 11003229, 10852852, 10844191, 10622087, 10022176, 9748709, 9477773, 9044014, 9215704, 8724186, 8930473, 9327276, 9266063, 9232136, 8633256, 8492077, 8605039, 8422967, 8234216, 8126317, 8105731, 7664164, 7366558, 7422236, 7637134, 7518583, 7022710, 6871072, 7062265, 7091751, 6704344, 6712133, 6539423, 6442278, 6555898, 6437152, 6353744, 6427717, 6221477, 6012014, 6166766, 5877095, 5754955, 5623407, 5486966, 5632194, 5667919, 5888724, 5539480, 5626763, 5727632, 5526096, 5330852, 5165494, 4707123, 4851265, 5114191, 4774978, 4610171, 4494267, 4710928, 5150226, 4853417, 4596730, 4721221, 4353775, 4113759, 4338720, 4456378, 4239882, 4407053, 4216507]
3215D216507j52408j16409M3708J60446J61342j38845k81295K32155J84526j96412
3205D113315J62932p3457j70428q7415M44083Q334j05985J99604j58870k81683
3195D050430O4360J6964l144j4184l21376j94247j29701k2595L9490J27575J19898
3184C733470n1739k92297j75312K64762M09740k40268j54841K60383K97024q5633
3174C965289k8687k11962k1892O09199J44509J0092j30183j95755k55217P2223
3164C957616J92023Q4894J05731j9833o50741J38304K64530k70259J27197q2388
3154C847074R7817Q296J13783O03024l35683k22523K74237j17698L1531J6943
3144D316801j15017K69930J9609J91820r9153k83891K99021j05046K34679o3315
$$ y = [4216507, 4064099, 3947690, 3991398, 4151844, 4313186, 4174341, 3893046, 4125201, 4309727, 4113315, 4276247, 4202790, 4032362, 3944947, 4389030, 4397364, 4291379, 4490983, 4332113, 4050430, 4114790, 4131754, 4128610, 4114426, 3793050, 3598803, 3469102, 3446507, 3485997, 3613572, 3733470, 3681731, 3389434, 3214122, 3478884, 3888624, 3648356, 3493515, 3753898, 4050922, 3965289, 3936602, 3724640, 3702748, 4311947, 4456456, 4466548, 4336365, 4140610, 3885393, 3957616, 4149639, 4234533, 4340264, 4320431, 3669690, 3807994, 4072524, 3802265, 3929462, 3847074, 3944891, 3953187, 4066970, 4669994, 4334311, 4111788, 4386025, 4268327, 4299858, 4316801, 4201784, 4471714, 4491323, 4683143, 4583990, 4300099, 4599120, 4494074, 4728753, 4665438]
3134D665438L11130J68906j49755l822O2103j13634l4193K29958j252P9311P3396
3123E287586J48405J86381P1297K10690n2953K37931N11227j11196N6836J99243
3113F745447R1444K21386l0100O00052K45537J15922J90343K4076j14462L34299
3103H423944k618N9148M22912J05376N92136N57738Q2167L07123L05934N17717
3093A1371577K13398J97490O00936P77315O92225M2014J37720N51941P64854R78572
3083A6328042L72376M81387O06494O06528M89990L28059P04845Q16708N93533
3074B1327962P88609O70094O15713R81105L42497K74480P93983O38580L02373
3065B6735396O64180M69840R50348M44901K36950J53664O42970O60878J98001
$$ y = [4665438, 4976568, 5145474, 4995719, 4991897, 5054000, 4940366, 4906173, 5136131, 5134879, 5214190, 5287586, 5435991, 5622372, 5693669, 5904359, 5851406, 6089337, 6600564, 6489368, 6546204, 6745447, 6836891, 7058277, 7028177, 7628229, 7873766, 7989688, 8180031, 8204107, 8089645, 8423944, 8421326, 8480474, 8903386, 9008762, 9600898, 10158636, 10240803, 10547926, 10853860, 11371577, 11584975, 11782465, 12383401, 13160716, 13852941, 13894955, 14032675, 14584616, 15349470, 16328042, 16700418, 17181805, 17788299, 18394827, 18884817, 19212876, 19917721, 20734429, 21327962, 22116571, 22786665, 23402378, 24383483, 24725980, 25000460, 25794443, 26433023, 26735396, 27399576, 27869416, 28819764, 29264665, 29501615, 29655279, 30298249, 30959127, 31157128]
3056C1157128L44677L20348L31204J90425K30450l234K39460M2160N9916K9275
3046C2941809k00600l05945m80238l41809O8065k80386n12327M3661l83990m26579
3036C0121661m04971n09241m38932o24157n83276l69667p94941n08442l10906
3027B5577128l57461n59552p56993j209772r70689n75677p85802o53446l02719
3018A9405017m31513n40794n11677k87264l02566q46299o79189k58138o91099
3009A4856478o57595l65400l45170m20307l93085l77081m21670o43593k08431
3000A1024146j18164o5359k03500n99325k27034j72937m01975l68445j99576o1667
2990H606164n48962k92372R2569J18654M7815m7710k06999m36191n7438k9314
$$ y = [31157128, 31501805, 31822153, 32153357, 32343782, 32574232, 32570998, 32810458, 32852618, 32912534, 32941809, 32741209, 32435264, 31955026, 31613217, 31681282, 31400896, 30888569, 30932230, 30548240, 30121661, 29716690, 29207449, 28768517, 28144360, 27561084, 27191417, 26396476, 25888034, 25577128, 25219667, 24660115, 23903122, 22693350, 21722661, 21146984, 20361182, 19707736, 19405017, 18973504, 18432710, 17921033, 17633769, 17331203, 16484904, 15805715, 15547577, 14856478, 14198883, 13833483, 13488313, 13068006, 12674921, 12297840, 11876170, 11232577, 11024146, 10905982, 10840623, 10637123, 10037798, 9810764, 9637827, 9235852, 8867407, 8667831, 8606164, 8057202, 7764830, 7857399, 7976053, 8023868, 7976158, 7769159, 7332968, 7275530, 7246216]
2980G246216p6304l51050K35531O9523k18550q5498k54976k18862O743K7815J00277
2969F480865m87988m67172K41117K66905k87484n7307m7887l93952n4552n5439
2959E137106j59564K75430R5822j85909l05312K47320K25785j08338r8399k78370
2949D845571k74481r0224Q4570j04989l87051L77939J04l19056L86645k04955
2939D314073p6956j88052J9066k9228m1267Q227n0885P0867l49303j24229j6088
2928C536225J49928K9713K89657n7874l76538k3589L75593J23010k25576p6895
2918C743654n74461K90047N85222j85919k78455j18527j88127o7517K32117j16235
2908C321799k976j14260J42014j02649K0378k53278N1508J84754q855M70200m99211
$$ y = [7246216, 7169912, 6818862, 7054393, 7123916, 6905366, 6819868, 6564892, 6346030, 6352773, 6380588, 6480865, 5992877, 5525705, 5766822, 6033727, 5746243, 5688936, 5641049, 5247097, 5192545, 5137106, 4977542, 5252972, 5348794, 5162885, 4857573, 5104893, 5330678, 5222340, 5123941, 4845571, 4571090, 4480866, 4565436, 4460447, 4073396, 4451335, 4451439, 4132383, 4519028, 4314073, 4237117, 4049065, 4068131, 4038903, 3997636, 4005863, 3954978, 4025845, 3676542, 3552313, 3536225, 3686153, 3715866, 4005523, 3947649, 3571111, 3547522, 3923115, 4046125, 3820549, 3743654, 3169193, 3459240, 4044462, 3858543, 3580088, 3461561, 3273434, 3205917, 3438034, 3321799, 3318823, 3204563, 3346577, 3243928, 3264306, 3011028, 3062536, 3247290, 3238435, 3708635, 3209424]
2897C209424J9351k6535k07512J09727j37119K7564J3268o618L15760q1586k07787
2886C027937J64715J02254j1963K10079o51473k11083q6353J89963L35252l55982
2876B713346m15857M79861J16084N3711L24814l8501j62745m5112k94110N1704
2866B783195J68143q0467K58596p0497j65878j63540L17268J48358l44618r2626
2856B757934L42101j41298J30636l2557j10664k05919J84117j43973J5926L43199
2846C139502J15741N677p0293o24405J15166K10727M4919N83144L3182k79K06919
2835C760000M6317j23935l31152N2527k26935m35440Q8430N73753L55883j07900
2825C651548k1954J84523J10021N8999J16484k88238m42697K60754J51164m83983
$$ y = [3209424, 3228775, 3202240, 2994728, 3104455, 2967336, 2994900, 3008168, 3001550, 3317310, 3235724, 3027937, 3192652, 3294906, 3282943, 3493022, 2841549, 2630466, 2544113, 2734076, 3069328, 2713346, 2297489, 2777350, 2893434, 2947145, 3271959, 3233458, 3070713, 3025601, 2731491, 2783195, 2951338, 2870871, 3129467, 3058970, 2893092, 2729552, 3046820, 3195178, 2850560, 2757934, 3100035, 2958737, 3089373, 3056816, 2946152, 2740233, 2924350, 2780377, 2796303, 3139502, 3255243, 3260920, 3190627, 2566222, 2681388, 2892115, 2937034, 3520178, 3553360, 3553081, 3760000, 3806317, 3682382, 3351230, 3403757, 3176822, 2741382, 2829812, 3403565, 3759448, 3651548, 3629594, 3814117, 3924138, 3983137, 4099621, 3811383, 3368686, 3629440, 3780604, 3296621]
2815C296621L44363j6022J01258K26155m09408M04202J70931r5729J39086j10275
2805D051182p3315Q7921l55600j17941M71100L9538L32427j00680j8033J16642
2795D433241l3590K48700l41108q6991N15816m1181M1282j17941k11329J65352
2785D572251M58865K35472n6795k94665K07472K65203j35037j28506J67790M75165
2775E767215Q1749l47354o7504m7525P7257J44627J66299K46139J46338j0727
2765F156514k14749m223M00692J61445K21368K68677n3935l96289R4508k29292
2755F404716N76728J82480j63438K93458r0339J65430n8276J50985j6791K60598
2745G705551K89531L02029K51553L22594k55169L60517K03254P4138M48553p5045
$$ y = [3296621, 3640984, 3624962, 3726220, 3952375, 3542967, 3947169, 4118100, 4022371, 4161457, 4051182, 3977867, 4065788, 3710188, 3592247, 4063347, 4102885, 4435312, 4334632, 4316599, 4433241, 4399651, 4648351, 4307243, 4220252, 4736068, 4694887, 4736169, 4618228, 4406899, 4572251, 5031116, 5266588, 5209793, 4915128, 5122600, 5387803, 5252766, 5124260, 5292050, 5767215, 5848964, 5501610, 5434106, 5386581, 5463838, 5608465, 5774764, 6020903, 6167241, 6156514, 5941765, 5937542, 6338234, 6499679, 6721047, 6989724, 6935789, 6539500, 6634008, 6404716, 6981444, 7163924, 7000486, 7293944, 7203605, 7369035, 7310759, 7461744, 7444953, 7705551, 7995082, 8297111, 8548664, 8871258, 8616089, 8976606, 9179860, 9253998, 9702551, 9627506]
2735I627506N30948o2509K4976L67952K7717J70230M79623K99306J47415J74869
2725A1788033O31320J93758j89868N17768K03741j94589L17953M44287K08298
2716A3920701L16519K06277J89364P32178N9589L00240L40503j57313L38612M13629
2706A6660299l9693r2592J67898M18941N47436j10213o1024L76544R98362K6973
2696A8892931M03472p0047J49852K73475N89910M36052M53209L04255P39335L71211
2686B2543655L45113N18027L02550Q33315J093152O22267N26023N94009J021231
2677B8399342J193963J003277Q10172R21369R49437J063665J100659O70251J202467
2668C7314602J186152J181839O76019J267592P17587J161851J093198Q69100J146883
$$ y = [9627506, 10158454, 10095945, 10120921, 10488873, 10516590, 10686820, 11166443, 11465749, 11613164, 11788033, 12419353, 12613111, 12423243, 12941011, 13144752, 12950163, 13268116, 13712403, 13920701, 14237220, 14443497, 14632861, 15365039, 15424628, 15724868, 16065371, 15908058, 16246670, 16660299, 16620606, 16528014, 16695912, 17114853, 17662289, 17552076, 17491052, 17867596, 18865958, 18892931, 19296403, 19226356, 19376208, 19649683, 20239593, 20675645, 21128854, 21433109, 22172444, 22543655, 22888768, 23406795, 23709345, 24542660, 25635812, 26258079, 26784102, 27378111, 28399342, 29593305, 30596582, 31406754, 32328123, 33277560, 34341225, 35441884, 36112135, 37314602, 38500754, 39682593, 40358612, 41626204, 42343791, 43505642, 44598840, 45467940, 46614823]
2659D6614823J112716R89510O42633O15998R37199K68195K28059P00337O19526
2650E2728996O92503K44147J1305M26055J49860N9419n6188j51859j42136n39949
2640E3422153l50578j52495m75550l15931l10966j111232k53344P8574p64520
2631D9766111j175029j359819n58811p01351o85786j140515p73396r26720p71657
2622D1673027j001551r69425j016407j091341p88568j007121p10120j191830r46046
2613C2950618q10526j003683m50334m89344p73861q87763o35695n17064n51843
2604B6830505n63153m04850k4202l29170n38114m56104J62903m83637j45274j19095
2594B3929809j75845M7506J61856n34983j35237J0915r3485M38962r8455n7999
$$ y = [46614823, 47727539, 48717049, 49359682, 49975680, 50912879, 51181074, 51409133, 52109470, 52728996, 53421499, 53665646, 53676951, 54103006, 54252866, 54312285, 54256097, 54104238, 53962102, 53422153, 53071575, 52919080, 52443530, 52127599, 51816633, 50705401, 50452057, 50530631, 49766111, 48591082, 47231263, 46672452, 45971101, 45285315, 44144800, 43371404, 42444684, 41673027, 40671476, 39702051, 38685644, 37594303, 36805735, 35798614, 35088494, 33896664, 32950618, 32140092, 31136409, 30686075, 30196731, 29422870, 28535107, 27899412, 27382348, 26830505, 26267352, 25862502, 25838300, 25509130, 24971016, 24514912, 24677815, 24194178, 24048904, 23929809, 23753964, 23801470, 23963326, 23428343, 23293106, 23304021, 23210536, 23649498, 23551043, 23493044]
2584B3493044j96633m14930r2574m1496q71K11685m96869Q5104K64943m85124
2574B2326279K94665L60821q1598p4295N11029J6413j48114Q7393Q7574j28827
2564B3251340O0102K37715L24119K18783K6080K44395L35962K61821P1060N47878
2554B5579255M61040M7769K72523N25955M51003M47592K75648L99329N98643L28165
2544B9386922L31175K24178J65385N67779Q9636K26516L02911J16223J07680q5736
2534C1432669k66021J84612K27586K91162J39901L741J30390L72481J74211R1294
2524C2782026M99768N22434K04391M79955K29401L19331N09079O36703M62445
2515C6645533P89247P93531K47234P07382N64031Q21686M57699J363751J346590
$$ y = [23493044, 23296411, 22881481, 22788907, 22747411, 22746540, 22958225, 22461356, 22546460, 22811403, 22326279, 22620944, 22981765, 22900167, 22825872, 23336901, 23353314, 23205200, 23292593, 23380167, 23251340, 23311442, 23549157, 23873276, 24092059, 24118139, 24362534, 24698496, 24960317, 25031377, 25579255, 26040295, 26088064, 26360587, 26886542, 27337545, 27785137, 28060785, 28460114, 29058757, 29386922, 29718097, 29942275, 30107660, 30675439, 30765075, 30991591, 31294502, 31410725, 31518405, 31432669, 31166648, 31351260, 31578846, 31870008, 32009909, 32013650, 32144040, 32516521, 32690732, 32782026, 33281794, 33804228, 34008619, 34488574, 34717975, 35037306, 35546385, 36183088, 36645533, 37434780, 38228311, 38475545, 39182927, 39746958, 40568644, 41026343, 42390094, 43736684]
2506D3736684P56325J196871N85529J087968J073430J566167J468465J224604
2498E2696043J541284J374830J374609J472802J454780J265653J625938J711529
2490F4517468J898003J431668J247600J192598J299067J641404J664046J516178
2482G6408032J590529Q40726J568495J690220J322291J515729J613220J584092
2474H8133334J561881J429594J668876J127442J321207J363703J226791J267618
2466I9100446M43923N70026P82083Q34456L02022j76797j40830m80883p89839
2457A00444607r52351j302713j107478j031680j057727j583924j658155j459297
2449I0291282j566344j612211j569971j236060j355702j436258j608586j666589
$$ y = [43736684, 44493009, 45689880, 46275409, 47363377, 48436807, 50002974, 51471439, 52696043, 54237327, 55612157, 56986766, 58459568, 59914348, 61180001, 62805939, 64517468, 66415471, 67847139, 69094739, 70287337, 71586404, 73227808, 74891854, 76408032, 77998561, 78839287, 80407782, 82098002, 83420293, 84936022, 86549242, 88133334, 89695215, 91124809, 92793685, 93921127, 95242334, 96606037, 97832828, 99100446, 99544369, 100114395, 100896478, 101730934, 102032956, 101856159, 101715329, 101234446, 100444607, 99492256, 98189543, 97082065, 96050385, 94992658, 93408734, 91750579, 90291282, 88724938, 87112727, 85542756, 84306696, 82950994, 81514736, 79906150, 78239561]
2441G8239561j373113j656910j295480j513851j581032j617525q95219j380450
2433F6925981j510090j700164j615287j910662j567021r64454j604016j432926
2425E4621361j556620j219760j465863j366423j219125j375041r97242j451230
2417D3970057r59013j030687j210942j108145q64406o24346q04573p44465n59494
2408C6063986m76249o58240o46456q75464j77253m09215m58597l12791j39116
2399C1910605j48126l66439N1238k47480m60829j84136l92249j57400l88836l69784
2389B9246564L24778J94833j67061j92105l49914k08332k80445P068l46696l91212
2379B7837478l29102j38247o1826l32780n23429k29136n05939n62072o02018n48185
$$ y = [78239561, 76866448, 75209538, 73914058, 72400207, 70819175, 69201650, 68306431, 66925981, 65415891, 63715727, 62100440, 60189778, 58622757, 57658303, 56054287, 54621361, 53064741, 51844981, 50379118, 49012695, 47793570, 46418529, 45421287, 43970057, 43011044, 41980357, 40769415, 39661270, 38796864, 38172518, 37367945, 36623480, 36063986, 35587737, 34929497, 34283041, 33407577, 33230324, 32821109, 32362512, 32049721, 31910605, 31762479, 31396040, 31447278, 31199798, 30738969, 30554833, 30162584, 30005184, 29616348, 29246564, 29571342, 29766175, 29599114, 29407009, 29057095, 28848763, 28568318, 28575386, 28228690, 27837478, 27508376, 27370129, 27308303, 26975523, 26452094, 26222958, 25717019, 25154947, 24552929, 24004744]
2369B4004744l44159l80906k03880l63614j46199n15805k91983J04231m39826
2360B1422603o26518m02730l6654m07433M3580J88934l55172j27910K77138k40860
2350A9734978m29723R8609M7988l29721J23760j05422m07212j92928k63966L07482
2340A8583845L13789L45990n90307k03301L16882k87106k14385J0599j99787K85111
2330A8361330O282j92362o1342l74022r3380r285O8484K85296J26880l4316L453
2319A8087018k16437l53178L06740k44627o1889L78613l64172j50737R0907l37647
2309A7134591J62948L01059p0576M3821L48121J82284J10642O9171k43770L95379
2299A8433670j08701l6680j31588j73204j3338k76357N21057K52133J96821Q67727
$$ y = [24004744, 23660585, 23279679, 23075799, 22712185, 22565986, 22050181, 21758198, 21862429, 21422603, 20796085, 20393355, 20356701, 19949268, 19992848, 20181782, 19826610, 19698700, 19975838, 19734978, 19305255, 19403864, 19451852, 19122131, 19245891, 19140469, 18733257, 18540329, 18276363, 18583845, 18897634, 19243624, 18653317, 18450016, 18766898, 18479792, 18265407, 18276006, 18076219, 18361330, 18367612, 18175250, 18113908, 17739886, 17646506, 17637221, 17705705, 17991001, 18117881, 18083565, 18087018, 17870581, 17517403, 17824143, 17579516, 17517627, 17896240, 17532068, 17381331, 17472238, 17134591, 17297539, 17598598, 17528022, 17571843, 17919964, 18102248, 18212890, 18282061, 18038291, 18433670, 18324969, 18288289, 18156701, 17983497, 17970159, 17693802, 18214859, 18466992, 18663813, 19531540]
2289A9531540O27734J8345j61228k82204K77489N42462O02314K46533L19085P6201
2279B1798271K94119P45879L90691M55440M55733M20661J12984N6662L09932M40319
2269B5480691K86241L29109O45919N61212L47841M09765O94020O07500Q58455
2260C0220753N16259J78589L11274Q92492J140847Q73942O28942N30100P51295
2251C6044493M37116Q71762J401656J084761J186375J306742Q83107R45757J305323
2242D5467092J834810J170172J469243J565058J284714K233686K196285K081671
2234E9302731K050767K199977K281317K368969K718645K501362K869208L045243
2226G9338219L094980L056196L123048L317281L380688L973769K924959L062384
$$ y = [19531540, 20159274, 20177619, 20016391, 19734187, 20011676, 20554138, 21156452, 21402985, 21722070, 21798271, 22092390, 22838269, 23228960, 23684400, 24140133, 24560794, 24673778, 24730440, 25040372, 25480691, 25766932, 26096041, 26741960, 27303172, 27651013, 28060778, 28754798, 29362298, 30220753, 30737012, 30915601, 31226875, 32119367, 33260214, 34134156, 34763098, 35293198, 36044493, 36481609, 37353371, 38755027, 39839788, 41026163, 42332905, 43216012, 44161769, 45467092, 47301902, 48472074, 49941317, 51506375, 52791089, 55024775, 57221060, 59302731, 61353498, 63553475, 65834792, 68203761, 70922406, 73423768, 76292976, 79338219, 82433199, 85489395, 88612443, 91929724, 95310412, 99284181, 102209140, 105271524]
2218A05271524L310353K997913L545519K997804K986942K808200K453305K078421
2210A28449981J834740J851094J335844R94650P47924M14756M33733m48199l24808
2201A35289715k73849q63724r73259j484196j834212j820211k625253k016278
2193A23398733k557501k923754k850509k779147l186176l254441k826290l550624
2185I9470291l369265k841835k892006l138735k672124k389358k584251l136414
2177G6446303k406917k257328k314512k042513k104249k053396j769542j717501
2169E9780345j831642j333736j513930j482743j460920j662698j298683o68199
2161D8527794j403064r52641r67086j345310q06960n59294o70100q49033n56347
$$ y = [105271524, 108581877, 111579790, 115125309, 118123113, 121110055, 123918255, 126371560, 128449981, 130284721, 132135815, 133471659, 134466309, 135214233, 135628989, 136062722, 135614523, 135289715, 135015866, 134152142, 133178883, 131694687, 129860475, 128040264, 125415011, 123398733, 120841232, 117917478, 115066969, 112287822, 109101646, 105847205, 103020915, 99470291, 96101026, 93259191, 90367185, 87228450, 84556326, 82166968, 79582717, 76446303, 74039386, 71782058, 69467546, 67425033, 65320784, 63267388, 61497846, 59780345, 57948703, 56614967, 55101037, 53618294, 52157374, 50494676, 49195993, 48527794, 47124730, 46172089, 45205003, 43859693, 43052733, 42493439, 41823339, 40974306, 40417959]
2152D0417959n81943p12781q91995o90429o68680p18446l78951l77274j29402
2143C5268058n42624l32078n05210q59917k5417n90922q10242m79329q9651l31059
2133C0701609N3964k70738l77913j82964r3797k83513n70571o6479p6483R8818
2123B8931933q35k52465p6335m03757L96260k65261J79026Q7893n10841N725j3250
2112B8078093p7293j70965J0792R5017n3740j75525j06929l03043j29328K79493
2102B7446572j85468K57586m3185j41678R6220Q0599O6230K37587J03372K27520
2092B8145355J03505J17812J41327K11875L40093K81306L79803M54780N96923
2083C0772779J80577Q07327P72352N64478R32056Q84105N53885P80173Q26588
$$ y = [40417959, 39836016, 39123235, 38231240, 37540811, 36872131, 36153685, 35774734, 35397460, 35268058, 34725434, 34393356, 33888146, 33028229, 33002812, 32411890, 31601648, 31122319, 31032668, 30701609, 30755573, 30484835, 30106922, 29923958, 29830161, 29546648, 28976077, 28909598, 28833115, 28931933, 28931098, 28678633, 28602298, 28198541, 28594801, 28329540, 28508566, 28596459, 28085618, 28091343, 28078093, 28000800, 27829835, 27840627, 27935644, 27881904, 27706379, 27599450, 27296407, 27167079, 27446572, 27261104, 27518690, 27475505, 27333827, 27430047, 27510646, 27576876, 27814463, 27917835, 28145355, 28248860, 28366672, 28507999, 28719874, 29059967, 29341273, 29721076, 30175856, 30772779, 30953356, 31760683, 32533035, 33097513, 34029569, 34913674, 35467559, 36247732, 37074320]
2074C7074320O39439Q42092P27788J137032J528988J115374J071739J367235J419740
2065D6923747J131033J469454J535350J627212J516824J272253J727706J541472
2057E8745051J302072J708169J474788J639919J021749Q56577J004045P50078
2049F8502448L19275P01687O98518L73797l20855J40725l59620j83037q40179
2040F9032759j115493o19588r60772r45176r50021j239636j511501j654009j541500
2031E8495063j386429j470522j733818j804087j290028j767851j465937j661648
2023D5914743j665824j656726j519956j086967j157579j239969j372146j035891
2015C5179685j439902q83572q13859p36632o49353o05610o27402j045561n99321
$$ y = [37074320, 37713759, 38555851, 39283639, 40420671, 41949659, 43065033, 44136772, 45504007, 46923747, 48054780, 49524234, 51059584, 52686796, 54203620, 55475873, 57203579, 58745051, 60047123, 61755292, 63230080, 64869999, 65891748, 66748325, 67752370, 68502448, 68821723, 69523410, 70221928, 70595725, 70274870, 70415595, 70055975, 69872938, 69032759, 67917266, 67297678, 66336906, 65391730, 64441709, 63202073, 61690572, 60036563, 58495063, 57108634, 55638112, 53904294, 52100207, 50810179, 49042328, 47576391, 45914743, 44248919, 42592193, 41072237, 39985270, 38827691, 37587722, 36215576, 35179685, 33739783, 32856211, 32042352, 31305720, 30656367, 30050757, 29423355, 28377794, 27778473]
2006B7778473q04917m12405m95621o74277l88467r108k66461k46760r03173n98557
1996B2978727n11286j12897l70196p76706q26K39752p3334m82108m01911l28819
1986B0160396L0320M49651l46938n24925m18354l15499q0350R9336j32941l88488
1976A8532208k39476q7386k86306k48770R0100k62776j98396j29386l85262m98397
1966A6286153m78375k48962j62858l13918m53579L02030n9520j76476Q194k83633
1956A4419056j24117k48875n41138o4746r4004l14631k83401o95659j75420N8444
1946A1935509P5594o6481p9931O9708k97852k13931L9330O3962J72314O0837r579
1935A1749480k06671J8358Q364K55703J58523m5461K98095j92830k24244M6655
$$ y = [27778473, 26973556, 26561151, 26065530, 25391253, 25002786, 24993678, 24727217, 24480457, 23577284, 22978727, 22467441, 22354544, 21984348, 21207642, 21206816, 21446568, 21373234, 20891126, 20489215, 20160396, 20190716, 20640367, 20293429, 19768504, 19350150, 19034651, 18954301, 19053637, 18920696, 18532208, 18292732, 18205346, 17919040, 17670270, 17760370, 17497594, 17299198, 17169812, 16784550, 16286153, 15807778, 15558816, 15395958, 15082040, 14628461, 14930491, 14870971, 14694495, 14702689, 14419056, 14294939, 14046064, 13504926, 13440180, 13346176, 13031545, 12748144, 12052485, 11877065, 11935509, 12011103, 11944622, 11864691, 11934399, 11636547, 11422616, 11461946, 11525908, 11698222, 11759059, 11749480, 11542809, 11561167, 11569531, 11825234, 11983757, 11938296, 12236391, 12043561, 11819317, 11865972]
1925A1865972k06223k21594r087j22749m40736J57834J11683q7908J61760n7507
1915A1151445j22295J76166p6664M2918j63552J07070J9571J20499P2263J85301
1905A1512722o1696P3633J59323N876q6968J51701j30025l41990N71286N67745
1895A2421607r365j89908O1635P2427M09052m1731O2643M13703j44065J15136
1885A3171134J06321L01742L56301o8423K08563L35627l62845J77357K96642N84887
1875A5107306K01292j58656K61839N55464L58293M08509K49204P6714J17565O87148
1865A7864678P97476r0747M18960J60262K55272O90434L47679J50273N18587J28679
1855B1241553M72132M95574P29668L79785J41008L40252O92581O17740N53849
$$ y = [11865972, 11659749, 11438155, 11429068, 11306319, 10865583, 11023417, 11135100, 11047192, 11208952, 11151445, 11029150, 11205316, 11128652, 11171570, 11008018, 11115088, 11134659, 11255158, 11327421, 11512722, 11451026, 11524659, 11683982, 11689858, 11602890, 11754591, 11624566, 11282576, 11853862, 12421607, 12412242, 12222334, 12283969, 12356396, 12765448, 12723717, 12786360, 13200063, 13055998, 13171134, 13277455, 13579197, 13935498, 13867075, 14075638, 14411265, 14048420, 14225777, 14522419, 15107306, 15308598, 15149942, 15411781, 15967245, 16325538, 16734047, 16983251, 17059965, 17177530, 17864678, 18662154, 18571407, 18990367, 19150629, 19405901, 20096335, 20444014, 20594287, 21112874, 21241553, 21713685, 22209259, 22938927, 23318712, 23459720, 23799972, 24492553, 25110293, 25664142]
1846B5664142M06372P64530P67498Q91490L74807M26179P35402J052287O13432
1837C1696139Q55737P24844Q41199O98579Q91620J476582R04805J291437O88999
1828D0069941J105306J189039J155327J252208R43162J659585J640688J378221
1820E0393477J595724J844429J542686K116541K255363K330210K205381K092696
1812F6376507K265777K422803K780044L341023L590993L720307L964071L994068
1804I2455593M126255M357141M623101N391694N980367O141186O374006O976216
1796A36425559P306273P886527Q653700Q649247R232520R391017J0176788J0416027
1788B08137658J0584913J0194447R862338R279861Q536144P264594N836770M481771
$$ y = [25664142, 26070514, 26835044, 27602542, 28494032, 28868839, 29295018, 30030420, 31082707, 31696139, 32551876, 33276720, 34117919, 34816498, 35708118, 37184700, 38089505, 39380942, 40069941, 41175247, 42364286, 43519613, 44771821, 45714983, 47374568, 49015256, 50393477, 51989201, 53833630, 55376316, 57492857, 59748220, 62078430, 64283811, 66376507, 68642284, 71065087, 73845131, 77186154, 80777147, 84497454, 88461525, 92455593, 96581848, 100938989, 105562090, 110953784, 116934151, 123075337, 129449343, 136425559, 143731832, 151618359, 160272059, 168921306, 178153826, 187544843, 197721631, 208137658, 218722571, 228917018, 238779356, 248059217, 256595361, 263859955, 269696725, 274178496]
1780B74178496K757715J40848j778980l823012n302359o824104q267200q966522
1772B42114882r548085r907865r769983r646269r526889r160939r017009q646590
1764A66891253p537069p464661p161588o446886o281010o144481n544953m869699
1756A15440906m755279m676154m550411l853621l836875l561526l439931l317047
1748H3450062k890257l196108k961118k708079k526963j810710k255196k050969
1740F3050662j640908k093971j706370j392061j304458j753229j904326j629720
1732D9625619j483087r30002j360481j281002j259181j434655q90983j049588
1724C9936640p52485j006479j057183p83906r69275j198176o66342l68984q60765
$$ y = [274178496, 276936211, 277077059, 275298079, 271475067, 266172708, 259348604, 251081404, 242114882, 232566797, 222658932, 212888949, 203242680, 193715791, 184554852, 175537843, 166891253, 159354184, 151889523, 144727935, 138281049, 132000039, 125855558, 120310605, 115440906, 110685627, 106009473, 101459062, 97605441, 93768566, 90207040, 86767109, 83450062, 80559805, 77363697, 74402579, 71694500, 69167537, 67356827, 65101631, 63050662, 61409754, 59315783, 57609413, 56217352, 54912894, 53159665, 51255339, 49625619, 48142532, 47212530, 45852049, 44571047, 43311866, 41877211, 40986228, 39936640, 39184155, 38177676, 37120493, 36336587, 35367312, 34169136, 33502794, 33133810, 32273045]
1715C2273045q09055o80741n46025q46223j006537p92904k38545p12778p06271
1706B5933966m05374k78824m56692p46342n62800o61119m43386q38283k89390
1697B1251756n53026m50023j85100l97112l67917l94526l53980m62336m70845
1688A7616891n46722k76595m4130j93191m28127l89449k31437m17963k13306j19290
1678A4756681j93866j76759n41126j47304j85525k60106l24578Q9941k59427l45971
1668A2411960k95118k55271j83928k42642k08250r6064L4575k08071P0257n58333
1658A0469115l95185K1261j18484l3724l98717m80938o1695K78296J3188m0583
1648I252534m13721m62951J07217p1118j16324k68042p731J41111O5165j6515
$$ y = [32273045, 31463990, 30783249, 30237224, 29391001, 28384464, 27591560, 27353015, 26640237, 25933966, 25528592, 25249768, 24793076, 24046734, 23483934, 22822815, 22379429, 21541146, 21251756, 20698730, 20248707, 20063607, 19666495, 19298578, 18904052, 18550072, 18087736, 17616891, 17070169, 16793574, 16749444, 16556253, 16128126, 15738677, 15507240, 15089277, 14875971, 14756681, 14562815, 14386056, 13844930, 13697626, 13512101, 13251995, 12927417, 13017358, 12757931, 12411960, 12116842, 11861571, 11677643, 11435001, 11226751, 11130687, 11165262, 10957191, 11027448, 10469115, 10073930, 10095191, 9976707, 9942983, 9544266, 9063328, 9001633, 9279929, 9293117, 9252534, 8838813, 8375862, 8483079, 8411961, 8295637, 8027595, 8019864, 8160975, 8226140, 8209625]
1638H209625l88857j98658j96232Q5547J50906j09722n32058o28958K11939M26363
1628G029895n66293K06576j32545r7939k26223l97516r1186j03101J51078J70763
1618E943509p3798j95092k49873J63172o8867n6547O1373Q3847j52465m1511l4503
1607E379245k02715p0427k05333J34434l12088j42934L11817O800k04058J88396
1597D883137m44650k10511k4871K61452j61105l68140J02376L56774q1533J13298
1587D426227l12252k69790L72204q4571K49897J12822o00049l80553k24061l7268
1577C252606L7974L12336K16267j91516j28678q5440l23320j86753L84524r4615
1567C193385J1047n0550J2683K24796l00992j67005m129k02134L37771l0964k28404
$$ y = [8209625, 7820768, 7622110, 7425878, 7511425, 7662331, 7552609, 7020551, 6391593, 6603532, 7029895, 6463602, 6670178, 6537633, 6439694, 6213471, 5815955, 5724769, 5621668, 5772746, 5943509, 5869711, 5674619, 5424746, 5587918, 5519051, 5462504, 5523877, 5607724, 5455259, 5413748, 5379245, 5176530, 5106103, 4900770, 5035204, 4723116, 4580182, 4891999, 4898799, 4694741, 4883137, 4438487, 4227976, 4203105, 4464557, 4303452, 3935312, 4037688, 4394462, 4312929, 4426227, 4113975, 3844185, 4216389, 4131818, 4381715, 4494537, 3894488, 3513935, 3289874, 3252606, 3290580, 3602916, 3819183, 3627667, 3498989, 3413549, 3090229, 2903476, 3288000, 3193385, 3204432, 3153882, 3166565, 3391361, 3090369, 2923364, 2919235, 2717101, 3054872, 3023908, 2795504]
1556B795504k93919K659N8267l3267j19413K0287K42178m994K1106J73396J57477
1545C019281j2245p2098J6470k39963k67612K77454K50982k20668m02299l6183
1535B313119j19719o9068L49610J81322l89618l20663K245L84884j71401J54501
1525B315212J72788l21435K67498p8832m5647p3519o0408K59147J82576j8943
1515B598437m01638O6024L10J93022q6955l7717L9859M1170J07015K77532m08785
1504B388274K966K0912j57637k06733j8787J10870l61803M3679J38062J26467
1494B086270J738j02230M16535L44077O8303k41244o8627L85756j04717j20727
1484B665134j79880j20960Q4k58657K71643L17680L79974l76140l31278J12382
$$ y = [2795504, 2501585, 2504244, 2562511, 2529244, 2409831, 2430118, 2672296, 2667302, 2688408, 2861804, 3019281, 3007036, 2934938, 2951408, 2711445, 2443833, 2721287, 2972269, 2751601, 2349302, 2313119, 2193400, 2124332, 2473942, 2655264, 2265646, 1944983, 1947228, 2332112, 2160711, 2315212, 2488000, 2166565, 2434063, 2355231, 2309584, 2236065, 2175657, 2434804, 2617380, 2598437, 2196799, 2262823, 2263133, 2456155, 2369200, 2331483, 2371342, 2412512, 2519527, 2797059, 2388274, 2391240, 2412152, 2254515, 2047782, 2028995, 2139865, 1778062, 1821741, 1959803, 2086270, 2088008, 1985778, 2402313, 2746390, 2814693, 2573449, 2504822, 2890578, 2785861, 2665134, 2485254, 2364294, 2364378, 2105721, 2377364, 2695044, 3075018, 2698878, 2367600, 2479982]
1474B479982J5121j0967m89746j74721L07845K04698r5444j33699M1689j63871
1464A980887J4934K9648Q0137J56579o0905j57411n80095J0760K30659M05351
1454B110544j06896o3824m41147J9442J98315J51475m59427k91078k97091N348
1444H25661J74225K25202K66965j68446j59328J37112l58204j25642m2599L64108
1434A139054K85223R3545o2522k44505J5707J10411J22402j39453k28830L8599
1424A129631K1215k70825j9959K07495n5328j19288J30743L646K2376L43660j93182
1413A200184n42473L6578J28188Q2381J38901K18584J71735j35258j16995q0465
1403A101360k73259J90823q5127l07956N7055J15511O0815J38987j8969k06680
$$ y = [2479982, 2495103, 2484136, 1994390, 1819669, 2127514, 2332212, 2236768, 2103069, 2144758, 1980887, 1995821, 2025469, 2105606, 2262185, 2201280, 2043869, 1463774, 1474534, 1705193, 2110544, 2003648, 1939824, 1498677, 1518119, 1716434, 1867909, 1408482, 1117404, 820313, 825661, 999886, 1225088, 1492053, 1323607, 1164279, 1301391, 943187, 817545, 774946, 1139054, 1424277, 1517822, 1455300, 1210795, 1226502, 1336913, 1459315, 1319862, 1091032, 1129631, 1150846, 880021, 860062, 1067557, 1012229, 892941, 1023684, 1027330, 1049706, 1393366, 1200184, 657711, 694289, 822477, 904858, 1043759, 1262343, 1434078, 1298820, 1181825, 1101360, 828101, 1018924, 933797, 625841, 682896, 798407, 859222, 998209, 979240, 772560]
1393G72560o8840L63779J84532l29916m14224L01548M184k27750P3491J83499
1383H42863p9933Q4529J6033j70833q0661r6296O3841k18653r9415N72623k64965
1372E69133j52110K26075K11435Q2215l01640j39957J2906j924N2385k19913l93479
1361e4874J57614L12020K07925Q064j63342J77278K5779j24886n28299j9293K81189
1350B79175k4349L08612P0803m36923k71998M66779O5808J88538J40019j3128
1340G73336k14722L3570q9975j06463L86233l02001j6914j39689j85824M79065
1330F16616J79959k78903k27901n6072J69943M1554P072K86171J30837k68506
1320F00770K06544j84326j14798J08206j38258j86625R4049n9893m1666O7876
$$ y = [772560, 703720, 1067499, 1252031, 922115, 507891, 809439, 813623, 585873, 659364, 842863, 762930, 847459, 863492, 692659, 611998, 515702, 579543, 360890, 261475, 834098, 569133, 417023, 643098, 854533, 936748, 635108, 495151, 508057, 506133, 558518, 338605, -54874, 102740, 414760, 622685, 630749, 467407, 644685, 670464, 545578, 17279, -2014, 279175, 254826, 563438, 634241, 197318, -74680, 392099, 457907, 646445, 786464, 773336, 558614, 592184, 502209, 395746, 781979, 479978, 463064, 323375, 137551, 616616, 796575, 517672, 289771, 233699, 403642, 445196, 452268, 738439, 869276, 600770, 807314, 622988, 508190, 616396, 478138, 291513, 385562, 325669, 284003, 351879]
1310C51879N7918k50777l64505K97072M77215l65425n30312N27026K84344l6081
1300D48354j86487l07129O385M43089l9333l16877J32536Q0158k06286J65768
1290B20178L45318O691k76979k80798M72253J04511p8101L3538k94559L07316
1280E59368P1575J04713l05406j33670J80779j85099J14582M9829j60387j71483
1270A24801k37272L7387N06593N3784l86738j21461K8117J13567K56754Q6529
1260D62061L21902K21448m86404j15238l99590L2586K36217m34081J16199j8867
1250f3767J10770K07928j90417j07438J56450R2345n0697n8338p7171j70038L035
1239a47338N7609l3644R6835J38624L44224k27263k45167o2034J53095Q8547j33125
$$ y = [351879, 409797, 159020, -205485, 91587, 568802, 203377, -326935, 200091, 484435, 448354, 261867, -45262, -38877, 404212, 364879, 48002, 180538, 260696, 54410, 220178, 565496, 572187, 295208, 14410, 486663, 591174, 513073, 546611, 252052, 559368, 630943, 735656, 430250, 296580, 477359, 292260, 406842, 456671, 296284, 124801, -112471, -75084, 431509, 485293, 98555, -22906, 5211, 118778, 375532, 462061, 783963, 1005411, 519007, 403769, 4179, 36765, 272982, -161099, -44900, -63767, 47003, 254931, 64514, -42924, 113526, 205871, 155174, 96836, 19665, -150373, -147338, -89729, -123373, -26538, 112086, 456310, 229047, -16120, -78154, 74941, 163488, 30363]
1228C0363j1332q0113l29212j88650K63589K39792J12065J18224J30291k36383
1218D8634Q7190k683j33684L52693j55295L20041k47543q6685L02594j84111L19513
1207F20664o2375k64258K97929L1326l7880l50378K365j40144j80226J68045j63667
1196g8599J70017J12640r8659o16k87600j41036J71328K01072J89276k72052l56406
1185c90635K24466M01508J5627l06527n056r2227m31217N31557J80324L0714l73424
1174b14890L69586N32037j7046j03875m9532k70064l47713j23130J64545M19619
1164C59537k73418m80676J76203J65857j70357L10069p7151k76110p735K91924
1154A8143J28749k56281J17571N262n5780j46593k34038K48634J1043j5774K17953
$$ y = [30363, 19031, -61082, -390294, -578944, -315355, -75563, 36502, 154726, 285017, 48634, 135824, 133141, -543, 352150, 196855, 516896, 269353, 182668, 485262, 301151, 620664, 558289, 294031, 591960, 623286, 585406, 235028, 237393, 97249, -82977, 85068, -78599, 91418, 204058, 105399, 104783, -182817, -323853, -152525, 48547, 237823, -34229, -390635, -166169, 235339, 250966, -55561, -60617, -152844, -584061, -52504, 127820, 158534, -214890, 154696, 686733, 669687, 565812, 516280, 246216, -101497, -224627, -60082, 359537, 86119, -394557, -218354, -52497, -222854, 87215, 10064, -266046, -273781, 18143, 146892, -109389, 8182, 13444, -42336, -188929, -422967, -174333, -163290, -179064, 38889]
1143C8889K01481K76502k24669K3847o890J75620k13267m64653J94753K25922
1133B27535j20495k15558N3615J64400N6438J46073M26649j47397k61799N768
1123C35229l07808R5553q919l24001L05535l6298q2376J55925k57675Q1707L51463
1112C08335k63894N5603j86420n5341L19422l16813J03958l4793N6451j66815
1102a80307Q9176M60095j65674K1616K5145m822N5577J283r2488l57035k51428
1091c98862L3669J92800o1139k21198J26656J75247K33875j22142j56165j82268
1081c79527j07860J06425K84981O8495J94009k51438J29406J49483P9542k68882
1071D634J31872J42123j77142r8897r4896O61852k57817k75962J7360k82275k519
$$ y = [38889, 240370, 516872, 292203, 316050, 309160, 484780, 271513, -193140, 1613, 227535, 107040, -108518, -54903, 109497, 165935, 312008, 738657, 591260, 329461, 335229, 27421, 122974, 114055, -209946, 95589, 59291, -23085, 132840, -124835, -43128, 308335, 44441, 100044, -86376, -141717, 177705, -139108, -35150, -69943, -13492, -180307, -91131, 368964, 203290, 224906, 250051, 245229, 300806, 302089, 209601, -147434, -398862, -365193, -172393, -233532, -454730, -328074, -152827, 81048, -41094, -197259, -379527, -487387, -380962, -95981, -27486, 166523, -84915, 44491, 193974, 273516, 4634, 136506, 278629, 101487, 2590, -92306, 569546, 311729, 35767, 53127, -229148, -231667]
1060b31667J58467J90902Q1179J04995M0288l19356j81626J32351K72071l16094
1050f8490K54506L96340j12639l46523j39241l49992M07409J98317O7359K8606
1040C35652m34847L07648J29494M4930J10250k20562j20302M3674k81904L62009
1030B76042j26250m169L83214l31038j6971K40838N6147q4227j78586M3444J08077
1019C66521k55915j03000J34340J6979k12355j66072R2343M27036N5257l09165
1009D5969j94450l9761K73624J00513J02955O4824p3230J18911J81207k64719
999C15843L97079M0622j5980J39181N9561n44709k77816K07626l7758M281K04129
988D92059k1001L00266M15108n59836N483k70089k00601K21330M48796m01448
$$ y = [-231667, -73200, 117702, 198881, 303876, 344164, 24808, -156818, -24467, 247604, -68490, 186016, 582356, 469717, 123194, -16047, -366039, 41370, 239687, 307046, 335652, -99195, 208453, 337947, 382877, 493127, 272565, 152263, 195937, -85967, 276042, 149792, 145623, 528837, 197799, 180828, 421666, 477813, 393586, 215000, 258444, 366521, 110606, 7606, 141946, 158925, -53430, -219502, -127159, 299877, 355134, 45969, -148481, -188242, 85382, 185895, 288850, 353674, 280444, 399355, 580562, 315843, 712922, 753544, 737564, 876745, 936306, 391597, 113781, 321407, 283649, 287930, 492059, 471058, 771324, 1186432, 626596, 632079, 361990, 161389, 382719, 831515, 430067]
978D30067L76351N6901n2722J48151o6834N9449k66319j20462K87116L50810j1599
967A190909r9716j09588J9312L32860L43332K24899O1125j83327Q977M34317K20851
956B443951o6362J26078L48417M14314N05036K53514J66719n3679K27732K38778
946D604498M73212N77874r486j03799n22862l1059j72977n04715r9863m30399
936C780424p11605o5912n42668J0243L9913K15926o60238j05739J48609k30021
926A878932k30862M8385L08191m42250l2519j78044l78013j3005j49693o2681
916G48441J27402k42739L751L11530p2441k69297j41459l42193j4012K70270K33623
905F12876j33958p3524J71173j18117l474j81498J34139j84585k08798K58455
$$ y = [430067, 806418, 863319, 810597, 958748, 891914, 951363, 685044, 564582, 851698, 1202508, 1190909, 1091193, 981605, 1000917, 1333777, 1677109, 1902008, 1963133, 1779806, 1788783, 2223100, 2443951, 2377589, 2503667, 2852084, 3266398, 3771434, 4024948, 4191667, 4137988, 4365720, 4604498, 5077710, 5655584, 5646098, 5542299, 5019437, 4988378, 4815401, 4310686, 4210823, 3780424, 3068819, 3002907, 2460239, 2470482, 2510395, 2726321, 2066083, 1960344, 2108953, 1878932, 1648070, 1696455, 2004646, 1562396, 1529877, 1351833, 973820, 960815, 811122, 748441, 875843, 633104, 636855, 948385, 875944, 606647, 465188, 122995, 108983, 379253, 612876, 478918, 405394, 576567, 458450, 454976, 273478, 407617, 223032, 14234, 272689]
895B72689j72888j98397L89372L10159o03659q6241K13443j9384R1336Q8467p2688
884B12209k78825l28898J60658l43769J61893N85191l19449J51767o8738o647
874g4608K01731N249j54032m49643K53475J5766N0973J32154k43443J59842J5314
863h7222L58194K35521n59071N6661L25491k33708k59848M47231O306k10266j32462
852e3173J1770J41221m17650Q8680j76031K76897R6377j54293M57028Q4347j39126
841B16047o1520j54682m20701j47172K87908K10534J39735M2256k36373j8448
831a42416j87691O5165M3632J87470k38311J76562J54069p2728P6697k0679J07963
820A49733k19877K27645J37939k79232J5000O1238Q8685J16959l44590j0865q7280
$$ y = [272689, 99801, -98596, 290776, 600935, -2724, -88965, 124478, 105094, 196430, 284897, 212209, -66616, -395514, -234856, -578625, -416732, 168459, -150990, 777, -67961, -74608, 127123, 132372, -21660, -471303, -217828, -202062, -151089, -18935, -262378, -102536, -87222, 270972, 506493, -52578, 4083, 329574, 95866, -163982, 283249, 289555, 79289, -53173, -41403, 99818, -317832, -229152, -405183, -128286, -31909, -186202, 270826, 355173, 216047, 154527, -155, -420856, -568028, -280120, -69586, 70149, 112405, -123968, -142416, -330107, -264942, -221310, -33840, -272151, -95589, 58480, -14248, 62449, 41770, 149733, -70144, 157501, 295440, 16208, 31208, 92446, 181131, 298090, -46500, -57365, -144645]
809a44645j57479J4647K2819L882j05304j23088J29458L27097j00907M1437j80568
798b72651M9521J0522l26680K1447N35813k70127J60793K39891k0772n08627J99144
787a81726O02918l38082l77145j73688K5113K82248o4263M0920M423j74902K80904
776g3280K94177l9480m21962o0537o4037J01828j41009j29496k33843P8285M12761
765b76593p0918k02671J02289j65972L68726J76205Q8914m23350L72575K85663
755B54868n03959k71373Q5027J432J9600K17075j80460j69872J9458O7521J33399
744c27284R1o0068K04667J64823n9900J22241p4221l67552n4066M62172q3947
733g3044m4802o3327N2227p6360j03063r7860k01392J39248M8759O4169L36477
$$ y = [-144645, -302124, -287477, -264658, -260776, -366080, -489168, -359710, -32613, -133520, -92083, -272651, -223130, -212608, -539288, -517841, 17972, -252155, -91362, 148529, 127757, -380870, -181726, 421192, 83110, -294035, -467723, -442610, -160362, -224625, -183705, -179282, -354184, -73280, 220897, 181417, -240545, -301082, -365119, -263291, -404300, -533796, -767639, -689354, -276593, -347511, -550182, -447893, -613865, -245139, -68934, 19980, -403370, -30795, 254868, -249091, -520464, -435437, -434005, -414405, -197330, -377790, -547662, -528204, -460683, -327284, -327193, -387261, -182594, -17771, -77671, 44570, -29651, -397203, -451269, 10903, -73044, -117846, -181173, -128946, -205306, -308369, -406229, -607621, -468373, -419614, -355445, -18968]
722a8968J18258n41608l4535J25223k19003R857K49673K37020K7295n9165k47056
711c53009j15600P2463m0001J06258J57667P8547K98514l8508p0688j49931N2138
700b150M14832k15149k4916l80996K51071J97379K35941k39366n62781R1285L32933
689I8083j13016N9307k0913o4840J69798l34171l6856L48082k22069r5898j30377
678c42870K75717J91960n48466O2711n923o6570L61714j27306r6778M06128l8550
667G1767j99918j80541M53597K58723j45117m24922j73224m0826J56728r0038
657c13771J46311L19182j12231j10166J6259P6063L6305j16008q6235q2427o4729
646b91447K46553N0866k28339o5965L06013j12339j07008J89018R5205l96036
$$ y = [-18968, 99290, -442318, -476853, -351630, -570633, -560776, -311103, -74083, -46788, -105953, -353009, -468609, -396146, -436147, -329889, -172222, -93675, 204839, 166331, 95643, -54288, -2150, 412682, 197533, 172617, -208379, 42692, 240071, 476012, 236646, -326135, -234850, 98083, -14933, 44374, 23461, -41379, 128419, -205752, -242608, 105474, -116595, -212493, -342870, -67153, 124807, -423659, -360948, -366871, -433441, -71727, -199033, -295811, 110317, 71767, -128151, -308692, 144905, 403628, 258511, -166411, -339635, -380461, -223733, -313771, -167460, 151722, 39491, -70675, -54416, 21647, 57952, -58056, -144291, -226718, -291447, -44894, 5972, -222367, -288332, 17681, -94658, -201666, -12648, 82557, -313479]
636c13479K24838j0206N8996j2734k65471Q141j35522L16788j82238o5822K7734
625c48975N18436K99503l59810k61722l17196K29194J6192K52694k42739J14494
615i9929K15801J9180j76444m6571J24916N2028N3032o15315l57780N34382M46373
604A49673R8786l66189k61727N6680n758K22692j99102r9950n24K27533J03534
593g4352k23744k845J1039o6961J79422k31916j17917L45978Q6731k82120K896
582c73789m7097j06467J86831k99702K96299L57655j29677J54191J89518j86576
572D1186m54428N2524L24088k17621j53884j80402j01487p0086K93947J67235
562b98928J4530J09543j95794j04456k55910R1061L19339L11055j26362l21344
$$ y = [-313479, -88641, -98847, -39851, -52585, -318056, -309915, -445437, -128649, -310887, -376709, -348975, 169461, 468964, 109154, -152568, -469764, -240570, -224378, 28316, -214423, -99929, 115872, 135052, -41392, -87963, 36953, 88981, 142013, -473302, -831082, -296700, 149673, 248459, -117730, -379457, -322777, -328535, -105843, -304945, -404895, -405419, -177886, -74352, -298096, -300941, -289902, -356863, -177441, -409357, -527274, -181296, -94565, -376685, -373789, -420886, -527353, -340522, -640224, -343925, 13730, -115947, 38244, 227762, 41186, -413242, -360718, -36630, -254251, -408135, -588537, -690024, -760110, -466163, -298928, -284398, -174855, -370649, -475105, -731015, -639954, -320615, -9560, -135922, -457266]
552d57266L26597j09300J0866J17123k93148K25060J37531q6581M25374J42005
542D38261m92018N03614l091m29519q6182n6136k14663J66190K395k7694j41143
531c39986J04042q7558Q8429K11276k75247j75778J91489j66270j21364K94106
521b76861j5240j28787j58034j89883j2154L08326J27281k32139o0623J62736
511d75378M43478n0261k18751L11096L18664J89939m40117m66758K05231K38429
501E5572L5549j83999Q1177J80005q9134r0370N6622O7886j14341k21578o3318
490b85929L75529L04194J93159m84369k34341m6812k51549J55415J65980J29809
480B1086j29277l8893J91756k84741m2169P7311j97660j13703r283k4414j7758
$$ y = [-457266, -130669, -239969, -229103, -111980, -405128, -180068, -42537, -129118, 296256, 438261, -53757, 449857, 446766, 17247, -68935, -125071, -339734, -173544, -171149, -198843, -339986, -235944, -323502, -235073, -23797, -299044, -474822, -283333, -449603, -570967, -276861, -292101, -420888, -578922, -768805, -780959, -472633, -345352, -577491, -638114, -475378, -31900, -82161, -300912, 10184, 328848, 518787, 78670, -388088, -182857, 55572, 91121, -92878, -11701, 168304, 79170, -11200, 45422, 113308, -1033, -222611, -285929, 89600, 393794, 586953, 102584, -131757, -178569, -430118, -274703, -108723, 21086, -108191, -147084, 44672, -240069, -282238, -204927, -402587, -516290, -525573, -549987, -567745]
469e67745p1364l9398J69403O7832j08221J47445Q5170P4131J10156l9079J47654
458b4016J58869l74413K73086K01191l05310k58256K2014J31052K51231n2798
448B2650J5542K3692j31366m15441J83572K17087l273P8919M383J83927k72742
437i3050P4755o9508j52246J20086J82101k60497j63946L62596K52631J15192
427C68114j46823l98208m8752o2775j39169j5757j91626J77638J2760L0336K73650
416a40612k48379K6077N9782l73110j15728P8376K80811K46183J93556j4441j52976
405a60461M4758p058o646j90025p6002Q2471L13192K9112J0593l5361j56445j58964
393c10836K15868J98876p4585M0923J6798k19619q1115J25276Q4101K16977o07453
$$ y = [-567745, -639109, -678507, -509104, -441272, -549493, -402048, -316878, -242747, -132591, -171670, -24016, 134853, -239560, 33526, 234717, -70593, -328849, -306835, -175783, 75448, 22650, 38192, 61884, -69482, -484923, -301351, -84264, -87537, -8618, -4235, 179692, -93050, -18295, -87803, -240049, -119963, 62138, -198359, -362305, 291, 252922, 368114, 221291, -176917, -225669, -288444, -427613, -443370, -634996, -457358, -444598, -414262, -140612, -388991, -362914, -303132, -676242, -791970, -713594, -432783, -186600, 6956, -7485, -160461, -115703, -122761, -129407, -319432, -395434, -312963, 229, 29341, 39934, 4573, -151872, -310836, -94968, 103908, 29323, 70246, 87044, -132575, -213690, -88414, -4313, 212664, -394789]
382c94789K33505J42447j44562k968k43019J18872O7172j84626K37496J97175
372B6703J05243m6051l5988k62094L3253K01258j94224J35984k04751k01697p4936
361e17300K97029L96987p660m2726j31394m38560j43100J58668L87878j82661
351b22839K66214P4217N7789K11168j14414q2695j76660k04365N4210k10495J92662
340a55208P717K63614K15757K0669n18468k61298m22K14592L89685j19260k57207
329a99829j59238p6043P4141L20510M95680j70907l88892p8891J59192L85221
319C60944k63954N5442j24043k68088k95857K72497J9251N14430j15536j72930
309a7844r9594n6495k587l30918p1737L82311j34078K3695J84892j36189m7206
$$ y = [-394789, -161284, -18837, -163399, -166367, -409386, -290514, -223342, -407968, -170472, 26703, 131946, 85895, 49907, -212187, -178934, 22324, -171900, -35916, -240667, -442364, -517300, -220271, 176716, 169056, 126330, -5064, -443624, -586724, -428056, -40178, -222839, 43375, 117592, 175381, 386549, 272135, 189440, 12780, -191585, -137375, -347870, -155208, -147491, 116123, 331880, 352549, -165919, -427217, -427639, -213047, 176638, 57378, -199829, -359067, -435110, -360969, -40459, 455221, 284314, -104578, -183469, -24277, 360944, 96990, 152432, 28389, -239699, -535556, -263059, -243808, 270622, 155086, -17844, -117438, -173933, -176520, -507438, -579175, -196864, -330942, -307247, -122355, -258544, -305750]
298c05750j08594Q8244M13947k62567j46561J23239j49094K28018l32127J5796
288d35449J33960l72523M69020J47198j90238K96530j02165k25778J19327J02761
278e7357K01967J13353m64553p1857K95905K48222J00239l20837k74586L24824
268I5320j57316L26663j44986k33517J75766j30811P4635j33687K25918l00826
258b02841j42551K84541K50607K59995n23563k40429O6412Q0509J07442m96048
248e55926L3083N3826J36077J15526j84813L86173M905j10704L80562l7074l48928
237a27293J99519r7134k58967J55756o3077K5965m1616J46949M00012l45663p7580
226h3129j35569M5872k05375L42522L13089r19432q2246M04992q1726M87003J91794
$$ y = [-305750, -414344, -326100, 87847, -174720, -321281, -198042, -347136, -119118, -451245, -435449, -301489, -674012, -204992, -57794, -248032, 48498, -53667, -279445, -160118, -57357, 144610, 257963, -206590, -278447, 17458, 265680, 365919, 45082, -229504, 95320, -61996, 264667, 119681, -113836, 61930, -68881, 5754, -127933, 97985, -202841, -345392, -60851, 189756, 449751, -73812, -314241, -247829, -167320, -59878, -555926, -522843, -469017, -332940, -217414, -402227, -16054, -11149, -121853, 258709, 221635, -127293, 72226, -24908, -283875, -128119, -191196, -165231, -206847, -59898, 340114, -5549, -83129, -218698, -172826, -378201, -35679, 277410, -642022, -724268, -319276, -401002, 86001, 277795]
215B77795k49630m03352L19971r7153N2325n7713J01333N6513l5453k8245j07221
204a70830J47780q0377j83460Q1108k83799K36946n6163j10420N6843k32420J99074
193c95718K25821N05111l25920n8888L20017j49789k97615N1524J06847O1201
183D2591l2929j22208j2611J85874n53268R9815l15895Q65508L7322k19616L51192
172C25775l73016j23880L9128k64814L84867o0583R5103K34310r0149k09366n2424
161i5049K7753P9645k52133J65486J05572p8180o5829J51127j53741p6228J44893
150d6684j99202K52891j69714K7913J98211k20167r6972j99371j25067M29908
140a48254q5670r143p0581R2113J42580m4648p6103K09443k70296J24234j95790
$$ y = [277795, 28165, -375187, -55216, -152369, -100044, -157757, -56424, 89, -35364, -63609, -170830, -23050, -103427, -286887, -205779, -489578, -252632, -308795, -419215, -362372, -594792, -395718, -169897, 335214, 9294, -49594, 270423, 120634, -176981, -125457, -18610, 42591, 9662, -112546, -125157, 60717, -492551, -392736, -708631, 156877, 194199, -25417, 325775, -47241, -171121, -131993, -396807, -11940, -72523, 22580, 256890, 166741, -42625, -95049, -67296, 12349, -239784, -74298, 31274, -46906, -112735, 38392, -115349, -191577, -46684, -245886, 7005, -162709, -134796, 63415, -156752, -253724, -453095, -578162, -148254, -233924, -243067, -313648, -221535, -78955, -123603, -199706, 9737, -260559, -136325, -332115]
129c32115J77367J42171j37973J5692Q1268K4118m918l505j86825j94335O4555
118c54500M13417j99712r700l8813l9354K53284k21665K46539J82393k58215k91156
107c17482j52861J40530K55340Q1121k20789L5596M4403q5887J30111P440k12224
96b94702j7386K07525J14815L0611j15954o2185J40j29104j22315K32610j04085
85b60030K3793K60160j10099M5099L74260l04176j04244p6423l7481j207J73418
74a6930J89539J08423j26166o289l0474k80563k05997r6592J48222K33861K4884
63e8082r7494q261J20154O0904q6292Q9886k98462P060J36099p8668k08846r5847
51e17849J31649m9735K23345Q2704r8387j01555J2442J32671j39173J56987K09998
$$ y = [-332115, -154748, -12577, -150550, -134858, -53590, -29472, -34390, -37895, -224720, -419055, -354500, 58917, -140795, -150495, -189308, -228662, 24622, -197043, 49496, 231889, -26326, -317482, -470343, -329813, -74473, 6648, -214141, -178545, -134142, -220029, -89918, -82478, -294702, -312088, -104563, 10252, 40863, -75091, -137276, -137136, -266240, -388555, -155945, -260030, -236237, 23923, -86176, -41077, 333183, 29007, -75237, -151660, -189141, -190348, -16930, 172609, 281032, 154866, 148577, 118103, -162460, -368457, -465049, -316827, -82966, -58082, -155576, -163837, -43683, 17221, -69071, 20815, -277647, -270587, -134488, -213156, -422002, -517849, -386200, -435935, -212590, -129886, -228273, -329828, -317386, -184715, -323888, -166901, 43097]
40D3097q1952j32406k6356J625J54027K1774M7657N0521r4241j37349J58122j90032
28a85513J13754p9344j0746j07963r8014M16175Q5952j1703k2649k14631p8540
17a93222p5494J0446K47189J7767j35225p2618j75739J51615K68027j91211m8591
6a97056k4188J23330k4386p6517J19088j15561
0a95290
$$ y = [43097, -38855, -171261, -197617, -195992, -41965, -20191, 27466, 77987, -16254, -153603, 4519, -185513, -71759, -151103, -161849, -269812, -367826, 48349, 134301, 122598, 99949, -114682, -193222, -268716, -258270, -11081, 6686, -128539, -201157, -376896, -225281, 42746, -148465, -197056, -221244, -97914, -122300, -198817, -79729, -195290]
$$ Imaginary data points
##PAGE= N=2
##DATA TABLE= (X++(I..I)), XYDATA
16383e004867l0915p881j03132M21208N4998J74048M4136m6359k18205J47450
16373d569519l5531n144L43129M0639J27245j84700Q8066K54445m8838m0636J97159
16362c833685L19722J14895k59036l34937N6708K89757j30033K96282J94515j16654
16352c402466J34872m6641Q8440O7788J54266L12263J09379j19546Q9450J6269
16342b595926M8603k604J81975J06090J02438J52476J4019j40125q2016K59259
16332a955811k4680K9527K12752J68897K19252J1608j75084J97180M1896k32133
16322a506596K3190M14172J32865j22441J31728j7598J31758j57403l8433K28998
16312g79760j41669j34225K07870k2171J450j28012J4144L06548J00729K96696
$$ y = [-5004867, -5035782, -5043663, -5146795, -4725587, -4670589, -4496541, -4452405, -4498764, -4716969, -4569519, -4605050, -4610194, -4267065, -4226426, -4099181, -4283881, -4195815, -3941370, -3990208, -4030844, -3833685, -3513963, -3399068, -3658104, -3993041, -3936333, -3646576, -3776609, -3480327, -3285812, -3402466, -3267594, -3314235, -3225795, -3158007, -3003741, -2691478, -2582099, -2701645, -2612195, -2595926, -2547323, -2549927, -2367952, -2261862, -2159424, -2006948, -1992929, -2133054, -2215070, -1955811, -1980491, -1950964, -1738212, -1569315, -1350063, -1338455, -1513539, -1316359, -1274463, -1506596, -1483406, -1069234, -936369, -1058810, -927082, -944680, -812922, -970325, -1008758, -779760, -921429, -1055654, -847784, -869955, -868505, -996517, -982373, -675825, -575096, -278400]
16302b78400j26646q307J25570j26399J73201Q6334O7484J99697j79346R3842
16292B7030k04151L02501K09310J844j13485l18864O8331J61743L16163J62228
16282F12650j42737r6769K47386J61530j3486J87797l06691l6823R4871k77479
16272D30249L24813K0411K40077J53454k12600l165Q7805o4778J72308J23491
16262A272065J44319K33763K67864j57530l15073j14275P6045k08169J53261J56161
16252A508431J37227J2696Q4737j21984J19483J02879K08170p8933J52802k9528
16242B095980o2377J97539j89242K04885R1737J04639R1711j57278r8823j35169
16232B143602J50262k96777k30359P30733J14416j16446J58252l93376j38386
$$ y = [-278400, -405046, -413353, -287783, -414182, -240981, -154647, -87163, 112534, -66812, 27030, -177121, 125380, 334690, 336534, 223049, -95815, -27484, 134259, 450422, 612650, 469913, 373144, 620530, 782060, 768574, 956371, 649680, 612857, 707728, 430249, 755062, 775473, 1015550, 1169004, 956404, 953239, 1041044, 976266, 1148574, 1272065, 1416384, 1650147, 1918011, 1760481, 1445408, 1331133, 1407178, 1199009, 1352270, 1508431, 1645658, 1658354, 1743091, 1621107, 1740590, 1843469, 2051639, 1972706, 2125508, 2095980, 2033603, 2231142, 2041900, 2246785, 2338522, 2443161, 2534872, 2377594, 2278771, 2143602, 2293864, 1997087, 1766728, 2497461, 2611877, 2495431, 2653683, 2260307, 2121921]
16223B121921K83347J17219m9928l1124M81332j2375R9374J04292K02045l1834
16213C284269k51369m30122K67016k0292K8599j08655Q4291j77197K55025K86082
16203C217647O3133l39449k06588J86410J25141P9210m8270j40182J8455M44633
16193C400140r2342p28n3418q1589k65948J56935p38m3811R7699k9385J40900
16182C227715K67230k33056k9154J65428j14533J04196q4281K30599n1976l6954
16172C445214J99240l7173l208J96766j7526L1165o3789j8268J31527J74695k51949
16161C786694P9122K44746P886Q7675m09417k65757N09L68412R9789l32303L32350
16150C999706M25534l07100J9827m32774k47257M08399O1563m9467j70465J42611
$$ y = [2121921, 2405268, 2522487, 2472559, 2441435, 2922767, 2910392, 3009766, 3114058, 3316103, 3284269, 3032900, 2602778, 2869794, 2849502, 2878101, 2769446, 2853737, 2676540, 2931565, 3217647, 3280780, 2941331, 2734743, 2921153, 3046294, 3125504, 3077234, 2937052, 2955507, 3400140, 3307798, 3307070, 3253652, 3172063, 2906115, 3063050, 3062312, 3018501, 3116200, 3086815, 3227715, 3494945, 3261889, 3232735, 3398163, 3283630, 3387826, 3303545, 3534144, 3482168, 3445214, 3644454, 3607281, 3604073, 3800839, 3783313, 3814478, 3750689, 3732421, 3863948, 4038643, 3786694, 3865816, 4110562, 4118448, 4206123, 3796706, 3530949, 3531458, 3899870, 3999659, 3667356, 3999706, 4425240, 4118140, 4137967, 3705193, 3457936, 3866335, 3927898, 3878431, 3707966, 3850577]
16140C850577J93343r7850o2166L1489Q8369m4023K3479K12699k6118L9706J8625
16129D228130l38109J19912L22576k88922k24583k53798J19962L03846l47080
16120C641934R3705K02707K01791M0471l24291J99527J24222j29202L52328r143
16110D394049k98743N13613M14884m49128n9930K62129n257l38749l23032m34585
16100C675251L23573J44622J98282j11122j29219J64916r5066m34708m8238M63621
16090D151912K79485O6610K14338r9049N155j00284p1919j43724l22466n2170
16080C927888J13607L03327Q7052j90609L48766q3762n75160J11199J09327R8591
16070D250226l99065o842J55218q5307J44202M57103j72447n22440k32196K49497
$$ y = [3850577, 4043920, 3946070, 3883904, 3915393, 4003762, 3959739, 3983218, 4195917, 4169799, 4209505, 4228130, 3890021, 4009933, 4332509, 4043587, 3819004, 3565206, 3685168, 3989014, 3641934, 3735639, 3938346, 4140137, 4180608, 3856317, 4055844, 4180066, 4050864, 4403192, 4394049, 4095306, 4608919, 5023803, 4574675, 4514745, 4776874, 4771617, 4432868, 4109836, 3675251, 3998824, 4143446, 4341728, 4230606, 4101387, 4266303, 4171237, 3736529, 3688291, 4151912, 4431397, 4498007, 4712345, 4613296, 4618451, 4518167, 4446248, 4302524, 3980058, 3927888, 4041495, 4344822, 4431874, 4241265, 4590031, 4506269, 3931109, 4042308, 4151635, 4250226, 3851161, 3844319, 3999537, 3914230, 4058432, 4515535, 4343088, 3820648, 3588452, 3837949]
16060C837949K34616P2440K39023K18884m835j80474q8699j38471K18579J22383
16050D531395j21864m997Q1154Q6642M9259m2663m85297j04093p042K46653N5996
16039D285143M01986o4770k31367r1654p9388J39023m46134J8491M39021j94423
16029D175928J57394j54557k36769J33562j54922K23832K50424j15821l3662K65961
16019D511370o6179j96892K20392k04489p7950L03651j56416J92961m09455J8198
16009D135191R2873J05127L05396N1947j83996J03507L88741n79316K1970j24175
15999D317265l404j0635k15445K07458L45500J5247K09888J5483m30840p8592
15989D371925k08415l2527k46067J45942L53855r7260J0352K23654K8374j89236
$$ y = [3837949, 4072565, 4145005, 4384028, 4602912, 4598077, 4417603, 4328904, 4190433, 4409012, 4531395, 4409531, 4404534, 4485688, 4572330, 4621589, 4578926, 4093629, 3989536, 3982494, 4229147, 4285143, 4687129, 4622359, 4390992, 4299338, 4219950, 4358973, 3912839, 3931330, 4370351, 4175928, 4333322, 4178765, 3941996, 4075558, 3920636, 4144468, 4394892, 4279071, 4245409, 4511370, 4445191, 4248299, 4468691, 4264202, 4186252, 4489903, 4333487, 4526448, 4116993, 4135191, 4228064, 4333191, 4638587, 4690534, 4506538, 4610045, 4998786, 4419470, 4441440, 4317265, 4313861, 4303226, 4087781, 4295239, 4640739, 4655986, 4865874, 4881357, 4450517, 4371925, 4163510, 4130983, 3884916, 4030858, 4384713, 4287453, 4297805, 4521459, 4549833, 4360597]
15979D360597j58047M2524N15664q313j98289R1320j14267n7405k66133r9483
15969D108168m5517J95355J20863o0313k3237l1617M66733j02011m55891R7984
15959D270517k77265N6634L97936k27321K42176L3821o1118K5685m87320J96768
15949D170513K43767k41688k34468O7193N5439L48828M5677J37889l6440j98696
15939D358014L90940j96077o16473J21942O30456N6430j69086J4260k443k49811
15929D338152k60760R2073J44225K91962k28596k27190K7428N9682K64323J27952
15919D629251l1378j18525l72686k99211M99195L35676q1209L72597q2774m74348
15909D376588M41664j45398m07094j44034m7656j61611L54963j35720q7812m487
$$ y = [4360597, 4202550, 4245074, 4760738, 4752425, 4554136, 4645456, 4531189, 4473784, 4207651, 4108168, 4062651, 4258006, 4378869, 4318556, 4295319, 4263702, 4730435, 4628424, 4172533, 4270517, 3993252, 4049886, 4447822, 4220501, 4462677, 4496498, 4435380, 4461065, 3973745, 4170513, 4414280, 4172592, 3938124, 4005317, 4060756, 4409584, 4455261, 4593150, 4556710, 4358014, 4748954, 4552877, 3936404, 4058346, 4688802, 4745232, 4576146, 4590406, 4587963, 4338152, 4077392, 4169465, 4313690, 4605652, 4377056, 4149866, 4177294, 4236976, 4501299, 4629251, 4597873, 4479348, 4106662, 3807451, 4306646, 4642322, 4561113, 4933710, 4850936, 4376588, 4818252, 4672854, 4265760, 4121726, 4074070, 3912459, 4267422, 4131702, 4043890, 4039403]
15899D039403M96048N7185q0529l6625j06421k63702K5288M56244N9526M8529
15889D694946k81699J58457P7273j43272p4149R356K34221K7758m11383J23165
15879D414673n4397N9244J81086p6571R5905L41266l49907j0424l4760K55556
15869D821671k29667p3445L42220J4754o34568J34391K90919j46040J15680m28837
15859D207078J99354M4677R9614K65254J91380K31111n52500j82414R0648J23361
15849D717563J4939k75093j05022j55431K01618k83296K67694J70078J5152n2498
15839D515704l60939N12034J9809j10274P3701P2956k77407j71858J34472P028
15829D415226K47142M4800k33953l16054J14294K8713j81679J2426P0390J46895
$$ y = [4039403, 4535451, 4592636, 4512107, 4475482, 4369061, 4105359, 4130647, 4586891, 4646417, 4694946, 4413247, 4571704, 4648977, 4505705, 4431556, 4440912, 4675133, 4702891, 4291508, 4414673, 4360276, 4419520, 4600606, 4524035, 4619940, 4961206, 4611299, 4600875, 4566115, 4821671, 4592004, 4518559, 4860779, 4875533, 4240965, 4375356, 4666275, 4520235, 4635915, 4207078, 4406432, 4451109, 4550723, 4815977, 5007357, 5238468, 4685968, 4503554, 4594202, 4717563, 4732502, 4457409, 4352387, 4196956, 4398574, 4115278, 4382972, 4553050, 4568202, 4515704, 4154765, 4666799, 4686608, 4576334, 4650035, 4722991, 4445584, 4273726, 4408198, 4415226, 4662368, 4707168, 4473215, 4157161, 4271455, 4300168, 4118489, 4130915, 4201305, 4348200]
15819D348200J58418k51377m37821M08122R8845L43498k35067n09048M28833K00032
15809D552635j85124Q6504J47502j04272j28813k42742K8308J56541P1401J18076
15799D500016j04134Q2273J43750L3100M17650j82200l16407M1596k42967j63536
15789D209141L06038R3032J7700k70898J42433j34998J26257j03375j388J37639
15779D521581j74065L8318j81561L68278L11523m41991J21442Q3869k59119k39638
15769D148637M75256M89795j27587k48402J32207k627k31135m00777K38349q0649
15759D393067j60447O2998J29909L75845n48584J50404N6980l53412J49373K49734
15749D505867J69729P8765L62002j54515l35105N815P4516k47502k52375K03862
$$ y = [4348200, 4506618, 4255241, 3817420, 4225542, 4324387, 4667885, 4432818, 3923770, 4352603, 4552635, 4367511, 4454015, 4601517, 4497245, 4368432, 4125690, 4153998, 4310539, 4381940, 4500016, 4395882, 4478155, 4621905, 4655005, 5072655, 4890455, 4574048, 4615644, 4372677, 4209141, 4515179, 4608211, 4625911, 4355013, 4497446, 4362448, 4488705, 4385330, 4383942, 4521581, 4347516, 4385834, 4204273, 4572551, 4884074, 4442083, 4563525, 4647394, 4388275, 4148637, 4623893, 5113688, 4986101, 4737699, 4869906, 4867279, 4636144, 4235367, 4473716, 4393067, 4232620, 4295618, 4425527, 4801372, 4252788, 4403192, 4460172, 4106760, 4256133, 4505867, 4675596, 4754361, 5116363, 4961848, 4626743, 4632558, 4707074, 4459572, 4207197, 4411059]
15739D411059j30175L95671P8997j93544n3059L81831J11446k78165m47145J00864
15729D377780k52450K72766J4017k43726K45712o7021J10745m38N1884r8754k66309
15718D144206K32755J81712J99130q5355p39844M64459M74248j34040l89188J15886
15708D463969P7342l802Q8343l9609J77963p0029j71855J30952K73660n9458j71527
15697D695949l77960J09367L30024m59012j77710M79650J76169l1331P9500J72965
15687D997611J06895k90217j82452K83996j97826J25023k87425p164j33258m49720
15677C965463K59034k5540J89901j47829P4254j10309J4224N9358l99214J8642
15667C897984L66069O7278k04810Q4968N7982l54488J21702L91723J11203K32586
$$ y = [4411059, 4280884, 4676555, 4755552, 4562008, 4508949, 4890780, 5002226, 4724061, 4276916, 4377780, 4125330, 4398096, 4412113, 4168387, 4414099, 4347078, 4457823, 4457385, 4509269, 4410515, 4144206, 4376961, 4558673, 4757803, 4672448, 3932604, 4397063, 4871311, 4737271, 4348083, 4463969, 4541311, 4537509, 4625852, 4586243, 4764206, 4694177, 4522322, 4653274, 4926934, 4867476, 4695949, 4317989, 4427356, 4757380, 4298368, 4120658, 4600308, 4776477, 4745146, 4824646, 4997611, 5104506, 4814289, 4631837, 4915833, 4718007, 4843030, 4555605, 4548441, 4415183, 3965463, 4224497, 4198957, 4388858, 4241029, 4315283, 4204974, 4219198, 4278556, 3879342, 3897984, 4264053, 4331331, 4126521, 4211489, 4269471, 3914983, 4036685, 4428408, 4539611, 4772197]
15657D772197m9062m4837k25312r103o9352o7346O6348L8326L81163k68611j5271
15646D509140P2803l8953j71177k17815J93420J9177j29004j1169J68984J85160
15636D580566K24685L7193J4656j21537k02263n68949k8603K31840K25901K09906
15626D603395P4556J07401J67906j620j56335k40061n43700J43271P0921M17187
15616D642921L38309k78003k81092J02377J21459j1337j09806M9145L0982k53881
15606D351074j56124k22426K80062k30015J2389J66233p0551K7401M03182L05580
15596D866805m320l5119l71120N9731L0672M09428k69630k21433K92661k19970
15586D537705J47689p4617q6083O254n3656K96027Q9985j30441l46302N21192
$$ y = [4772197, 4723135, 4678298, 4452986, 4443883, 4374531, 4307185, 4373533, 4411859, 4793022, 4524411, 4509140, 4581943, 4542990, 4371813, 4153998, 4347418, 4366595, 4237591, 4226422, 4395406, 4580566, 4805251, 4842444, 4857100, 4735563, 4533300, 3964351, 3935748, 4167588, 4393489, 4603395, 4677951, 4785352, 4953258, 4951638, 4795303, 4555242, 4011542, 4154813, 4225734, 4642921, 4981230, 4703227, 4422135, 4524512, 4645971, 4634634, 4524828, 4573973, 4604955, 4351074, 4194950, 3972524, 4252586, 4022571, 4034960, 4201193, 4130642, 4158043, 4561225, 4866805, 4862485, 4827366, 4456246, 4515977, 4546649, 4956077, 4686447, 4465014, 4757675, 4537705, 4685394, 4610777, 4524694, 4530948, 4477292, 4773319, 4863304, 4732863, 4386561, 4907753]
15576D907753q399k92323K78267k81605J51414J7057j00371n4919m51955J76740
15566D341659L88634J07224m36156k11702L83295q5483J12265K00846m12643O0170
15556D448109M81139J60121K18784m66574l1277K71286J0423M9081l92002J3368
15546D762458j19911m87149M89333L06318l44191j76146J46553Q2549n05221J29907
15536D284500L05926n8906J07415O5850k33417J53354K8696M9536N6355n4138
15526D705171p8134k12691N0365J70884j6127l22544q6529L76674M51650m9672
15516D989047k15964j12095M2271k26202j45620J72097l22692R9887J202j49816
15506D132115L04855Q2581J57273N172J19784N8684J87232k28251P0961m67820
$$ y = [4907753, 4899354, 4607031, 4885298, 4603693, 4755107, 4772164, 4671793, 4616874, 4164919, 4341659, 4730293, 4837517, 4401361, 4189659, 4572954, 4487471, 4599736, 4800582, 4387939, 4448109, 4929248, 5089369, 5308153, 4841579, 4810302, 5081588, 5092011, 5141092, 4749090, 4762458, 4642547, 4155398, 4644731, 4951049, 4606858, 4430712, 4577265, 4659814, 4154593, 4284500, 4590426, 4531520, 4638935, 4704785, 4471368, 4624722, 4653418, 4702954, 4759309, 4705171, 4627037, 4414346, 4464711, 4635595, 4619468, 4296924, 4210395, 4587069, 5038719, 4989047, 4773083, 4660988, 4703259, 4477057, 4331437, 4503534, 4180842, 4280729, 4281931, 4132115, 4436970, 4519551, 4676824, 4681996, 4801780, 4860464, 5047696, 4819445, 4890406, 4422586]
15496D422586n19165L43327N500J98575J87870j22872J3980L54526p9702J02081
15486D906706J32885j70871j37327j47702j00570p4820J63723K69429j83176j49919
15476D508358M9305J30252j03883K4118l70308j07518J07637r3974J13791L03860
15466D561638J43614m0953K56636j92053J65788O89l70925R9920J28484k35802
15456D517036k2764j83250j3538q9764k3411M40321o2365k36882q487M28258k16963
15445D528191l06581N36495j10024j7755J87698k21597P0944J83346k83792K68268
15435D835193K0786j54084J59514j81898j25435J07452J38668j80591M46295l23711
15425D742189j45501M06376m11465m45861n8025M06234p078l50612K67988L50320
$$ y = [4422586, 3903421, 4246748, 4252248, 4450823, 4638693, 4515821, 4529801, 4884327, 4804625, 4906706, 5039591, 4868720, 4731393, 4583691, 4483121, 4408301, 4572024, 4841453, 4658277, 4508358, 4557663, 4687915, 4584032, 4608150, 4237842, 4130324, 4237961, 4143987, 4257778, 4561638, 4705252, 4664299, 4920935, 4728882, 4894670, 4895359, 4524434, 4624354, 4752838, 4517036, 4494272, 4311022, 4297484, 4207720, 4184309, 4624630, 4562265, 4325383, 4316896, 4745154, 4528191, 4221610, 4758105, 4648081, 4630326, 4818024, 4596427, 4667371, 4850717, 4566925, 4835193, 4855979, 4701895, 4861409, 4679511, 4554076, 4661528, 4800196, 4619605, 5065900, 4742189, 4596688, 5003064, 4591599, 4145738, 4087713, 4493947, 4486869, 4136257, 4404245, 4754565]
15415D754565j63495l27645K29265K29935n26942J09916K31598M59886k653j64736
15405D829694L4715L74362n25025j32688M54080p1741o13550k15448K4507P41576
15395D900482K63965l39805l9946l00760l7415J07832L20665l05036J83518j82033
15385D571467j59588m8678K12162K01243p2552m31422J28883J19301L41169j21887
15375D740098o1985n0987N19938m78811L29745J48982n44204K04801l33589j76484
15365D297504L15990M2279Q5734K37607k77073k00025K567k9675l35726O09243
15355D748425Q0727k31438L8825J13009J34044k94967m9856N3694q6151L29671
15345D835983k97439j17829M8236L66781J22383j56787J9855J41255r1326o40162
$$ y = [4754565, 4591070, 4263425, 4492690, 4722625, 4195683, 4305599, 4537197, 4997083, 4994430, 4829694, 4864409, 5238771, 4713746, 4581058, 5035138, 4963397, 4349847, 4134399, 4158906, 4900482, 5164447, 4824642, 4784696, 4483936, 4446521, 4554353, 4875018, 4569982, 4753500, 4571467, 4411879, 4363201, 4575363, 4776606, 4704054, 4272632, 4401515, 4520816, 4861985, 4740098, 4678113, 4627126, 5147064, 4668253, 4997998, 5146980, 4602776, 4807577, 4473988, 4297504, 4613494, 4655773, 4741507, 4979114, 4702041, 4502016, 4504583, 4474908, 4139182, 4748425, 4829152, 4597714, 4636539, 4749548, 4883592, 4588625, 4538769, 4592463, 4506312, 4835983, 4538544, 4420715, 4468951, 4835732, 4958115, 4801328, 4821183, 4962438, 4871112, 4230950]
15335D230950J02460L64610P854J26430J14667j97571n54011L4595M3305j48540
15325D124749J28061K69046J39257M7093K63628O614n2225l48153m00237M53410
15315D631243J74992J05837Q7298k13988j83927p7273n9369J12055K96035k37027
15305D635876N5828L51328k01881L3654k21143L22942l626j87793o4435k54043
15295D466707J85065K12146J47565j34768L45115n8234k83972l6201k09418P2759
15285D706764j09997R0564m2554k00249k06248j0743J24546N0055Q8443j01777
15275D388804r1565J58759L9807l09791L79931R9135J85470q3105L847N34992
15265E306284m52609l03444l4582l7648L42878K23366m2897l54930J64399Q5344
$$ y = [4230950, 4333410, 4698020, 4705874, 4832304, 4946971, 4749400, 4195389, 4229984, 4273289, 4124749, 4252810, 4521856, 4661113, 4708206, 4971834, 4978448, 4926223, 4578070, 4177833, 4631243, 4806235, 4912072, 4999370, 4785382, 4601455, 4524182, 4464813, 4576868, 4872903, 4635876, 4691704, 5043032, 4841151, 4874805, 4653662, 4976604, 4972978, 4785185, 4720750, 4466707, 4651772, 4863918, 5011483, 4876715, 5221830, 5163596, 4879624, 4843423, 4634005, 4706764, 4596767, 4687331, 4644777, 4444528, 4238280, 4227537, 4352083, 4402138, 4490581, 4388804, 4297239, 4455998, 4495805, 4186014, 4565945, 4665080, 4850550, 4767445, 4771292, 5306284, 4853675, 4550231, 4515649, 4478001, 4820879, 5044245, 5001348, 4646418, 4810817, 4896161]
15255D896161l96153j0416L62800J84616J62813n9461J22680l90993l60102Q9046
15245D600991K13812j52802k48522N0746r40k20569O73449j8047L70418n3671
$$ y = [4896161, 4500008, 4489592, 4852392, 5037008, 5199821, 5140360, 5263040, 4872047, 4511945, 4600991, 4814803, 4662001, 4413479, 4464225, 4463285, 4242716, 4916165, 4898118, 5268536, 5214865]
$$ [...]
##END NTUPLES=NMR SPECTRUM
##END=
