##TITLE=1H_CA-8867-1
 CDCl3, 8 sc, 
 1.06.2021
##JCAMPDX= 6.0         $$ Bruker NMR JCAMP-DX V2.0
##DATA TYPE= NMR SPECTRUM
##DATA CLASS= NTUPLES
##ORIGIN= UXNMR, Bruker Analytische Messtechnik GmbH
##OWNER= root
$$ XWIN-NMR		Version 3.5
$$ Tue Jun  1 11:57:10 2021 Russian Standard Time (UT+4h)  she@DPX200
##.OBSERVE FREQUENCY= 200.131506
##.OBSERVE NUCLEUS= ^1H
##.ACQUISITION MODE= SIMULTANEOUS
##.ACQUISITION SCHEME= undefined
##.AVERAGES= 8
##.DIGITISER RES= 18
##SPECTROMETER/DATA SYSTEM= spect
##.PULSE SEQUENCE= zg30
##.SOLVENT NAME= CDCl3
##.SHIFT REFERENCE= (INTERNAL, CDCl3, 0, 16.001)
##AUDIT TRAIL= $$ (NUMBER, WHEN, WHO, WHERE, WHAT)
$$ ##TITLE= Audit trail, XWIN-NMR		Version 3.5
$$ ##JCAMPDX= 5.01
$$ ##ORIGIN= Bruker BioSpin GmbH
$$ ##OWNER= she
$$ F:/spectra/data/she/nmr/H-F/1/pdata/1/auditp.txt
$$ ##AUDIT TRAIL=  $$ (NUMBER, WHEN, WHO, WHERE, WHAT)
(   1,<2021-06-01 11:55:58.18 +0400>,<she>,<DPX200>,
      <created by zg, POWCHK disabled, PULCHK disabled
       configuration hash MD5:
       00 E9 B6 7A A2 85 ED C7 34 08 36 98 17 FE 4E 26
       data hash MD5: 16K
       11 C2 0A 5B D9 AE F2 93 B3 50 FF 3D E7 54 43 E4>)
(   2,<2021-06-01 11:56:00.56 +0400>,<she>,<DPX200>,
      <Start of raw data processing
       efp BC_mod = 2 LB = 0.24 FT_mod = 6 PKNL = 1 PHC0 = -11281.29 PHC1 = 15.20099 SI = 16K 
       data hash MD5: 16K
       3E 73 B4 81 52 80 59 FA B6 C4 B6 73 98 24 D3 E8>)
(   3,<2021-06-01 11:56:20.71 +0400>,<she>,<DPX200>,
      <pk PHC0 = -200.1899 PHC1 = -0.2 
       data hash MD5: 16K
       BB 4A D5 DA 16 04 02 11 91 8D EB 48 4D 60 A5 D6>)
(   4,<2021-06-01 11:56:23.71 +0400>,<she>,<DPX200>,
      <abs ABSG = 5 
       data hash MD5: 16K
       40 72 68 E5 FE E4 E6 31 FD 2C E8 64 B6 EB 5B 0D>)
$$ ##END=
$$ 
$$ hash MD5
$$ 87 AE F1 DB 57 F7 BC 36 49 18 DD E9 1D 47 12 EC
##$RELAX= 
##$RELAX= 
##$RELAX= 
##$RELAX= 
##$RELAX= 
##$RELAX= 
$$ Bruker specific parameters
$$ --------------------------
##$DU= <F:/spectra>
##$EXPNO= 1
##$NAME= <H-F>
##$PROCNO= 1
##$TYPE= <nmr>
##$USER= <she>
##$AMP= (0..31)
100 100 100 100 100 100 100 100 100 100 100 100 100 100 100 100 100 100 
100 100 100 100 100 100 100 100 100 100 100 100 100 100 
##$AQSEQ= 0
##$AQ_mod= 1
##$AUNM= <au_zg>
##$AUTOPOS= <>
##$BF1= 200.13
##$BF2= 200.13
##$BF3= 200.13
##$BF4= 200.13
##$BF5= 200.13
##$BF6= 200.13
##$BF7= 200.13
##$BF8= 200.13
##$BYTORDA= 1
##$CFDGTYP= 0
##$CFRGTYP= 5
##$CHEMSTR= <none>
##$CNST= (0..31)
1 1 145 1 1 1 1 1 1 1 1 1 1 1 1 1 1 1 1 1 1 1 1 1 1 1 1 1 1 1 1 1 
##$CPDPRG= <>
##$CPDPRG1= <>
##$CPDPRG2= <>
##$CPDPRG3= <>
##$CPDPRG4= <mlev>
##$CPDPRG5= <mlev>
##$CPDPRG6= <mlev>
##$CPDPRG7= <mlev>
##$CPDPRG8= <mlev>
##$CPDPRGB= <>
##$CPDPRGT= <>
##$D= (0..31)
0 1.2 0 0 0 0 0 0 0 0.06 0 0.03 0 0 0 0 0.0002 0 0 0 0 0 0 0 0 0 0 0 0 
0 0 0 
##$DATE= 1622534157
##$DBL= (0..7)
120 120 120 120 120 120 120 120 
##$DBP= (0..7)
150 150 150 150 150 150 150 150 
##$DBP07= 0
##$DBPNAM0= <>
##$DBPNAM1= <>
##$DBPNAM2= <>
##$DBPNAM3= <>
##$DBPNAM4= <>
$$ [...]
##$SUBNAM3= <"">
##$SUBNAM4= <"">
##$SUBNAM5= <"">
##$SUBNAM6= <"">
##$SUBNAM7= <"">
##$SUBNAM8= <"">
##$SUBNAM9= <"">
##$SW= 16.9725357007746
##$SWIBOX= (0..15)
0 0 2 0 0 0 0 0 0 0 0 0 0 0 0 0 
##$SW_h= 3396.73913043478
##$TD= 16384
##$TD0= 1
##$TE= 0
##$TE2= 300
##$TE3= 300
##$TEG= 300
##$TL= (0..7)
0 120 120 120 120 120 120 120 
##$TP= (0..7)
150 150 150 150 150 150 150 150 
##$TP07= 0
##$TPNAME0= <>
##$TPNAME1= <>
##$TPNAME2= <>
##$TPNAME3= <>
##$TPNAME4= <>
##$TPNAME5= <>
##$TPNAME6= <>
##$TPNAME7= <>
##$TPOAL= (0..7)
0.5 0.5 0.5 0.5 0.5 0.5 0.5 0.5 
##$TPOFFS= (0..7)
0 0 0 0 0 0 0 0 
##$TUNHIN= 0
##$TUNHOUT= 0
##$TUNXOUT= 0
##$USERA1= <user>
##$USERA2= <user>
##$USERA3= <user>
##$USERA4= <user>
##$USERA5= <user>
##$V9= 5
##$VALIST= <valist>
##$VCLIST= <CCCCCCCCCCCCCCC>
##$VD= 0
##$VDLIST= <DDDDDDDDDDDDDDD>
##$VPLIST= <PPPPPPPPPPPPPPP>
##$VTLIST= <TTTTTTTTTTTTTTT>
##$WBST= 1024
##$WBSW= 4
##$XGAIN= (0..3)
0 0 0 0 
##$XL= 0
##$YL= 0
##$YMAX_a= 587752
##$YMIN_a= -768046
##$ZGOPTNS= <>
##$ZL1= 120
##$ZL2= 120
##$ZL3= 120
##$ZL4= 120
##$ABSF1= 16.06001
##$ABSF2= -0.912653
##$ABSG= 5
##$ABSL= 3
##$ALPHA= 0
##$AQORDER= 0
##$ASSFAC= 0
##$ASSFACI= 0
##$ASSFACX= 0
##$ASSWID= 0
##$AUNMP= <proc_1d>
##$AZFE= 0.1
##$AZFW= 0.1
##$BCFW= 0
##$BC_mod= 2
##$BYTORDP= 0
##$COROFFS= 0
##$CY= -3
##$DATMOD= 1
##$DC= 0
##$DFILT= <>
##$DTYPP= 0
##$F1P= 0
##$F2P= 0
##$FCOR= 1
##$FTSIZE= 16384
##$FT_mod= 6
##$GAMMA= 0
##$GB= 0
##$INTBC= 1
##$INTSCL= 1.334414e-10
##$ISEN= 128
##$LB= 0.24
##$LEV0= 0
##$LPBIN= 0
##$MAXI= 10000
##$MC2= 0
##$MEAN= 0
##$ME_mod= 0
##$MI= 1.114404
##$NCOEF= 0
##$NC_proc= -6
##$NLEV= 6
##$NOISF1= 3.799351
##$NOISF2= 2.8
##$NSP= 0
##$NTH_PI= 0
##$NZP= 0
##$OFFSET= 16.00096
##$PC= 1
##$PHC0= -11481.48
##$PHC1= 15.00099
##$PH_mod= 1
##$PKNL= yes
##$PPARMOD= 0
##$PSCAL= 0
##$PSIGN= 0
##$REVERSE= no
##$SF= 200.130002097053
##$SI= 16384
##$SIGF1= 3
##$SIGF2= 2
##$SINO= 5.538805
##$SIOLD= 16384
##$SREGLST= <1H.CDCl3>
##$SSB= 0
##$STSI= 16384
##$STSR= 0
##$SW_p= 3396.73913043479
##$SYMM= 0
##$S_DEV= 0
##$TDeff= 16384
##$TDoff= 0
##$TI= <>
##$TILT= no
##$TM1= 0
##$TM2= 0
##$TOPLEV= 0
##$USERP1= <user>
##$USERP2= <user>
##$USERP3= <user>
##$USERP4= <user>
##$USERP5= <user>
##$WDW= 1
##$XDIM= 16384
##$YMAX_p= 413304148
##$YMIN_p= -455641
$$ End of Bruker specific parameters
$$ ---------------------------------
##NTUPLES= NMR SPECTRUM
##VAR_NAME=  FREQUENCY,     SPECTRUM/REAL,   SPECTRUM/IMAG
##SYMBOL=    X,             R,               I
##VAR_TYPE=  INDEPENDENT,   DEPENDENT,       DEPENDENT
##VAR_FORM=  AFFN,          ASDF,            ASDF
##VAR_DIM=   16384,         16384,           16384
##UNITS=     HZ,            ARBITRARY UNITS, ARBITRARY UNITS
##FACTOR=    0.207333158178282, 1,           1
##FIRST=     3202.27203754885, 0,            0
##LAST=      -194.467092885942, 0,           0
##MIN=       -194.467092885942, -455641,     0
##MAX=       3202.27203754885, 413304148,    0
$$ Real data points
##PAGE= N=1
##DATA TABLE= (X++(R..R)), XYDATA
$$ [...]
4393B5954676J38984J76792K19340L49885M48562N43111O00427O41449P83860
4384B9857086Q79133R87345J021642J246877J422773J493820J579429J764453
4376D0252558J856243K005343K160837K199317K157926K317584K225310K126320
4368E7301438K134267J786605J633130J476195J041792O56948L25187j736l97330
4359F5956496m50792l35011k59168j41983m7430L897J85114L06407M98283P02506
4349F6418319M98328L58460M71986K60079J68113k3169k77447o03382p12691p40902
4339F5817694p71275q24226q30058p35123n64714m19448k82724j73672q0879j70488
4329F0965087n0204N8273j16172l02547m28668n47951r24897j103096j421111
$$ plain form
4393 25954676 26093660 26270452 26489792 26839677 27288239 27831350 28431777 29073226 29857086
4384 29857086 30736219 31723564 32745206 33992083 35414856 36908676 38488105 40252558
4376 40252558 42108801 44114144 46274981 48474298 50632224 52949808 55175118 57301438
4368 57301438 59435705 61222310 62855440 64331635 65373427 66030375 66355562 66353826 65956496
4359 65956496 65505704 65170693 64911525 64769542 64722112 64726009 64911123 65217530 65715813 66418319
4349 66418319 66916647 67275107 67747093 68007172 68175285 68152116 67874669 67271287 66558596 65817694
4339 65817694 65046419 64222193 63392135 62657012 62092298 61672850 61390126 61216454 61135575 60965087
4329 60965087 60914883 60973156 60856984 60554437 60125769 59577818 58652921 57549825 56128714
4320E6128714j593495j859396j877632j938267k131133k107545k008517k105435
4312D0507294j897986j765347j642073j550742j511178j413793j156294j166950
4304B8402931r82745r58471r16071p00547p14558o99282o90826o67990n08280
4295B1564161m56061l74954l62447m94564l24891m68167l52973l35687l87356
4286A8007061l24608j43346p6284k72829k20750j43595q5943r4897m0844j32896
4276A6471069o4700K2644J27270J26114L0100J55779J34151L1752K41719K27659
4266A7503557K03261J34361J70676J00909O7125O4106L0858l9115k34172m02282
4256A7599284m15107m70320m92268n12138m53056m87155o24878n78262n72854
$$ plain form
4320 56128714 54535219 52675823 50798191 48859924 46728791 44621246 42612729 40507294
4312 40507294 38609308 36843961 35201888 33651146 32139968 30726175 29569881 28402931
4304 28402931 27420186 26461715 25545644 24845097 24130539 23431257 22740431 22072441 21564161
4295 21564161 21108100 20733146 20370699 19876135 19551244 19083077 18730104 18394417 18007061
4286 18007061 17682453 17539107 17462823 17189994 16969244 16825649 16739706 16644809 16603965 16471069
4276 16471069 16406369 16429013 16556283 16682397 16712497 16868276 17002427 17034179 17275898 17503557
4266 17503557 17706818 17841179 18011855 18112764 18179889 18243995 18274853 18235738 18001566 17599284
4256 17599284 17184177 16713857 16221589 15709451 15256395 14769240 14144362 13566100 12993246
4247A2993246l96770n21558m04575l91814l39486l00468k84465j97995l28921
4238I827194k17956k25747k46505j87757j07916j57125j81189j78975q6804p8188
4228H159032n1542r4305o9678n6197q0356o7434l1086K1014q0196q5223j35335
4217G428694j47312R861P0977n2346n2290o0453j5503j39075m0119P7773L9330
4206G119537m8015j0098k4026p2695j6835M789l7161N8589K6240m5684J3169N5583
4194G023393j34700n9582n6096R1162J05889o1996j02165p4130l9088p3768j00343
4183F518576l2171j7015m375R477P218k4203l4514J67418Q1201l7788R8962J30527
4171F863313L7043K8646J29902K17058K08614J52281J62519K35520J74726P0056
$$ plain form
4247 12993246 12596476 12074918 11670343 11278529 10939043 10638575 10354110 10156115 9827194
4238 9827194 9609238 9383491 9136986 8949229 8841313 8684188 8502999 8324024 8237220 8159032
4228 8159032 8107490 8013185 7943507 7887310 7806954 7739520 7708434 7729448 7649252 7564029 7428694
4217 7428694 7281382 7291243 7362220 7309874 7257584 7197131 7181628 7042553 7002434 7080207 7119537
4206 7119537 7071522 7061424 7037398 6964703 6947868 6952657 6915496 6974085 7000325 6954641 6967810 7023393
4194 7023393 6888693 6829111 6773015 6864177 6970066 6908070 6805905 6731775 6692687 6618919 6518576
4183 6518576 6486405 6469390 6465015 6474492 6481710 6457507 6422993 6590411 6671612 6633824 6732786 6863313
4171 6863313 6900356 6929002 7058904 7275962 7484576 7636857 7799376 8034896 8209622 8279678
4161H279678J75076L39323K86700J61054J59998K92637K74249K54076K70888J88845
4151A0682524K79606L63130K64041K78659L47360K71727M21722L03699K70432
4142A3482900K55288J67498N6608J501o8482j66251j26056q9273l3014r7325k05666
4131A3177728j09403j79597j79911l3307l7937j8029O7820K42416K12849J39167
4121A3281796L00120L81016L12179N77696N80208L83744M86166O17089M78415
4112A7398429M94070M18008K94086J72320J07930L3810j04285k18559p4571k01858
4102A8319380j18629l41267m78422m54963n34350n46130o68786n97486m08121
4093A4171226l07935k05529j61883j51934q8093J40833J18069J7184j4866k5607
$$ plain form
4161 8279678 8454754 8794077 9080777 9241831 9401829 9694466 9968715 10222791 10493679 10682524
4151 10682524 10962130 11325260 11589301 11867960 12215320 12487047 12908769 13212468 13482900
4142 13482900 13738188 13905686 13962294 13963795 13895313 13729062 13603006 13513733 13480719 13383394 13177728
4131 13177728 13068325 12888728 12708817 12675510 12637573 12619544 12687364 12929780 13142629 13281796
4121 13281796 13581916 13962932 14275111 14852807 15433015 15816759 16302925 16920014 17398429
4112 17398429 17892499 18310507 18604593 18776913 18884843 18918653 18814368 18595809 18521238 18319380
4102 18319380 18200751 17859484 17381062 16926099 16391749 15845619 15176833 14579347 14171226
4093 14171226 13863291 13657762 13495879 13343945 13255852 13396685 13514754 13531938 13517072 13491465
4083A3491465n8449j6156M0341q792M6464Q4842o7295r4337n4656j86582r2858
4072A3083987j94377j68663k99059k78196m54534m02512n65354m10818l86652
4063I923822m71761k98552k51545k15663k74373j30731j87856j25902k35381r7338
4053G634720Q993j33050l8648q0422q5379M3768r6642P585r0240q9242j31960
4042F949483n4954L7711L3689p805j01121r2638j77277N5175M4413j0684K8409
4031F704401P7077K4158l4198o002K1838J40043j9633j02218j32691j13127k09705
4020F349943k73621j06419l5013m0028p0195p6127r6519K3623p5776k19219k5758
4009E354891N4660m8735M18J1393k5665p1643J9462K2561l0125r4668q6846k8087
$$ plain form
4083 13491465 13433016 13416860 13457201 13448409 13494873 13579715 13512420 13418083 13363427 13176845 13083987
4072 13083987 12889610 12720947 12421888 12143692 11689158 11286646 10721292 10310474 9923822
4063 9923822 9452061 9153509 8901964 8686301 8411928 8281197 8093341 7967439 7732058 7634720
4053 7634720 7643713 7510663 7472015 7391593 7306214 7349982 7253340 7260925 7170685 7081443 6949483
4042 6949483 6894529 6932240 6965929 6958124 6857003 6764365 6587088 6642263 6686676 6675992 6704401
4031 6704401 6781478 6805636 6771438 6765436 6787274 6927317 6907684 6805466 6672775 6559648 6349943
4020 6349943 6076322 5969903 5934890 5894862 5824667 5748540 5652021 5675644 5599868 5380649 5354891
4009 5354891 5409551 5360816 5361234 5372627 5346962 5275319 5294781 5317342 5287217 5192549 5105703 5077616
3997E077616n0606K0197l1538R9690J11941K7932P0234K2042j743j780O6296J43361
3985E553642N7971r2451L1564k5850J1204n7581J2005J32095m7517M4800l5102
3974E584780j16914m2666M3613n7502l6887J11556m5427q643J8872n8406n3233
3963E339143j5482J19150J19147j00755j49083N3743Q4656P8180K3823P4554R5666
3952E722742L1138M2356N035n2273P5369J20147J04024p175j0401K3176j9897
3941F034241k7695l8986J756k4609J04027j1770j606L2181L7012Q2506N8063J36151
3929F381271Q7920J5993Q1050N4687M4071Q6382R9788O6095Q6625J45394K9417
3918G178693J04583J19789J41493K57539J70072J52737R6934K51837J84605K60014
$$ plain form
3997 5077616 5027010 5047207 5015669 5115359 5227300 5255232 5325466 5347508 5345765 5343985 5410281 5553642
3985 5553642 5611613 5519162 5550726 5524876 5536080 5478499 5490504 5622599 5575082 5619882 5584780
3974 5584780 5467866 5425200 5468813 5411311 5374424 5485980 5440553 5431910 5450782 5392376 5339143
3963 5339143 5323661 5442811 5561958 5461203 5312120 5365863 5450519 5528699 5552522 5627076 5722742
3952 5722742 5753880 5796236 5801271 5748998 5824367 5944514 6048538 6041363 6030962 6054138 6034241
3941 6034241 6006546 5967560 5969316 5944707 6048734 6036964 6035358 6067539 6104551 6187057 6245120 6381271
3929 6381271 6469191 6485184 6566234 6620921 6664992 6751374 6851162 6917257 7003882 7149276 7178693
3918 7178693 7283276 7403065 7544558 7802097 7972169 8124906 8221840 8473677 8658282 8918296
3908H918296L02440L53343K82416K69863M27173L58450L87127M72711L74407K40009
3898A2386235N28741M80949K92407L12261J39691J80382J45918m6172k8695n9540
3888A4332177r2917j33925j5102m2569m3690R7286k1553k143j8573J51594J76787
3877A4387372K99825K93191L16102M96725M37970N04807M84392O11047N73946
3868A8405377M13586N34605M47470K44194J33302R0733j3562j46645p2745p1518
3858A9964797j12782k15643k27758l75198m32756k21689k97069l81054m04359
3849A7296489m00456l01361j53622R900m1578M7761J40362K74755J71410K47904
3839A7291564J87490K81601L06824K13889J20253J55596J66420J11932K5849J66341
$$ plain form
3908 8918296 9220736 9574079 9856495 10126358 10553531 10911981 11299108 11771819 12146226 12386235
3898 12386235 12914976 13395925 13688332 14000593 14140284 14320666 14466584 14420412 14391717 14332177
3888 14332177 14239260 14105335 14090233 14047664 14003974 14101260 14079707 14077564 14058991 14210585 14387372
3877 14387372 14687197 14980388 15296490 15793215 16231185 16735992 17220384 17831431 18405377
3868 18405377 18818963 19353568 19801038 20045232 20178534 20269267 20255705 20109060 20036315 19964797
3858 19964797 19852015 19636372 19408614 19033416 18600660 18378971 18081902 17700848 17296489
3849 17296489 16896033 16594672 16441050 16450950 16409372 16457133 16597495 16872250 17043660 17291564
3839 17291564 17479054 17760655 18067479 18281368 18401621 18557217 18723637 18835569 18861418 19027759
3829A9027759J69202J76720j7575j03090R612k50892k06985k48892j81324j08706
3819A8265829p9523j22407m1309j4543n5091J39732J15984J62129O6658O5217
3809A8502676K32752J45381o1522N9360J56100K25324J60824K65352K82713L48202
3799B0317162L49330L35099M07509M27920M90099L99844N29310O10270P07797
3790B4574340Q25483Q63267Q64846J054781J064163J286185J386091J541615J508020
3781C4968791J615390J878205K339497K568816K929044L361620L779038M199503
3773E7639904M991633N754121O343440O931699P718663Q491163R566511J1106192
3765A18543326J3050506J5053084J6302116J6611973J5904108J5061978J4332480
$$ plain form
3829 19027759 19196961 19373681 19356106 19253016 19262628 19011736 18804751 18555859 18374535 18265829
3819 18265829 18186306 18063899 18022590 18008047 17952956 18092688 18208672 18370801 18437459 18502676
3809 18502676 18735428 18880809 18819287 18878647 19034747 19260071 19420895 19686247 19968960 20317162
3799 20317162 20666492 21001591 21409100 21837020 22327119 22726963 23256273 23866543 24574340
3790 24574340 25399823 26263090 27127936 28182717 29246880 30533065 31919156 33460771 34968791
3781 34968791 36584181 38462386 40801883 43370699 46299743 49661363 53440401 57639904
3773 57639904 62631537 68385658 74729098 81660797 89379460 97870623 107437134 118543326
3765 118543326 131593832 146646916 162949032 179561005 195465113 210527091 224859571
3758B24859571J1526340M181512n924630j7201499k5548737k8529984k5862042
3751A37500531k0095007j5005695j0927490q113711o174391m931351l805603l089300
3743F5357983k525938j980168j603295j302429j175111r71547j057939j020967
3735E3720589r72531j070239r17357o49561o63816n23069k68560r8979J18556
3726D8675033K98436K33660L63552M48986M79858N96800O54714Q15602R44209
3717E3510850J138919J302034J650985J892765K219259K535503L135198L710194
3709G1095707M337610M933389N606955O332790P088771Q096587R097856J0695147
3701A27284812J2614865J4509272J5701843J5580281J5631525J6052895J4656438
$$ plain form
3758 224859571 236385911 240567423 234642793 217441294 191892557 163362573 137500531
3751 137500531 117405524 102399829 91472339 83358628 77184237 72252886 68447283 65357983
3743 65357983 62832045 60851877 59248582 57946153 56771042 55799495 54741556 53720589
3735 53720589 52748058 51677819 50760462 50110901 49447085 48924016 48655456 48556477 48675033
3726 48675033 48973469 49207129 49570681 50019667 50499525 51096325 51751039 52566641 53510850
3717 53510850 54649769 55951803 57602788 59495553 61714812 64250315 67385513 71095707
3709 71095707 75433317 80366706 85973661 92306451 99395222 107491809 116589665 127284812
3701 127284812 139899677 154408949 170110792 185691073 201322598 217375493 232031931
3694B32031931Q596274p76558q650205j4820821k1045628k5768423k5222318k0322041
3686A24022211j5400278j1380767q457398o558119n084341m151694l265455k625397
3678F7098762k117442j670602j418434j313907j367361j295280j234369j185893
3670E5495474j156025j102942r95314q95502p86645q12134p53669p06630o61003
3661D7625610o69842o54177o61601p55745p94620p14352o05058n02350m74287
3652D1793578l81865k09114k77808j68479o8817k5669j55829p1498p0216j21850
3642D0242433p9705r6510O4597k3577l8111n8o6507j52717j8359k13933l62957
3631C9254596l04036l20854m69643n02175n32775n77068n04249m21720n35048
$$ plain form
3694 232031931 240628205 239851647 231201442 216380621 195334993 169566570 144344252 124022211
3686 124022211 108621933 97241166 88783768 82225649 77141308 72989614 69724159 67098762
3678 67098762 64981320 63310718 61892284 60578377 59211016 57915736 56681367 55495474
3670 55495474 54339449 53236507 52241193 51345691 50559046 49746912 48993243 48286613 47625610
3661 47625610 46955768 46301591 45639990 44884245 44089625 43375273 42770215 42267865 41793578
3652 41793578 41411713 41202599 40924791 40756312 40687495 40661826 40505997 40434499 40364283 40242433
3642 40242433 40162728 40066218 40130815 40107238 40069127 40069069 40002562 39849845 39831486 39617553 39254596
3631 39254596 38950560 38629706 38160063 37657888 37125113 36548045 36043796 35622076 35087028
3622C5087028m81045l62622m12596l73142l21587l51855j86395j64893j96566
3613C2236327j67413k3204M319K3919J14690M5864J09020k1541Q5397J27334p9944
3602C2454768j31526n5422j52578k27718j52127p2313r5566j63413j44179n0307
3592C1209619j34008m0425o8214P5147P7947J3412J50564K49126K46454L94982
3582C2174604L92000K47613K77068L11812L34487M23299M37950M49343M61398
3573C5509574M91815M28607N69577N45043M14007N01995L77072M85529M72992
3564C9796211M40016M61160M20370N43947N31161O64282O45981P20946Q46269
3555D5070343Q32788R34211R07813J049754J054581J226476J282292J457197J380546
$$ plain form
3622 35087028 34605983 34243361 33830765 33457623 33136036 32784181 32597786 32432893 32236327
3613 32236327 32068914 32045710 32050029 32073948 32188638 32234502 32343522 32321981 32407378 32534712 32454768
3602 32454768 32323242 32267820 32115242 31887524 31735397 31663084 31567518 31404105 31259926 31209619
3592 31209619 31075611 31035186 30966972 31042119 31120066 31133478 31284042 31533168 31779622 32174604
3582 32174604 32566604 32814217 33091285 33403097 33737584 34160883 34598833 35048176 35509574
3573 35509574 36001389 36429996 36999573 37544616 37958623 38460618 38837690 39323219 39796211
3564 39796211 40236227 40697387 41117757 41661704 42192865 42857147 43503128 44224074 45070343
3555 45070343 45903131 46837342 47745155 48794909 49849490 51075966 52358258 53815455 55196001
3546E5196001J273503J223154J200887R54982P83813O22087K67942N4406j91939
3537F1384836l04235j67371p113K38359K39403N23012Q17887Q07193J116893J081937
3527F5730801J090653J098826R46102Q71175O70386L22108P6288p353j89353l89366
3517G0220267l92891l94880n37551o06477n37513o37296n51905n90829o28660
3508F5342265o98320r32601q14752q43377q64005r01192q07319p58985o78546
3499E8043168l94683n00326m93294l88474k52203k76577j30497j86266k56677
3490E5164171k44011l31818l09445m25204m92581n12874n41324l73174k66509
3481E1667231m23168k88915j04512j79809j17186J22586L5142J58356K20313K51009
$$ plain form
3546 55196001 56469504 57692658 58893545 59848527 60632340 61254427 61522369 61576775 61384836
3537 61384836 61080601 60913230 60906117 61144476 61383879 61906891 62724778 63531971 64648864 65730801
3527 65730801 66821454 67920280 68866382 69737557 70407943 70730051 70806339 70798986 70609633 70220267
3517 70220267 69827376 69432496 68894945 68288468 67750955 67113659 66561754 65970925 65342265
3508 65342265 64643945 63711344 62896592 62053215 61189210 60288018 59480699 58721714 58043168
3499 58043168 57648485 57148159 56654865 56266391 56014188 55737611 55607114 55420848 55164171
3490 55164171 54920160 54588342 54278897 53853693 53361112 52848238 52306914 51933740 51667231
3481 51667231 51244063 50955148 50850636 50670827 50553641 50676227 50711369 50869725 51090038 51341047
3471E1341047K87645L22824K86713L36568M45212M01557M64222M57942L50449
3462E4694179M77479L58575M27706L57682K73038M13407J89677J74370L0141L2733
3452E7428987j32769j98625k83641l96124m84855m38877l93317m25019l60855
3443E4314905k52756k61498o9323j33112m9403R7281J85821K82417K92751N42664
3433E4949747M94822M85979M63302O68691P64224P31649P00610P83692Q01560
3424F0844276O82030P36729P29604O72817N77929Q12834P59485P54784R01081
3415F7471569R81372J125864J109543J011167J078638J127572J162662R20428
3407G5988815Q33775R45865P25706P74797P83092P04340N28850M54857L14714
$$ plain form
3471 51341047 51628692 51951516 52238229 52574797 53020009 53421566 53885788 54343730 54694179
3462 54694179 55171658 55530233 55957939 56315621 56588659 57002066 57191743 57366113 57396254 57428987
3452 57428987 57296218 57097593 56813952 56417828 55932973 55494096 55100779 54675760 54314905
3443 54314905 54062149 53800651 53731328 53598216 53548813 53646094 53831915 54114332 54407083 54949747
3433 54949747 55444569 55930548 56393850 57062541 57826765 58558414 59259024 60042716 60844276
3424 60844276 61526306 62263035 62992639 63665456 64243385 65056219 65815704 66570488 67471569
3415 67471569 68452941 69578805 70688348 71699515 72778153 73905725 75068387 75988815
3407 75988815 76822590 77768455 78494161 79268958 80052050 80756390 81285240 81740097 82054811
3398H2054811K09239J37891j6422j12359k91225m10495o31268p26368q08570p75727
3388G8629507q31103p47720p36442n94336n96945m58401l24936j54923M2867K56666
3378G4484234M38002N09752O07085O62617R08500Q55704P03860N89967M49900
3369H0209621J75620j71855n50781o66835q61683p83524o80820o08833n44515
3360G5516395l03704k62956j89164j87187j75204j53327j70260j79315k8848N0892
3350G3917322L83764N31298Q23512J004631J266676J404415J541369J864473K026438
3341H4763898K264709K539685K851771L259870L564649L688861L534274L035593
3333A09503310K630108J730949M44571j423669l878389o191711p330200p425178
$$ plain form
3398 82054811 82264050 82401941 82385519 82273160 81981935 81571440 80940172 80213804 79405234 78629507
3388 78629507 77798404 77050684 76314242 75719906 75122961 74664560 74339624 74184701 74227568 74484234
3378 74484234 74922236 75431988 76039073 76701690 77610190 78465894 79169754 79759721 80209621
3369 80209621 80385241 80213386 79662605 78995770 78134087 77350563 76669743 76060910 75516395
3360 75516395 75212691 74949735 74760571 74573384 74398180 74244853 74074593 73895278 73866430 73917322
3350 73917322 74301086 74832384 75655896 76660527 77927203 79331618 80872987 82737460 84763898
3341 84763898 87028607 89568292 92420063 95679933 99244582 102933443 106467717 109503310
3333 109503310 112133418 113864367 114308938 112885269 109006880 102815169 95484969 88059791
3325H8059791o798236n907083m856360l942555l298485k854208k287521j852258
3317E6263085j554281j331127j243791r17597q69862j045044r30030r81148r67881
3308D6422324q05732q59882q88213r50490p78451p62627p52384p34117o81577
3299C9208851o68698o39249n51509n41862n67127o41105n75102m40404m51503
3290C4132292n01919n74995n08352m13657n10399l41367m37144m76938k69927
3281C0097594m20663k41071k04429j70374j74073p6821m9289j09533j06238l5783
3271B8509320K5946P475K2250N963m6569q782N4974N7140M2786Q5268J76142J08373
3259B9040286K21754K08717K42929J87210L53407L14928M70956M45727M76700
$$ plain form
3325 88059791 81261555 75354472 70498112 66555557 63257072 60402864 58115343 56263085
3317 56263085 54708804 53377677 52133886 51216289 50346427 49301383 48371353 47390205 46422324
3308 46422324 45616592 44756710 43868497 42918007 42139556 41376929 40624545 39890428 39208851
3299 39208851 38540153 37900904 37349395 36807533 36240406 35599301 35024199 34583795 34132292
3290 34132292 33630373 33055378 32547026 32133369 31622970 31281603 30844459 30367521 30097594
3281 30097594 29676931 29435860 29231431 29061057 28886984 28810163 28760874 28651341 28545103 28509320
3271 28509320 28535266 28542741 28564991 28570954 28524385 28515603 28570577 28627717 28670503 28755771 28931913 29040286
3259 29040286 29262040 29470757 29713686 29900896 30254303 30569231 31040187 31485914 31962614
3250C1962614N30130O89583P89427Q61199R66878J125398J104215J297069J269258
3241D0595771J472860J699639J822639J925581K218248K494016K607652K908069
3233E7744475L251773L597510L982230M319574M729430N140179N681315O049776
3225I4496262O572832O925411P395185P640357P705485P623898O945910O134428
3217A51439768M859677L242107J124829j322330m190292o677589q749894r696283
3209A30029993r833652r601714q761159p749993o851337o026718n359417m564688
3201G1281315m029649l505424l106576k712415k502549k237450j996670j977249
3193D9213333j776682j697097j496336j498012j522863j295459j176104j059683
$$ plain form
3250 31962614 32492744 33182327 33971754 34832953 35799831 36925229 38029444 39326513 40595771
3241 40595771 42068631 43768270 45590909 47516490 49734738 52228754 54836406 57744475
3233 57744475 60996248 64593758 68575988 72895562 77624992 82765171 88446486 94496262
3225 94496262 101069094 107994505 115389690 123030047 130735532 138359430 145305340 151439768
3217 151439768 156299445 159541552 160666381 159344051 155153759 148476170 139726276 130029993
3209 130029993 120196341 110594627 101833468 94083475 87232138 81205420 75846003 71281315
3201 71281315 67251666 63746242 60639666 57927251 55424702 53187252 51190582 49213333
3193 49213333 47436651 45739554 44243218 42745206 41222343 39926884 38750780 37691097
3185C7691097j009299r61746q65405q88816r08834q69101q77861p45261p84800
3176B9779974o08678o50414n66584o08048l88526m13011l22363k27999k38489
3167B5755862j84339q5106p0555n3824l778R9555J6496L5696J24361J74612K22332
3156B6031312J78432K57279J66697M9568M5435K1105k45302l71998m20298n90173
3146B5122057p22756p71080p07327o07033n62122o66177n07624m53240m44730
3137A9679968m06763m12721l45874k73607k60160l30616k12995l20414k57715
3128A6859103k60491j95632k61008j48235j92386k11427j09464r8946j29396M404
3118A5256522p3338j39363j87280k4522p1044j59462j36667j04677j13101k31510
$$ plain form
3185 37691097 36681798 35720052 34854647 33965831 33056997 32187896 31310035 30564774 29779974
3176 29779974 29171296 28520882 27954298 27346250 26957724 26544713 26222350 25994351 25755862
3167 25755862 25571523 25486417 25415862 25362038 25358260 25457815 25474311 25510007 25634368 25808980 26031312
3156 26031312 26209744 26467023 26633720 26683288 26728723 26749828 26504526 26132528 25712230 25122057
3146 25122057 24399301 23628221 22920894 22313861 21751739 21085562 20577938 20124698 19679968
3137 19679968 19273205 18860484 18514610 18241003 17980843 17650227 17437232 17116818 16859103
3128 16859103 16598612 16402980 16141972 15993737 15801351 15589924 15480460 15381514 15252118 15256522
3118 15256522 15183184 15043821 14856541 14832019 14760975 14601513 14464846 14360169 14247068 14015558
3108A4015558q9966j37114j59920j15678l1581J676k0830L9918K8655J01514n5588
3097A3576644O6925O8023R3375R6187M2546J39439J24271O6860P6034R9408J21358
3086A4571070J48683J5729L591o8584j1286J03553r7817m3353J0523j12018j00653
3075A4419438j03647K2202L476r6039j20497j01764j51792j89084l8786j17271
3065A3526236j14807M0656j01907j91108j23032j39329j02151j01502j12774n5530
3055A2524752n4825o7101k10567K5104P7825K8300O637L919P7574K4527J8990
3044A2455135R1030Q9270N7384J64828K11386K6449J01008J07975K13612J86368
3034A3704445J84789J41601K00391K65020J58309J93789J13125K17118K67813
$$ plain form
3108 14015558 13925592 13788478 13628558 13512880 13481299 13482975 13462145 13502063 13530718 13632232 13576644
3097 13576644 13643569 13711592 13804967 13901154 13943700 14083139 14207410 14274270 14350304 14449712 14571070
3086 14571070 14719753 14735482 14739073 14670489 14659203 14762756 14664939 14621586 14632109 14520091 14419438
3075 14419438 14315791 14337993 14341469 14245430 14124933 14023169 13871377 13682293 13643507 13526236
3065 13526236 13411429 13452085 13350178 13159070 13036038 12896709 12794558 12693056 12580282 12524752
3055 12524752 12469927 12402826 12192259 12217363 12295188 12323488 12330125 12334044 12411618 12436145 12455135
3044 12455135 12546165 12635435 12692819 12857647 13069033 13095482 13196490 13304465 13518077 13704445
3034 13704445 13889234 14030835 14231226 14496246 14654555 14848344 14961469 15178587 15446400
3025A5446400J80662J61099K97845K58637K07912K05491L53884K34827L37155
3016A7683912L96868K58206K86445K74931L02509L40025L20631K78554K64098
3007B0406179K81490K55641J75786K83783K67189K43003K97458K95506K40856
2998B2746891L36283L58880L62746L53125K72345M12248L16440K89112M26387
2989B5874457M18116L77571L50541M76012M59173N00112M91237O06845M11346
2980B9965410N68197O26063L80358M27329K80090L97904L19751L16956K78655
2971C3560713K29260K44818L35038L69891L12129L10134M56875L99689L00779
2962C6519326K84722K72702K80586K11976J04671J21213J28613J78805K31378
$$ plain form
3025 15446400 15627062 15788161 16086006 16344643 16552555 16758046 17111930 17346757 17683912
3016 17683912 18080780 18338986 18625431 18900362 19202871 19542896 19863527 20142081 20406179
3007 20406179 20687669 20943310 21119096 21402879 21670068 21913071 22210529 22506035 22746891
2998 22746891 23083174 23442054 23804800 24157925 24430270 24842518 25158958 25448070 25874457
2989 25874457 26292573 26670144 27020685 27496697 27955870 28455982 28947219 29554064 29965410
2980 29965410 30533607 31159670 31540028 31967357 32247447 32645351 32965102 33282058 33560713
2971 33560713 33789973 34034791 34369829 34739720 35051849 35361983 35818858 36218547 36519326
2962 36519326 36804048 37076750 37357336 37569312 37673983 37795196 37923809 38102614 38333992
2953C8333992K08212L18170M31468M13152L53768L47400L26850L75879L42710
2944D1451601L61947K79896K24159J25458K00791J51123K27305J92094J75404
2935D3389778J71898J38188J40040O7999J36833J35008J14358R4679L1153m7618
2925D4372316q1475r7924q7365j93727k92261m47218n36866m48142n63342o26414
2915D0997582n59402o36361m80872n51974n94054n95976n69778o60388o49447
2906C5699330p37060q52941p90805q97053q11274q90602r00673q78043q35911
2897B8104968p68780p23117o86780p70368p02589o64795p49584p95007q71385
2888B1372563p86926p13898o53534o75238p00831o12695n25928m65251o03320
$$ plain form
2953 38333992 38542204 38860374 39291842 39704994 40058762 40406162 40733012 41108891 41451601
2944 41451601 41813548 42093444 42317603 42443061 42643852 42794975 43022280 43214374 43389778
2935 43389778 43561676 43699864 43839904 43907903 44044736 44179744 44294102 44388781 44419934 44372316
2925 44372316 44290841 44192917 44105552 43911825 43619564 43172346 42635480 42187338 41623996 40997582
2915 40997582 40438180 39801819 39320947 38768973 38174919 37578943 37009165 36348777 35699330
2906 35699330 34962270 34109329 33318524 32421471 31610197 30719595 29818922 28940879 28104968
2897 28104968 27336188 26613071 25926291 25155923 24453334 23788539 23038955 22243948 21372563
2888 21372563 20585637 19871739 19218205 18542967 17842136 17229441 16703513 16238262 15634942
2879A5634942m26663l84229m84240m67340l99251m09438l30868l46993l38225
2870A2047695k72261k31937l83040m07962k40937k23781l51253j26012k68449
2861I542063k97137k16021j73880j29726j75433j41238k86120k05532j45914j49971
2851G621091j02264k8340k13348j19729j27561j26923j00866q6608k31062r6485
2841F387905p9898j04389j64454j56424J0832l4832j60235j71068n0830j43651
2831E332956j84333O84j18084r8151M0051m8347m7800M0460m3371p2876j02581
2820D698608p7414k3198j4735n8886r1507j06158m250j92r4794j49967N8756n4113
2808D082150l1921l6292j86665L6429j19659j4321K6505k7349l8587p3865k4056
$$ plain form
2879 15634942 15208279 14824050 14339810 13872470 13473219 13063781 12732913 12385920 12047695
2870 12047695 11775434 11543497 11160457 10752495 10511558 10287777 9936524 9810512 9542063
2861 9542063 9244926 9028905 8855025 8725299 8549866 8408628 8122508 7916976 7771062 7621091
2851 7621091 7518827 7490487 7277139 7157410 7029849 6902926 6802060 6715452 6484390 6387905
2841 6387905 6308007 6203618 6039164 5882740 5893572 5858740 5698505 5527437 5476607 5332956
2831 5332956 5148623 5149307 5031223 4933072 4973123 4924776 4876976 4917436 4874065 4801189 4698608
2820 4698608 4621194 4597996 4583261 4524375 4432868 4326710 4322460 4322268 4227474 4077507 4136263 4082150
2808 4082150 4050229 4013937 3827272 3863701 3744042 3729721 3756226 3728877 3690290 3616425 3592369
2797C592369j05814J9150o6449k197j6759o2294Q8068j04137j13664m4585M0296
2786C223984o2204L4275k1358n8727K2754k3449R148M9693l6441j5666k9783p6020
2774C016206j8307J0949J0979r096j5843l4723M2416o8378l9295k7242j00650
2763B767016J24522M8576l1979n2727n3640O0354l9814R392J22780M3766j5381
2752B982865j21942m8811k354M8285J2569M835P9327j9046o9461p0814l4990P58
2740B761221R401O3791j24082l8904j8262Q232O0732J66744J18563j9901N1296
2729C038831k7849M1011N5463L9113M8880J09355M2040N6844L42239k2069P0197
2718C794055J76135J00524P8062J52224J76271l3811J5904m3655l6466o76l0612
$$ plain form
2797 3592369 3486555 3505705 3439256 3437059 3420300 3358006 3446074 3341937 3228273 3183688 3223984
2786 3223984 3161780 3196055 3174697 3115970 3138724 3115275 3124423 3174116 3137675 3122009 3092226 3016206
2774 3016206 2997899 3008848 3019827 3010731 2994888 2960165 3002581 2934203 2894908 2867666 2767016
2763 2767016 2891538 2940114 2908135 2855408 2801768 2862122 2822308 2831700 2954480 2998246 2982865
2752 2982865 2860923 2812112 2809758 2858043 2870612 2875447 2954774 2935728 2866267 2795453 2760463 2761221
2740 2761221 2770622 2834413 2710331 2671427 2653165 2661397 2722129 2888873 3007436 2987535 3038831
2729 3038831 3010982 3051993 3107456 3146569 3195449 3304804 3346844 3403688 3745927 3723858 3794055
2718 3794055 3970190 4070714 4148776 4301000 4477271 4443460 4459364 4415709 4379243 4378567 4347955
2707D347955m3503j10727p7384j15409p6110k9228j07014o8070j48631j22971
2697C448908j46559n7409p5615j21364r53r9567R6006j68115j66082l2969L9058
2686B715339q317k02351P4794j54305L9082N0720j9787q6296j51692J3573O527
2675B277287l9598j4430o4424o6417j06834L001j17188M8378J9515J8653j5124
2664A942819m0594j46867O796O3222J5522q923j172K1504o7490J4372P4965j4261
2652A859893j1044k4024k9441J1180Q0923N835j10408K33062M483j0866j28469
2641A881124m664O3287M1967K2676j4046R5172R8134K3671n6884n7286K2202L3538
2629B148891M819O035Q0554Q0996j4647J1943q1184J13257j8255j01405M1165
$$ plain form
2707 4347955 4304452 4193725 4116341 4000932 3924822 3895594 3788580 3720510 3571879 3448908
2697 3448908 3302349 3244940 3169325 3047961 3047008 2947441 3043447 2875332 2709250 2676281 2715339
2686 2715339 2707022 2504671 2579465 2425160 2464242 2514962 2495175 2408879 2257187 2270760 2277287
2675 2277287 2237689 2223259 2158835 2092418 1985584 1988585 1871397 1919775 1939290 1957943 1942819
2664 1942819 1902225 1755358 1762154 1825376 1840898 1831975 1830803 1852307 1784817 1799189 1874154 1859893
2652 1859893 1848849 1824825 1795384 1806564 1887487 1893322 1782914 2015976 2020459 2009593 1881124
2641 1881124 1876460 1939747 1981714 2004390 1990344 2085516 2183650 2207321 2150437 2093151 2115353 2148891
2629 2148891 2153710 2159745 2240299 2321295 2306648 2318591 2237407 2350664 2332409 2231004 2272169
2618B272169O7380R2619P9215J5828J7731L8770j7209j6282J14630J00796M4659
2607B810306P6918k2785Q2155R3866q151J13797J8178j9368O1377Q1596n0057
2596C237832J3531Q098L0024j3362p6434J55473l936m0843Q1636Q5323l2526l4154
2584C410662P1233K6965k5656N32P6482m0770k7616J41234P5808L7401j2715J33741
2572C867301p634j4158R3952K1307J15725m1874o2630l6829n280j0532j29498
2561C789850k2978o485M7527j31356j26688q6187j147R462n1722l250Q2809N961
2549C505796j2700k9854J5479l1071J02402P585k474N1443k2428J441L3949M2115
2537C661683L5397j4302m7748R8743O2005J5041j5373M057R973k7390n1923J44686
$$ plain form
2618 2272169 2339549 2432168 2511383 2527211 2544942 2583712 2566503 2550221 2664851 2765647 2810306
2607 2810306 2887224 2864439 2946594 3040460 3032309 3146106 3164284 3144916 3206293 3287889 3237832
2596 3237832 3251363 3259461 3289485 3276123 3199689 3355162 3351226 3310383 3392019 3477342 3444816 3410662
2584 3410662 3481895 3508860 3483204 3483736 3560218 3519448 3491832 3633066 3708874 3746275 3733560 3867301
2572 3867301 3859667 3845509 3939461 3960768 4076493 4034619 3971989 3935160 3929880 3919348 3789850
2561 3789850 3766872 3760387 3807914 3676558 3549870 3463683 3462536 3471998 3420276 3417026 3499835 3505796
2549 3505796 3493096 3463242 3478721 3447650 3550052 3557637 3555163 3606606 3584178 3585619 3619568 3661683
2537 3661683 3697080 3682778 3635030 3733773 3795778 3810819 3795446 3799503 3809476 3782086 3730163 3874849
2525C874849J17117J05060K2661J1086j1038J19349K01141R7586M9874N1552J24560
2514D763797J4166J86585M3862q0330L4935o8535M7705J07140J80167N0694N9278
2503E339464L860n9270J65715R6654j374k9427N3408O0871k0294o967q5205n6032
2491E461403M299m9816n9487K3160K5002J5402m2263k2173n8127l8012Q8063n7146
2479E290305r4674O0672O1026l275N8782L8402l9991J8988M7787j467N8926Q9324
2467E584805P3630M4503R7110Q5657o123l6537J10717J01151N1240J17271J75099
2456F398523M797Q4196J07789j5347J07868J13897L9376j10594M9198M3231P0020
2445F892954O7056R2770N3700K4903M6399j4191P0000J37533R936o7282j7799
$$ plain form
2525 3874849 3991966 4097026 4119687 4130773 4119735 4239084 4440225 4537811 4587685 4639237 4763797
2514 4763797 4777963 4964548 5008410 4928080 4963015 4894480 4942185 5049325 5229492 5280186 5339464
2503 5339464 5343324 5284054 5449769 5546423 5545049 5515622 5569030 5629901 5609607 5602640 5517435 5461403
2491 5461403 5465702 5415886 5356399 5379559 5404561 5419963 5377700 5355527 5297400 5259388 5347451 5290305
2479 5290305 5195631 5256303 5317329 5314054 5372836 5411238 5371247 5390235 5438022 5436555 5495481 5584805
2467 5584805 5658435 5702938 5800048 5885705 5879582 5843045 5953762 6054913 6106153 6223424 6398523
2456 6398523 6403320 6487516 6595305 6579958 6687826 6801723 6841099 6730505 6779703 6822934 6892954
2445 6892954 6960010 7052780 7106480 7131383 7177782 7163591 7233591 7371124 7381060 7313778 7295979
2434G295979J69595J24074j38J5752j02134o061J46677L8625O5862J4995j687
2423G761539J02437n499J9259o9384M974J22699J1628M2886o1648O6482p816M6577
2411H034134J09717J60817J19854M2181J69235N134J98779J03164K07930K36951
2401I387896J10087O4851J09821K55271K12822J22483P4403J17071N640J86647
2391A0646992K5820l3795l8825q04k8082p6329N5324L3671K0578P4615J35835
2380A0815000J66804N5358Q6712J53930J19305O0914M7993O5641M1186O2841J10892
2369A1786576N0269M0357R0644l1324J30769J1840M8710J39663L5093N5371M1352
2358A2399320J64154J61008R5230P1832J64378J47830J82484J04279K8521J18356
$$ plain form
2434 7295979 7465574 7589648 7589510 7605262 7503128 7497067 7643744 7682369 7748231 7763226 7761539
2423 7761539 7863976 7858477 7877736 7808352 7813326 7936025 7947653 7990539 7928891 7995373 7987557 8034134
2411 8034134 8143851 8304668 8424522 8466703 8635938 8641072 8839851 8943015 9150945 9387896
2401 9387896 9497983 9562834 9672655 9927926 10140748 10263231 10337634 10454705 10460345 10646992
2391 10646992 10672812 10639017 10600192 10599388 10571306 10494977 10550301 10583972 10604550 10679165 10815000
2380 10815000 10981804 11037162 11123874 11277804 11397109 11458023 11506016 11571657 11612843 11675684 11786576
2369 11786576 11836845 11877202 11967846 11936522 12067291 12079131 12127841 12267504 12302597 12357968 12399320
2358 12399320 12563474 12724482 12819712 12891544 13055922 13203752 13386236 13490515 13519036 13637392
2348A3637392K01240J25156J09725K82951J93428K45926J91631K52836K82660
2339A5522945L21296K19243J97238J90740K21411M01931K18471J29784J91079
2330A7614138J09128J76485J65011N9480J69053K20308R1112J03272J01953J52085
2320A8962025J38547J75458L4605M7791J63943J73892M2729J66152J94666J51787
2310B0251595R3422J25160J87919O2696J69814K51283J64225J48918K09460J01604
2300B1766096J80426K17037J37094J34775J31841R3916J31828J65704J32269M4118
2290B3135104J27606J54140J01900R6820J96166J44730J27131J60133J17717K02303
2280B4563750P4122J47956K9969J18730J07921Q7415K16675J69553R3470R2597
$$ plain form
2348 13637392 13838632 13963788 14073513 14356464 14549892 14795818 14987449 15240285 15522945
2339 15522945 15844241 16063484 16260722 16451462 16672873 17074804 17293275 17423059 17614138
2330 17614138 17723266 17899751 18064762 18124242 18293295 18513603 18604715 18707987 18809940 18962025
2320 18962025 19100572 19276030 19310635 19358426 19522369 19696261 19738990 19905142 20099808 20251595
2310 20251595 20345017 20470177 20658096 20720792 20890606 21141889 21306114 21455032 21664492 21766096
2300 21766096 21946522 22163559 22300653 22435428 22567269 22661185 22793013 22958717 23090986 23135104
2290 23135104 23262710 23416850 23518750 23615570 23811736 23956466 24083597 24243730 24361447 24563750
2280 24563750 24637872 24785828 24815797 24934527 25042448 25129863 25346538 25516091 25609561 25702158
2270B5702158J52586J60557L53244L93652J12574K55232L90403L22029L06231
2261B8148666L98305M46737M54509M13275M79494N74854L92913N45875N81157
2252C2435785N24430N95082O04735N79902M14715M82349N15443L13390N09206
2243C6975037L23240K23409J86499K25691K51260L38525J54742K27011M15092
2234C9320506L21971L97403M04790L96989L06070K16855L11096J94852P0950N1870
2224D1993352J70966J64593J93945K36504J35375K23615L23228L28634N23326
2215D4293538N08674O41915O16630N49464O00738P39815P81692Q18163P68168
2206E0318797Q34239R72060R19410J013303J087037J174889J204565J390443J293268
$$ plain form
2270 25702158 25854744 26015301 26368545 26762197 26874771 27130003 27520406 27842435 28148666
2261 28148666 28546971 28993708 29448217 29861492 30340986 30915840 31308753 31854628 32435785
2252 32435785 32960215 33555297 34160032 34739934 35154649 35636998 36152441 36465831 36975037
2243 36975037 37298277 37521686 37708185 37933876 38185136 38523661 38678403 38905414 39320506
2234 39320506 39642477 40039880 40444670 40841659 41147729 41364584 41675680 41870532 41941482 41993352
2224 41993352 42164318 42328911 42522856 42759360 42894735 43118350 43441578 43770212 44293538
2215 44293538 44802212 45444127 46060757 46610221 47210959 47950774 48732466 49550629 50318797
2206 50318797 51153036 52125096 53044506 54057809 55144846 56319735 57524300 58914743 60208011
2197F0208011J446521J491219J527960J796655J845637J967664K017339K054681
2189G4355687K159629K204352K293498K291552K324368K545419K447285K325948
2181I2947738K357461K461078K504416K572863K588736K873913K874682L087872
2173A14268759L370504L418594L535466L686370L803394L804723L895411L821654
2165A43604875L661878L641328L666568L719586L684517L602726L437632L374797
2157A72393907L560217L263328L362490L343301L315804L410379L545229L489323
2149A99683978L518996L981404M253254M145541M416283M847661M913872M788437
2141B34549426M910737M887633M801277M556645M332359M158605L716879L266083
$$ plain form
2197 60208011 61654532 63145751 64673711 66470366 68316003 70283667 72301006 74355687
2189 74355687 76515316 78719668 81013166 83304718 85629086 88174505 90621790 92947738
2181 92947738 95305199 97766277 100270693 102843556 105432292 108306205 111180887 114268759
2173 114268759 117639263 121057857 124593323 128279693 132083087 135887810 139783221 143604875
2165 143604875 147266753 150908081 154574649 158294235 161978752 165581478 169019110 172393907
2157 172393907 175954124 179217452 182579942 185923243 189239047 192649426 196194655 199683978
2149 199683978 203202974 207184378 211437632 215583173 219999456 224847117 229760989 234549426
2141 234549426 239460163 244347796 249149073 253705718 258038077 262196682 265913561 269179644
2133B69179644K982850K624747K055626J533429J103751N44981j84374q08295
2125B79032359j324535j792063k272057k575458k993361l488348l623563l954629
2117B57008345m533723n037015n249012n801195o454829o733293p108424p533385
2109B08557469p723629p808145p638182p395080p008914o667758o265520n808679
2101A52241562n427019m910160m569416m308203l994945l647997l533203l426790
2093A18423829l043212l060882l043017k718811k530282k550663k388605k311498
2085I6776859k217411k158813k066314j912421j906955j820752j736047j481468
2077H1476678j515975j440375j397539j276509j176062j263092j219175j065119
$$ plain form
2133 269179644 272162494 274787241 276842867 278376296 279480047 280025028 279840654 279032359
2125 279032359 277707824 275915761 273643704 271068246 268074885 264586537 260962974 257008345
2117 257008345 252474622 247437607 242188595 236387400 229932571 223199278 216090854 208557469
2109 208557469 200833840 193025695 185387513 177992433 170983519 164315761 158050241 152241562
2101 152241562 146814543 141904383 137334967 133026764 129031819 125383822 121850619 118423829
2093 118423829 115380617 112319735 109276718 106557907 104027625 101476962 99088357 96776859
2085 96776859 94559448 92400635 90334321 88421900 86514945 84694193 82958146 81476678
2077 81476678 79960703 78520328 77122789 75846280 74670218 73407126 72187951 71122832
2069G1122832r81678r24909p23076o21741n19394m26632k72837k85503k44711
2060F6122351Q9037K36840J56306M21082N45186L44046N08143O49294P65359O23188
2050G0460832O46770P41414N31978L54446M78908M05219L34012K62922K72620
2041G4489121L21748K95076L73210L68849L97150M46125O05717P93603N78618
2032G8669217O07597P23446O99501N82164N90493N49266K98138P7496j65716k66825
2022H2364777m90787m96845n64286q09298p57978r06377q91260p96144p19144
2013G5932658m90167l62093j96580p9233J99751M92193O25728P85776J111903
2004G8019936J342801J341331J616963J831528J952636K160495K307495K460019
$$ plain form
2069 71122832 70141154 69216245 68493169 67871428 67352034 66925402 66652565 66367062 66122351
2060 66122351 66211388 66448228 66604534 67025616 67570802 67914848 68422991 69072285 69837644 70460832
2050 70460832 71107602 71849016 72380994 72735440 73214348 73619567 73953579 74216501 74489121
2041 74489121 74810869 75105945 75479155 75848004 76245154 76691279 77296996 78090599 78669217
2032 78669217 79276814 80000260 80699761 81281925 81872418 82421684 82719822 82797318 82631602 82364777
2022 82364777 81873990 81377145 80812859 80003561 79245583 78339206 77447946 76651802 75932658
2013 75932658 75442491 75080398 74883818 74804585 75004336 75496529 76122257 76908033 78019936
2004 78019936 79362737 80704068 82321031 84152559 86105195 88265690 90573185 93033204
1996I3033204K559556K588059K608661K540444K654574K514319K409468K309328
1988A13217613K259248K142349K085493J871879J794582J829106J689718J689857
1980A28579845J845312J791791J780546J983662J723635J724301J853750J822625
1972A43105467J730137J599149J570437J411838J305783J101467P72738O90055
1964A53287071K88304l7000m92339q57470j158877j398635j569125j667077j873086
1955A44521766j920870j811899j906404j570664j315755j243603q86702o13862
1947A33252007m40641l57579j48458o235Q3640K03145K43116K67629K17659J0803
1937A33325086O6924O1559m6967j07160j46933k53248k35614r0880m5560Q6079
$$ plain form
1996 93033204 95592760 98180819 100789480 103329924 105984498 108498817 110908285 113217613
1988 113217613 115476861 117619210 119704703 121576582 123371164 125200270 126889988 128579845
1980 128579845 130425157 132216948 133997494 135981156 137704791 139429092 141282842 143105467
1972 143105467 144835604 146434753 148005190 149417028 150722811 151824278 152597016 153287071
1964 153287071 153575375 153538375 153046036 152188566 151029689 149631054 148061929 146394852 144521766
1955 144521766 142600896 140788997 138882593 137311929 135996174 134752571 133865869 133252007
1947 133252007 132811366 132453787 132305329 132299094 132382734 132585879 132828995 133096624 133314283 133325086
1937 133325086 133392010 133453569 133406602 133299442 133152509 132899261 132663647 132572767 132527207 132613286
1927A32613286R2444K38107L81324K32094K82493L79946L24238J76472m8791k18385
1917A34453228m43516p53657r16734j317543j693657j909301k103172k421299
1909A22894349k576366k771730k933098l081040l084284l063973l177361l069016
1901I9137481l054607l063129l062181k904669k819872k676122k508499k421593
1893G6626809k164992k065458k096017j874039j657058j503404j484800j272776
1885F2508265j278842j180727j021961j009891q91832r26137q47551p83691q25138
1876E3742495q85595q41724q27117q98836q29212p46053p42644q22730q22042
1867D6326542p23715n66756n61516m15931k80463k52168k81393j92223j45566
$$ plain form
1927 132613286 132705730 132943837 133325161 133557255 133839748 134219694 134543932 134720404 134671613 134453228
1917 134453228 134009712 133256055 132339321 131021778 129328121 127418820 125315648 122894349
1909 122894349 120317983 117546253 114613155 111532115 108447831 105383858 102206497 99137481
1901 99137481 96082874 93019745 89957564 87052895 84233023 81556901 79048402 76626809
1893 76626809 74461817 72396359 70300342 68426303 66769245 65265841 63781041 62508265
1885 62508265 61229423 60048696 59026735 58016844 57125012 56198875 55351324 54567633 53742495
1876 53742495 52856900 52015176 51188059 50289223 49460011 48713958 47971314 47148584 46326542
1867 46326542 45602827 45036071 44474555 44058624 43778161 43525993 43244600 43052377 42906811
1858D2906811j11493o1394r9981j12051n7999j77800k72851k49587j89515l22131
1848D1252009l41266k98816l90295m58487m56402m43266n22451l79509k94581
1839C7666936l78035l75775k09522q743p1865j88944l545J89631L14381K89859
1829C7224378M43130M80850O76360N94339O46806O40235L22060r4520n03019o46730
1819C9783889p95285o09529n63316m76722m10637k88062j34695k41651j43969
1810C6120023J0709N4895Q0489J10860J98120K41090J61322K08164K45493L97578
1800C7828743L43173L57556L28536L73960M60164M05530O42673O82188P47993
1791D2170516Q12863Q11300Q00187R01893P97952Q62699J032353R37998R62782
$$ plain form
1858 42906811 42795318 42733924 42633943 42521892 42463893 42286093 42013242 41763655 41574140 41252009
1848 41252009 40910743 40611927 40221632 39763145 39306743 38863477 38341026 37961517 37666936
1839 37666936 37288901 36913126 36703604 36694861 36622996 36434052 36430507 36620138 36934519 37224378
1829 37224378 37667508 38148358 38824718 39419057 40065863 40706098 41028158 40933638 40430619 39783889
1819 39783889 38988604 38379075 37815759 37339037 36928400 36640338 36505643 36263992 36120023
1810 36120023 36130732 36185627 36266116 36376976 36575096 36816186 36977508 37185672 37431165 37828743
1800 37828743 38171916 38529472 38858008 39231968 39692132 40097662 40740335 41422523 42170516
1791 42170516 42983379 43794679 44594866 45496759 46294711 47157410 48189763 49127761 50090543
1782E0090543R69660Q99962R28420J011643J042204J071059J118814J095099J016796
1773E9244200J040211J098842J249617J212044J345260J446925J495594J802493
1765F9935186J807240J827227K025605K078687K063702J969444K111008J823877
1757H5641976J660363J553269J639482J856648K196765K668053K950596L271614
1749A03438766L570862M078591M566654N022856N448055O041829O397344O953609
1741A45518566P376322P937845Q377588Q863912R412525J0020679J0492822J1336247
1733B19336506J2126514J2668066J3050119J2911182J2089061J0780075R080187
1726C02041710O854917M430576K844291K228172K486846L320965M701311O057522
$$ plain form
1782 50090543 51060203 51960165 52888585 53900228 54942432 56013491 57132305 58227404 59244200
1773 59244200 60284411 61383253 62632870 63844914 65190174 66637099 68132693 69935186
1765 69935186 71742426 73569653 75595258 77673945 79737647 81707091 83818099 85641976
1757 85641976 87302339 88855608 90495090 92351738 94548503 97216556 100167152 103438766
1749 103438766 107009628 111088219 115654873 120677729 126125784 132167613 138564957 145518566
1741 145518566 152894888 160832733 169210321 178074233 187486758 197507437 208000259 219336506
1733 219336506 231463020 244131086 257181205 270092387 282181448 292961523 302041710
1726 302041710 308896627 313327203 316171494 318399666 320886512 324207477 328908788 334966310
1718C34966310O636559O575226O229142O663653P829142R538679J0536153J0234863
1710C99209727Q607772N161565L25084n751762j2361521j8128820k2357834k4423186
1702C30281025k4601321k3127093k1097323j8733198j6280790j4232532j2426698
1695A99782070j1060068r612907q741819p901335p275096o835141o267886n921302
1687A36166516n645714n546357n180276m857956m621054m322983m224315l946434
1679I7821427l690912l440922l218238l129703k785828k691849k450660k397991
1671G4015324k201417k203658j913181j778366j682587j453519j212675j078129
1663F0491792j090505q24301o13936p44389p66452q99844r32686j139867j302858
$$ plain form
1718 334966310 341602869 348178095 354407237 361070890 368900032 378438711 388974864 399209727
1710 399209727 407817499 412979064 413304148 407552386 395190865 377062045 354704211 330281025
1702 330281025 305679704 282552611 261455288 242722090 226441300 212208768 199782070
1695 199782070 188722002 179109095 170367276 162465941 155190845 148355704 142087818 136166516
1687 136166516 130520802 124974445 119794169 114936213 110315159 105992176 101767861 97821427
1679 97821427 94130515 90689593 87471355 84341652 81555824 78863975 76413315 74015324
1671 74015324 71813907 69610249 67697068 65918702 64236115 62782596 61569921 60491792
1663 60491792 59401287 58576986 57963050 57218661 56452209 55552365 54619679 53479812 52176954
1654E2176954j160259j124399j031222r59804q13901q90685j121422j323362j320470
1645D2431430j543264j444716j249280j236969j177298j065547r40066r82334
1637C2791956r03710q49905p46679p20577o35266o55571o79746n60951n53166
1628B6486385n53469n34229m85778l79013m63807m14636m56138l54711l41098
1619B2503506l75679l15642k53296m42209m15291k77362k24020k79986l81815
1610A9538206k01291m12995l86346k66745k98872m43260l28167k80047k54350
1601A6666133l83145k39799j96553j62879l39748j95568j65235k54802j86500
1592A4541904j94871k07601k99763k01575j46228l68194k94321j63372k79382
$$ plain form
1654 52176954 51016695 49892296 48861074 47901270 47087369 46196684 45075262 43751900 42431430
1645 42431430 40888166 39443450 38194170 36957201 35779903 34714356 33774290 32791956
1637 32791956 31888246 31038341 30291662 29571085 28935819 28280248 27600502 27039551 26486385
1628 26486385 25932916 25398687 24912909 24533896 24070089 23655453 23199315 22844604 22503506
1619 22503506 22127827 21812185 21558889 21116680 20701389 20424027 20200007 19920021 19538206
1610 19538206 19336915 18923920 18537574 18270829 17971957 17528697 17200530 16920483 16666133
1601 16666133 16282988 16043189 15846636 15683757 15344009 15148441 14983206 14728404 14541904
1592 14541904 14347033 14139432 13839669 13638094 13491866 13123672 12829351 12665979 12386597
1583A2386597j75368j54526j77161j73646k34333j13731m8425k65349j13649l2014
1573A0898395j39911k00697j85056j23463j23365j18268k39020j92646j47546
1564I428423p8039j01119j48368j97430n9261q1156j71359k14698r3177P3573
1554H357389k01415j73880P749j58478q9878m7629n8360q0717j72815q9641l7732
1543G254593o7356j73140k4966r8227m8750j6932k0516j46362j19039N8869l628
1532F594546j02816p6608L9575j11034p6708r753j21696m0965j10625K8669p5838
1521E936747j32334n7932l7497p2375n2435o658p8068p9797m6252o0387o9096
1510E243916j73120O7013P2729m7035o8211j82811K8899j18142j29131q4939o8453
$$ plain form
1583 12386597 12211229 12056703 11879542 11705896 11471563 11357832 11309407 11044058 10930409 10898395
1573 10898395 10758484 10557787 10372731 10249268 10125903 10007635 9768615 9575969 9428423
1564 9428423 9350384 9249265 9100897 8903467 8844206 8763050 8591691 8376993 8283816 8357389
1554 8357389 8155974 7982094 7989843 7831365 7741487 7693858 7635498 7554781 7381966 7292325 7254593
1543 7254593 7187237 7014097 6989131 6890904 6842154 6825222 6804706 6658344 6539305 6598174 6594546
1532 6594546 6491730 6415122 6454697 6343663 6266955 6257202 6135506 6094541 5983916 6012585 5936747
1521 5936747 5804413 5746481 5708984 5636609 5584174 5577516 5499448 5419651 5373399 5313012 5243916
1510 5243916 5070796 5137809 5210538 5163503 5095292 4912481 4941380 4823238 4694107 4609168 4540715
1499D540715q7914q0357P2328j45708j38005k6924R1678j49822q7225M5963p0880
1488C963849j6558l9324O7426j20185l7204r8769N8592o946j04015K1792J07928
1477C796586K196m2049Q2887K0059j11263M9640q668m5645p6211J4705R6212p8926
1465C699523j28863P6086O2006j42369L39R02R464O1691K5530O623k3427l6486
1453C611019o5579n8098k2804K9179P7212n0055L4219J06063m7129j39708P3287
1442C547606Q0363j10208m8799J41925N0676k4259Q102R7794K2965n9019J41931
1431C849077J3145o4811L4140J02669J01594o3122M1776O8323m4097K7858N3869
1420D120421k6453o5276L6652J32021n439L6218r820O2570q5646Q90Q51M5481
$$ plain form
1499 4540715 4452801 4372444 4444772 4299064 4161059 4134135 4225813 4075991 3988766 4034729 3963849
1488 3963849 3947291 3907967 3975393 3855208 3818004 3719235 3777827 3770881 3666866 3688658 3796586
1477 3796586 3798782 3756733 3839620 3859679 3748416 3798056 3789388 3743743 3667532 3682237 3778449 3699523
1465 3699523 3570660 3646746 3708752 3566383 3566722 3567624 3577088 3638779 3664309 3670932 3647505 3611019
1453 3611019 3545440 3487342 3464538 3493717 3570929 3520874 3555093 3661156 3614027 3474319 3547606
1442 3547606 3627969 3517761 3468962 3610887 3661563 3637304 3645406 3743200 3766165 3707146 3849077
1431 3849077 3862222 3797411 3831551 3934220 4035814 3972692 4014468 4082791 4038694 4066552 4120421
1420 4120421 4093968 4028692 4065344 4197365 4191926 4228144 4218324 4280894 4195248 4196138 4196989 4242470
1408D242470P1553L7467j1696j34231m8234j9020q8938j83044j22097l179r5563
1397C645488j01451j1327m3071j88082j15072k2779j40304O1773j09357K2255
1387B998073q469k2477o9685k569k7423k46309J67997L7745q0241r9940m1607
1376B605095o0488K5592J30715l7048j35566j13602N7079K3242p8193j44858R0585
1365B362553j4811P995N365l9472J053n0373j42125M7084k8747m578J58q5665
1353B058437m7998Q7344L0546j69763N5682P9642N9928j43436r1156M1787p1806
1342A889207m1224M2353P4517n2864q0390q8224J0292n8511r5571P0246j3694
1331A656137P3810q7202k0130L0680k7866L9828L8911l0261q655j9059r065j14224
$$ plain form
1408 4242470 4314023 4351490 4339794 4205563 4157329 4138309 4049371 3866327 3744230 3741051 3645488
1397 3645488 3544037 3532710 3489639 3301557 3186485 3163706 3023402 3085175 2975818 2998073
1387 2998073 2989604 2967127 2897442 2894873 2867450 2621141 2789138 2826883 2746642 2646702 2605095
1376 2605095 2544607 2570199 2700914 2663866 2528300 2414698 2471777 2495019 2416826 2271968 2362553
1365 2362553 2347742 2355737 2361102 2321630 2322683 2272310 2130185 2177269 2148522 2143944 2144102 2058437
1353 2058437 2010439 2097783 2128329 1958566 2014248 2093890 2153818 2010382 1919226 1961013 1889207
1342 1889207 1847983 1890336 1964853 1911989 1831599 1743375 1753667 1695156 1599585 1669831 1656137
1331 1656137 1729947 1642745 1622615 1653295 1625429 1665257 1704168 1673907 1665252 1646193 1637128 1522904
1319A522904J0920j1605j1236n0462L1700O273m1332N8278r3567j8028j00437
1308A303408M9173L2328q2089m6247n1974J2528L9682r0921n8417N5803l6518
1297A126756J9128q986n529l1285J5178M123m6829M6481n650j22768q50J64855
1285A154624j00213l5986P8032M8373j31843j8213l0400J5860J0298O9839q6169
1274I74202K7021n5630n4540k756K6495O2113L2823N4284j02218k8567j2288O6684
1262I87623R763M4810k5974k3034J15313M0023j15312r4340R6791R1334k1326
1251A105671M7264j254m2150j52376J41815o4126j05260J07183p2699L7560J0133
1240A011761m6500r452O751J08870l7416Q6115j6943r2548k2053P9591O5726j0306
$$ plain form
1319 1522904 1533824 1522219 1510983 1460521 1492221 1498494 1457162 1515440 1421873 1403845 1303408
1308 1303408 1352581 1384909 1302820 1256573 1204599 1217127 1256809 1165888 1107471 1163274 1126756
1297 1126756 1145884 1136898 1131369 1100084 1115262 1119385 1072556 1119037 1113387 990619 989769 1154624
1285 1154624 1054411 1018425 1096457 1144830 1012987 994774 964374 980234 990532 1060371 974202
1274 974202 1001223 945593 891053 888297 914792 976905 1009728 1064012 961794 933227 920939 987623
1262 987623 997386 1042196 1016222 993188 1108501 1148524 1033212 938872 1035663 1126997 1105671
1251 1105671 1152935 1151681 1109531 957155 1098970 1034844 929584 1036767 964068 1001628 1011761
1240 1011761 965261 955809 962560 1071430 1034014 1120129 1103186 1010638 988585 1068176 1133902 1123596
1228A123596J22846j43721m8683n5674M9623l4609N9843O1024q0960L2851l5290
1217A050846R5247q7786n9501R7385p2880r2160p9434N8429J033p5454O5966m9670
1205H52021L7481o665R8893M4911j48758q9232R891K8333q3987P4233K073J1202
1193H30396L1795L3627k7214j51365J62527O1053n3696p8926j5891Q4856J8349
1182H95511j06379n2735K0456r386J10297j5824l0434l9179k4095O4626N1585
1171H64443n927j7309K9168o8808o7249m9429q063K1193N5242m9550N8726m4827
1159G17610l6071k0036p4268k3230m8305N2948L9291k693l2812r0415O3681j2734
1147E32966J6757L0998j9635O8230m9442J2107K5044j8276m9889n71K4335l5885
$$ plain form
1228 1123596 1246442 1102721 1054038 998364 1047987 1013378 1073221 1134245 1053285 1086136 1050846
1217 1050846 1146093 1058307 998806 1096191 1023311 931151 851717 910146 911179 835725 901691 852021
1205 852021 889502 882837 981730 1026641 877883 788651 798542 826875 742888 817121 819194 830396
1193 830396 862191 895818 868604 717239 879766 940819 887123 808197 792306 877162 895511
1182 895511 789132 736397 756853 747467 857764 841940 811506 772327 748232 812858 864443
1171 864443 858516 841207 870375 801567 734318 684889 676826 698019 753261 703711 762437 717610
1159 717610 681539 661503 587235 564005 515700 568648 607939 605246 572434 482019 545700 532966
1147 532966 549723 580721 561086 629316 579874 591981 617025 598749 548860 548289 572624 536739
1135E36739J20880K7496j14836m6376j495P5997l6430J08200Q83j36210l4872
1124D99976R0204o985n5528O8327O6401L1058j15404q9105n2493j3325Q7161l7057
1112D73230r566L5661L1700o1381k4170Q1101l7861J1341P439o1665k9540k3017
1100C93272j785N465K4456M0159N7568m4856j090N9707K0964m7839m8723L2132
1088D89430J04684k5708l2060k1293q960m9245J30228M5954j02867k8408r353
1077D92402n3336j23968R4376M6085m9964k5040P934Q1517l7272M2523J21485
1066E96742L9813o7294N207q1448m7233N5627N8344N671j07740N3858K8241n5694
1054D84094R9673L713j41966K0921Q8687r498l2937j0942l0539m7582m0471L6060
$$ plain form
1135 536739 657619 685115 570279 523903 522408 598405 561975 670175 671058 534848 499976
1124 499976 590180 583195 527667 595994 662395 693453 578049 488944 436451 423126 510287 473230
1112 473230 463664 499325 531025 469644 445474 526575 488714 500055 507494 445829 416289 393272
1100 393272 391487 396952 421408 461567 519135 474279 473189 532896 553860 506021 457298 489430
1088 489430 594114 568406 536346 515053 506093 456848 587076 633030 530163 501755 492402
1077 492402 439066 315098 409474 455559 405595 380555 388489 470006 432734 475257 596742
1066 596742 636555 569261 574468 493020 445787 501414 559758 565429 457689 511547 539788 484094
1054 484094 583767 587480 445514 466435 555122 545624 512687 501745 471206 423624 383153 419213
1042D19213n307Q2217M4692j7812M609m1597J35378q918n7025O6676q1069l8468
1030E02589j4966N7530K7540O8703Q1959j1685L0274j7166P640Q884l5087J82639
1018H88854l5611n7153l9274O2551m5534l5502R2236K8941M6121O2887j52643
1007H15873N6723j6456l9552J6498Q1450P3609M7114J4952l1834J00508k4045
996A094840J3141n4620P1071R1398K4532n8071O579Q9497P3262K2293N9862j20720
984A313064r001k4010m2564J4374l262O6062J06800l1181j217Q7428J0167K9426
972A516086J82731K2797P2935P8146l7902J29397J02161J98499Q4775J19729J59012
961B628366K00825J83891K19181K14035L86522M89552L21546L72523L22373N35329
$$ plain form
1042 419213 413906 496123 540815 523003 527612 486015 621393 612475 555450 622126 541057 502589
1030 502589 487623 545153 572693 641396 723355 711670 741944 724778 732418 741302 706215 888854
1018 888854 853243 796090 756816 819367 773833 738331 830567 859508 905629 968516 815873
1007 815873 872596 856140 816588 833086 914536 988145 1035259 1050211 1018377 1118885 1094840
996 1094840 1107981 1053361 1124432 1215830 1240362 1182291 1188870 1278367 1351629 1373922 1433784 1313064
984 1313064 1304063 1280053 1237489 1251863 1248601 1314663 1421463 1390282 1389065 1476493 1486660 1516086
972 1516086 1698817 1721614 1794549 1872695 1834793 1964190 2066351 2264850 2349625 2469354 2628366
961 2628366 2829191 3013082 3232263 3446298 3832820 4322372 4643918 5016441 5338814 5874143
951E874143N32838N62591O89285O37633R05168J030220J127426J467179J766040
942A4592523K075277K028224J697435J519376J314405k62350k313470l411266
934A7240154l332227k393719j818875j297229r84193p96448p00284n43144k88178
925E085857j52779j62975j81410k13226j18159j81446k89485j71421j66102q3650
915C365204l06581j56333j11014j40323j26971r8307j47987k3126m0727j78973
905B034862N047m0874K8676j89210j45348m9273j15216k4434k6770n439m4049
894A427972j55044R6551k2648m8293n3591q4760j77348o7030N6466L3822O3239
883A069336j15400n1471P1476r0203p055P4775M5732l2816n7299q5997q1568O3762
$$ plain form
951 5874143 6406981 6969572 7658857 8296490 9201658 10231878 11359304 12826483 14592523
942 14592523 16667800 18696024 20393459 21912835 23227240 22964890 20651420 17240154
934 17240154 13907927 11514208 9695333 8398104 7413911 6617463 5917179 5374035 5085857
925 5085857 4933078 4770103 4588693 4375467 4257308 4075862 3786377 3614956 3448854 3365204
915 3365204 3058623 2902290 2791276 2650953 2523982 2425675 2277688 2254562 2213835 2034862
905 2034862 2039909 1999035 2027711 1838501 1693153 1643880 1528664 1504230 1477460 1472021 1427972
894 1427972 1272928 1369479 1346831 1298538 1244947 1160187 982839 915809 972275 1006097 1069336
883 1069336 953936 902465 973941 883738 876683 951458 997190 964374 907075 821078 739510 803272
871H03272q5180P3930M9795m9972r1800k7753q3956Q652J07519j1460n4676k9116
859F09255O217N4015l0315j03436l4234J53491r2860q2590m4611N213r382k4577
847D06186j0779J1481M4285J3336L3619M6219k9030r0129q1992M829M0872O6484
835D55381M7239o3165J8510l8633L5019L0444p3227o8790l6374q067P7240J19952
823D95529o3851k0204j7250p2655R9598j16652O3894J5751n9034Q2991n5789K5941
811C78269K381l1086l157m1716j8736k6718O0000k8695K4066o5004k2967P0164
799B96801N5696L7325j05053M1308Q3241o8480r7199j20525Q1664o2026k1970
788A20782M4086L5437r122K1962M7238J1017K5163l7581k7808l3185p7297M928
$$ plain form
871 803272 718092 792022 841817 791845 700045 672292 588336 596988 704507 693047 638371 609255
859 609255 615472 669487 639172 535736 501502 654993 562133 479543 434932 440145 430763 406186
847 406186 395407 406888 451173 464509 498128 544347 515317 425188 343196 348025 388897 455381
835 455381 502620 439455 457965 419332 454351 484795 411568 342778 306404 298337 375577 495529
823 495529 431678 411474 394224 321569 421167 304515 368409 384160 325126 408117 352328 378269
811 378269 380650 349564 346407 304691 285955 259237 319237 290542 314608 249604 226637 296801
799 296801 352497 389822 284769 326077 409318 340838 243639 123114 204778 142752 120782
788 120782 164868 200305 191183 213145 260383 271400 296563 258982 231174 197989 120692 125620
776A25620J8146p5602K25R9036J77k8549L7263o4440K8373n9073M9466l7801K9126
763A21967O6179j550N8269m2374j00010M8058R2289l5849k0725J7489l789P3562
751B73516N1094Q030j42967l1014N6701m8522o8385K2432M6402J24060r5887j28186
739F7274r394O1306J7362q1105L2806l8474M5837r741k1869L314L2010p831l8621
726E2874k9446R5369q0839K159K7488q4695M8076J4359J7008p5624R463P8479
714G4671K0634k9046J3041l8110K5015O0623m937p5810l8946j694P0666k3549
702E2558L5811J9630Q5657k6879j01137L4156k6449J1570j3132R5242j23072m3723
690B32j6427O1806J4008l4817M0096L6092p0899N377j7268l3440J0889K4738n2041
$$ plain form
776 125620 143766 68164 68389 167425 167602 139053 176316 111876 140249 81176 130642 92841 121967
763 121967 188146 186596 244865 202491 102481 150539 242828 206979 186254 203743 199954 273516
751 273516 324610 332640 189673 158659 215360 166838 98453 120885 167287 291347 195460 67274
739 67274 57880 119186 136548 55443 88249 49775 95612 85871 64002 67316 99326 91495 52874
726 52874 23428 118797 37958 40117 67605 -17090 30986 45345 62353 -13271 -3808 74671
714 74671 95305 66259 79300 41190 66205 126828 121891 46081 7135 5441 76107 52558
702 52558 88369 107999 193656 166777 65640 99796 73347 84917 71785 167027 43955 232
690 232 -16195 45611 59619 24802 64898 100990 30091 35468 18200 -15240 -4351 20387 -31654
677c1654K4928L5618P7466Q4471r1548l5208Q2398k8619n171k0082n5704P195
665D4090o826j6555M140R8846q0751N0445M9313L1185m0766L2246Q671q0672j9200
652G4166R7211J09965q5471j26699m5824l3373p2921J01084k903L5459K943q669
640D4968n0012M4085R1137J665p0189n4279M3142m9889n3686Q5485j1214n8272
628c7059K4468J7363M7060j34922l2427K4523J07116p0664j105j09383J05260
617e9770O3228J377k3751j05800J25153M8583o9553K0511P7315q5247l7535L5576
605i913P2730J21788q5171n2291q2726j8154K3271q6830R6880J5972J09654l311
593A01899j15457M054N4751L1662k7814j649j5519o1325N1987j32435L9493j108
$$ plain form
677 -31654 -6726 28892 106358 190829 99281 64073 146471 117852 112681 92599 36895 44090
665 44090 37264 20709 24849 123695 42944 93389 142702 173887 133121 165367 174038 93366 74166
652 74166 171377 281342 195871 69172 23348 -10025 -82946 18138 15235 50694 53637 44968
640 44968 -5044 39041 130178 131843 61654 7375 50517 628 -53058 32427 21213 -37059
628 -37059 -12591 4772 51832 -83090 -115517 -90994 16122 -54542 -55647 -165030 -59770
617 -59770 3458 4835 -18916 -124716 437 49020 -20533 -22 77293 -7954 -45489 -9913
605 -9913 62817 184605 99434 47143 -35583 -53737 -30466 -117296 -20416 -4444 105210 101899
593 101899 -13558 -9504 45247 76909 49095 47446 31927 -29398 22589 -109846 -70353 -71461
581g1461o5406J08193Q1941l8124p3964N6361j5044J9518k820j0713p4260Q1817
569c962J16565q6332r8327M3445P4355l4332j5644k7069o3644j07372J9802J49343
557c3172M2701m5715p3847J3096j0924N312R5361l4936j9798j2858L8169k8856
545f5467k8220L1308K4339J2587N9012K0133j9880k6174M2238n5477O439J6221
533A7059O7039j9801n4956N0605m9054N3154o5709P944J9971k0929m1975K6727
521i925J22854R745q1918K1075L8797o0210P5535k985k8036M6915r8137q2881
509d9171m2176N3849p4197n5717j2985J34296K9528q209k3281l8755K8011j3839
497g2646K9778J8627q679L4746P647o9426j5215P5045N8373l6844n9957M6492
$$ plain form
581 -71461 -136867 -28674 53267 15143 -58821 -2460 -17504 2014 -806 -11519 -85779 -3962
569 -3962 112603 26271 -72056 -28611 45744 11412 -4232 -31301 -94945 -202317 -182515 -33172
557 -33172 9529 -36186 -110033 -96937 -107861 -102549 -7188 -42124 -61922 -74780 -36611 -65467
545 -65467 -93687 -62379 -38040 -25453 33559 53692 33812 7638 49876 -5601 838 17059
533 17059 84098 64297 9341 59946 10892 64046 -1663 6281 26252 5323 -36652 -9925
521 -9925 112929 122674 40756 61831 100628 40418 115953 112968 84932 131847 33710 -49171
509 -49171 -91347 -37498 -111695 -167412 -180397 -46101 -16573 -24782 -48063 -86818 -58807 -72646
497 -72646 -42868 -24241 -32920 1826 9473 -59953 -75168 -123 58250 21406 -38551 7941
485G941K0325j71783P4816N1294l0208J8904L1113l1499o948K4946o4686j3440
473h9225m3377q381J6102O6516l1831k7372Q6217q5025l758R5432j5444n5511
461i5657J4161N9413l7712l1538M0724J2997l7502j0192Q975m8830n514M5157
449h5518M0952m203j04824n649M0201p8815k7742R7236Q3823n1342j606Q2683
437a4804K3712j14046J05385l1597R79N1072j24866J8124p4841R8636O9423j0495
425c318l5936J4146P3979j23925O2055q6273k8456j7813R4612K4594k2631N0259
413A293J6827l9247k8749m0695L6950L737j18184R5407J27948j19765j15690J56798
401b3370P6058q1344k3807R3764m1482n6408L5460L5075m8389J2106K6934M5738
$$ plain form
485 7941 28266 -143517 -68701 -17407 -47615 -28711 2402 -29097 -36045 -11099 -75785 -89225
473 -89225 -132602 -140983 -124881 -58365 -90196 -117568 -31351 -116376 -120134 -24702 -40146 -95657
461 -95657 -81496 -22083 -59795 -91333 -50609 -37612 -75114 -85306 -76331 -125161 -130675 -85518
449 -85518 -44566 -48769 -153593 -159242 -119041 -197856 -225598 -128362 -44539 -95881 -97487 -14804
437 -14804 8908 -105138 247 -31350 -30371 20701 -104165 -86041 -160882 -62246 7177 -3318
425 -3318 -39254 -25108 48871 -75054 -12999 -99272 -127728 -145541 -50929 -26335 -48966 1293
413 1293 18120 -21127 -49876 -90571 -53621 -49884 -168068 -72661 55287 -64478 -180168 -23370
401 -23370 52688 -28656 -52463 41301 -181 -56589 -21129 13946 -34443 -22337 4597 50335
389E0335N6584n9882p4335j1330o1207L6862l5237K72J21813j4148m5288M7652
377A2091r8268k0296M2126j744J3730k8413m2759M4668L9240o8512P112j8884
365a19909J4048l2047P4253L0045o1614o487J8128M3218J2209R6096j00652K1489
353a1223o4753q5857N3855Q874l0549J3745P0486K3478j3730J06482j21112p9732
341a30036k2604R0499M3639o8408O0865j4383R6724m6335p3272q792L4105Q0857
329D2859o8078k9716o2286L0512K890J1450r5037O3364J08638j52277O1043J11366
317B4728r8432O0027k2928M6572m4849j03969N1701O171K1704l4258J08145o0633
305d6021j3216k4455N571r5263J8936J05645P916L8378N070k0259j32199j07141
$$ plain form
389 50335 106919 47037 -27298 -38628 -99835 -62973 -98210 -97938 23875 9727 -35561 12091
377 12091 -86177 -106473 -64347 -66091 -52361 -80774 -123533 -78865 -39625 -108137 -101025 -119909
365 -119909 -105861 -137908 -63655 -33610 -95224 -101711 -83583 -40365 -28156 67940 -32712 -11223
353 -11223 -75976 -161833 -107978 -99104 -129653 -115908 -45422 -21944 -35674 70808 -50304 -130036
341 -130036 -152640 -62141 -18502 -86910 -26045 -40428 56296 9961 -63311 -72103 -37998 42859
329 42859 -25219 -54935 -117221 -86709 -83819 -72369 -167406 -104042 4596 -147681 -86638 24728
317 24728 -73704 -13677 -36605 9967 -34882 -138851 -87150 -80979 -59275 -93533 14612 -46021
305 -46021 -59237 -83692 -78121 -173384 -154448 -48803 -40887 -2509 2561 -17698 -149897 -257038
293b57038K17768R7174M8268j58755M950k5026n5261K5356p620j9915j2153P2540
281f9712N4203o5670l5212N6478J4682O5081k9271k998o2617q9997j1380P2404
269a04009o807L2324j0586J8116m4133K8600O4074j20089m3983N2981Q0634K594
257e0284o7996M7886r0620N016R1426n7201j6535m0458J28459m2481J0203K2235
245f0350l1780l7219N6912M8252q2570l8897j1660P7645N4450J922J2402r7670
233a08563r6105O023O9885Q9183k5678o7492J5486m2397O694J15497R207p7649
221a05909K5574o3273j0160j3034J05500N5430k5548p7651K0357O8593m9175O7660
209a636n5216j23803K2645l8493K8179K8552L8656k611k8957k4605r089J19174
$$ plain form
293 -257038 -39270 57904 106172 -52583 -47633 -72659 -127920 -102564 -110184 -130099 -142252 -69712
281 -69712 -15509 -81179 -116391 -59913 -45231 19850 -9421 -12419 -75036 -165033 -176413 -104009
269 -104009 -110816 -78492 -89078 -70962 -115095 -86495 -22421 -142510 -186493 -133512 -52878 -50284
257 -50284 -118280 -70394 -161014 -155998 -64572 -121773 -138308 -178766 -50307 -92788 -82585 -60350
245 -60350 -92130 -129349 -72437 -24185 -106755 -145652 -157312 -79667 -25217 -23295 -10893 -108563
233 -108563 -204668 -198645 -128760 -39577 -65255 -132747 -117261 -159658 -152964 -37467 -28260 -105909
221 -105909 -80335 -143608 -153768 -166802 -61302 -5872 -31420 -109071 -88714 -20121 -69296 -1636
209 -1636 -56852 -180655 -158010 -196503 -168324 -139772 -101116 -103727 -132684 -157289 -166378 -47204
197d7204n9354m3946K1242j3472l4131K8075M6214j02333K1552R5175j9320R5025
185a2477j33955J3613L7799J72326m7180j9459n7769J6505n0896l8449R1123k8810
173e7629j6692o3968r3473K6744Q4871J7910k831L9810k53o4169p6099O6744R6763
160d2272l3551l0562K6719j5096j627o1902O061J1707K484m312L7966L8694q1162
147a46853K8344k8881O730q5033M2629O6481K1026N1519m8871J3794l9045j38814
135b56974k2893R4327R2272o0784K608j4780L3136L015m0089K8529n036l6666
123a83335N6812J4319O266q2135j6221P5155J2866o7028K2640R865m016J7971
111a36841m2455Q588j1100N2256K1226m4575q0382k7556m2040L3731N3789p704
$$ plain form
197 -47204 -106558 -150504 -129262 -142734 -176865 -148790 -102576 -204909 -183357 -88182 -107502 -12477
185 -12477 -146432 -132819 -95020 77306 30126 10667 -47102 -30597 -81493 -119942 -28819 -57629
173 -57629 -74321 -138289 -231762 -205018 -120147 -102237 -105068 -65258 -65511 -129680 -205779 -139035 -42272
160 -42272 -75823 -106385 -79666 -94762 -96389 -158291 -152230 -140523 -138039 -142351 -104385 -65691 -146853
147 -146853 -118509 -147390 -140660 -225693 -183064 -116583 -95557 -44038 -92909 -79115 -118160 -256974
135 -256974 -279867 -185540 -93268 -154052 -151444 -166224 -133088 -130073 -170162 -141633 -146669 -183335
123 -183335 -126523 -112204 -105938 -188073 -204294 -129139 -116273 -183301 -160661 -150796 -154812 -136841
111 -136841 -179296 -170708 -181808 -129552 -108326 -152901 -233283 -260839 -302879 -269148 -215359 -223063
99b23063K3196J60868n182l9768p6113m2774Q9023O4011p4161p6898K6360j1882
87a86383K3918Q89J3046L0049k1562M9733p6327j7410R7486m4852J1405m7485
75a67493O1974k6122n8649L0684M2931m0867p7876R0597K1896M175M1869K1271
63e5610m407k7150K1997p7345k4472J1546M0048J4929k2939q6235L0019J3374
51a66245J3773J2379j28j8962K5468M2826o1128j15619O8359K0873j6390N4827
39a39967O310K840p0779p8573O8118N6099J8173o0783O6914q7296o2631N3850
27b27725O9179L2830m8791R3092p2739R98p2321m392K1034J1495P957M7274q6836
14b28945n605O8547k3890n2712Q1339K0768J5256P85j515p1572k2034N6835k1385
$$ plain form
99 -223063 -199867 -38999 -44181 -83949 -160062 -202836 -113813 -49802 -123963 -200861 -174501 -186383
87 -186383 -162465 -161576 -148530 -118481 -140043 -90310 -166637 -184047 -86561 -131413 -120008 -167493
75 -167493 -105519 -131641 -190290 -159606 -116675 -157542 -235418 -144821 -122925 -118750 -76881 -55610
63 -55610 -60017 -87167 -65170 -142515 -166987 -155441 -115393 -100464 -123403 -209638 -179619 -166245
51 -166245 -152472 -140093 -140221 -159183 -133715 -90889 -152017 -267636 -199277 -178404 -194794 -139967
39 -139967 -133657 -130817 -201596 -280169 -212051 -155952 -137779 -198562 -131648 -218944 -281575 -227725
27 -227725 -158546 -125716 -174507 -81415 -154154 -153156 -225477 -229869 -208835 -197340 -189383 -142109 -228945
14 -228945 -234550 -166003 -189893 -242605 -161266 -140498 -125242 -124457 -125972 -197544 -219578 -162743 -184128
1a84128J7514
0a66614
$$ plain form
1 -184128 -166614
0 -166614
$$ Imaginary data points
##PAGE= N=2
##DATA TABLE= (X++(I..I)), XYDATA
16383g413674K7410O8063Q2084O5735R3898J0583L7975R9041J08615K4737R6052
16372f699481J29569O1574P7911J30842k569M7542O8346R4185Q7551Q4292O7187
16361e853051P3599O8336l2533O3454Q1435P3840L9744Q2438O1853L3275Q2396
16350e225214J21265Q2320J09196N3604J05763N1852P1771p212J1065J17213J23677
16339d384700J13916L7883N2218m601L7043K1745J31690R2698J29910N4725J1501
16328c705972M7780J0953Q8840J9187J24102J33630M4348L8410R6754P6395J5388
16317c010185j8027O3072J18377R7911M6734J0903J3772R6098O5906J37671O3942
16306b313826j118O3516K181O4618M1111P9803K9280J35048J5993O448R298R1159
$$ plain form
16383 -7413674 -7386264 -7318201 -7236117 -7170382 -7076484 -7065901 -7027926 -6928885 -6820270 -6795533 -6699481
16372 -6699481 -6569912 -6508338 -6430427 -6299585 -6302154 -6254612 -6186266 -6092081 -6004530 -5920238 -5853051
16361 -5853051 -5779452 -5711116 -5743649 -5680195 -5598760 -5524920 -5485176 -5402738 -5340885 -5307610 -5225214
16350 -5225214 -5103949 -5021629 -4912433 -4858829 -4753066 -4701214 -4629443 -4636655 -4625590 -4508377 -4384700
16339 -4384700 -4270784 -4232901 -4180683 -4185284 -4148241 -4126496 -3994806 -3902108 -3772198 -3717473 -3705972
16328 -3705972 -3658192 -3647239 -3558399 -3539212 -3415110 -3281480 -3237132 -3198722 -3101968 -3025573 -3010185
16317 -3010185 -3028212 -2965140 -2846763 -2748852 -2702118 -2691215 -2677443 -2581345 -2515439 -2377768 -2313826
16306 -2313826 -2314944 -2251428 -2249247 -2184629 -2143518 -2063715 -2034435 -1899387 -1883394 -1876946 -1867648 -1776489
16294a776489Q9415N7735R1722N2992N8992O4082P0559k0823N9208K8238Q4824
16283a139545J02827K2128Q0105O5468O4030J5811O3120k4043Q2341K0473J8922
16272f28363J21418R158P0843L0834j2557P7573J2191R7118N1800K1074K3081
16261a25830M1737J28211L1045M7154L877M1862q598M6218Q9588P5656k4888N9088
16249D05120R2951j0701K2010R6858j5323Q6885j0364J0263M8155N0620M2007
16238H18481J3528j5548J31166P5201l70J29372m4696n2023L0012l090K14553
16227A296586O1224l8384l1575l7926M7031P0292L2828j879J21951K8286O086
16216A554520k3809p5465M4708P0819K1504K3193J72517L6666l5963J04297N101
$$ plain form
16294 -1776489 -1687074 -1629339 -1537617 -1484625 -1425633 -1361551 -1290992 -1311815 -1252607 -1224369 -1139545
16283 -1139545 -1036718 -1014590 -934485 -869017 -804987 -789176 -726056 -750099 -667758 -647285 -628363
16272 -628363 -506945 -497787 -426944 -396110 -408667 -331094 -318903 -221785 -169985 -148911 -125830
16261 -125830 -84093 44118 75163 122317 126194 168056 159458 205676 295264 370920 346032 405120
16249 405120 498071 487370 509380 606238 590915 677800 667436 677699 725854 776474 818481
16238 818481 832009 816461 947627 1022828 1022458 1151830 1107134 1055111 1085123 1082033 1296586
16227 1296586 1357810 1319426 1287851 1249925 1296956 1367248 1400076 1398197 1520148 1548434 1554520
16216 1554520 1530711 1455246 1499954 1570773 1592277 1615470 1787987 1824653 1788690 1892987 1898088
16205A898088L6534o7666O7981K3387J0653L6914m4616L6321K4630L2528M898
16194B059652j0421j2561J1007R5316m0717Q8154O8928L999O5004o2023J3668
16183B280006J6331j4191L7315P7730J1505J7659M9381q328P5385j0865m5812
16172B486116P059L0788j4460p631K3788O4336O0512k6649P7236K9381M299J7266
16160B752041k7801J2579p854J786K4051K4575J30911j9335m3151k1029j9019
16149B807754j5275L3138L0767N0551j0315J3199P596m67J45718m7131K7743j2957
16137C030321m0441M9865M927J2034j0685k6489r0722P4212n772J4403J63975
16126C175628m8654O533j05250M6530O3970P258L9340K4829o6918k9928J6234
$$ plain form
16205 1898088 1934622 1866956 1934937 1958324 1968977 2005891 1961275 1997596 2022226 2054754 2059652
16194 2059652 2049231 2036670 2047677 2142993 2102276 2190430 2259358 2263357 2328361 2266338 2280006
16183 2280006 2296337 2282146 2319461 2397191 2408696 2426355 2475736 2467408 2542793 2531928 2486116
16172 2486116 2493175 2523963 2509503 2501872 2525660 2589996 2650508 2623859 2701095 2730476 2734775 2752041
16160 2752041 2724240 2736819 2728965 2730751 2754802 2779377 2910288 2890953 2847802 2826773 2807754
16149 2807754 2792479 2825617 2856384 2906935 2896620 2909819 2917415 2916948 3062666 3015535 3043278 3030321
16137 3030321 2989880 3039745 3044672 3056706 3046021 3019532 2928810 3003022 2997250 3011653 3175628
16126 3175628 3126974 3133507 3028257 3074787 3138757 3146015 3185355 3210184 3143266 3113338 3129572
16115C129572L7401m7478K6042P8431m0240l2797J16352m807l8750L5045j1471
16104C247300J8713l047k7255N2447O6177j22811J4606N8152j7174N243j00670
16093C191681j2633k5599J09078k0016k5740J0556M8081Q8447o783n086l2740
16082C319246j4934Q3517N7588r3388l033l2748J1274n3435p4388M0945J25149
16071C365793k7711q962k968L7865j0222k7773O7891K8764m1571j5434J4552K5837
16059C406061K9024L5155L4121L6767n7980m7922N9343o1372j05418R3149O8361
16048C489289l1104o6676L8837l6069p7956M0301L8231k8120M6247r3312q4777
16037C234891J0981J39975R2080K8352k0991r946L6388k1926j16773o3460J52761
$$ plain form
16115 3129572 3166973 3119495 3145537 3223968 3183728 3150931 3267283 3262476 3223726 3258771 3247300
16104 3247300 3266013 3262966 3235711 3288158 3354335 3231524 3246130 3304282 3287108 3292351 3191681
16093 3191681 3179048 3153449 3262527 3242511 3216771 3227327 3275408 3363855 3357072 3351986 3319246
16082 3319246 3304312 3387829 3445417 3352029 3348996 3316248 3327522 3274087 3199699 3240644 3365793
16071 3365793 3338082 3329120 3326152 3364017 3353795 3326022 3393913 3422677 3381106 3365672 3380224 3406061
16059 3406061 3435085 3470240 3504361 3541128 3483148 3435226 3494569 3433197 3327779 3420928 3489289
16048 3489289 3458185 3391509 3430346 3394277 3316321 3356622 3394853 3366733 3412980 3319668 3234891
16037 3234891 3245872 3385847 3477927 3506279 3485288 3475342 3511730 3489804 3373031 3309571 3462332
16026C462332k485K1052p8209J9310O2541j2577k978j12972k080P3750M2040r3959
16014C375765K205J19881m3957l5319J24187J0331m4704q8424l4588k1975M8338
16003C411740l8852J03510q656m4385J00305j60419k4074O2772Q2397j509l9457
15992C443372K5978l9828l1704m6748J23574j2j06837l734K4775p644j33441J35149
15980C382900R1491m4922r7306J40324Q3425r5219k6048j8310K1594l2612P9067
15969C484384L8490q3871M3549p9070J09789j2242r0097Q8954n1470K0775m0841
15958C428350Q573K7805j9818O4377K7985J162l4606k6714q1619k2400N0429k7766
15946C395758N9643O4321m5175j6324l0969k5744k3908m7245O8201M1625Q3306
$$ plain form
16026 3462332 3459847 3480899 3402690 3422000 3484541 3471964 3468986 3356014 3353934 3427684 3469724 3375765
16014 3375765 3377970 3497851 3453894 3418575 3542762 3553093 3508389 3419965 3385377 3363402 3411740
16003 3411740 3372888 3476398 3467742 3423357 3523662 3363243 3339169 3401941 3484338 3482829 3443372
15992 3443372 3469350 3429522 3397818 3351070 3474644 3474632 3367795 3364061 3388836 3381192 3247751 3382900
15980 3382900 3474391 3429469 3332163 3472487 3555912 3460693 3434645 3416335 3437929 3405317 3484384
15969 3484384 3522874 3439003 3482552 3403482 3513271 3501029 3410932 3499886 3448416 3469191 3428350
15958 3428350 3436923 3464728 3444910 3509287 3537272 3538434 3503828 3477114 3395495 3373095 3423524 3395758
15946 3395758 3455401 3519722 3474547 3458223 3427254 3401510 3377602 3330357 3398558 3440183 3523489
15935C523489K7579j29549J8843J7943n0402J5146P8614l9353J7039P7397l644
15924C553102j10725k7142L528j905j2030O0253N8888j54429l3696J72026o2700
15913C445170M6544j211j1667m5167j2023L9285M4281K9527r940M5192p7606j594
15901C490791n716K449j16502K8000O5739l1414k2765R6684L7887J051m0178k6203
15889C479823P848M8502l0743r550O4529p8825J8489m4428J53361p3751j10365
15878C424890j41632q945J24090K2109N0319r165K0777j3263N9182J8717j03200
15867C443879l1110p293J3019J10669m5769M4501j9941M6827j9405j8142J22p414
15855C509943J7616o0385J6768J5M470J359J3036J12124k8041o2302j23386l6063
$$ plain form
15935 3523489 3551068 3421519 3440362 3458305 3407903 3423049 3501663 3462310 3479349 3556746 3553102
15924 3553102 3442377 3415235 3418763 3416858 3404828 3465081 3523969 3369540 3335844 3507870 3445170
15913 3445170 3491714 3490503 3478836 3433669 3421646 3460931 3505212 3534739 3524799 3569991 3492385 3490791
15901 3490791 3485075 3487524 3371022 3399022 3464761 3433347 3410582 3507266 3545153 3546204 3506026 3479823
15889 3479823 3487671 3536173 3505430 3495880 3560409 3481584 3500073 3455645 3609006 3535255 3424890
15878 3424890 3283258 3274313 3398403 3420512 3470831 3461666 3482443 3469180 3528362 3547079 3443879
15867 3443879 3412769 3405476 3418495 3529164 3483395 3527896 3507955 3554782 3535377 3517235 3517357 3509943
15855 3509943 3527559 3467174 3483942 3483957 3488427 3489786 3502822 3614946 3586905 3524603 3401217 3365154
15843C365154q6292J21873M0752M692l6363k1658M4518q8609J9492J21584j6097
15832C469046O248J09275p745j59430m4649R7520P314Q413N2986J2320r2557j8692
15820C440049k7127M5791Q5627n6549l7886M1284M0819n5234p8587R2732P0300
15809C561219k6801J6099M1707j2506Q0453j11351m7064m9343L6739M1583O8751
15798C599486m3274j19005n8138O4103J14917q1938o281N5856J15283q5898m2546
15787C512565k050n8701P7949K8984M6710r2328j4651J05345l5186l1553k3729
15776C513355K8062L3438m2610k5348j24047n9301J69036j7503j9331k8570P0090
15765C497271J0123N359j6383n4000R255o8046L4617J35750m8693j3466j105M4209
$$ plain form
15843 3365154 3278862 3400735 3441487 3446179 3409816 3388158 3432676 3344067 3363559 3485143 3469046
15832 3469046 3475294 3584569 3576824 3417394 3372745 3470265 3477579 3485992 3538978 3551298 3458741 3440049
15820 3440049 3412922 3458713 3544340 3487791 3449905 3491189 3532008 3476774 3398187 3490919 3561219
15809 3561219 3534418 3550517 3592224 3579718 3660171 3548820 3501756 3452413 3489152 3530735 3599486
15798 3599486 3556212 3437207 3379069 3443172 3558089 3476151 3469870 3525726 3641009 3555111 3512565
15787 3512565 3510515 3451814 3529763 3558747 3605457 3513129 3498478 3603823 3568637 3537084 3513355
15776 3513355 3541417 3574855 3532245 3506897 3382850 3323549 3492585 3475082 3455751 3427181 3497271
15765 3497271 3507394 3512753 3496370 3442370 3451625 3383579 3418196 3553946 3505253 3491787 3490682 3534891
15753C534891J9503j11232O5982J4133l157l077J562j13693j1098P8142J4828
15742C486784j8502L4713o0751L2150J55947K2568r6334n7426O7363J0051l2716
15731C543847M255N4920l1762o106O340n1939p101q4387N5784K5681N7269n3087
15719C513714l7840M448N1318j3474q854j5390j9639J10179m6725l4260o0000
15708C443477Q2401m8558J4788P5378m2691k2009p2033O545J04236L109r3110
15697C451533J05294P5964r2867p8197L9794o0505L0956M0825K242l0139K0469
15686C505369O8087k1496K6824j30563J32J8477j7506O8494N322j08216K7022
15675C441946Q8114n9250l20O3199L2644Q7715p6205M5219K3782r6969J8361n2532
$$ plain form
15753 3534891 3554394 3443162 3509144 3523277 3520120 3517043 3518605 3404912 3393814 3471956 3486784
15742 3486784 3468282 3502995 3442244 3474394 3630341 3652909 3556575 3499149 3566512 3576563 3543847
15731 3543847 3548102 3603022 3571260 3565154 3571494 3519555 3512454 3428067 3483851 3509532 3566801 3513714
15719 3513714 3475874 3480322 3531640 3518166 3509312 3493922 3474283 3584462 3537737 3503477 3443477
15708 3443477 3525878 3477320 3492108 3567486 3524795 3502786 3430753 3437298 3541534 3544643 3451533
15697 3451533 3556827 3632791 3539924 3461727 3501521 3441016 3471972 3512797 3515039 3484900 3505369
15686 3505369 3573456 3551960 3578784 3448221 3448353 3466830 3449324 3517818 3523140 3414924 3441946
15675 3441946 3530060 3470810 3470490 3533689 3566333 3654048 3577843 3623062 3646844 3549875 3568236 3515704
15663C515704j20890j0237O9710J19339j4871o7875N2970L6775o9488q014R6786
15652C599909N9619m5339M9639n5287k9919P133o6991K0997l7120J6821M7185
15641C566647L8408N8635n6240q5651m7441M7459J02188j38558N9609Q6109J3091
15630C644256K9371j01322R455L5427m1162K089M6537K688m2195M8692j8451K7581
15618C642966M448k8265J0189k3506M407o6489n6368o922Q1974j8449m3556M7146
15606C547575k8895N0484k734M7242P467j1395m0945m3073Q771o7119J8586N7854
15594C543818N3055O637l0298o765k0532n174J3189o989J175R9766J912j7715
15582C632079l493l9785L7142k6411j24566P8094l8433L3109M4015m1356r072
$$ plain form
15663 3515704 3394814 3384577 3454287 3573626 3558755 3490880 3543850 3580625 3511137 3503123 3599909
15652 3599909 3659528 3614189 3663828 3608541 3578622 3585755 3518764 3539761 3502641 3519462 3566647
15641 3566647 3605055 3663690 3607450 3521799 3474358 3521817 3624005 3485447 3545056 3631165 3644256
15630 3644256 3673627 3572305 3581760 3617187 3576025 3578114 3624651 3627339 3585144 3633836 3615385 3642966
15618 3642966 3647414 3619149 3629338 3605832 3610239 3543750 3487382 3480460 3562434 3543985 3500429 3547575
15606 3547575 3518680 3569164 3566430 3613672 3621139 3609744 3568799 3525726 3534497 3467378 3485964 3543818
15594 3543818 3596873 3603510 3573212 3566447 3545915 3540741 3553930 3546941 3548116 3647882 3649794 3632079
15582 3632079 3628586 3588801 3625943 3599532 3474966 3553060 3514627 3547736 3591751 3550395 3541323
15571C541323l7317M3545q772n5929n2615J07636N1328L3902j34045O4357o5357
15560C488056j3206L2110l6628Q0901p840m9671N6327M4054O7422J8655j08360
15549C571820K3856K9538O8026m9838p1406j38097P5083Q6140M1651J6160Q03
15538C653736o410o8918r3647K1653Q4457o3042J4603r772k5803K4605Q7502o9009
15526C549955M9782M8701M3345m2608k4634r262P183j13389L4218J37610m0848
15515C640053r6558l1193N9730J2618P8426l5502l2286N9796K68j1476l0916r3602
15503C519358m4N2054J39034q4239j30705N6149N0957l6583p0199P5682P5768
15492C647232q0850o8592P4645J39304o9632P143j4560M1567m0251n5147L7950
$$ plain form
15571 3541323 3504006 3547551 3538779 3482850 3430235 3537871 3589199 3623101 3489056 3553413 3488056
15560 3488056 3474850 3506960 3470332 3551233 3543393 3493722 3550049 3594103 3661525 3680180 3571820
15549 3571820 3595676 3625214 3693240 3643402 3571996 3433899 3508982 3595122 3636773 3652933 3653736
15538 3653736 3647326 3578408 3484761 3506414 3590871 3527829 3542432 3532660 3506857 3531462 3618964 3549955
15526 3549955 3599737 3648438 3691783 3649175 3624541 3615279 3622462 3509073 3543291 3680901 3640053
15515 3640053 3543495 3512302 3572032 3584650 3663076 3627574 3595288 3655084 3655352 3643876 3612960 3519358
15503 3519358 3519314 3571368 3710402 3626163 3495458 3551607 3602564 3565981 3495782 3571464 3647232
15492 3647232 3566382 3497790 3572435 3711739 3642107 3649250 3634690 3676257 3636006 3580859 3618809
15481C618809K1995j7680j06011k2953N7028p6098L3961L8804o5495Q9180Q2699
15470C654239o6341m8769K2100r171j6246R400J1168j5999o1545k4911J26757
15459C580682J3550l9358K3978K0879K1995O8797R325j07106k3230J33341k9641
15448C673212K1225l0500j20771q145k1591K5902L4398r8042L9701n337Q8029
15437C598081J36532k4565l3865j3437p2949O5226J15340k4688m5612o3110O7260
15426C704213o309m5148O1341o3666n9758M0591J18876j10297p325M4976l2877
15415C644617J10154o0429O2464j14810j10310l641O3886r382K1412k7563j3643
15404C562755k0703N2761J15376j9486M5556n1296j08641N3233j4611K8101N9989
$$ plain form
15481 3618809 3640804 3623124 3517113 3494160 3551188 3475090 3509051 3547855 3482360 3571540 3654239
15470 3654239 3587898 3539129 3561229 3552058 3535812 3545212 3556380 3540381 3478836 3453925 3580682
15459 3580682 3594232 3554874 3578852 3599731 3621726 3690523 3699848 3592742 3569512 3702853 3673212
15448 3673212 3694437 3663937 3543166 3535021 3513430 3539332 3573730 3475688 3515389 3510052 3598081
15437 3598081 3734613 3710048 3676183 3662746 3589797 3655023 3770363 3745675 3700063 3636953 3704213
15426 3704213 3697904 3652756 3714097 3650431 3590673 3631264 3750140 3639843 3632518 3677494 3644617
15415 3644617 3754771 3694342 3756806 3641996 3531686 3528045 3591931 3582549 3603961 3576398 3562755
15404 3562755 3542052 3594813 3710189 3690703 3736259 3684963 3576322 3629555 3614944 3643045 3703034
15393C703034l9760m1243K4166j7767J8114O2609R8678o4062l2457j0396r2360
15382C608556L1158j9512L0886q4743J5568l161P1401M7203M1032L7247j15904
15371C659731j2078n3950N8393K2234o5724M5906q6286N7339J5468M9127J0888
15360C701048M805m2372m3979j8320r2319J83826K7165q2248o0144k5904J78910
15349C730468p4366o0923L3926q4123P1639O0687o8350l0331O8985L4630m5880
15338C636362Q503J27129K7866k2823k3713j09712r37k1283M8836r07j9278m9071
15326C600972N640k6559J0623K536M9900l8418j7715M2936n953Q1956q9009Q0583
15314C697492j0202l3313R0320m1280q1601j1671J07058M8180r6685l7522o7696
$$ plain form
15393 3703034 3663274 3622031 3646197 3628430 3646544 3709153 3807831 3743769 3711312 3700916 3608556
15382 3608556 3639714 3620202 3651088 3566345 3581913 3578752 3650153 3697356 3738388 3775635 3659731
15371 3659731 3647653 3593703 3652096 3674330 3608606 3654512 3568226 3625565 3641033 3690160 3701048
15360 3701048 3705853 3663481 3619502 3601182 3508863 3692689 3719854 3637606 3577462 3551558 3730468
15349 3730468 3656102 3595179 3629105 3544982 3616621 3677308 3608958 3578627 3647612 3682242 3636362
15338 3636362 3644865 3771994 3799860 3777037 3753324 3643612 3642675 3621392 3670228 3669321 3650043 3600972
15326 3600972 3606612 3580053 3590676 3593212 3643112 3604694 3586979 3629915 3623962 3705918 3616909 3697492
15314 3697492 3687290 3653977 3744297 3703017 3621416 3609745 3716803 3764983 3668298 3630776 3563080
15303C563080J11828k1331l7614O1619L2323J593n6220K8345p864r3867k5161
15292C556731R9155J08966o1048m850r5347L1146J17018Q6386K731r3526o1233
15281C686129k0056n0201j26649O8693N3461M9712o6704p8722O2344Q6899L0985
15270C695891Q3596m846m569j569j28558j7340Q5107j1497J8534Q0506j0754j00323
15258C684178n5289K2223L165P6757Q330m809K0871j01001j2200L68Q0452l7341
15246C685704P536J13889j80068p0221J39841J66966M102m3956K0035j9526o1535
15235C762767n9963J9724j07733J26351J09696L7765l0098j59349n2454J2883
15225C659589J11586k5636M4816L7737j65324j5034L9424L8227J2848J3753o3760
$$ plain form
15303 3563080 3674908 3653577 3615963 3677582 3709905 3711498 3655278 3683623 3675759 3581892 3556731
15292 3556731 3655886 3764852 3703804 3698954 3603607 3634753 3751771 3838157 3840888 3747362 3686129
15281 3686129 3666073 3615872 3489223 3557916 3611377 3661089 3594385 3515663 3578007 3664906 3695891
15270 3695891 3779487 3774641 3770072 3768503 3639945 3622605 3707712 3696215 3714749 3795255 3784501 3684178
15258 3684178 3628889 3651112 3654277 3731034 3739364 3734555 3755426 3654425 3642225 3642593 3723045 3685704
15246 3685704 3693240 3807129 3627061 3556840 3696681 3863647 3867749 3823793 3843828 3824302 3762767
15235 3762767 3702804 3722528 3614795 3741146 3850842 3888607 3858509 3699160 3646706 3659589
15225 3659589 3771175 3745539 3790355 3828092 3662768 3647734 3687158 3725385 3738233 3751986 3688226
15214C688226p9872K00696k3122o252j4091o9179m1476l2405O2286m2527k6410
15203C615874o6421M9732N1761j06887P0468N5951P5677N706k5828j34706J0485
15192C601812L7687J9622J51439n5993k4032q0711K8345o944n0N4732k5895p219
15180C692793L4189j14104n7280J22018o010l8371M9258J460M498p895K378j7752
15168C665182m5847j183O5235O3372l9086o3622J0718N2783m9389j9337M9074
15157C687900K9828j11692M6746L6603M2070q3621M456O0295J8701n2465j7742
15146C661079j274K4975M3008o9409j0417J23546k7127o8769M6954p1007N3118
15135C704677N9111O8237j20997n1045O3281J4026K3775L3928n550k31K0867P3495
$$ plain form
15214 3688226 3608354 3809050 3785928 3779676 3765585 3696406 3654930 3622525 3684811 3642284 3615874
15203 3615874 3549453 3599185 3650946 3544059 3614527 3670478 3746155 3751861 3726033 3591327 3601812
15192 3601812 3639499 3659121 3810560 3754567 3730535 3649824 3678169 3671225 3671175 3725907 3700012 3692793
15180 3692793 3726982 3612878 3555598 3677616 3671606 3633235 3682493 3683953 3688451 3680556 3682934 3665182
15168 3665182 3619335 3618152 3683387 3746759 3707673 3644051 3654769 3707552 3658163 3638826 3687900
15157 3687900 3717728 3606036 3652782 3689385 3731455 3647834 3652290 3712585 3731286 3678821 3661079
15146 3661079 3659805 3684780 3727788 3658379 3647962 3771508 3744381 3675612 3722566 3651559 3704677
15135 3704677 3763788 3832025 3711028 3659983 3723264 3737290 3761065 3794993 3789443 3789212 3810079 3883574
15123C883574j74300Q0606m372k1319n209j6704J3093j22781j9742l8985J85609
15112C759470O1654L9496j36635L8490m7378j9077k754j2265J53816k193Q0110
15101C912734j86308j36600J06204L0258R5678n671r827O775j00586J0898r4693
15090C628862P4142m0701L2943L4015k0406J9806k000N126N3111m2106m5689P9977
15078C777080J6497q9774l0412L1391M4377L8110j9203L4828k6791j9935k0431
15067C735737M1845J1622M3593o0586k2842m6287P8813N1444l1198k6229n931
15056C769981J9377k6401p6365M6431j37132j866J37580J5099O262N392N4908
15045C813266l2605n6871N0979L0585o584l1367N5774L8192j19591N8982L477
$$ plain form
15123 3883574 3709274 3789880 3785508 3764189 3758980 3742276 3755369 3632588 3612846 3573861 3759470
15112 3759470 3821124 3860620 3723985 3762475 3715097 3696020 3693266 3681001 3834817 3832624 3912734
15101 3912734 3726426 3589826 3696030 3726288 3821966 3816295 3806468 3813243 3712657 3723555 3628862
15090 3628862 3703004 3662303 3695246 3729261 3708855 3728661 3726661 3731787 3784898 3742792 3697103 3777080
15078 3777080 3793577 3703803 3673391 3704782 3749159 3787269 3768066 3802894 3776103 3756168 3735737
15067 3735737 3777582 3789204 3832797 3772211 3749369 3703082 3781895 3833339 3802141 3775912 3769981
15056 3769981 3789358 3762957 3686592 3733023 3595891 3594025 3731605 3746704 3752966 3758358 3813266
15045 3813266 3780661 3723790 3774769 3805354 3798770 3767403 3823177 3861369 3741778 3800760 3804237
15034C804237K4153j12832J5579M2290q2266o4987K2837P8717J02409R4247J9931
15023C944315o6355j20354q0634J00942K2848N6263l1223j3581L7696k8269M5249
15012C866897p0242o7922l642J2092N8804q7536J4079L5555o0062r829J60290
15001C848484M2911p8435N223j40168L1452J59999k5369N744P6502O0811j01312
14990C885842k7070n8690k4244P1452q7385K3251j23399J44674p5351n8488L4136
14979C704728L696J17412P860j20020J2111L2065r75l4391k8089K856R5496k065
14967C790684O0165j5140q6607Q4328j0590q6452l6538Q4802l4148K5491J8899
$$ plain form
15034 3804237 3828390 3715558 3731137 3773427 3691161 3626174 3649011 3727728 3830137 3924384 3944315
15023 3944315 3877960 3757606 3676972 3777914 3800762 3857025 3825802 3812221 3849917 3821648 3866897
15012 3866897 3796655 3728733 3725091 3737183 3795987 3708451 3722530 3758085 3698023 3688194 3848484
15001 3848484 3891395 3812960 3818183 3678015 3709467 3869466 3844097 3849841 3926343 3987154 3885842
14990 3885842 3858772 3800082 3775838 3847290 3759905 3783156 3659757 3804431 3729080 3670592 3704728
14979 3704728 3708424 3825836 3833696 3713676 3725787 3757852 3756877 3722486 3694397 3697253 3792749 3790684
14967 3790684 3850849 3835709 3749102 3833430 3822840 3736388 3699850 3784652 3750504 3775995 3794894
$$ [...]
##END NTUPLES=NMR SPECTRUM
##END=
