##TITLE=1H_CA-8866-1
 CDCl3, 8 sc, 
 31.05.2021
##JCAMPDX= 6.0         $$ Bruker NMR JCAMP-DX V2.0
##DATA TYPE= NMR SPECTRUM
##DATA CLASS= NTUPLES
##ORIGIN= UXNMR, Bruker Analytische Messtechnik GmbH
##OWNER= root
$$ XWIN-NMR		Version 3.5
$$ Mon May 31 11:17:58 2021 Russian Standard Time (UT+4h)  she@DPX200
##.OBSERVE FREQUENCY= 200.131506
##.OBSERVE NUCLEUS= ^1H
##.ACQUISITION MODE= SIMULTANEOUS
##.ACQUISITION SCHEME= undefined
##.AVERAGES= 8
##.DIGITISER RES= 18
##SPECTROMETER/DATA SYSTEM= spect
##.PULSE SEQUENCE= zg30
##.SOLVENT NAME= CDCl3
##.SHIFT REFERENCE= (INTERNAL, CDCl3, 0, 15.9844)
##AUDIT TRAIL= $$ (NUMBER, WHEN, WHO, WHERE, WHAT)
$$ ##TITLE= Audit trail, XWIN-NMR		Version 3.5
$$ ##JCAMPDX= 5.01
$$ ##ORIGIN= Bruker BioSpin GmbH
$$ ##OWNER= she
$$ F:/spectra/data/she/nmr/H-F/1/pdata/1/auditp.txt
$$ ##AUDIT TRAIL=  $$ (NUMBER, WHEN, WHO, WHERE, WHAT)
(   1,<2021-05-31 11:16:08.70 +0400>,<she>,<DPX200>,
      <created by zg, POWCHK disabled, PULCHK disabled
       configuration hash MD5:
       00 E9 B6 7A A2 85 ED C7 34 08 36 98 17 FE 4E 26
       data hash MD5: 16K
       5B 92 08 26 7B F3 AB F7 9A 69 56 C2 DE 75 6E D3>)
(   2,<2021-05-31 11:16:19.14 +0400>,<she>,<DPX200>,
      <Start of raw data processing
       efp BC_mod = 2 LB = 0.24 FT_mod = 6 PKNL = 1 PHC0 = -11124.55 PHC1 = 18.00099 SI = 16K 
       data hash MD5: 16K
       32 BB 29 D0 C8 A4 52 84 AD 52 55 85 02 14 13 5D>)
(   3,<2021-05-31 11:16:43.40 +0400>,<she>,<DPX200>,
      <pk PHC0 = 5.958728 PHC1 = -9.199999 
       data hash MD5: 16K
       B1 8B 7E 1A 50 4F 07 10 A9 D4 61 A4 B5 85 5B 05>)
(   4,<2021-05-31 11:16:46.70 +0400>,<she>,<DPX200>,
      <abs ABSG = 5 
       data hash MD5: 16K
       DD 4E 82 86 A9 BA 9A F7 EB AB CA 48 30 10 29 CE>)
$$ ##END=
$$ 
$$ hash MD5
$$ CE 95 B2 0E FE 4B 65 55 03 CD BB 81 D8 C9 E8 DF
##$RELAX= 
##$RELAX= 
##$RELAX= 
##$RELAX= 
##$RELAX= 
##$RELAX= 
$$ Bruker specific parameters
$$ --------------------------
##$DU= <F:/spectra>
##$EXPNO= 1
##$NAME= <H-F>
##$PROCNO= 1
##$TYPE= <nmr>
##$USER= <she>
##$AMP= (0..31)
100 100 100 100 100 100 100 100 100 100 100 100 100 100 100 100 100 100 
100 100 100 100 100 100 100 100 100 100 100 100 100 100 
##$AQSEQ= 0
##$AQ_mod= 1
##$AUNM= <au_zg>
##$AUTOPOS= <>
##$BF1= 200.13
##$BF2= 200.13
##$BF3= 200.13
##$BF4= 200.13
##$BF5= 200.13
##$BF6= 200.13
##$BF7= 200.13
##$BF8= 200.13
##$BYTORDA= 1
##$CFDGTYP= 0
##$CFRGTYP= 5
##$CHEMSTR= <none>
##$CNST= (0..31)
1 1 145 1 1 1 1 1 1 1 1 1 1 1 1 1 1 1 1 1 1 1 1 1 1 1 1 1 1 1 1 1 
##$CPDPRG= <>
##$CPDPRG1= <>
##$CPDPRG2= <>
##$CPDPRG3= <>
##$CPDPRG4= <mlev>
##$CPDPRG5= <mlev>
##$CPDPRG6= <mlev>
##$CPDPRG7= <mlev>
##$CPDPRG8= <mlev>
##$CPDPRGB= <>
##$CPDPRGT= <>
##$D= (0..31)
0 1.2 0 0 0 0 0 0 0 0.06 0 0.03 0 0 0 0 0.0002 0 0 0 0 0 0 0 0 0 0 0 0 
0 0 0 
##$DATE= 1622445368
##$DBL= (0..7)
120 120 120 120 120 120 120 120 
##$DBP= (0..7)
150 150 150 150 150 150 150 150 
##$DBP07= 0
##$DBPNAM0= <>
##$DBPNAM1= <>
##$DBPNAM2= <>
##$DBPNAM3= <>
##$DBPNAM4= <>
$$ [...]
##$SUBNAM3= <"">
##$SUBNAM4= <"">
##$SUBNAM5= <"">
##$SUBNAM6= <"">
##$SUBNAM7= <"">
##$SUBNAM8= <"">
##$SUBNAM9= <"">
##$SW= 16.9725357007746
##$SWIBOX= (0..15)
0 0 2 0 0 0 0 0 0 0 0 0 0 0 0 0 
##$SW_h= 3396.73913043478
##$TD= 16384
##$TD0= 1
##$TE= 0
##$TE2= 300
##$TE3= 300
##$TEG= 300
##$TL= (0..7)
0 120 120 120 120 120 120 120 
##$TP= (0..7)
150 150 150 150 150 150 150 150 
##$TP07= 0
##$TPNAME0= <>
##$TPNAME1= <>
##$TPNAME2= <>
##$TPNAME3= <>
##$TPNAME4= <>
##$TPNAME5= <>
##$TPNAME6= <>
##$TPNAME7= <>
##$TPOAL= (0..7)
0.5 0.5 0.5 0.5 0.5 0.5 0.5 0.5 
##$TPOFFS= (0..7)
0 0 0 0 0 0 0 0 
##$TUNHIN= 0
##$TUNHOUT= 0
##$TUNXOUT= 0
##$USERA1= <user>
##$USERA2= <user>
##$USERA3= <user>
##$USERA4= <user>
##$USERA5= <user>
##$V9= 5
##$VALIST= <valist>
##$VCLIST= <CCCCCCCCCCCCCCC>
##$VD= 0
##$VDLIST= <DDDDDDDDDDDDDDD>
##$VPLIST= <PPPPPPPPPPPPPPP>
##$VTLIST= <TTTTTTTTTTTTTTT>
##$WBST= 1024
##$WBSW= 4
##$XGAIN= (0..3)
0 0 0 0 
##$XL= 0
##$YL= 0
##$YMAX_a= 553994
##$YMIN_a= -398061
##$ZGOPTNS= <>
##$ZL1= 120
##$ZL2= 120
##$ZL3= 120
##$ZL4= 120
##$ABSF1= 15.97092
##$ABSF2= -1.001742
##$ABSG= 5
##$ABSL= 3
##$ALPHA= 0
##$AQORDER= 0
##$ASSFAC= 0
##$ASSFACI= 0
##$ASSFACX= 0
##$ASSWID= 0
##$AUNMP= <proc_1d>
##$AZFE= 0.1
##$AZFW= 0.1
##$BCFW= 0
##$BC_mod= 2
##$BYTORDP= 0
##$COROFFS= 0
##$CY= -3
##$DATMOD= 1
##$DC= 0
##$DFILT= <>
##$DTYPP= 0
##$F1P= 0
##$F2P= 0
##$FCOR= 1
##$FTSIZE= 16384
##$FT_mod= 6
##$GAMMA= 0
##$GB= 0
##$INTBC= 1
##$INTSCL= 1.334414e-10
##$ISEN= 128
##$LB= 0.24
##$LEV0= 0
##$LPBIN= 0
##$MAXI= 10000
##$MC2= 0
##$MEAN= 0
##$ME_mod= 0
##$MI= 1.114404
##$NCOEF= 0
##$NC_proc= -6
##$NLEV= 6
##$NOISF1= 3.799351
##$NOISF2= 2.8
##$NSP= 0
##$NTH_PI= 0
##$NZP= 0
##$OFFSET= 15.98439
##$PC= 1
##$PHC0= -11118.59
##$PHC1= 8.800991
##$PH_mod= 1
##$PKNL= yes
##$PPARMOD= 0
##$PSCAL= 0
##$PSIGN= 0
##$REVERSE= no
##$SF= 200.130005413528
##$SI= 16384
##$SIGF1= 3
##$SIGF2= 2
##$SINO= 5.538805
##$SIOLD= 16384
##$SREGLST= <1H.CDCl3>
##$SSB= 0
##$STSI= 16384
##$STSR= 0
##$SW_p= 3396.73913043479
##$SYMM= 0
##$S_DEV= 0
##$TDeff= 16384
##$TDoff= 0
##$TI= <>
##$TILT= no
##$TM1= 0
##$TM2= 0
##$TOPLEV= 0
##$USERP1= <user>
##$USERP2= <user>
##$USERP3= <user>
##$USERP4= <user>
##$USERP5= <user>
##$WDW= 1
##$XDIM= 16384
##$YMAX_p= 312828774
##$YMIN_p= -539647
$$ End of Bruker specific parameters
$$ ---------------------------------
##NTUPLES= NMR SPECTRUM
##VAR_NAME=  FREQUENCY,     SPECTRUM/REAL,   SPECTRUM/IMAG
##SYMBOL=    X,             R,               I
##VAR_TYPE=  INDEPENDENT,   DEPENDENT,       DEPENDENT
##VAR_FORM=  AFFN,          ASDF,            ASDF
##VAR_DIM=   16384,         16384,           16384
##UNITS=     HZ,            ARBITRARY UNITS, ARBITRARY UNITS
##FACTOR=    0.207333158178282, 1,           1
##FIRST=     3198.9561090234, 0,             0
##LAST=      -197.78302141139, 0,            0
##MIN=       -197.78302141139, -539647,      0
##MAX=       3198.9561090234, 312828774,     0
$$ Real data points
##PAGE= N=1
##DATA TABLE= (X++(R..R)), XYDATA
$$ [...]
8113 42156646 43433344 44707741 46361018 48199662 50568397 53001781 55391587 57445146
8105 57445146 59090296 59883767 59864854 59414127 58068484 56293186 54859247 53824718 53208329
8096 53208329 52836203 52946598 53254518 53380634 53505641 53599165 54303716 55311237 56492146
8087 56492146 58051690 60047389 61899861 63812021 65688117 67383650 68717125 69711175
8079 69711175 70821300 72278067 73863189 75841346 78550525 81417937 84569216 87943861
8071 87943861 91236485 94171327 96356222 97402218 97397153 96222244 93763388 90441780 87219608
8062 87219608 83829716 80552365 77049637 73292668 69702215 66364367 63558200 60959283
8054 60959283 59060093 57540716 56060778 54906945 54042579 53175182 53082144 53282633 53500251
8045 53500251 53716398 54011852 54430521 54581825 54672779 54947836 55367417 55981687 56689250 57616100
8035 57616100 58454049 59143075 60065404 61208223 62632862 63784707 64238888 63836242 62550700
8026 62550700 60089777 56379882 52462033 48674972 45328005 42660630 40334133 38355785
8018 38355785 36634308 35257586 33846030 32656638 31466879 30205136 28968969 28071467
8010 28071467 27144076 26282554 25628651 25097239 24731667 24347993 24040742 23753529 23532734
8001 23532734 23451602 23252453 22936485 22830112 22917383 22965226 22897364 23008468 23054299 23164216
7991 23164216 23257487 23314491 23314935 23404428 23492465 23806727 24338207 25022498 25626703 26450734 27536889
7980 27536889 28871377 30203422 31390461 31846049 30905320 29555434 28185049 27008617
7972 27008617 26461901 26205495 25776299 25695804 25705821 25888466 26317734 26817746 27351916 28033633
7962 28033633 28794189 29623529 30626197 31708197 32238989 32398543 32731163 33264256 33661755
7953 33661755 33639234 33530451 33106408 32571022 31755224 30848660 29916167 29144592 28490075 27587291
7943 27587291 26990356 26982624 26596599 26304565 26299860 26409896 26588949 26767233 27207841 27473377
7933 27473377 28219638 29199136 30382610 31930908 33699378 35565694 37330800 38789619
7925 38789619 39958727 40514826 40866757 40824859 40684579 40649996 40176517 39729918 39026775 38216947
7915 38216947 37482428 36739137 36046951 35731408 35404534 35348106 35713135 36526451 37252546 38205842
7905 38205842 39579032 40987260 42955477 45071265 47561371 50309625 53434021 56544560
7897 56544560 59417315 62215447 64856410 67539885 69990883 71621831 72232294 71649700
7889 71649700 70505899 68814754 66770119 63996855 60670373 57404376 54025515 50855846
7881 50855846 48347398 46159196 44436082 43134887 42354527 41769881 41003424 40745031 40683915
7872 40683915 41016994 41469192 42383920 43531286 44991135 46692374 48249972 49734029 51393237
7863 51393237 52902220 54289400 56208370 58224480 60090457 61472935 62379238 62233907
7855 62233907 60741367 58494792 55796893 52831884 49593731 46438741 43640812 41029627
7847 41029627 38763299 36550787 34218476 32242106 30592007 28912757 27364960 26175850
7839 26175850 25266321 24527414 24001144 23677405 23481868 23335829 23141681 23263637 23242811 23505661
7829 23505661 23727610 24065857 24546228 24977353 25194567 25267283 25188666 25439417 25460049 24911613
7819 24911613 24210260 23129350 22248398 21382800 20175803 18982223 17820336 16778720 15659657
7810 15659657 14816844 14111418 13218959 12407102 11556549 10931015 10475984 10036086 9727885
7801 9727885 9339412 9034485 8714883 8343315 8080806 7966394 7838840 7353814 7104949 6990048
7791 6990048 6942479 6753715 6599178 6439545 6272678 5990670 5648884 5644997 5604717 5467762
7781 5467762 5339450 5175555 5241319 5077385 5006127 4962454 4972388 4731673 4429297 4385239 4270111
7770 4270111 4177745 4177119 4024146 3935019 3868913 3759961 3693648 3538673 3483197 3283435 3135938
7759 3135938 3203607 3172901 3038437 3028659 3136644 2878594 2806090 2688053 2683549 2651056 2542562
7748 2542562 2645198 2562871 2391778 2461041 2568499 2407876 2213246 2272855 2242987 2162574
7738 2162574 2034348 2127540 1989004 1981928 1969455 1940983 1910211 2034796 2057075 1959423 1907663
7727 1907663 1862400 1874573 2002594 2127849 1943671 1833646 1786991 1932287 1859035 1734068
7717 1734068 1815432 1741610 1573656 1562528 1649413 1740866 1560204 1535966 1501543 1424916 1533673
7706 1533673 1447483 1263817 1555135 1585080 1457546 1273202 1306369 1322941 1327446 1222027 1205030
7695 1205030 1252986 1442616 1305264 1003622 1221004 1411062 1313882 1368686 1326735 1295219
7685 1295219 1267243 1276750 1365393 1499114 1317188 1107190 1136019 1213696 1218525 1217595 1074660
7674 1074660 1168018 1181913 1149744 1073847 1137825 1033157 832493 755457 797057 961653 950748
7663 950748 929716 966393 964902 908339 838126 738569 775992 898468 796664 716352 708133 767621
7651 767621 811478 756859 810835 824152 671849 598410 608690 417371 551967 773279 793407
7640 793407 517890 556218 761634 649073 501609 339629 354130 456114 574870 751739
7630 751739 623832 775680 577855 469826 624822 540350 427012 385807 436924 537827
7620 537827 621183 628768 591615 452883 364807 446712 500217 471432 266230 359608 345059
7609 345059 541625 424490 446111 439163 499864 455917 347206 443532 384139 372378 269439
7598 269439 282753 380239 394716 370547 280939 305163 429515 373803 324068 217193 64990
7587 64990 107436 224588 220782 180520 178329 131008 235527 415288 413145 423992 366370 273280
7575 273280 331204 354947 492690 509605 482280 428561 174720 251189 356166 392431 366362
7564 366362 232921 299837 473584 552203 380421 215752 410576 454157 266827 326340
7554 326340 362446 267342 313835 276102 257320 422735 422436 99798 183238 308390 241844
7543 241844 161051 87497 96032 325587 404936 582852 557698 311786 277260 317862 209971
7532 209971 202716 220062 354459 271710 284675 407834 239412 260378 281935 64076 196423
7521 196423 348722 365699 214531 244710 291170 385915 569362 386965 390377 279026 431237
7510 431237 400817 422176 393037 358120 363493 294859 479101 441685 311383 418190 441088
7499 441088 373384 507677 544039 650251 426110 368377 471345 309490 332560 253641 292006
7488 292006 406020 443390 339521 216419 506288 517427 331736 251057 190104 283257 427662
7477 427662 478076 495602 544776 447248 454195 387622 215379 341723 396903 290333 386696
7466 386696 331463 297342 186660 273872 241094 147258 352975 433202 349370 312220 242065
7455 242065 127196 111751 208911 199572 252240 296618 90002 110574 103337 195666 265410 280835
7443 280835 255157 118626 46890 226553 318047 129792 95367 270809 383279 244975
7433 244975 248573 298387 217031 214449 105236 174427 323639 486644 257422 106027 285040
7422 285040 264937 99201 117522 171964 219188 195773 123286 95170 64342 52360 -1128
7411 -1128 -89796 42014 128179 270413 241526 53247 103969 -21421 -119267 124990 213676
7400 213676 17770 -108230 -30682 10933 6429 215097 126314 162035 137881 68390 21882
7389 21882 -220 32388 107208 46328 178754 150942 142306 81861 207993 188009 159130 135976
7377 135976 -111045 -63678 141585 326821 247826 162949 283494 221896 249885 254271 132985
7366 132985 132389 222028 407057 279636 258283 269365 129095 165991 49967 94848 99085
7355 99085 85205 64646 -43610 118548 156493 77730 26373 -89414 -4651 -34329 57864
7344 57864 64412 113384 202875 323644 198375 34150 30828 129645 26879 -118788 -1298
7333 -1298 1893 114745 155442 45950 -83413 167762 154069 -3139 -38743 213308 270777
7322 270777 175281 35116 98703 137862 185945 220218 318225 227250 275970 249816 23434
7311 23434 -104099 98796 86978 99082 215721 321116 285361 204974 234875 108989 -31901
7300 -31901 25045 244295 286267 198794 194853 194852 203315 85528 -14050 120852 175234 160664
7288 160664 -26187 -55423 75353 106636 68934 77929 80463 -115158 -16796 94525 67141
7277 67141 -9064 -62774 -47793 -20775 108475 184203 71438 237979 191781 46417 74684
7266 74684 113664 170199 181960 223091 192604 99269 -107947 -74204 -10638 69192 -40804
7255 -40804 53605 103676 337077 184498 273368 145230 80486 64255 48528 134198 124358
7244 124358 205742 318096 258414 227917 240763 125318 150444 78149 27965 75628 369071
7233 369071 458003 367276 361174 350783 249538 154364 151104 236521 167409 107917 49143 172442
7221 172442 267226 274968 331951 291511 290905 208894 184460 239595 326436 216488 294628 235221
7209 235221 325309 396275 295352 156639 202129 227725 218578 268739 175304 181903 86534 154180
7197 154180 94629 195881 196113 273047 281891 313661 114194 23496 126552 300336 266026
7186 266026 245261 250537 398386 225053 137073 131102 254608 358940 325283 204190 200219
7175 200219 380703 295627 182142 266237 329589 336204 324728 314100 349272 362744 292535
7164 292535 186243 270096 235757 355689 281819 203442 266119 246744 262990 386895 331094
7153 331094 304727 339618 430614 307132 120600 120436 72426 79168 191767 223837 249348 18625
7141 18625 74161 179463 208926 108672 184276 270744 227503 256588 239207 306956 308382 252622
7129 252622 225534 159425 209794 255101 280556 171102 305175 192679 281033 324133 310513
7118 310513 220480 294329 425162 210562 83265 141011 116893 289415 311782 225356 241290
7107 241290 246784 289226 390003 437131 383600 360524 101682 226358 245092 275113 243115
7096 243115 337837 186162 309002 330920 366369 313849 486660 566193 364318 367602 289770
7085 289770 301016 371018 222288 160434 285098 354209 453259 275818 278332 241978 272571
7074 272571 240021 230098 254316 152685 225197 335512 505117 474145 302983 157678 158655
7063 158655 286486 402339 507668 778267 450432 353611 475572 453457 421430 232488
7053 232488 80980 280306 317725 296327 198445 425317 385101 312640 243031 164617 118350
7042 118350 322313 512369 404050 479329 484558 484853 449885 271039 302066 459193 262974
7031 262974 219322 212516 498282 612590 583933 616171 778484 716019 468571 326114 332966
7020 332966 277364 189619 237389 367018 371936 366445 430435 534784 437499 256955 150272
7009 150272 350921 489985 332187 282850 496395 477344 413475 271451 200020 270171 369641
6998 369641 327853 294123 201885 324190 495237 507829 420802 512555 375305 217814 265796
6987 265796 361882 441406 524579 528086 575682 620416 756477 540234 459585 548797 511399
6976 511399 537854 387114 313963 361164 423973 513115 472631 547111 542473 513160 515181 405253
6964 405253 464446 455088 607255 566052 550048 580483 707751 647666 562450 464650 619574
6953 619574 586336 459103 404974 404944 396884 339943 597830 677013 644476 540382 529986 402380
6941 402380 337934 465661 548218 522788 698466 751915 437469 543096 535726 492670 446748
6930 446748 448200 511797 605381 467606 484966 540992 548174 594895 599378 492960 622496 579803
6918 579803 467453 611136 637334 655550 679042 593678 658944 714594 581438 460654 449883
6907 449883 583864 712686 430225 507999 663088 776416 617377 429156 461050 528100
6897 528100 576182 489302 527059 615669 734241 730820 700308 727755 657347 691508 758351 805728
6885 805728 724382 645258 748039 700670 502098 695719 859232 782495 541451 517540 736942
6874 736942 614432 452651 707294 858595 860158 835376 874713 875605 959985 972270 749515
6863 749515 899171 928788 929045 846354 1055099 963011 801944 809908 852106 871504 812619 483784
6851 483784 716262 900004 945373 831100 887326 944413 1061088 977041 1076473 904595 944718
6840 944718 1075906 1078269 987523 867472 938833 882464 848768 694613 753582 910538 888385
6829 888385 905432 931221 950331 903098 796523 827975 869809 837772 955461 915740 989731
6818 989731 836509 836718 922668 967970 788687 823380 928905 894967 855566 920860 1135694
6807 1135694 1093703 836693 641823 816116 913404 749783 743526 1018795 986388 989198 805135
6796 805135 914805 971348 1022275 927296 749661 799177 930273 880419 1054816 915777 918151
6785 918151 871158 943435 1027846 976382 989704 1132563 1003979 1123209 1201351 1119732 927354
6774 927354 941407 880277 1038476 976358 1015705 1020126 1060382 1171319 1120021 1085187 1019324
6763 1019324 854263 708606 992419 1200177 1048102 938497 1178973 1151958 1102823 1168924
6753 1168924 1130514 1192357 1176374 1057544 1015315 1188494 1105344 1093802 1023796 1054179 1175794
6742 1175794 1191016 1170948 1102825 1004879 1272527 1248584 1302828 1412133 1256882 1378727 1211325
6731 1211325 1184842 1127695 1201774 1277281 1220148 1292087 1370261 1335342 1380816 1444382 1483494
6720 1483494 1177634 1381540 1356521 1416671 1315822 1293176 1190527 1285799 1309877 1271151 1456950
6709 1456950 1575454 1302035 1190866 1172798 1397877 1394641 1310508 1391093 1385825 1302580 1273413
6698 1273413 1436923 1452831 1608996 1489585 1411461 1522777 1753239 1564075 1471616 1632578
6688 1632578 1549831 1466262 1352826 1526632 1471825 1412609 1491379 1636985 1483097 1303012
6678 1303012 1473540 1624285 1685007 1541573 1533620 1569231 1491049 1499487 1306853 1298286 1440175
6667 1440175 1588193 1539440 1601510 1502860 1347844 1352332 1457876 1620565 1610787 1714038 1824414
6656 1824414 1762413 1515537 1427749 1420663 1557975 1468799 1596552 1699573 1770285 1684162 1598557
6645 1598557 1607001 1798261 1677334 1575413 1652588 1677124 1717455 1815946 1893730 1891952 1764755
6634 1764755 1786962 1858464 1827025 1648475 1711417 1733046 1782736 1924937 1941727 1785520 1666943
6623 1666943 1622990 1537017 1614402 1679053 1692150 1788183 1942005 1928845 1930750 2051421 1969448
6612 1969448 1850978 1840672 1961318 1931208 1955701 2101309 2147988 1943129 1792331 1946132
6602 1946132 2005030 2029119 1819511 1907633 2048069 2048985 2085955 2010019 1986561 2080802 2145836
6591 2145836 2181755 2141398 2156273 1932274 2033261 2151558 2316715 2153509 2285317 2370371
6581 2370371 2204052 2114751 2217462 2193830 2162468 2108600 2165385 2214806 2268054 2266096 2211125
6570 2211125 2300057 2417161 2318148 2083053 2361456 2324814 2132376 2136699 2292605 2171085
6560 2171085 2332368 2401605 2543340 2419054 2470270 2304351 2294556 2321619 2383745 2397017 2484569
6549 2484569 2546701 2563301 2633284 2616379 2694938 2526986 2521966 2515778 2525642 2589154 2728098 2617092
6537 2617092 2515044 2527626 2584413 2704512 2690474 2578189 2707810 2576842 2656409 2712747
6527 2712747 2662345 2749783 2680905 2808947 2671085 2735732 2848714 2827302 2694019 2688851 2801775
6516 2801775 2777697 2697916 2885830 2787659 2841440 2783515 2795032 2919390 2999583 3094180 3006958
6505 3006958 2987835 3059010 2967826 2817842 2785298 2869459 3033806 3262758 3210972 3128323 3470339
6494 3470339 3452268 3173171 3000215 3093779 3125692 3146154 3201609 3336590 3229410 3178318 3224243
6483 3224243 3230299 3272379 3374565 3454021 3503090 3431104 3456798 3513297 3558927 3490623 3444802
6472 3444802 3352096 3432202 3474141 3477863 3481876 3471294 3525255 3512616 3529741 3659981 3701644 3630504
6460 3630504 3476648 3466431 3476281 3582302 3806470 3898801 3834995 3887144 3881845 3942140 3784121
6449 3784121 3608128 3764120 3931985 3695495 3708197 3904858 4120849 4015611 3874454 3928174
6439 3928174 4192996 4034560 3974897 4099710 4252610 4075263 4041413 4150227 4134763 4338104
6429 4338104 4265335 4106285 4045911 4062332 4102886 4119250 4221103 4147526 4327016 4494098 4383055
6418 4383055 4256905 4229162 4429269 4439061 4451952 4416935 4507246 4450001 4516075 4648716 4656700
6407 4656700 4537875 4636741 4612145 4670624 4605603 4721837 4756098 4880382 4856828 4824804 4850678
6396 4850678 4917026 4819446 4825204 4716012 4886133 4977205 4852229 4897655 4925862 4953299 4978554
6385 4978554 5113080 5131895 4974959 5091920 4999048 5255315 5197855 5218778 5372853 5314050
6375 5314050 5198894 5273209 5468591 5559015 5587802 5541424 5484263 5583384 5632146 5554674 5689762
6364 5689762 5666411 5616685 5859417 5851033 5842587 5714656 5801424 5840025 5810415 6016252 6111098
6353 6111098 6293098 6419058 6171713 6079217 6186505 6223347 6140379 6160117 6277246 6545450
6343 6545450 6619179 6482679 6642762 6506168 6628702 6533298 6502010 6664330 7010307 6883609
6333 6883609 6923332 7062000 7145591 7087904 7300211 7178515 7123224 7115389 7210658 7189848 7129287
6322 7129287 7365421 7494701 7516843 7563798 7535364 7626845 7755024 7722558 7729744 7927764 8030025
6311 8030025 8156306 8179521 8285816 8441550 8485335 8458288 8537696 8676283 8788159 8810052
6301 8810052 8920567 9139315 9276275 9377912 9679949 9860259 10008246 10240490 10380747 10523360
6291 10523360 10590181 10883642 11227170 11561126 11944299 12429406 12858366 13259549 13822980 14267832
6281 14267832 15128561 15979697 16737981 17564011 18531191 19676675 20727626 22257945 23900762
6272 23900762 25685333 27559293 29759210 31869253 33639481 34544314 34430539 33177711
6264 33177711 31202428 28576047 26292181 24238250 22484850 20849765 19631292 18626892
6256 18626892 17564275 16780243 16187735 15541936 15146084 14741318 14269261 13977694 13593756
6247 13593756 13234261 12810347 12610786 12453230 12206175 11993475 11931844 11733725 11423491 11307076
6237 11307076 11329491 11080366 10944641 10829091 10879839 10864434 10862534 10866589 10686021 10547257 10532771
6226 10532771 10446583 10342243 10399525 10463668 10458481 10403069 10327601 10219706 10390162 10380432 10332417
6215 10332417 10298372 10164828 10024928 9835260 9954750 10196969 10331396 10163046 9993362 9893617
6205 9893617 9977591 9958445 9847992 9919202 9978581 9998707 10014332 9988300 10011462 10107976 10116796
6194 10116796 9953719 9767691 9920757 10070950 9907465 9741339 9774716 10041043 10186762 9952421
6184 9952421 9832080 10014246 10042000 9930644 9868643 10121871 10124791 10109696 10022473 10023815 10132397
6173 10132397 10204102 10043145 9753249 9962305 10019471 10135503 10034846 9942230 10069029 10063414
6163 10063414 10177920 10088944 10007340 10060920 10081869 10029762 9960669 10182217 10358459 10341272 10192068
6152 10192068 10053360 10230675 10374196 10278503 10290670 10245055 10243487 10475114 10477681 10262548 10305662
6141 10305662 10485271 10533327 10390088 10402342 10463247 10400528 10381636 10318935 10421074 10453041 10401306
6130 10401306 10266591 10262014 10414996 10393625 10405556 10338026 10419824 10417857 10402067 10457699 10583944
6119 10583944 10556079 10604631 10439824 10447071 10471222 10546543 10466521 10462742 10426761 10371557 10412488
6108 10412488 10642773 10714418 10629226 10530478 10639163 10599508 10582101 10482978 10458652 10452275 10635249
6097 10635249 10823919 10708017 10626775 10525628 10581773 10590652 10585960 10455164 10596240 10703740
6087 10703740 10743478 10701950 10817758 10759518 10740644 10560747 10669358 10797407 10778645 10612262
6077 10612262 10553706 10754962 11028601 11030983 10994659 11086238 11137757 11040025 11015701 10964291 10998302
6066 10998302 10845667 10844572 10890158 11063776 11104453 10891748 10525450 10489586 10632783 10636754 10616122
6055 10616122 10532975 10587953 10711876 10724691 10712652 10593399 10531318 10435211 10486325 10610989 10520943
6044 10520943 10434557 10485293 10386303 10463682 10397445 10515839 10426651 10428947 10367862 10355627 10384627
6033 10384627 10538965 10574450 10371885 10378306 10365708 10361045 10393684 10376488 10233318 10143238 10244702
6022 10244702 10408613 10349757 10469181 10372321 10301382 10207043 10247176 10331951 10226138 9866642
6012 9866642 10100742 10121823 10295231 10240838 10122507 9961474 10045018 10077986 10042529 9845394
6002 9845394 9966753 10158855 10131652 10043005 9918923 9979629 9979665 9940867 9833649 9826065 9893758
5991 9893758 9908674 9823538 9611997 9726147 9918037 10038480 9805809 9668087 9743528 9901122
5981 9901122 9873448 9759029 9785865 9865451 9722616 9687109 9639448 9766800 9561854 9651431 9686152
5970 9686152 9662466 9739518 9533682 9401103 9428235 9462959 9435481 9458627 9450920 9406194 9261862
5959 9261862 9381792 9548415 9392237 9150785 9200382 9230544 9286862 9409034 9386602 9191159
5949 9191159 9193271 9163339 9139999 8958556 9131811 9213040 9168265 9072438 9048326 9014663 9034654
5938 9034654 8830695 8994408 8988595 9135928 8999999 8972849 8981151 8944409 9000973 8764320 8848699
5927 8848699 8934054 8838941 8839926 8864294 8931152 8921339 8873347 8676817 8816412 8907321 8809252 8621912
5915 8621912 8530027 8546046 8741424 8664334 8676974 8694474 8632963 8508636 8598908 8602492 8669705
5904 8669705 8614614 8628793 8622856 8366801 8216231 8373386 8431665 8458017 8458098 8441535 8504082 8544483
5892 8544483 8435256 8341257 8393144 8392629 8251202 8199597 8201045 8184244 8345109 8209223 8128033
5881 8128033 7946543 8200746 8071566 8000369 8031091 8222441 8121875 7864406 7913840 7989653
5871 7989653 8030519 8139604 7946404 7997791 8012384 8177622 8042250 7967552 8049867 8081834 7825294
5860 7825294 7758839 7764983 7784360 7833100 7855818 7779255 7660170 7689626 7824347 7950444 7973860
5849 7973860 7854311 7792793 7676283 7773968 7647572 7546881 7559707 7726962 7878657 7721266
5839 7721266 7668039 7774657 7730995 7715468 7457445 7435369 7561461 7680360 7445728 7500221
5829 7500221 7727497 7709132 7475156 7332070 7413952 7440447 7475359 7434567 7464403 7343698 7406424
5818 7406424 7314436 7385006 7348199 7556409 7314107 7034144 7226664 7386636 7310219 7217570
5808 7217570 7188928 7332127 7092087 7286342 7235949 7009182 6958225 7101962 7086987 6992162
5798 6992162 7128491 7010489 6953623 7128155 7001965 6989504 7059809 7049805 6921720 6715756
5788 6715756 6830890 7040838 7033058 6934798 6853240 6849820 6937207 6987950 6755875 6578497 6647246
5777 6647246 6692742 6517445 6626047 6556205 6570559 6614676 6733726 6710770 6533705 6441823 6484521
5766 6484521 6529541 6671036 6686414 6571072 6466672 6401095 6340561 6351298 6318880 6443223 6355338
5755 6355338 6273336 6327853 6316493 6226853 6257144 6409491 6425220 6423032 6203644 6067894 6211919
5744 6211919 6247945 6243476 6279274 6198152 6360633 6270692 6344470 6327379 6316054 6231758 6221802 6097091
5732 6097091 5960373 5986603 6185706 6229891 6096389 6025200 6146831 6005925 6072799 6206013
5722 6206013 6158608 5903424 5938929 5850788 5970986 5992915 6073436 5911995 6044542 6332502
5712 6332502 6245268 6064671 5860840 5910508 5823329 5796057 5989205 5846339 5877097 5959168 6064298
5701 6064298 6028401 5795389 5806170 5731010 5812857 5757223 5819585 5825207 5876501 5999925 5832943
5690 5832943 5698889 5756823 5835341 5835308 5744788 5557648 5590715 5613678 5716462 5670839 5615638
5679 5615638 5650084 5633574 5450128 5372882 5468535 5479971 5430333 5542516 5702759 5617418 5528304
5668 5528304 5506635 5382222 5244822 5617829 5551181 5420841 5411882 5483874 5446265 5518757 5482324
5657 5482324 5371337 5403669 5425418 5302029 5308167 5306379 5346216 5236738 5314794 5234475 5367744
5646 5367744 5600485 5555597 5279776 5135632 5233755 5427398 5356573 5305308 5402151 5379539 5300935
5635 5300935 5439057 5536838 5510656 5508771 5265123 5025079 4993150 5245468 5312233 5200106 5137676
5624 5137676 5270111 5252012 5331378 5378585 5186850 4925392 5012112 5246596 5177027 5113839 5043759
5613 5043759 5084397 5142418 5229873 5220270 5122168 4954648 5004389 4916990 4889486 5080385 5101808
5602 5101808 4993339 4926002 4951542 5020899 5021877 4907931 4876110 5065018 5184983 5178889 5093000
5591 5093000 5105160 5206860 4976410 4820185 4758719 4965557 4959428 4888195 4781874 4863821 5065700
5580 5065700 5095757 4898559 4989806 5007914 5073030 4846144 4965847 4926961 4712153 4803569 4879090
5569 4879090 4957736 4967626 4899526 4896134 4880451 4897473 4930458 4996104 4889584 4848749 4748356
5558 4748356 4609882 4739083 4754066 4784171 4814929 4823597 4781861 4868096 4844207 4735772 4785640
5547 4785640 4762783 4659798 4661539 4955200 5000968 4776362 4605074 4595445 4682023 4713187 4716253
5536 4716253 4772646 4958428 4875590 4624945 4665420 4647061 4612168 4640998 4516478 4526953 4595458
5525 4595458 4632593 4536115 4658164 4768984 4829698 4697073 4737876 4611788 4623964 4647888 4523868
5514 4523868 4470788 4527148 4538706 4636975 4651728 4656827 4651210 4508601 4415208 4436073 4400404 4468700
5502 4468700 4553482 4515552 4529303 4838646 4785070 4591391 4499496 4422955 4411559 4502878 4565332
5491 4565332 4539539 4507964 4478323 4518493 4599694 4564567 4590482 4587233 4500915 4393030 4467437
5480 4467437 4472302 4450719 4671767 4791771 4657953 4499750 4455124 4556800 4481989 4461202 4284698
5469 4284698 4164120 4492756 4595713 4579447 4517255 4538508 4645177 4539800 4463052 4515518
5459 4515518 4563037 4734644 4656575 4616320 4544999 4663517 4715389 4693731 4662495 4589044 4478301
5448 4478301 4491606 4633736 4796660 4597644 4429627 4305172 4434453 4560595 4404264 4269228
5438 4269228 4312713 4416813 4667655 4724256 4682026 4489962 4504089 4493458 4352347 4321846 4526508
5427 4526508 4614946 4573174 4549618 4607902 4648142 4676970 4688198 4507651 4360580 4344489 4569941
5416 4569941 4695519 4658535 4672486 4583957 4652233 4538157 4634371 4639976 4515324 4490636 4590846
5405 4590846 4723333 4779975 4896624 4685555 4657199 4702099 4801968 4803961 4744945 4581756 4557501
5394 4557501 4624194 4728046 4797424 4735794 4703292 4627407 4524351 4639574 4557845 4601157 4690233
5383 4690233 4705334 4758600 4766931 4817742 4806295 4703174 4707347 4813022 4907730 4913847 4946351 4882751
5371 4882751 4857518 4887317 5000484 4858402 4871100 5032376 4999775 4957948 5003388 5130305 5240711
5360 5240711 5496462 5457676 5283509 5301584 5176653 5236497 5359691 5564229 5634067 5478979
5350 5478979 5543118 5597724 5650238 5846710 5733935 5667846 5690636 5921499 5878399 5837621 5950132
5339 5950132 5995500 6141874 6253532 6135157 6308319 6402684 6354485 6477521 6580002 6779016
5329 6779016 6931753 7000621 6948197 6862136 6998154 7204246 7342978 7444205 7443292 7624606 7775380
5318 7775380 7843068 7774638 7878118 8036814 8224823 8392227 8574902 8774555 9097556 9266211
5308 9266211 9339511 9525064 9903309 10083292 10065742 10062673 10426562 10632228 10712068 10704037 10558509
5297 10558509 10520928 10684707 10716204 10735850 10803544 10832638 10841704 10720132 10716008 10889344 10979392
5286 10979392 10969678 11069687 11190751 11449168 11725229 11650428 11658469 11918984 12245747 12431420
5276 12431420 12523858 12568567 12767471 12891450 13140924 13204512 13113368 12991645 12910379 12805039
5266 12805039 12788238 12769654 12608862 12338766 12013284 12052392 11931141 11966791 11918810 11555121
5256 11555121 11275439 11349606 11318213 11311481 11135679 11168046 11185712 11351084 11229105 11122087
5246 11122087 11180399 11311630 11335670 11205516 11220994 11323748 11248456 11119654 11031664 10863634
5236 10863634 10748501 10729815 10497249 10149507 9713533 9495217 9442532 9142653 9047921 8872464
5226 8872464 8778570 8678553 8765703 8519676 8231178 8088910 7988948 7809363 7724702 7759820
5216 7759820 7770480 7689701 7548633 7546519 7536988 7472692 7337985 7241503 7142754 7159687 6980107
5205 6980107 6915246 6859636 6929680 6622819 6512480 6500175 6222664 6136870 6244164 6045750
5195 6045750 5874689 5937538 6016239 5968724 5965189 5920542 5676277 5523946 5441051 5519136 5412719
5184 5412719 5404399 5485546 5447715 5285689 5287930 5203833 5208887 5203115 5299881 5140946 5168528 4993011
5172 4993011 4950117 4961072 4984601 4900838 4889587 5062204 5159859 5096706 4948294 4822307 4829910
5161 4829910 4937380 5006907 4955427 4830775 5013688 5088932 5008312 4884604 4808284 4845615 4723337
5150 4723337 4714288 4781198 4803122 4763494 4831386 4745951 4868356 4814518 4672429 4752883 4646347
5139 4646347 4736581 4764292 4808782 4995929 4868269 4621445 4857828 4945437 4962124 4815219
5129 4815219 4631786 4498696 4581182 4785183 5050682 5042680 4969007 4891201 4735762 4583595
5119 4583595 4629125 4704040 4848054 4813618 4909624 5060822 5050513 4960380 4871323 4796028 4840084
5108 4840084 4766595 4652236 4873207 4938091 4939157 4912016 4959544 5044944 5104409 5106112 4913363
5097 4913363 4681839 4836443 4975645 4788908 4675526 4844705 4989068 5100833 5146900 5077867
5087 5077867 4868717 4868657 4889142 4697029 4945245 5056507 5021888 5041617 5049282 5109411 5114618 4975734
5075 4975734 4873849 4825301 5018311 5082820 5186492 5202068 5231159 5366643 5235102 5129862
5065 5129862 5287515 5278475 5240730 5213150 5384904 5330651 5284549 5423132 5423738 5373711 5480551
5054 5480551 5377394 5233527 5319302 5380057 5321539 5323172 5439949 5404932 5315856 5208956 5383656
5043 5383656 5384296 5457740 5343529 5441551 5211254 5271075 5411618 5269497 5338245 5583785 5456053
5032 5456053 5399306 5391147 5563862 5560915 5625630 5709624 5566686 5474103 5460357 5520223 5394993
5021 5394993 5751824 5975727 5847361 5786053 5728807 5713195 5767849 5682263 5618836 5579452 5732527
5010 5732527 5867356 5722006 5839742 5976678 5876251 5708832 5809171 5960332 5844857 5740550
5000 5740550 5934280 6023810 5911704 5905001 5931587 5941554 5964177 5918936 5948094 5961835 6101279
4989 6101279 6243561 6154853 6144420 6276451 6307247 6025235 6056149 6044817 6221856 6532565
4979 6532565 6645534 6416556 6540670 6740461 6602589 6385220 6458802 6574469 6433977 6651660
4969 6651660 6773372 6734667 6781719 6771536 6624097 6716872 6983483 6886439 6569981 6704275
4959 6704275 6885981 6728374 6858542 7091768 7231055 7304493 7368612 7421506 7519303 7616213
4949 7616213 7513073 7265933 7359521 7576813 7742800 7896330 8002181 7950286 7826437 7880626
4939 7880626 8072041 8060153 8270361 8438792 8468557 8428505 8535398 8813303 8719013 8768141
4929 8768141 9009123 9266624 9373025 9433035 9507286 9601601 9769182 10030537 10362792 10450636
4919 10450636 10705198 10974595 11016137 11058597 11265236 11558796 11684860 12146489 12577655 12741014
4909 12741014 12912143 13337639 13552647 13764662 14037667 14395530 14636622 15127902 15687279
4900 15687279 16157303 16492032 17045059 17667658 18316185 19220399 19846343 20524218 21467047
4891 21467047 22401550 22973702 23729595 25139328 26342093 27392603 28735456 30154384 31706755
4882 31706755 33386677 35067440 36822902 38643147 40710667 42541958 44042532 45391341
4874 45391341 46390251 47304469 47860835 48164565 48300213 48197741 47864230 47310231 46630721
4865 46630721 45599707 44554972 43015010 41145062 39425282 37713614 35817137 34133362
4857 34133362 32661285 31093826 29652883 28483951 27589111 26592683 25667175 24687440 23758480
4848 23758480 22840131 22004228 21162910 20520999 20147864 19694565 19155334 18797962 18402949
4839 18402949 18083617 17515361 17346280 17224310 17061943 16840519 16503928 15976099 15620881
4830 15620881 15401000 15081113 14569643 14296931 14084345 13738085 13418085 13204535 13113294 12741981
4820 12741981 12566835 12502543 12394099 12394733 12186962 11869943 11724418 11544014 11343447 11138154
4810 11138154 10957191 10953442 10722334 10821038 10853813 10743524 10719193 10638851 10505409 10452092 10467377
4799 10467377 10484826 10444844 10312849 10342749 10250177 10417126 10478067 10465317 10359085 10464606
4789 10464606 10496862 10485992 10602742 10685372 10721715 10710771 10716618 10933394 10879791 10874512 10946935
4778 10946935 10985029 11005039 10935772 11048977 11096924 11132289 11294527 11355141 11564681 11794781
4768 11794781 12006937 11970898 11965270 12338026 12441434 12514681 12738803 12826892 13117432 13249659
4758 13249659 13413345 13503335 13684041 13841547 13918437 13987159 14017697 14020792 14011377 14170709 14312918
4747 14312918 14407471 14490696 14597430 14574701 14753501 15010966 15291084 15356289 15617040 15825746
4737 15825746 15576705 15508015 15432427 15304959 15240495 15235745 15295920 15173541 15231926 15313397 15455237
4726 15455237 15539062 15469109 15450993 15404557 15601206 15743151 15621138 15679718 15876983 15903997
4716 15903997 16012219 15858911 15813353 15721992 15615875 15237416 14813891 14630101 14598272 14606737
4706 14606737 14489886 14210207 14134050 14120135 14206957 14130725 13944655 13918965 13730432 13815820
4696 13815820 13703534 13546585 13615280 13456117 13191664 13025234 12798026 12478392 12192637 12120977
4686 12120977 11929531 11770185 11628439 11396318 11255841 10994744 10709601 10644751 10660926 10548705
4676 10548705 10264985 10161148 10297726 10268724 10142478 10024001 9824472 9734494 9485623 9286712
4666 9286712 9086359 8980409 8756547 8605106 8505078 8496655 8429074 8211286 7983920 7851675
4656 7851675 7679755 7583750 7706890 7721112 7573668 7436524 7490493 7380399 7255486 7250061
4646 7250061 7275406 7215907 6982280 6996993 7017269 6989020 6977320 6858906 6822095 6978897 7041580
4635 7041580 6979498 6813733 6773449 6736852 6734378 6675073 6727339 6954527 7013220 6865563 6884833
4624 6884833 6808808 6784258 6812130 6699986 6826471 7038142 6991315 6704326 6717938 6896979
4614 6896979 6804259 6923505 6750788 6774699 7023860 6996551 6837072 6702257 6889080 6954698
4604 6954698 6957066 6880853 6836115 6871070 6928143 6907078 6939464 6982411 7141668 7200888 7074180
4593 7074180 7150977 7247363 7257713 7165922 7181509 7431515 7373189 7415357 7496858 7474419 7601219
4582 7601219 7496702 7461734 7502559 7700420 7883603 7839622 8078883 8187629 8161764 8330243
4572 8330243 8352709 8428841 8611587 8610402 8662667 8805302 8983598 9159591 9463269 9670054
4562 9670054 9871588 9954082 10155990 10476052 10788980 10994173 11138519 11295539 11866422 12191645
4552 12191645 12471190 12986255 13340733 13795517 13965524 14177482 14662613 15012258 15469297
4543 15469297 15760490 15908782 16082863 16278322 16393493 16483128 16473037 16579325 16509963 16619949
4533 16619949 16613537 16502503 16704300 16781619 16571416 16647428 16793850 16857873 17105894 17389570
4523 17389570 17486542 17452050 17864230 18136814 18337406 18724516 19241898 19588889 20096419 20607605
4513 20607605 20978216 21330901 21623054 21903404 22316722 22775520 23197071 23380688 23432822 23734788
4503 23734788 23963971 24226799 24384280 24497597 24461821 24405680 24200190 24107671 23965252 23836217
4493 23836217 23670504 23529663 23077913 22732522 22424376 22067428 21754722 21179075 20941240
4484 20941240 20671755 20482662 20120662 19962217 20021396 19824401 19693827 19707477 19633277 19808704
4474 19808704 19806978 19831725 19821511 19824108 19943857 19942293 19762005 19828030 19967974 19837014 19530276
4463 19530276 19341812 19128182 18855114 18551622 18135991 17792803 17477154 16988501 16378662
4454 16378662 15818066 15452695 14889886 14457470 14041218 13825709 13525251 13135162 12921622
4445 12921622 12830659 12536808 12347394 12194647 11943391 11899930 11733453 11649927 11755362 11775390
4435 11775390 11570994 11351174 11373169 11527090 11568639 11393468 11395762 11443774 11425214 11403775 11254644
4424 11254644 11234796 11398858 11413315 11121796 10776484 10603179 10664405 10674826 10656939 10852433
4414 10852433 11134115 11151940 11108328 11153241 11287582 11398012 11395542 11518568 11820967 12108182
4404 12108182 12237900 12237341 12303362 12461256 12524743 12572283 12774752 12999243 13110453 13397775
4394 13397775 13526559 13772261 14227162 14844686 15324489 15798579 16265639 16864476 17545214
4385 17545214 18199223 19196566 20089500 21182453 22468269 23814901 25088654 26349661 27488111
4376 27488111 28649700 29567639 30185900 30340879 30600574 31018510 31339237 31396961 31728892
4367 31728892 32360048 32885200 33151141 33001491 32825853 32527841 32042449 31710382 31360415
4358 31360415 31230162 31299894 31629106 31965721 32466440 33100205 33695640 34150426 34339340 34444255
4348 34444255 34333318 34140154 34067750 34135234 34175063 34392305 34737755 35249623 35778618 36279839
4338 36279839 36681380 36770500 36550700 36013247 35112023 33963611 32844860 31731966 30829927
4329 30829927 29958690 29259867 28462751 27781602 27475485 27256171 26995358 26676272 26252981
4320 26252981 26143473 26232954 26264482 26289893 26530774 26739441 27082884 27296431 27335943 27298733
4310 27298733 27481168 27344469 27269982 27119888 26874081 26815116 26601818 26488577 26206831 25903504
4300 25903504 25374418 24991526 24634096 24421589 24152306 23919383 23728791 23563248 23192563
4291 23192563 22870956 22593078 22312018 21879975 21420346 21016994 20600343 20222006 20091639
4282 20091639 19674288 19200360 18743375 18292361 17792411 17445516 17144062 16720116 16534678
4273 16534678 16408763 16217997 16137412 16249289 16272849 16087331 15853586 15702498 15446617 15273219
4263 15273219 15152550 15008482 14812369 14596816 14305006 13780815 13310177 12914189 12342571
4254 12342571 11877537 11481451 11104304 10752679 10294056 10018885 9583614 9378277 9093227
4245 9093227 8716867 8537429 8298446 8044678 7737079 7333804 7143977 6922388 6742082 6603593
4235 6603593 6488598 6445825 6331636 6279896 5997435 5993500 5952379 5770951 5741985 5676790 5519639
4224 5519639 5357681 5433707 5431299 5113112 4904516 4937133 4940102 5017710 4840615 4713338 4596645
4213 4596645 4564929 4679284 4628694 4669636 4500380 4545453 4525762 4329889 4189612 4156191 4234854
4202 4234854 4164506 4134343 3965953 3986844 3955427 3682787 3566065 3686767 3865875 3745565
4192 3745565 3570782 3577581 3550040 3492500 3546055 3694084 3497935 3428004 3452867 3411813 3330252
4181 3330252 3405912 3474199 3303135 3341231 3326640 3429088 3451021 3276901 3211889 3145492 3085625
4170 3085625 3195508 3018984 3063427 3041790 3061201 3050086 3042941 3198903 3091963 3062984 3042332
4159 3042332 2913232 2947041 2967410 2799648 2953987 3093326 3100235 3155788 3138030 2890401 2812092
4148 2812092 2936001 2996431 2897994 2841128 2939752 2800632 2751626 2960407 3050752 2809135 2765893
4137 2765893 2879313 2865581 2804890 2888544 2890884 2854139 2820919 2919138 2686715 2827177 2657934
4126 2657934 2565447 2541248 2711127 2658544 2460080 2573706 2693552 2713226 2599698 2645319
4116 2645319 2572661 2497994 2431215 2520136 2551586 2553062 2501221 2585826 2562931 2584312 2464576
4105 2464576 2438083 2336598 2370658 2205532 2168389 2361828 2449240 2348159 2333378 2441010
4095 2441010 2502927 2286423 2060187 2064936 2254576 2349192 2452348 2558974 2409957 2279910
4085 2279910 2214696 2241373 2223864 2225732 2241542 2185960 2069259 2212345 2509194 2460158 2063377
4074 2063377 1969824 1962439 2206740 2111891 2037745 2180509 2207041 2127991 2015739 2257848 2341109
4063 2341109 2200939 2093395 2099483 1905114 2061701 2028629 2091756 2140766 2257089 2432230
4053 2432230 2377043 2311867 2080217 2020493 1985832 2128494 2165548 2006506 2143803 2011962
4043 2011962 1985055 2213250 2242333 2140719 2013997 2155016 2165579 2126689 2087047 1970120
4033 1970120 1878030 2017167 1910386 1981515 2057235 2001002 1909770 1989932 2221146 2109408 1850149
4022 1850149 1860579 1977283 2133926 1958691 1991737 1940760 1969093 1917668 1858230 1890348 1910325
4011 1910325 2156102 1828517 1884423 1979001 2037256 2106316 2032536 1965297 2106106 2089619 2061757
4000 2061757 1973646 2005828 2046919 2075686 2027815 2116036 2193296 2035213 1889794 1971789 2030971
3989 2030971 1930711 2043798 2129790 2107889 2049952 2179840 2175934 2050485 2069386 2144564 2135255
3978 2135255 2140407 2248684 2224913 2304341 2331882 2411363 2341251 2311786 2321224 2171153 1995998
3967 1995998 2052228 2120031 2087116 2053821 2064559 1980286 2090583 2179474 1996743 1824901 2012740
3956 2012740 2018186 1981482 1965574 1896028 1793956 1797587 1882079 1848521 1843975 1902395 1933444 1897708
3944 1897708 2047963 1985349 2053989 2012724 1915640 1934783 1902595 1885738 1834480 1973316 2077935
3933 2077935 2000442 2080994 2168493 2228464 2122792 2021535 1907319 1954184 1964504 1934118 1764875
3922 1764875 1928808 1872453 1945528 1985670 2118363 2044294 2063906 2175468 2124153 2308220 2245561
3911 2245561 2108954 2140047 2308427 2393230 2239028 1989685 1997505 2172118 2235519 2238131 2181811
3900 2181811 2156707 2180745 2158566 2056355 2148810 2242847 2251816 2327890 2400508 2312733 2263053
3889 2263053 2143329 2104605 2194831 2372888 2340453 2308102 2250271 2269201 2280189 2205221 2225710
3878 2225710 2299217 2141900 1948614 1912999 2055335 2310167 2532340 2470073 2286179 2250248
3868 2250248 2259268 2405047 2380733 2358696 2344134 2338321 2387425 2352265 2413512 2572158 2484182
3857 2484182 2519477 2477987 2510395 2600203 2505116 2469596 2767610 2831889 2749070 2692773 2673831
3846 2673831 2501728 2698180 2790695 2967723 2880273 2858861 2979354 2887172 2859538 2870623 2923506
3835 2923506 2924167 2885051 2886807 3025548 3310771 3304463 3194741 3206679 3311799 3302294 3138567
3824 3138567 3154507 3135197 3424968 3577416 3444062 3555323 3660617 3814285 3748302 3528660
3814 3528660 3549809 3642906 3579981 3542235 3510103 3781580 3943578 3934839 3857465 3954504 3987218
3803 3987218 3997959 4050222 4159624 4290641 4438701 4261840 4437789 4708297 4759257 4643681
3793 4643681 4527897 4756574 4914540 5005794 4813728 4992683 5225626 5254589 5421649 5444263
3783 5444263 5513293 5723950 5789165 5949752 6115799 6279476 6326472 6501728 6825280 7338798
3773 7338798 7532983 7936300 8305316 8451713 8968762 9506973 9924931 10445808 10890577 11365670
3763 11365670 11625557 11813685 12039379 12254206 12374327 12434120 12490940 12757106 12913920 13131847
3753 13131847 13472602 13798281 14091376 14346052 14531426 14717227 14974014 15218270 15164683 14898884
3743 14898884 14449150 14187926 13934339 13773188 13674267 13341416 13069617 12757590 12469787 12247504
3733 12247504 11861676 11647708 11444948 11117205 10914772 11011830 11167734 11072264 11145654 11248810
3723 11248810 11069357 11149510 11237092 11372245 11495442 11825405 12254154 12671822 13000061 13334177
3713 13334177 14080352 14535275 14999353 15835702 16695533 17426646 18089812 18867656 19513657
3704 19513657 19920293 20422384 20235898 20193136 20458214 20720590 20847878 21116943 21544946 21943652
3694 21943652 22108840 22510957 23058488 23422280 23590514 23740444 23814953 23831728 23478742 22893643
3684 22893643 22294579 21487055 20815608 20087635 19335356 18465962 17618490 16899492 16349152
3675 16349152 15737031 15072452 14352487 13601194 12896779 12366301 11963053 11683439 11263726
3666 11263726 10703654 10484788 10023832 9607625 9532847 9147945 8889563 8722728 8497328 8429560
3656 8429560 8305319 8302608 8001607 7926665 7878781 7726713 7585614 7552059 7527862 7468243 7502814
3645 7502814 7512456 7472826 7430217 7338030 7411594 7428820 7504669 7632012 7526691 7516961 7549541
3634 7549541 7760834 7773515 7687835 7744202 7792783 7986307 8135358 8053600 8155555 8342242
3624 8342242 8505666 8549553 8348266 8451576 8804563 8991672 9211694 9279593 9462888 9776411
3614 9776411 10124652 10254899 10452278 10724913 11038859 11175716 11358163 11662322 11988975 12357007
3604 12357007 12493923 12521430 12658557 12664328 12663585 12768972 13088198 13127548 13292174 13550602 13838327
3593 13838327 14144705 14418310 14910701 15050032 15375979 15813584 16389567 16820121 17224012
3584 17224012 17822698 18403351 18728790 19030052 19239509 19278153 19152527 18690108 18335095 17841357
3574 17841357 17661760 17323586 16783228 16676905 16437983 16095540 15818924 15312680 15039375
3565 15039375 14743035 14566677 14521215 14286481 14074312 13784292 13738418 13606198 13718631 13629718
3555 13629718 13534520 13632922 14075994 14424682 14553028 14755394 15012733 15347605 15566468 15694444
3545 15694444 16070814 16567497 16877325 17065883 17367166 17693412 17720306 17322312 17032968 16750374
3535 16750374 16238867 15802378 15376212 15236626 15017963 14965566 14940282 14811144 14895650 14857018
3525 14857018 14710193 14403727 14420149 14423999 14223482 13888843 13521161 13315594 12879338 12288493
3515 12288493 11826824 11388739 11258275 10930717 10726691 10613787 10366312 10141184 9990584
3506 9990584 10034809 9738644 9231944 8989555 9097828 8955213 8775174 8627557 8621414 8626635
3496 8626635 8750361 8766466 8702207 8934983 8951738 8952263 8865703 9023752 9431017 9691671 9736568
3485 9736568 9882942 9926371 9918958 10102527 10001485 9938881 9686742 9323685 8831368 8682239
3475 8682239 8560346 8190936 7909484 7767644 7540419 7360414 7125463 6814832 6544482 6605618
3465 6605618 6518913 6342223 6130293 6006158 5735204 5631242 5598266 5674639 5614676 5376188
3455 5376188 5333372 5231522 5147750 5075294 5112351 5044164 4989610 5083109 5154387 5178723 5360813
3444 5360813 5327502 5038216 4946652 5121574 5221740 4980388 4769480 4690472 4739494 4679848
3434 4679848 4692250 4476701 4366462 4539520 4513441 4508250 4508661 4485963 4429949 4229786 4357797
3423 4357797 4392422 4172229 4032167 4203310 4248343 4148043 4312670 4259953 4189087 4291015
3413 4291015 4173724 4109729 4246460 4251431 4240732 4136082 4132609 4058895 4217274 4065375 4296334
3402 4296334 4260728 4227681 4365336 4285689 4281384 4452639 4392161 4395658 4361445 4478894 4342259
3391 4342259 4223615 4302789 4404095 4431405 4328569 4318669 4274185 4342919 4540904 4642244 4692034
3380 4692034 4742663 4640964 4540699 4411536 4594201 4774394 4875218 4980461 5011201 5084963
3370 5084963 5065356 5089923 5272306 5584292 5632583 5614816 5636041 5767254 5819859 5772996 5585149
3359 5585149 5546620 5367675 5088803 4992051 5011517 4879115 4856115 4885810 4714266 4750693 4890430
3348 4890430 4701074 4571131 4814423 4715392 4473831 4510887 4621798 4538640 4582221 4820984
3338 4820984 5003445 4907307 4865168 4901782 4790060 4678071 4894743 4963036 4965773 4854153 4973090
3327 4973090 4997798 4973711 4947826 5159968 5164659 5072372 5101399 5226371 5353349 5297188 5343492
3316 5343492 5343527 5390447 5472638 5532506 5599123 5558832 5643284 5662943 5639301 5696806 5670775 5903499
3304 5903499 6041067 6047473 6160588 6325679 6393130 6281721 6565323 6742480 6805810 6710103
3294 6710103 6852222 7029017 7068344 7120872 7147678 7172897 7494271 7476914 7453159 7558531 7848501
3283 7848501 7846552 7849829 8017846 8484871 8586453 8452864 8577091 8694162 8675308 8606098 8722499
3272 8722499 8903696 9099546 9251930 9362721 9369659 9563260 9718852 9700011 9826308 10215732
3262 10215732 10404783 10718244 10806287 11001093 11187559 11504823 11861050 12315699 12613934 13099410
3252 13099410 13551813 13984427 14663659 15326553 15842421 16641227 17561474 18413255 19007905
3243 19007905 19794180 20856999 21746637 22644493 23658478 24829946 26144675 27483353 28983975
3234 28983975 30902031 33161449 35617522 38544479 41900685 45938279 50559533 55406290
3226 55406290 59903547 63990766 66934965 68366123 67821233 65760165 62369785 58011077
3218 58011077 52939519 48051164 43413510 39441146 36191586 33282957 30933307 29175653
3210 29175653 27731831 26425655 25298540 24173370 23456417 22554120 21897721 21351779 20884271
3201 20884271 20421817 19835216 19525377 19526149 19301341 19086846 18782762 18642399 18507566 18298214
3191 18298214 17982270 17811160 17666172 17576882 17545346 17553865 17535272 17413949 17296388 17123416
3181 17123416 17182441 17275153 17230535 17102345 17249104 17468743 17507786 17568444 17715340 17938541
3171 17938541 18184393 18564135 18861165 19230590 19638515 20170597 20680640 21336021 22084748
3162 22084748 22831613 23620650 24423952 25087372 25895967 27076959 28274174 29549832 31203794
3153 31203794 33007454 34963843 37231842 39819266 42477256 45213302 48252902 51981480
3145 51981480 56275190 61187324 66663759 72490549 78869738 85315958 91196276 94804552
3137 94804552 95135638 91570108 85205276 77946308 70798763 64460546 59133681 54977215
3129 54977215 51544908 48734374 46407729 44367367 42710340 41218338 39797610 38599654
3121 38599654 37614871 36546170 35573244 34785108 34261766 33805797 33496575 33252232 33223790
3112 33223790 33350455 33355867 33594557 33862158 34045334 34111662 34091096 33937944 33967839 34008858
3102 34008858 34236614 34540431 34905754 35398602 35621896 35583391 35775764 36107299 36298533 36570235
3092 36570235 37080303 37773876 38262674 38793798 39552774 40590049 41541731 42785149 44157585
3083 44157585 45640849 47303215 49035581 50883119 53108730 55603477 58381832 61433510
3075 61433510 64943279 68638582 72614838 77140008 82108223 87857735 94458959 101823041
3067 101823041 109671519 118308681 127969665 138787793 151074557 165348951 181845990
3060 181845990 200946892 222245961 246169666 271201384 295077523 312099967 312828774
3053 312828774 294848658 265345790 233744461 205086858 180710836 160975771 145213918
3046 145213918 132202073 121174804 112448366 105188819 98635857 93022269 87871502 83477224
3038 83477224 79456239 76002229 72853197 70121140 67725361 65435057 63525320 61924381
3030 61924381 60691076 59802401 59103849 58627243 58280052 57876850 57833507 57706193 57590845
3021 57590845 57642548 57763883 57919489 58276631 58596993 59074600 59432512 59865242 59992138 60441071
3011 60441071 61027807 61688208 62307179 63018581 63942409 64547167 65318429 66048156 66687492
3002 66687492 67309753 67960950 68494793 69321670 70186459 71252070 71959169 72769563 73829041
2993 73829041 74826202 75680819 76179755 76718287 77224418 77822144 78419959 79087173 79833164
2984 79833164 80376616 81175639 82003100 82851971 83579933 84372453 84843707 85498694 86265070
2975 86265070 86970202 87608056 88363791 88915091 89535484 90390112 90962435 91388693 91985163
2966 91985163 92437164 92789005 93321185 93796283 94152908 94323112 94673802 95028979 95120717 95037965
2956 95037965 94979754 95022847 94872207 94529537 94266700 94062096 93657009 93157602 92333301 91645772
2946 91645772 91129839 90323879 89259419 88377611 87522665 86414639 85151815 84030313 82810515
2937 82810515 81246436 79745681 78210300 76683169 75066026 73328094 71536381 69821085
2929 69821085 68257560 66704181 64763449 63126217 61560326 59912251 58106891 56385813
2921 56385813 54794654 53113958 51269357 49649041 48085774 46627501 45141514 43560777
2913 43560777 42020853 40597292 39294082 37790235 36432722 35354281 34382919 33313768
2905 33313768 32294777 31526176 30533410 29479861 28490232 27694704 27045713 26406968 25665234
2896 25665234 24927187 24417808 24012199 23494955 22892455 22423798 22035123 21493331 20866708
2887 20866708 20484961 20201722 19974247 19689296 19135539 19020798 18871046 18340318 17772349
2878 17772349 17558316 17390425 16833296 16552957 16487998 16223656 15906822 15578572 15390141 15120723
2868 15120723 14901440 14497812 14189032 14006993 13900624 13645560 13398456 13177468 13107229 13039572
2858 13039572 12748121 12632164 12404478 12159395 12020629 11881126 11808760 11613674 11514695 11495978
2848 11495978 11398669 11352700 11195195 11109285 10901599 10823828 10776239 10553273 10396100 10495711
2838 10495711 10432090 10353537 10392609 10376247 10484761 10384996 10157328 10263622 10459113 10323528
2828 10323528 10134691 10062328 10017135 9991694 9750935 9911421 10014234 9797683 9668286 9751943
2818 9751943 9763130 9871998 9762523 9747029 9708629 9841716 9901124 9801521 9762856 9759616 9578680
2807 9578680 9574847 9733889 9953508 9879367 9822043 9850893 9963556 10039349 10011670 9991835 9919557
2796 9919557 9853404 9799798 9746623 9857675 10039451 9937196 9900720 10037927 10158932 9997263
2786 9997263 9989541 9789236 9697890 9833219 9946694 9951615 9772057 9788684 9844005 9962882 10024428
2775 10024428 9870264 9824459 9753370 9740678 9800716 9614805 9504805 9408040 9444777 9463171 9398768
2764 9398768 9490434 9567485 9598684 9627009 9675169 9625635 9740680 9786647 9660556 9719020 9852786
2753 9852786 9907887 10040295 10216938 10378861 10526517 10696705 10948758 11263578 11376302 11499771
2743 11499771 11372471 11370862 11460615 11474616 11326111 11375305 11240157 11379683 11336672 11355145 11362184
2732 11362184 11421888 11365436 11295100 11419477 11613226 11575570 11414474 11474693 11518393 11598409 11636827
2721 11636827 11755463 11842183 11883639 11902095 12015646 12044631 12023176 11906386 11892808 12006805
2711 12006805 12133943 12033679 12004303 12078501 12295804 12247319 12212938 12399175 12463474 12384820
2701 12384820 12157620 12262879 12558064 12712873 12721028 12700674 12963274 13052760 13041498 13046327 13118780
2690 13118780 13158756 13179325 13271288 13533896 13695301 13922816 13893341 14076892 14286717 14525716
2680 14525716 14820345 15086831 15519920 15783154 15845675 15978857 16173281 16575963 16740938 16914442
2670 16914442 17240888 17651751 17954866 18352861 18774928 19138787 19550750 19894072 20181209
2661 20181209 20421937 20866829 21267661 21590667 21897449 22399999 22955652 23292500 23560050
2652 23560050 23931084 24085241 24397857 24744397 25326474 25704508 26143359 26489876 27029104
2643 27029104 27472409 27890918 28198739 28590077 29083532 29425695 29887355 30463384 31046729
2634 31046729 31636501 32057570 32720380 33303390 33778708 34493818 35128351 35909462 36549211
2625 36549211 37198844 38050156 39023557 40033367 41020447 41922881 43034452 44171337 45344589
2616 45344589 46321036 47479555 48984230 50540243 52024620 53500538 54999218 56385367
2608 56385367 58184234 59880067 61692801 63350357 64913201 66577273 68462543 70423259
2600 70423259 72032881 73725191 75737252 77569572 79437073 81137563 82984387 84937579
2592 84937579 86898192 88897207 90817998 93075256 95202665 97278893 99368417 101637223
2584 101637223 103870100 106200857 108889289 111726853 114632560 117890071 121114371 124821061
2576 124821061 128599256 132375960 136315233 140347425 144488069 148581390 152486573 156329786
2568 156329786 159910140 163282397 166415286 169259999 171667200 173940488 176377917 178464477
2560 178464477 180404774 182483704 184715154 187044028 189155157 191437888 193585949 195451228
2552 195451228 197444899 199374369 201024810 202635209 204336029 206144851 208444052 210725162
2544 210725162 213277317 216172906 219283592 222714826 226338693 230347178 234452588 238867401
2536 238867401 243669722 248419960 252928955 257367516 261584878 265650725 269332848 272828579
2528 272828579 275796544 278285882 280426099 282590609 284505693 286093612 287454093 288868926
2520 288868926 290195039 291503540 292689615 293674558 294429003 294859915 295033876 294761755 294107249
2511 294107249 293033154 291620687 289960131 287645484 284737985 281653855 278518162 275471513
2503 275471513 272341412 269200898 265873970 262697842 259598574 256252960 252632746 249002527
2495 249002527 245379827 241557449 237061340 232280184 227368646 222607939 217387430 212033205
2487 212033205 206921167 201984353 197231560 192329021 187425530 182998580 178627985 174610040
2479 174610040 170734081 166993305 163398905 159859453 156435811 153149232 150023831 146922072
2471 146922072 143895411 140946894 138256976 135558766 132956417 130484060 127994004 125575642
2463 125575642 123131508 120743601 118234909 115752621 113219565 110877395 108553916 106307730
2455 106307730 103865239 101805032 99778833 97854942 95856713 93793772 92068760 90266446
2447 90266446 88361030 86613550 84970574 83597399 82276761 81094989 79724825 78393672
2439 78393672 77184035 76095591 74938121 73581336 72459206 71494242 70706147 69861953 68846221
2430 68846221 67939288 67224693 66536366 65812008 64934098 64005245 63265848 62743793 62051145
2421 62051145 61339177 60567663 59967878 59102984 58069832 56987640 56231750 55243768 54311817
2412 54311817 53393951 52770979 51936239 51069788 50104474 49163192 48280301 47361522 46118886
2403 46118886 45053157 44179085 43338979 42339135 41176533 40137942 39443592 38607674 37306265
2394 37306265 36169092 35133844 34279476 33450271 32478532 31607284 30882956 29964970 28928895
2385 28928895 28105180 27319608 26626633 25755379 25016998 24037428 23361418 22847511 22131499
2376 22131499 21604028 21150350 20611347 19789560 19368763 18955195 18287503 17759802 17372311
2367 17372311 17155499 16763815 16471797 16074701 15633686 15181235 14836908 14612029 14209435
2358 14209435 13939374 13554794 13424333 13262866 13118306 12788495 12412882 12000566 11901388 11623711
2348 11623711 11366284 11031256 10924335 10834769 10729777 10472406 10248941 10158474 10134818 9831012
2338 9831012 9412001 9250147 9203227 9010642 8764052 8587903 8291489 8248899 8293698 8213213
2328 8213213 7922655 7614754 7293865 7295552 7281947 7222562 7186004 7195846 7003778 6952908 6867692
2317 6867692 6744469 6520879 6234615 6263519 6266150 6135289 5851173 5788932 5766181 5748220 5630732
2306 5630732 5483036 5528891 5625515 5425261 5397677 5180658 5040233 5223513 5211081 4933297
2296 4933297 4849750 4880744 4924057 4732208 4673732 4785133 4784668 4640148 4579604 4491910 4193560
2285 4193560 4323878 4387983 4369054 4134404 4019733 3859037 3854956 3856807 3766939 3826890 3972678
2274 3972678 3979727 4055388 3932927 3991574 3845930 3825269 3657668 3600990 3588299 3535159 3519535
2263 3519535 3496755 3641384 3689741 3678253 3663581 3657356 3441694 3454497 3390011 3377659 3412116
2252 3412116 3666835 3665123 3408159 3324274 3395554 3383749 3340113 3190921 3314375 3409249 3412626
2241 3412626 3363208 3211006 3345250 3476223 3531891 3506110 3530972 3359308 3272487 3415099
2231 3415099 3387863 3410840 3634124 3751940 3770081 3637770 3397571 3416704 3449676 3600681
2221 3600681 3451944 3380038 3466217 3644817 3592270 3498684 3308482 3241513 3340745 3341944 3278277
2210 3278277 3457148 3407180 3336137 3416571 3485766 3406756 3219404 3202513 3265406 3485464 3626178
2199 3626178 3459559 3530881 3571849 3572998 3574357 3367458 3394589 3367291 3623897 3614195 3457319
2188 3457319 3418585 3454553 3495091 3418196 3356071 3473973 3633181 3779660 3698273 3562994 3604521
2177 3604521 3517436 3510571 3634786 3761702 4008375 4049195 4120567 4193046 4320535 4354947 4373628
2166 4373628 4504460 4414537 4444375 4507443 4501443 4338442 4174360 4136591 3873992 3532117 3142806
2155 3142806 3075685 3187216 2935301 2771379 2809682 2961838 2755928 2536334 2329556 2324694
2145 2324694 2435321 2328766 2261345 2066408 2277429 2230398 2206942 2012368 2058306 2100218
2135 2100218 2167840 1911156 1698687 1652535 1899748 1782449 1658014 1712338 1730784 1819197
2125 1819197 1774524 1601443 1535737 1621731 1411584 1294026 1398792 1455865 1604651 1585419
2115 1585419 1588245 1562787 1180186 1158925 1246549 1274348 1261726 1354882 1239932 1099716 1103858
2104 1103858 1141745 1022729 988382 1035892 1102070 1147683 1014093 916893 966129 935167 999088
2093 999088 1041865 913766 839388 712358 896667 964242 771239 670987 563031 788966
2083 788966 769401 838166 892108 1024002 884832 754633 665784 649754 839003 831454 639105
2072 639105 597300 570040 730790 655056 537546 542593 716369 777709 582933 533753 524072
2061 524072 527070 549514 550089 603390 537949 485659 576863 588154 488595 466162 541552 515631
2049 515631 347443 467001 564707 667896 510624 379277 330504 354377 508954 480660
2039 480660 413345 337015 286463 341501 253044 288765 370428 440223 512291 473044 410352 462617
2027 462617 415093 184468 208224 406021 534568 432643 281322 337384 510168 383591
2017 383591 221476 158864 202242 497035 613647 424567 432511 410394 394783 318228 356169
2006 356169 335346 340418 332011 318420 296336 347970 449104 314254 229720 248999 94553
1995 94553 163198 219376 417501 247153 212138 157798 290758 334545 127060 65756 65900
1984 65900 50638 76438 -10335 33929 -36318 69267 255600 253311 178170 136358 -8583
1973 -8583 -7450 249976 330179 202734 217461 279158 194370 102896 238187 220106 197477 266328
1961 266328 125076 210276 157503 102521 55083 -31491 -52768 2885 30440 207568 129472
1950 129472 19146 149009 316208 255251 -20757 73176 159293 55822 86260 51565 46365
1939 46365 77368 136549 189005 155573 190089 243993 115571 4560 20024 75361 20860
1928 20860 -36951 -50324 -12939 -171974 -92981 36952 160223 159905 149603 25334 13377
1917 13377 96230 123546 9712 74254 244077 261807 130683 55403 100263 136033 35
1906 35 -100161 -127482 -169362 -171729 -123620 90117 318142 100504 -36998 16119 119214
1895 119214 111516 24341 -31131 -131493 26789 -27221 98828 143737 29209 117836 149461
1884 149461 -100715 -141211 -58110 -11440 116083 -26529 -34852 163161 285474 231677 148603
1873 148603 164054 152578 136037 172767 63890 -106996 -165488 -11898 48179 88426 13093
1862 13093 69722 126753 122355 216487 163780 208299 64167 -9233 25005 116073 106482 95627
1850 95627 31448 42415 99569 119305 -14803 33193 197240 207499 212276 86560 -52533
1839 -52533 -13831 18063 88376 190231 276994 305336 206227 75709 102269 183056 284661
1828 284661 52215 -44960 41549 240168 343911 192528 118285 57876 261309 305201 123953
1817 123953 31607 284716 356299 159302 219517 271404 249726 137883 19187 66736 328925
1806 328925 524672 313618 -62145 65122 213334 138426 135148 331888 320076 249456 190217
1795 190217 203240 163016 1930 -202001 -140957 88397 262501 120062 39426 114631 148186
1784 148186 155754 88940 266468 298411 137012 28898 319635 331643 330518 157636 188955
1773 188955 272315 162121 40359 88597 -58708 174155 362293 315326 205870 384591
1763 384591 436817 187777 52082 141181 185199 164151 74110 -7532 211691 500458 407664
1752 407664 150689 35060 -50271 -23381 57743 114950 -3599 -35819 -28297 263697 315431
1741 315431 164372 48301 88111 -92941 -31455 280670 386988 197107 132956 149336
1731 149336 66881 -1967 -176830 -302468 -235970 -168995 -136794 -39962 59679 115146 26560
1720 26560 1553 -199576 -349978 -267067 -169773 -200904 -121191 87276 143140 185645 -10637
1709 -10637 -58041 -72639 93791 -73775 -175930 -255445 -210437 -39416 -1220 -5988 -4395
1698 -4395 -56909 19377 -52894 -204840 -255308 -256010 -113980 -94868 -218950 -250285 -53635 67050
1686 67050 -7216 -242098 -185196 -279301 -367262 -286432 -148653 144559 286827 29068 -134631
1675 -134631 9217 52879 -198987 -119498 -18809 -82170 -208484 -198703 88622 209715 49280
1664 49280 -84016 -212556 -31606 -47689 -156275 -208484 -221748 -211595 -119175 38787 77993
1653 77993 -50506 -311334 -314636 -160776 -54401 -43767 -8195 -61314 -10647 -113684 -129515
1642 -129515 -102489 -59418 79077 -50842 -143243 -134615 -87490 9085 -225912 -432894 -299040
1631 -299040 -142685 15160 -152543 -281519 -336914 -351278 -196822 -165499 -210652 -159929 -245057
1620 -245057 -230118 -312154 -205676 -247519 -340276 -273344 -71647 11295 -19950 -138714 -106881
1609 -106881 -162807 -111777 -27053 -251440 -360746 -299661 -183447 -369295 -208514 -208436 -319946
1598 -319946 -398379 -176704 -55793 -216550 -325890 -245603 -232844 -166736 -129656 -126008 -145519
1587 -145519 -157048 -241968 -243013 -159563 -271824 -381158 -192570 -88743 -200295 -184705 -127005
1576 -127005 -118010 -295881 -156718 -78467 -80104 -183857 -224826 77385 105684 -40383 -278588
1565 -278588 -111554 -34497 -120899 -212020 -191354 30340 115711 -85741 -7439 -138939 -255300
1554 -255300 -257293 -149175 -132955 -165031 -239695 -64877 -20816 28621 6763 -137981 -83962
1543 -83962 -186789 -153746 -359801 -273053 -34585 69610 -62548 -86907 -98038 -75073 -172838
1532 -172838 -227112 -410844 -352905 -141121 -2388 -62741 100144 123375 -139839 -59051 -5415
1521 -5415 -94566 -250024 -313433 -228808 -7833 7801 -108124 -82255 88719 121110 -37749
1510 -37749 -28987 -117541 -144705 -104853 -5414 161390 83828 -33026 -30090 53756 -55032 -136701
1498 -136701 -140193 13015 119896 -141468 -239987 -72088 56238 148694 159012 -129695 -144997
1487 -144997 -101123 123912 130591 102502 -49257 -110135 -13951 -195385 -308717 -241962 -163392
1476 -163392 -195321 -164461 53744 11958 -119701 -76909 -100840 -108096 -318468 -148494 -139589
1465 -139589 -176990 -18610 -47406 -37211 82753 33936 -149448 -115761 81702 88080 -21516
1454 -21516 -145131 -223716 -152572 -49866 -99525 -109514 -98245 -211559 -290164 -61606 102286
1443 102286 -222651 -176248 11858 91458 -32406 -135240 -133325 -5993 -48325 -51659 111826
1432 111826 99257 28599 -67416 -157292 56818 81242 -201265 -158449 -22356 -63252 -171869
1421 -171869 -86571 -108669 -149635 -258399 -285562 -235623 49443 -26977 -265331 -314481 -258170
1410 -258170 -105852 -90440 -223311 -119962 -119645 -58681 -123485 -64300 4476 -71037 -109173
1399 -109173 -40516 -56737 -277070 -305800 -208549 -132042 -43957 122564 -4074 -61034 -5566
1388 -5566 -166939 -469288 -361712 -169814 -209248 -158041 -158148 -55529 -25738 -118521 -85743
1377 -85743 -219963 -275054 -206289 -181392 -90777 -127944 -102323 -15629 29521 -33730 -94364 -52643
1365 -52643 -20745 -246390 -43183 -74297 -180072 -18197 138137 175541 42842 -122235
1355 -122235 -292638 -250239 -153191 -160277 -10364 25960 -99928 -65477 -61314 15608 -170059
1344 -170059 -236627 -284843 -343274 -278837 -203523 -165657 -134968 -47491 77932 -89128 -70159
1333 -70159 -84246 -142428 -144063 -137386 -39757 49835 -30844 -133687 -135919 -136935 -212782 -219723 -251675
1320 -251675 -376042 -338184 -99596 15639 -50060 -245928 -190478 -125745 -120897 -76232 -183561
1309 -183561 -51319 -183486 -263098 -114157 -158334 3429 -56447 -110920 -69620 4382 -137923
1298 -137923 -152926 -103478 -127044 -182064 -218266 -255426 38157 37207 -119347 -168080 -250602 35087
1286 35087 86498 -32910 -119 -159710 -60503 92486 134560 8145 -166153 -42155 -127692
1275 -127692 68000 20023 -90848 -48797 16615 -96233 -61932 -18328 -30739 93059 2176
1264 2176 -239253 -240415 -94964 -86094 -231014 -135079 -100748 -118944 -73397 -10913 121952 133512
1252 133512 -96835 -146110 -48038 18261 -64328 -168757 -67758 -98083 -143154 -117564 12762
1241 12762 106799 70847 99801 171645 144611 203573 242698 221210 79015 -96556 50678
1230 50678 68042 -45335 -169980 -118185 138269 173586 58140 109392 -24871 -231721 9846
1219 9846 -123795 -160712 -82997 -239084 -246195 -100306 25505 -100212 -16061 46882 59285
1208 59285 -81747 -121075 -160505 -3465 66968 -22539 -39959 95305 56242 67057 24529
1197 24529 -70991 -118133 -178654 -131391 -10199 -27993 43118 74057 5704 -94069 -142656 -99107
1185 -99107 -234382 -90840 -35921 130172 149387 121763 -29559 -77959 35429 39519 11778
1174 11778 -11065 -150055 -130818 59611 29663 -19108 106460 61119 46693 180060 123650
1163 123650 30630 118890 66739 -30785 57128 256418 223178 95189 242515 87076 -13813
1152 -13813 209786 3071 -71318 214294 212110 153788 247789 256261 68645 106432 124223
1141 124223 48787 12937 -37807 -7207 -110664 -31803 69038 39607 -60307 70336 110627
1130 110627 182846 237649 113805 6800 21293 -31216 -51654 155892 282695 233242 227245
1119 227245 219543 182836 268600 230002 197693 110180 88664 11877 182597 306806 327452
1108 327452 264247 354982 341666 334013 114353 65687 165984 27268 44439 173036 364736
1097 364736 278389 285776 329686 383228 303385 65484 -10800 216376 138510 271952 388007
1086 388007 388215 339101 317037 259527 236527 341368 423074 338826 247500 311074 428049 379966
1074 379966 371306 332183 250562 476921 439052 312124 388949 500301 501335 439884 536219
1063 536219 614749 477277 431507 476088 647878 539988 462709 487271 548032 771658 586644
1052 586644 495213 573530 744792 679150 551805 625536 818572 833771 871844 707958 710636
1041 710636 700959 721508 724455 730606 1131399 1173891 1052133 903235 893398 928997 1075722 945848
1029 945848 1193023 1290844 1294862 1019392 1170340 1349404 1372707 1295202 1162691 1350180 1468191
1018 1468191 1422940 1252842 1224095 1474973 1583843 1684183 1763771 1664438 1693923 1810077
1008 1810077 1896114 1709995 1754210 1777226 1891519 2007096 2220707 2368586 2390468 2386660 2491861
997 2491861 2557361 2439082 2599359 2792344 2813092 2897050 2938678 3114031 3263981 3302713 3479716
986 3479716 3601547 3846473 3833242 4184452 4715118 4997507 5257950 5558096 5846212 6191396
976 6191396 6608464 7172716 7650095 8319852 9107057 9784268 10716011 11551668 12456881 13326503
966 13326503 14380326 15485772 16692592 18416196 20197560 22427691 25216636 28140162
958 28140162 31654975 35666986 40254198 44864836 47909751 47318503 42842329 36851826
950 36851826 31277883 26599178 23069771 20400194 18051625 15999908 14665268 13546388
942 13546388 12511991 11605382 10959092 10440990 9773795 9230043 8519508 7755794 7223353
933 7223353 6630016 6177729 5785203 5443114 5264918 4917523 4710185 4605665 4542629 4468601
923 4468601 3969570 3789159 3727317 3659100 3376962 3117512 3178973 3206920 2986707 2748884
913 2748884 2650912 2575411 2559317 2478716 2175271 2282358 2458064 2203138 2150909 2153404 1998034
902 1998034 1921298 1808395 1696447 1787689 1745484 1686124 1707705 1645457 1624429 1778353 1586295
891 1586295 1276139 1224893 1424804 1291297 1149275 1052065 1432037 1444603 1164336 988585
881 988585 954055 1117441 920390 691331 676467 805708 955045 862903 845712 1076848 899402
870 899402 773433 684311 688215 790770 554869 630262 873681 830132 766936 651257 585285
859 585285 581995 517930 499315 387736 510969 511467 436574 337316 536059 690561 551859
848 551859 449061 416797 366245 356635 385403 345016 428138 355222 442938 209645 182308 185193
836 185193 309170 267061 305318 381843 513887 395120 203675 134786 231281 284529 254691
825 254691 153241 241848 641527 564745 386703 218525 188901 232744 354802 319622 210089
814 210089 202437 228279 123825 19666 157196 327792 305083 223122 41464 106503 125092
803 125092 34916 11718 66136 331964 256813 100673 71315 113801 112636 142939 12912
792 12912 -48204 63570 200716 312231 142685 120751 210283 165915 42337 -16988 121417
781 121417 341659 256560 44864 -8943 -15467 89979 47073 -137358 60696 60414 267499
770 267499 119251 93921 25880 170517 303460 198439 145054 -109205 -113151 208081 152248
759 152248 -114316 -15953 238356 377043 227693 -2826 -125275 30266 -97610 -137639
749 -137639 -8912 174748 259782 182768 -10642 10705 28776 17169 -96717 -74758 -14337
738 -14337 58542 147728 -78855 -45575 125573 76559 42419 8167 184721 216214 56031
727 56031 -187461 49823 354235 104902 -109918 -29216 60815 10787 142599 160065 -775
716 -775 -50278 190405 132458 -16763 -168955 -1771 -7539 -33752 -4330 5981 121947 213794
704 213794 217674 119955 76497 24944 -129470 -178083 98278 -2028 -25927 103520 76673
693 76673 -73584 -89984 -94135 -33549 -32335 48255 44524 47600 -82300 -74798 53002 131819
681 131819 76775 -47367 -37984 -51006 53820 -106642 -82384 97613 231998 204668 175362
670 175362 177906 280124 314801 128465 50092 275265 285115 171797 127177 -36782 -50183
659 -50183 -40778 85438 70433 80313 62026 201577 -25665 -160580 -74984 88710 50038
648 50038 28118 55974 -45833 74609 32277 -162959 -333755 -27656 18126 -173901 -121695
637 -121695 107453 21902 -51218 -7912 -53245 -181204 -98770 -112129 -126739 -44717 139697
626 139697 122122 -86317 -187398 -108404 -60361 -110002 -228869 -274132 -288660 -98433 -24533
615 -24533 -168817 9417 145346 118004 -90843 -177186 -195099 -177445 -104116 -80368 -3897
604 -3897 130092 117005 6554 -40087 25837 -30311 6724 -34502 25568 123989 177939 120112
592 120112 -37954 8707 -26267 -69398 -20062 -81328 99016 29811 -112248 -33331 -26603
581 -26603 -217413 -110260 84963 7898 -187557 -144177 5620 23343 -105760 -120615 15524
570 15524 139000 205505 95487 -63420 39100 65785 -27057 -115007 23164 33672 -26655
559 -26655 43923 -96922 -275494 -148982 -59214 -153462 -24461 23707 125026 8898 -4758
548 -4758 -559 -13582 -98199 -74980 -129822 -65806 -4635 -91789 -175335 -114278 -94081 -18809
536 -18809 -49502 -112134 -211876 -143609 -161223 -172786 -234568 17072 -65939 -208974 -245771 -114080
524 -114080 -107534 -91196 -11881 -205262 -137172 -53006 22439 -34470 -110768 -129073 19761 78505
512 78505 146798 69312 130582 251150 149441 -163579 -348988 -210728 -13229 2462 -136863
501 -136863 124510 282844 54593 -104750 -132114 -104118 -36943 -157055 -352406 -215995
491 -215995 -34229 63472 -48101 58573 68851 27198 27518 -119814 -237769 -171381 -58271
480 -58271 -68799 -151899 14532 96266 100062 -41860 -148875 -146343 -159883 -92239 17484 -375
468 -375 96515 117524 -24641 -108427 -201791 -248257 -272120 -228618 -100486 -28972 98385 98575
456 98575 78705 9678 -19524 -38549 -18940 21371 -83818 -176653 -96596 54627 87293 61109
444 61109 -3346 -65195 -127636 -329212 -49111 128608 -10520 -212353 -148625 54645 52662
433 52662 -7919 -74811 -176877 -41618 123650 84128 84388 225641 163262 104391 123847 -59542
421 -59542 -239774 -194034 -3461 -220063 10829 70749 3709 19040 -40723 -185858 -93790
410 -93790 69622 42363 -181738 -72712 182747 77502 -86211 -131164 4626 154291
400 154291 78052 163785 60589 174360 206354 -25744 -264420 -297538 -54487 30316 509
389 509 -4126 -156273 -93325 -65516 -104305 144269 191600 186264 11370 36812 16320 -161771
377 -161771 -123489 -35650 79617 22430 157962 59494 -56903 2763 -1768 17223 93385
366 93385 -34617 -76271 84154 27567 -29919 26443 85385 -11671 -100269 -60202 105459
355 105459 54275 -75178 4352 26246 -55877 -51481 -110294 27279 27778 -82408 -58380 86770
343 86770 16783 -41386 -146629 46144 180632 51616 -261765 -231186 -232652 -140441 -160609
332 -160609 -95407 115866 172604 62041 56972 116728 94586 157050 -46206 -130751 -38616
321 -38616 110048 12519 -10299 127011 183186 61609 15154 -110995 -67696 187777 174103
310 174103 -48294 -149948 101164 73669 -127044 -119903 59608 138196 -15459 -5712 -26634
299 -26634 -1214 193098 43622 -100082 -42306 130498 32996 -74451 -111470 -141050 -23752
288 -23752 37047 20970 -107323 -26190 54496 7555 -84169 -93474 -262268 -167435 -263388 -116555
276 -116555 -51672 156585 272234 112848 -19586 28156 28731 33751 -169438 -211821 -119177
265 -119177 -140175 -23963 12088 -6969 -125028 -107488 -75570 -118120 -66569 -61458 -9540 97829
253 97829 133285 86572 59279 -90667 -176375 -190229 -54137 -29798 -178573 -162911 -49944
242 -49944 62911 -3027 44659 -39804 -197807 -62011 -10331 -84104 -191232 -12718 27185
231 27185 -146256 -89844 -143110 -149836 -141736 -121016 -129133 -74117 28778 179670 144571 -16655
219 -16655 -71964 -103532 -217658 -84377 -147562 -52181 -16590 -64840 -203857 -18847 -45155
208 -45155 -94931 -256554 -179423 12753 -30083 -32347 92358 91739 18031 8525 -3954 85316
196 85316 39210 -166104 -351074 -95934 144392 -18289 -23937 46570 -87613 -117160 -116434
185 -116434 -135437 -107236 -226226 -179460 -68387 -75751 -14565 -108631 -189958 -59363 -94520
174 -94520 -109305 -58404 -39696 -96374 -148855 -148854 -85511 -22457 67154 118230 16225 -159321
162 -159321 50618 133982 -12483 -80653 12085 204883 171762 178629 27970 -54156 -101161
151 -101161 -196056 -401545 -126683 93766 159248 -34813 8397 82408 -73970 -177940 -49381
140 -49381 -3673 57276 58126 41168 42795 -43743 77190 86199 -72488 -63171 -109297 -55737 -82829
127 -82829 -210444 -167584 -162703 -112527 -282870 -300556 -94684 -57055 -130922 -264966 -299798
116 -299798 -191003 -65455 78944 88760 -82465 -153491 -117837 -186204 -345729 -236967 -44050
105 -44050 -2815 -109544 -38976 -34487 57177 -13435 -91345 -68484 50041 -107071 -234539
94 -234539 -153283 -1528 -170322 -221667 -89032 -92841 -19904 -48688 -54365 -76967 -106309 -6458
82 -6458 -21298 -63388 213069 135501 34414 -11863 -64792 -80141 -101349 -96521 -144273 -216055
70 -216055 -106115 -222180 -33260 -71087 -71373 -130383 -145285 -17023 -186678 -205284 -103585
59 -103585 -5331 29589 -108081 -164137 -303239 -265310 -117057 -147039 -187107 -217375 -101046
48 -101046 -189630 -188371 -205003 -241525 -118437 -113118 -233638 -198571 -102540 -69134 -65882 -31223
36 -31223 -7209 -104644 -102705 -157096 -137510 -114381 -109750 -233169 -141678 -58313 -10104 -87607
24 -87607 -59653 -83205 -65253 -76937 -81628 -44664 -29610 21598 -34693 -24709 -206202 -251003
12 -251003 -228301 -213435 -308853 -164924 5703 16937 21097 -21906 -151700 -153555 -96459 -76004
0 -76004
$$ Imaginary data points
##PAGE= N=2
##DATA TABLE= (X++(I..I)), XYDATA
16383 -3607707 -3468548 -3435256 -3439024 -3475579 -3466056 -3534101 -3364732 -3113072 -3046025 -3126222 -3111956
16372 -3111956 -2988177 -2896081 -2955761 -2980946 -2972139 -2868116 -2748553 -2702739 -2647707 -2654054 -2537618
16361 -2537618 -2464826 -2355559 -2437158 -2521040 -2478165 -2387292 -2342229 -2177761 -2100679 -2011520 -1944422
16350 -1944422 -1981300 -2081119 -2049270 -1977165 -1968549 -1949755 -1803055 -1799719 -1763795 -1666775 -1620423
16339 -1620423 -1494726 -1498483 -1472242 -1430115 -1357077 -1326234 -1461732 -1388961 -1339419 -1218578 -1088341
16328 -1088341 -1162436 -1182694 -1169056 -881878 -884883 -836770 -922772 -903026 -811247 -826403 -763831
16317 -763831 -683533 -696487 -762975 -730606 -531869 -442329 -583910 -549803 -362196 -271611 -373002
16306 -373002 -359719 -297024 -289540 -321972 -277529 -330378 -126251 136375 170812 83484 -12977
16295 -12977 45427 82925 156987 156540 92289 170816 263686 262827 204914 146114 253437 384710
16283 384710 451789 448601 443426 492878 530313 646441 748958 774767 903435 1077944 1083752
16272 1083752 960380 830518 795244 718975 684553 805462 913039 1091570 1029016 1077842
16262 1077842 1213543 1165708 1192984 1196341 1248125 1272465 1308223 1238743 1306290 1461071 1461152 1536163
16250 1536163 1529135 1501763 1434061 1417616 1425276 1344566 1430106 1696460 1660100 1750253 1841476
16239 1841476 1825768 1833915 1791896 1689271 1565931 1632756 1674397 1871929 1986876 1945348 1836511
16228 1836511 1767582 1882942 2107683 1936999 1883615 2023305 2093831 2061939 2016163 2150198
16218 2150198 2321270 2445130 2248594 2109505 2177092 2140412 2089946 2201178 2251827 2243359
16208 2243359 2370742 2395809 2388260 2387767 2278640 2295333 2262529 2301633 2277699 2408974 2324154
16197 2324154 2362489 2661078 2783362 2611639 2406771 2508576 2532118 2546626 2547914 2471179
16187 2471179 2559326 2657953 2687670 2682279 2631530 2555653 2563419 2635188 2615416 2742488 2867587
16176 2867587 2976496 2906650 2766743 2780895 2868375 2972607 2777113 2651784 2696125 2731194
16166 2731194 2749025 2810358 2899019 2996106 2960414 3035373 2951190 2919566 2987079 2940286 3009414
16155 3009414 3040179 3062565 2979856 3061386 3020041 3016035 3150257 3083715 2871673 2982922 3120489
16144 3120489 2999112 2957228 3080699 3024003 3094053 3256646 3163293 2883939 2901133 3022549
16134 3022549 3086877 3011078 3052659 3007360 3177702 3373431 3309191 3138084 3147511 3107033 3014315
16123 3014315 3070001 3018350 3177043 3342730 3326983 3381286 3315298 3226054 3159808 3157757 3055108
16112 3055108 3063532 3332958 3314827 3281122 3274168 3426023 3414066 3328242 3397258 3383106 3150436
16101 3150436 3218170 3206491 3145884 3294914 3418888 3470862 3323613 3196261 3321727 3311912
16091 3311912 3230932 3117827 3192110 3260119 3592015 3633487 3690916 3644363 3632069 3378916 3266696
16080 3266696 3360427 3300591 3360573 3353841 3384546 3371273 3339471 3354164 3402965 3341650 3346037 3371612
16068 3371612 3528515 3428102 3400631 3368681 3512181 3583424 3591393 3428979 3296830 3233954
16058 3233954 3238614 3271455 3414665 3535527 3508957 3555395 3476723 3470812 3587727 3538194 3350322
16047 3350322 3194203 3313849 3506690 3503250 3464122 3328606 3447942 3572967 3474827 3312852
16037 3312852 3300069 3595459 3585021 3400731 3279501 3499094 3462764 3390928 3512012 3546049
16027 3546049 3514721 3412370 3340227 3447276 3526327 3626165 3433920 3458503 3501182 3507401 3435573
16016 3435573 3364658 3375736 3409616 3440440 3306601 3222416 3171499 3253943 3285855 3331391 3304614
16005 3304614 3334673 3334577 3421805 3502263 3529227 3550660 3448858 3372372 3403953 3264400 3337117
15994 3337117 3364842 3446721 3447722 3310129 3413424 3605357 3494153 3256418 3429160 3605329
15984 3605329 3574676 3614269 3615293 3471409 3499329 3402094 3227253 3276257 3337562 3490558 3548944
15973 3548944 3570827 3439542 3512734 3564177 3399331 3307261 3294988 3127528 3495686 3600990
15963 3600990 3365681 3266889 3608587 3678338 3627268 3414408 3399545 3330840 3230181 3371962
15953 3371962 3530487 3544661 3468616 3389882 3398763 3499677 3564648 3446141 3417166 3392184 3384958
15942 3384958 3406402 3492399 3551175 3494623 3778818 3859232 3478515 3090029 3188866 3252404 3316298
15931 3316298 3469651 3559010 3490341 3581651 3539070 3412532 3317286 3424074 3346469 3389132 3340837
15920 3340837 3464985 3533439 3526574 3540575 3356607 3265813 3393626 3481642 3415900 3354665 3385397
15909 3385397 3510087 3697026 3533322 3509094 3534416 3702569 3576261 3503237 3488741 3399084
15899 3399084 3311256 3272240 3394312 3525941 3591941 3531185 3330271 3390177 3474269 3587591
15889 3587591 3429255 3481474 3424087 3466203 3498885 3472870 3441158 3414884 3474511 3388617 3481620
15878 3481620 3427329 3440317 3398642 3389487 3402578 3687226 3751559 3734462 3689762 3489500 3412524
15867 3412524 3393834 3328810 3286998 3164129 3591204 3727451 3671343 3602113 3515678 3544866 3554938
15856 3554938 3557539 3494681 3407494 3449323 3422407 3464815 3525022 3561751 3771047 3688765 3644468
15845 3644468 3563478 3444903 3346768 3461421 3480076 3571822 3572426 3669635 3691919 3593235 3446675
15834 3446675 3320763 3360863 3393470 3443621 3418855 3538816 3522863 3690932 3677340 3652341 3489456
15823 3489456 3365238 3144274 3249193 3433105 3520405 3446720 3479488 3515816 3736898 3682069
15813 3682069 3599557 3553313 3464167 3498619 3362818 3381196 3457747 3457010 3489993 3593553 3580004
15802 3580004 3567639 3554945 3441601 3385346 3474193 3583401 3579301 3474580 3487262 3546968 3652667
15791 3652667 3548946 3437267 3373914 3389277 3420117 3466369 3630230 3736612 3598149 3376282
15781 3376282 3507079 3446935 3392698 3326288 3446429 3556984 3529480 3504702 3474033 3553218 3443655
15770 3443655 3413935 3476457 3687289 3628348 3554671 3413128 3271992 3272302 3239768 3264128 3356936
15759 3356936 3427240 3557288 3444719 3435855 3439051 3414035 3278865 3312047 3374249 3597188 3633847
15748 3633847 3463596 3467569 3494770 3501663 3726770 3742221 3549543 3505085 3518279 3614532 3442475
15737 3442475 3350000 3398306 3611995 3777198 3718000 3644376 3724075 3728088 3474215 3439803 3560477
15726 3560477 3540790 3378203 3489723 3708236 3637405 3567154 3559871 3669446 3689999 3516203
15716 3516203 3445736 3483032 3637405 3498832 3497927 3678268 3640962 3579970 3529844 3410221 3330451
15705 3330451 3223535 3393044 3487812 3583968 3700657 3831269 3803945 3531028 3491155 3502587
15695 3502587 3533425 3354981 3486533 3765393 3766342 3583085 3480066 3413277 3560992 3477741
15685 3477741 3462866 3366077 3559720 3723618 3768187 3644880 3560513 3600029 3536256 3577860 3524457
15674 3524457 3450262 3540914 3576819 3384226 3470186 3719820 3889397 3671283 3479482 3542905
15664 3542905 3535326 3505110 3562393 3630754 3642297 3712656 3757712 3708508 3727507 3449981 3167591
15653 3167591 3257349 3571375 3633459 3558606 3671812 3613825 3695186 3675099 3649548 3470639 3503459
15642 3503459 3362362 3244383 3352010 3535084 3704706 3659292 3639068 3556233 3489883 3516808
15632 3516808 3697481 3557906 3441825 3606434 3755021 3512305 3556190 3632796 3634672 3502897
15622 3502897 3622924 3705780 3688670 3498408 3482717 3605014 3668013 3514675 3376929 3453303
15612 3453303 3521342 3753812 3549408 3485435 3576695 3703009 3633171 3451401 3411212 3534618
15602 3534618 3572849 3344706 3473567 3502608 3567545 3681482 3439205 3375801 3368025 3434096 3544248
15591 3544248 3493478 3535047 3693578 3782495 3674915 3615817 3557769 3403828 3520411 3560788
15581 3560788 3752345 3649873 3527624 3523474 3615769 3686775 3624758 3501506 3371842 3411397
15571 3411397 3504669 3808726 3638179 3581930 3563260 3549821 3618490 3574943 3434861 3387904 3528939
15560 3528939 3623553 3523060 3473242 3549473 3811279 3847195 3656712 3599811 3539050 3532355 3442584
15549 3442584 3462620 3546121 3781678 3818987 3742846 3447971 3404827 3330353 3451193 3569548
15539 3569548 3474314 3503388 3583095 3840674 3690521 3534748 3667949 3475586 3393958 3551123
15529 3551123 3543679 3545416 3486182 3664944 3598148 3633503 3614940 3513183 3623319 3658734 3459007
15518 3459007 3360343 3440236 3492574 3499797 3435693 3537199 3596844 3534097 3486201 3528168 3260423
15507 3260423 3318623 3694031 3794448 3599133 3649031 3660546 3606782 3551778 3594770 3495538 3389978
15496 3389978 3442004 3467238 3638883 3735089 3736693 3433818 3565447 3798426 3617933 3441237
15486 3441237 3548162 3654017 3581430 3445262 3589634 3664646 3686015 3811205 3715223 3590161
15476 3590161 3550365 3719612 3624714 3572205 3646845 3849551 3753775 3638430 3672689 3515876
15466 3515876 3572015 3663254 3635417 3757956 3748249 3586117 3527763 3597410 3800411 3550986 3502877
15455 3502877 3506338 3521087 3563544 3458692 3472723 3545593 3543593 3559201 3446331 3497898 3653690
15444 3653690 3580969 3466558 3554710 3781363 3806835 3544109 3540586 3573739 3530025 3499250 3587771
15433 3587771 3397494 3459450 3633572 3652051 3679099 3712159 3653753 3573298 3581483 3636081 3687913
15422 3687913 3480057 3552124 3656010 3575645 3643458 3700783 3653221 3644223 3588421 3681024 3681704
15411 3681704 3727692 3607834 3560583 3603821 3687016 3606970 3497185 3541127 3717001 3706513 3745090
15400 3745090 3809205 3643826 3659209 3610817 3495049 3453978 3582202 3731871 3610960 3573352
15390 3573352 3711870 3958161 3809272 3728547 3733347 3612935 3593172 3699212 3707943 3713748 3946670
15379 3946670 3879211 3752196 3692476 3671277 3481585 3437240 3491059 3541101 3767837 3696171 3863275
15368 3863275 3792161 3878827 3792171 3520594 3544132 3575977 3793995 3864975 3911953 3863307 3828982
15357 3828982 3905575 3724024 3553265 3594472 3723429 3633584 3517673 3675118 3590189 3558961
15347 3558961 3636696 3696251 3569751 3598489 3725120 3639633 3513198 3772769 3778024 3678791 3628108
15336 3628108 3688334 3766299 3778031 3703904 3617842 3499587 3446293 3442371 3401308 3631941 3884666
15325 3884666 3741829 3548337 3579226 3647809 3509695 3438700 3645293 3715214 3700364 3684889
15315 3684889 3719013 3684031 3653674 3650614 3748098 3869844 3805465 3643357 3591218 3577960 3771939
15304 3771939 3844569 3675745 3715552 3677174 3513500 3464119 3407399 3442023 3629819 3748767
15294 3748767 3777282 3740723 3823370 3818658 3574042 3554013 3631288 3694269 3621046 3668946 3606567
15283 3606567 3599602 3759406 3662176 3594049 3504222 3555871 3453594 3507834 3724232 3617445 3492761
15272 3492761 3576812 3712409 3617843 3639936 3690844 3650193 3701412 3612094 3778696 3742016 3700148
15261 3700148 3803964 3717018 3574175 3593445 3712330 3571109 3599213 3777333 3714277 3682447
15251 3682447 3999538 3921487 3811408 3761769 3662497 3641709 3659252 3755213 3759742 3728656 3699300
15240 3699300 3627475 3674226 3713073 3868473 3793930 3759254 3795493 3708898 3743605 3725549 3678828
15229 3678828 3636225 3499092 3713687 3694980 3731282 3830193 3793579 3682750 3572747 3780099
15219 3780099 3612734 3426246 3737313 3844840 3759134 3901921 3889183 3751351 3730370 3749048
15209 3749048 3646505 3684979 3829752 3805575 3754168 3771909 3952902 3915293 3780481 3709005
15199 3709005 3643747 3474638 3380134 3507096 3745983 3975117 3814640 3746705 3761209 3783155
15189 3783155 3719644 3533749 3657145 3828265 3594133 3596437 3605187 3747691 3805373 3881520 3607387
15178 3607387 3649928 3641259 3639255 3654206 3738738 3813851 3779910 3766367 3776145 3669083 3584146 3555351
15166 3555351 3698951 3770334 3612256 3693681 3604955 3676943 3992427 3967904 3845797 3791659
15156 3791659 3770369 3812393 3616922 3795391 3812656 3835434 3654434 3763032 3901710 3805466
15146 3805466 3842396 3750471 3712499 3725780 3774653 3535184 3544594 3904063 3850476 3651667 3633682
15135 3633682 3666782 3575718 3471125 3594297 3691661 3699604 3743576 3815805 3795215 3684710 3848489
15124 3848489 3782006 3724746 3636477 3642681 3610663 3602091 3629024 3580859 3706560 3749689 3628954
15113 3628954 3616170 3721149 3813097 3794723 3986048 3946140 3957797 3861345 3952174 3885364 3770829
15102 3770829 3859087 3750449 3744877 3679160 3841986 3866697 3843730 3680385 3511575 3673755
15092 3673755 3903656 3764213 3706082 3751789 3999280 4007157 3754025 3645282 3853238 3917265
15082 3917265 3816091 3807082 3700680 3654912 3787424 3844370 3800436 3717298 3711602 3684587 3786151
15071 3786151 3740766 3690199 3789073 3809955 3779811 3677965 3675755 3807019 3767105 3752233 3856969
15060 3856969 3908870 3743911 3627372 3687573 3605846 3793592 3856511 3809223 3828629 3934804
15050 3934804 4184145 4030615 3788261 3699394 3755488 3823087 3775619 3882873 3815647 3850762
15040 3850762 3908190 3684647 3701410 3797189 3692094 3607896 3776446 3836847 3725687 3802625
15030 3802625 3793584 3871347 3849129 3984930 3825301 3674489 3569981 3639039 3826882 4066784
15020 4066784 3973662 4000697 3945192 3989271 3914806 3639003 3670555 3789855 3855128 3689795 3569183
15009 3569183 3739222 3796310 3845476 3907528 3874033 3903034 3960314 3946332 3741391 3820589 3839822
14998 3839822 3763408 3783161 3864364 3800865 3837434 3714093 3770403 3778352 3964067 3877133 3875191
14987 3875191 3762663 3825665 3940367 3948322 3867378 3812885 3780943 3801442 3784670 3816295 3830209
14976 3830209 3762559 3711993 3622987 3843764 3975965 3673434 3566153 3699274 3721466 3751375
14966 3751375 3878828 4022432 3927784 3742056 3799458 3851969 3775536 3774824 3666169 3728813 3988963
14955 3988963 4064998 4016263 3978333 3891207 3647608 3684640 3832950 3783946 3772725 3735827 3873216
14944 3873216 3809617 3809278 3868975 3735840 3682731 3777149 3750856 3615225 3746758 3966032 3958713
14933 3958713 3912017 3817934 3828279 3760154 3764801 3807913 3742851 3709919 3677117 3675886 3948119
14922 3948119 3960138 3832904 3798969 3837825 3823460 3660243 3698848 3911516 3956386 3988495 3801539
14911 3801539 3602869 3582242 3771695 3848042 3557439 3500073 3714179 3924301 3845470 3819613
14901 3819613 4059567 4142601 4005279 3878581 3671849 3599218 3767622 3885919 3967673 3982080
14891 3982080 3998675 3854105 3737251 3711416 3720724 3646005 3623788 3651298 3737226 3731681 3773746
14880 3773746 3826905 3817733 3922962 3968560 3793888 3759937 4019088 3878315 3635407 3680949
14870 3680949 3813574 3870599 3857975 3899007 3690717 3553161 3797741 3957007 4015998 3994327
14860 3994327 3899030 3894368 3921302 3969380 4021546 3757705 3856257 3783679 3804470 3881158 3984087
14849 3984087 3892552 3771658 3847977 3950063 3976789 3912682 3968171 3897648 3694866 3656980 3826662
14838 3826662 3927698 3916230 3908574 3722459 3853146 4029482 4023826 3781995 3630373 3787999
14828 3787999 3789833 3882058 3800604 3794479 3873713 3781419 3747373 3623283 3779618 3827287 3697308
14817 3697308 3743823 3954883 4132390 3953754 3865777 3802654 3873518 3942649 3882270 3850841 3974986
14806 3974986 3895736 3812770 3726010 3874999 3892503 3716144 3792542 3811011 3794717 3962445 4007244
14795 4007244 4079527 3855340 3749874 3853806 4013614 4037638 3873427 3823454 3768142 3787090
14785 3787090 3891534 3841500 3919068 3755563 3923444 4002980 3927333 3907327 3763296 3859879
14775 3859879 3815449 3766620 3844160 3983720 3942096 3863992 3829388 3713541 3648859 3742939 3876621
14764 3876621 3908387 3931077 3848758 3777027 3932532 3994756 3830944 3680169 3791907 3754857
14754 3754857 3699584 3679543 3750169 3810808 3818107 3896075 3840791 3741925 3660535 3755239 3782218
14743 3782218 3802814 3887045 3838301 3966971 4041519 4077221 3988148 4007869 3887523 3796680 3870681
14732 3870681 3863689 3829198 3929309 4096787 4143341 4033193 4120590 4023791 3980890 3939371 3851444
14721 3851444 3985298 3872785 3824503 4119509 4085970 3990814 3884030 3919375 3767873 3672274
14711 3672274 3801468 3671758 3641980 3740311 3705195 3977280 4185192 4091240 3717514 3664569
14701 3664569 3847303 3823096 3598117 3737369 3989489 3949878 3961325 3935015 3952750 4029056
14691 4029056 4008029 3907031 3774482 3716773 3815040 3763447 3800818 3874664 3899980 3978473 4002307
14680 4002307 3915214 3831450 3739279 3858654 3755068 3808060 3906445 3795819 3914061 3900799
14670 3900799 3895075 3950121 3806413 3913245 3918087 3910013 3858107 4095221 4122064 3997815 3896588
14659 3896588 3759472 3929561 3957534 3855341 3763076 3772299 4034333 4008864 4054985 3975317 3979790
14648 3979790 4008105 3925835 3942387 3970014 4004277 4028756 3942066 3965425 4099218 4080597 3818241
14637 3818241 3742983 3835823 3965162 3927056 3741848 3778428 3806044 4045663 4103018 4041758 3942905
14626 3942905 3854007 3849174 3675875 3825186 3962308 4012766 4035658 4012770 3841857 4047936
14616 4047936 4152154 4051784 3954008 3947337 3968425 3871775 3911159 3815422 3823985 3839052 3880437
14605 3880437 3887711 4010504 4021826 3874941 3845697 3860774 3915446 3971664 3965677 3973118 3947045
14594 3947045 4036767 4135214 4070347 3798505 3869828 4139021 4019527 3974132 4103959 4065384
14584 4065384 4044476 4145956 4063760 3870182 3711365 3850702 4123548 4187455 4143506 3976219
14574 3976219 4114344 4139937 4105493 4100942 4152467 4255904 4025086 4016476 3978937 4093400 4161277
14563 4161277 3886624 3879291 3820544 3989269 4094053 4048831 3958926 3905927 4073645 4034783 4065070
14552 4065070 4276046 4141812 4019625 3857760 3896010 3902410 3932606 3994446 4145395 4056253
14542 4056253 4179114 4038488 3859602 3769586 3964704 4016769 3955582 3989843 3920556 3922949 3905459
14531 3905459 3997078 3958217 3765287 3944870 4047441 4014769 4117268 4067429 4140656 4075486
14521 4075486 3987856 3877058 3956501 4055774 4041107 3829852 3902023 4006930 3987091 3984759 4053855
14510 4053855 3995683 3826875 3887724 3911341 3960450 4020043 4111915 3982078 3801454 3950831
14500 3950831 4060997 4028443 3953837 3988421 3987681 4206060 4096716 3877937 4029467 3959533 3944238
14489 3944238 3973365 3896596 4071687 3971457 4090062 3882576 3951595 4122312 4118000 4128019
14479 4128019 4044286 4079853 4068378 4114636 4064695 3844257 4064381 4157976 4109891 3987625 3980586
14468 3980586 3856818 3852782 4047041 3945579 3878285 3916386 3954066 3935548 4043370 3904435
14458 3904435 3901240 4017393 4070558 4000764 4127817 4108962 4033689 3900160 3929745 4080759 4065975
14447 4065975 4059363 4266052 4162319 3927932 3976624 3888748 4011048 4122553 4207496 3971563
14437 3971563 3921607 4042070 4119386 4036327 3884397 3875168 3813074 3796934 3811353 3768877 3654677
14426 3654677 3923651 4062509 4020497 4031836 4056983 3935482 3986000 4065492 3959701 3969326 4148561
14415 4148561 4184324 4236648 4203923 4170094 4033073 4003676 3746516 3844821 4066419 3986760 3947513
14404 3947513 4015557 4258785 4276225 4148211 4083478 4232043 4097097 3886935 3866965 3988051
14394 3988051 4074516 4201127 4079266 4245799 4098806 3999533 4116914 4114829 4023383 3940349
14384 3940349 4109661 4228743 4360813 4149594 4093390 4218573 4241232 4156838 4010023 4108511
14374 4108511 4074490 4108463 4191935 4165671 4009616 3945040 4175137 4103510 4125253 4103381 4099837
14363 4099837 3978831 4077337 4151642 4186620 4117412 3959353 3995159 4151388 4179823 4076065
14353 4076065 3973205 3889119 3989387 4051769 4056829 4113556 4124008 3974420 3982624 3880287 3960523
14342 3960523 4051269 4214483 4074018 3959170 4051606 4182346 4187129 3969261 3913983 3767727
14332 3767727 3743211 4104237 4113308 3948559 3776542 3761263 3934718 3965929 4044015 4150927
14322 4150927 4136972 4101327 4158185 4113995 4133767 4064792 4047208 3928013 4078619 4238762 4060585
$$ [...]
##END NTUPLES=NMR SPECTRUM
##END=
