##TITLE=1H_CA-8864-A3
 CDCl3, 8 sc, 
 1.06.2021
##JCAMPDX= 6.0         $$ Bruker NMR JCAMP-DX V2.0
##DATA TYPE= NMR SPECTRUM
##DATA CLASS= NTUPLES
##ORIGIN= UXNMR, Bruker Analytische Messtechnik GmbH
##OWNER= root
$$ XWIN-NMR		Version 3.5
$$ Tue Jun  1 12:03:23 2021 Russian Standard Time (UT+4h)  she@DPX200
##.OBSERVE FREQUENCY= 200.131506
##.OBSERVE NUCLEUS= ^1H
##.ACQUISITION MODE= SIMULTANEOUS
##.ACQUISITION SCHEME= undefined
##.AVERAGES= 8
##.DIGITISER RES= 18
##SPECTROMETER/DATA SYSTEM= spect
##.PULSE SEQUENCE= zg30
##.SOLVENT NAME= CDCl3
##.SHIFT REFERENCE= (INTERNAL, CDCl3, 0, 15.9751)
##AUDIT TRAIL= $$ (NUMBER, WHEN, WHO, WHERE, WHAT)
$$ ##TITLE= Audit trail, XWIN-NMR		Version 3.5
$$ ##JCAMPDX= 5.01
$$ ##ORIGIN= Bruker BioSpin GmbH
$$ ##OWNER= she
$$ F:/spectra/data/she/nmr/H-F/1/pdata/1/auditp.txt
$$ ##AUDIT TRAIL=  $$ (NUMBER, WHEN, WHO, WHERE, WHAT)
(   1,<2021-06-01 12:02:10.90 +0400>,<she>,<DPX200>,
      <created by zg, POWCHK disabled, PULCHK disabled
       configuration hash MD5:
       00 E9 B6 7A A2 85 ED C7 34 08 36 98 17 FE 4E 26
       data hash MD5: 16K
       56 68 6B 79 E1 36 90 57 70 4D 4E FE 80 5F 3D BB>)
(   2,<2021-06-01 12:02:13.31 +0400>,<she>,<DPX200>,
      <Start of raw data processing
       efp BC_mod = 2 LB = 0.24 FT_mod = 6 PKNL = 1 PHC0 = -11481.48 PHC1 = 15.00099 SI = 16K 
       data hash MD5: 16K
       79 FF 21 18 D1 5A 44 A7 31 E5 39 8A D6 3E B1 84>)
(   3,<2021-06-01 12:02:35.35 +0400>,<she>,<DPX200>,
      <pk PHC0 = -4.723523 PHC1 = 7.800001 
       data hash MD5: 16K
       F1 F3 79 18 1C 91 1C 95 88 A3 72 47 54 59 E6 15>)
(   4,<2021-06-01 12:02:38.34 +0400>,<she>,<DPX200>,
      <abs ABSG = 5 
       data hash MD5: 16K
       97 21 38 1E 01 70 6A 4B 1F 59 39 CB 27 94 63 7C>)
$$ ##END=
$$ 
$$ hash MD5
$$ 79 68 15 70 E6 50 B0 F4 E4 02 7B F0 FB D2 D4 44
##$RELAX= 
##$RELAX= 
##$RELAX= 
##$RELAX= 
##$RELAX= 
##$RELAX= 
$$ Bruker specific parameters
$$ --------------------------
##$DU= <F:/spectra>
##$EXPNO= 1
##$NAME= <H-F>
##$PROCNO= 1
##$TYPE= <nmr>
##$USER= <she>
##$AMP= (0..31)
100 100 100 100 100 100 100 100 100 100 100 100 100 100 100 100 100 100 
100 100 100 100 100 100 100 100 100 100 100 100 100 100 
##$AQSEQ= 0
##$AQ_mod= 1
##$AUNM= <au_zg>
##$AUTOPOS= <>
##$BF1= 200.13
##$BF2= 200.13
##$BF3= 200.13
##$BF4= 200.13
##$BF5= 200.13
##$BF6= 200.13
##$BF7= 200.13
##$BF8= 200.13
##$BYTORDA= 1
##$CFDGTYP= 0
##$CFRGTYP= 5
##$CHEMSTR= <none>
##$CNST= (0..31)
1 1 145 1 1 1 1 1 1 1 1 1 1 1 1 1 1 1 1 1 1 1 1 1 1 1 1 1 1 1 1 1 
##$CPDPRG= <>
##$CPDPRG1= <>
##$CPDPRG2= <>
##$CPDPRG3= <>
##$CPDPRG4= <mlev>
##$CPDPRG5= <mlev>
##$CPDPRG6= <mlev>
##$CPDPRG7= <mlev>
##$CPDPRG8= <mlev>
##$CPDPRGB= <>
##$CPDPRGT= <>
##$D= (0..31)
0 1.2 0 0 0 0 0 0 0 0.06 0 0.03 0 0 0 0 0.0002 0 0 0 0 0 0 0 0 0 0 0 0 
0 0 0 
##$DATE= 1622534530
##$DBL= (0..7)
120 120 120 120 120 120 120 120 
##$DBP= (0..7)
150 150 150 150 150 150 150 150 
##$DBP07= 0
##$DBPNAM0= <>
##$DBPNAM1= <>
##$DBPNAM2= <>
##$DBPNAM3= <>
##$DBPNAM4= <>
$$ [...]
##$SUBNAM3= <"">
##$SUBNAM4= <"">
##$SUBNAM5= <"">
##$SUBNAM6= <"">
##$SUBNAM7= <"">
##$SUBNAM8= <"">
##$SUBNAM9= <"">
##$SW= 16.9725357007746
##$SWIBOX= (0..15)
0 0 2 0 0 0 0 0 0 0 0 0 0 0 0 0 
##$SW_h= 3396.73913043478
##$TD= 16384
##$TD0= 1
##$TE= 0
##$TE2= 300
##$TE3= 300
##$TEG= 300
##$TL= (0..7)
0 120 120 120 120 120 120 120 
##$TP= (0..7)
150 150 150 150 150 150 150 150 
##$TP07= 0
##$TPNAME0= <>
##$TPNAME1= <>
##$TPNAME2= <>
##$TPNAME3= <>
##$TPNAME4= <>
##$TPNAME5= <>
##$TPNAME6= <>
##$TPNAME7= <>
##$TPOAL= (0..7)
0.5 0.5 0.5 0.5 0.5 0.5 0.5 0.5 
##$TPOFFS= (0..7)
0 0 0 0 0 0 0 0 
##$TUNHIN= 0
##$TUNHOUT= 0
##$TUNXOUT= 0
##$USERA1= <user>
##$USERA2= <user>
##$USERA3= <user>
##$USERA4= <user>
##$USERA5= <user>
##$V9= 5
##$VALIST= <valist>
##$VCLIST= <CCCCCCCCCCCCCCC>
##$VD= 0
##$VDLIST= <DDDDDDDDDDDDDDD>
##$VPLIST= <PPPPPPPPPPPPPPP>
##$VTLIST= <TTTTTTTTTTTTTTT>
##$WBST= 1024
##$WBSW= 4
##$XGAIN= (0..3)
0 0 0 0 
##$XL= 0
##$YL= 0
##$YMAX_a= 212498
##$YMIN_a= -204931
##$ZGOPTNS= <>
##$ZL1= 120
##$ZL2= 120
##$ZL3= 120
##$ZL4= 120
##$ABSF1= 16.00096
##$ABSF2= -0.9717045
##$ABSG= 5
##$ABSL= 3
##$ALPHA= 0
##$AQORDER= 0
##$ASSFAC= 0
##$ASSFACI= 0
##$ASSFACX= 0
##$ASSWID= 0
##$AUNMP= <proc_1d>
##$AZFE= 0.1
##$AZFW= 0.1
##$BCFW= 0
##$BC_mod= 2
##$BYTORDP= 0
##$COROFFS= 0
##$CY= -3
##$DATMOD= 1
##$DC= 0
##$DFILT= <>
##$DTYPP= 0
##$F1P= 0
##$F2P= 0
##$FCOR= 1
##$FTSIZE= 16384
##$FT_mod= 6
##$GAMMA= 0
##$GB= 0
##$INTBC= 1
##$INTSCL= 1.334414e-10
##$ISEN= 128
##$LB= 0.24
##$LEV0= 0
##$LPBIN= 0
##$MAXI= 10000
##$MC2= 0
##$MEAN= 0
##$ME_mod= 0
##$MI= 1.114404
##$NCOEF= 0
##$NC_proc= -8
##$NLEV= 6
##$NOISF1= 3.799351
##$NOISF2= 2.8
##$NSP= 0
##$NTH_PI= 0
##$NZP= 0
##$OFFSET= 15.97506
##$PC= 1
##$PHC0= -11486.2
##$PHC1= 22.80099
##$PH_mod= 1
##$PKNL= yes
##$PPARMOD= 0
##$PSCAL= 0
##$PSIGN= 0
##$REVERSE= no
##$SF= 200.130007279605
##$SI= 16384
##$SIGF1= 3
##$SIGF2= 2
##$SINO= 5.538805
##$SIOLD= 16384
##$SREGLST= <1H.CDCl3>
##$SSB= 0
##$STSI= 16384
##$STSR= 0
##$SW_p= 3396.73913043479
##$SYMM= 0
##$S_DEV= 0
##$TDeff= 16384
##$TDoff= 0
##$TI= <>
##$TILT= no
##$TM1= 0
##$TM2= 0
##$TOPLEV= 0
##$USERP1= <user>
##$USERP2= <user>
##$USERP3= <user>
##$USERP4= <user>
##$USERP5= <user>
##$WDW= 1
##$XDIM= 16384
##$YMAX_p= 290943682
##$YMIN_p= -2107096
$$ End of Bruker specific parameters
$$ ---------------------------------
##NTUPLES= NMR SPECTRUM
##VAR_NAME=  FREQUENCY,     SPECTRUM/REAL,   SPECTRUM/IMAG
##SYMBOL=    X,             R,               I
##VAR_TYPE=  INDEPENDENT,   DEPENDENT,       DEPENDENT
##VAR_FORM=  AFFN,          ASDF,            ASDF
##VAR_DIM=   16384,         16384,           16384
##UNITS=     HZ,            ARBITRARY UNITS, ARBITRARY UNITS
##FACTOR=    0.207333158178282, 1,           1
##FIRST=     3197.08896674265, 0,            0
##LAST=      -199.650163692144, 0,           0
##MIN=       -199.650163692144, -2107096,    0
##MAX=       3197.08896674265, 290943682,    0
$$ Real data points
##PAGE= N=1
##DATA TABLE= (X++(R..R)), XYDATA
$$ [...]
8141 8513612 9563796 9864588 10438481 10634135 11004705 11334007 11665768 12444468 13512499
8132 13512499 13266162 13072483 14504677 14752064 14014863 15258253 16280494 15666236 15626946
8123 15626946 15979548 15657628 14825775 14918500 14937585 14548102 14173981 14276233 13833514 13335904
8113 13335904 12948266 12880448 12591228 12270506 12548297 13405129 13108414 12973497 13643148 13830326
8103 13830326 13278102 13320558 14023244 14021713 14257662 14437978 14149014 14716656 15140833 14691943
8093 14691943 14774143 15455027 15182916 14749270 14699095 14883073 14534414 14166033 14133505 13650618
8083 13650618 13050857 12684993 12307918 12495017 12242553 12430425 12272233 12190286 12279864 12826157
8073 12826157 13068619 12613583 12738775 12659839 12211575 12060606 11749518 11731349 11742190 11402101
8063 11402101 11633885 11771472 11613722 11107656 11392603 11441950 11531947 12361338 12341514 11712037
8053 11712037 11868248 11989773 12029268 11996603 11939374 11921362 11795857 11418692 11684735 11679562
8043 11679562 11834857 12193334 12287187 11968834 12563906 13246036 13759120 14129920 13996473 14362800
8033 14362800 13679209 13668418 14882794 14690077 13693851 14078620 14515834 14422763 14660273 14707852
8023 14707852 14403768 14096475 14766899 15909038 16186836 15948383 16661792 17431281 17273345
8014 17273345 17558857 18168356 18553082 19161552 19904235 20517994 20814512 21320911 22022344
8005 22022344 22580735 23008087 23806406 24698544 25427240 25589584 26369986 26859595 28200323
7996 28200323 29196557 30323500 32127461 33928075 35871939 38894429 41888506 44641948
7988 44641948 48387640 52429617 56788902 62017179 67169566 73051749 81173287 91782184
7980 91782184 104637710 118072673 127639785 127056673 114030222 97468846 81245370 68985784
7972 68985784 61109810 54668252 50201798 46466078 43139481 40728648 39230259 38002644
7964 38002644 36114910 34356624 33673799 32696856 32168481 31694710 31330522 30532489 30421905
7955 30421905 29836157 29177590 29313988 28342161 27514136 27570438 27238191 27121471 27230888 27938917
7945 27938917 27555846 27550768 27817002 27986017 28084339 28066086 27896692 28095491 28452235 27975931
7935 27975931 27588859 28272131 28487648 27642591 27474959 27752403 27493743 26593404 27400455
7926 27400455 27969158 26941269 25968063 26422892 26574664 26261867 26849123 27372140 27209952
7917 27209952 27120971 28048206 28480923 28790056 29330506 30216195 30634465 30635071 31074291 32016428
7907 32016428 32305881 32807182 33891611 35265205 35558563 36355549 38229402 39649708 40861077
7898 40861077 42665162 45176033 46867231 48473171 51723878 53979380 56190158 59957165
7890 59957165 63441849 66629524 70318229 73357315 76480101 79889194 83178446 86872140
7882 86872140 90974105 93913294 96160832 98481876 97789616 94933713 91952638 88158028
7874 88158028 82988538 78309250 74354099 69164218 63741664 60080704 56780536 53532455
7866 53532455 51291015 49403495 46643641 44323687 42993503 41528285 40280563 40028702
7858 40028702 38988049 37841849 37284003 36618821 36819752 36424300 36037505 36080769 36601903
7849 36601903 36938916 37838412 38621502 40040989 41491848 42837708 45485854 48287042 50405347
7840 50405347 53159001 55180955 54451185 53506146 52196173 48419719 44048213 40520528
7832 40520528 37307371 34455355 32513357 30759234 28985040 26960258 25367290 24419418
7824 24419418 23591451 22765447 22137997 20930925 20111956 19378388 18904350 17978589 17263300
7815 17263300 17711070 17265992 16859208 16813233 17401325 15846156 15216385 15224135 14755955 13744076
7805 13744076 13939748 14341228 14105648 13593823 13669515 14239720 14037813 13863988 13899448 13646735
7795 13646735 13369641 13616507 13992521 13929199 13463840 13338932 12592056 12661178 13289229 13060189
7785 13060189 12642858 12924624 12206844 11258212 11785732 11759016 11678726 11956046 12664326 13223093
7775 13223093 13430892 12899074 12844087 12450892 12372437 12414435 13314765 13478596 12774468 12468843
7765 12468843 12862748 13472818 13654735 14226634 14471667 14137253 13700281 14513169 15167950
7756 15167950 14966214 15521956 15538745 15370481 15408107 15678980 15849702 15853074 15807428 16780904
7746 16780904 16644531 16748186 17477762 17520640 17158040 17813759 17821560 17551624 17523637 17949598
7736 17949598 18123019 17884323 18273232 18017415 17515305 17376056 17602603 17063359 16963803 16686720
7726 16686720 16965278 16400414 16559439 17015082 17120858 17153930 17138126 17617385 17882878 17865859
7716 17865859 18315739 19261084 19113984 18965137 19348220 19575495 20472814 21001093 20175553
7707 20175553 20097280 20558585 19970191 20790460 21554398 21414801 20987689 22026732 22372678
7698 22372678 22868762 23257047 23125491 23645387 24150180 24121508 23550439 23547973 23644520 23477687
7688 23477687 23434611 23466778 22998001 22612341 23115501 23473370 23334670 23278280 23959246 24348459
7678 24348459 24287653 24201307 24938154 25481176 26338615 26954023 28035339 28667729 29373245 31678320
7668 31678320 33629002 35005122 37042257 39229843 40924123 42275888 42590251 41977218
7660 41977218 42673630 41725570 41007461 40974111 40238027 39605887 38401100 36952974 35004866
7651 35004866 33265811 31278620 29838614 28026703 26468845 25568468 24968137 24298770 23828352
7642 23828352 23593446 22701195 22299640 22439481 22594729 21837262 22263391 22833771 22819771 23432324
7632 23432324 24766937 25319570 25377968 26535249 27657233 28571874 29645964 30926710 31511355
7623 31511355 32493921 31950394 31122621 31187281 30940756 30337118 30020296 29435487 28592415 28258845
7613 28258845 26911879 25125081 23228529 21833196 20026583 18987598 18233577 17076577
7605 17076577 16796743 16033869 15684192 15253824 14945204 14537530 14693781 13829582 13765098 13466812
7595 13466812 13241835 12784392 12587810 12119866 12038871 11971252 12280559 12363344 11275174 11420945
7585 11420945 11631255 11423525 11043788 10756587 10235077 9921682 9688600 10225580 10286563 9466753
7575 9466753 8758477 8870451 8878453 8336713 8964006 8886116 8273537 8089673 8078924 7443206
7565 7443206 7504086 7979657 8166299 7725725 7426505 6989105 7008538 7462339 7324213 7194084
7555 7194084 6772265 7375065 7696953 7638205 7907603 7973755 7399956 7280135 7912736 8133971
7545 8133971 7700889 7531010 7784509 7200731 7029978 6895533 6787276 6565546 6708249 6819750
7535 6819750 6403536 6351953 6771282 7049677 7238211 6746834 6133025 6652915 6475530 5774053
7525 5774053 6158842 6028111 5228179 5935615 5681069 4611371 4045251 4226656 3862939
7516 3862939 3903245 4058836 4057258 3992159 3650330 4244670 4283498 4046599 3395249 3541638
7506 3541638 3038991 3106487 4027476 4584975 4076175 3662954 3451503 3226005 3824864 4110748
7496 4110748 3986764 3712834 3932162 3762142 3995876 3345203 3652168 4095824 3316420 3303660
7486 3303660 4663008 5015645 4011811 3799589 4039534 3504129 3083309 3732309 3406315
7477 3406315 2579473 2710591 2956700 2485277 2639614 3011365 2686126 3128010 2282730 2397762
7467 2397762 2952890 2502796 1348486 2177830 2470951 1456313 1610873 2082552 1404710
7458 1404710 879933 1533895 1542707 1027224 555266 1507265 1345526 1098172 2099264 2877474
7448 2877474 1903475 1576757 2120328 1733273 1837001 2505088 3144996 2522817 1816893 1333798
7438 1333798 1595323 1064200 1171778 1052296 936199 578653 1035598 936627 354790 516483
7428 516483 844592 1213258 1231746 1486327 1734232 1632928 849205 1014816 769551 387665
7418 387665 1056734 839272 38936 387622 521073 298266 203407 29777 -204382 198149
7408 198149 941127 1186490 1567149 1083481 626567 875972 990067 456915 394381 958266
7398 958266 672844 576318 -107517 347720 320109 489154 423504 408380 -182195 400271
7388 400271 1024333 840107 596503 391959 515260 416625 1251884 1181927 1003002 682323
7378 682323 812173 398273 356451 321244 227842 148784 304066 864660 489087 1157414
7368 1157414 1145374 966648 782025 1320257 1310067 951079 776846 873772 407422 304633
7358 304633 492303 695586 358204 199513 276030 303007 570180 281647 -157270 -687575
7348 -687575 187445 202253 283043 292390 163087 -788265 -705986 -113544 230530 211554 13292
7337 13292 911952 1050688 1174537 343583 480181 -50198 179198 104661 -27693 244958
7327 244958 -80293 -179682 -317595 -262353 -453911 -327815 -135540 994932 369863 677873
7317 677873 1345493 1131687 255359 961993 594068 -379056 -5422 150245 41612 -263397
7307 -263397 -278945 -431243 -130079 -547175 -56729 155294 -151165 -515371 -74711 144262
7297 144262 8609 209202 -188030 3916 -230542 67258 420874 232173 -392732 -143390
7287 -143390 413488 -492 152444 842134 695781 144685 176934 5814 -153545 -139996
7277 -139996 766122 -101246 -266879 -202280 254993 197513 554210 702328 763466 534294
7267 534294 235224 569434 176667 6723 -418836 23337 -618455 -890723 -1139839 -1180716
7257 -1180716 -1307254 -752131 -539296 -213223 -13890 -237895 652899 224618 131854 280589
7247 280589 651954 206805 -91038 -1027046 -1506838 -1070504 -1111264 -1470700 -1223121 -391137
7237 -391137 -298666 -169208 -166442 316658 -315685 199743 293583 428052 -66760 -324921
7227 -324921 -3946 -52589 -464943 -1239207 -981554 -816123 -723574 -212975 304332 -191745
7217 -191745 -200901 -103004 -418930 -716603 -647248 -693946 -603466 -603145 -812652 -142007 -572612
7206 -572612 -838763 -222656 -196548 -684529 -33576 -409365 -406382 -458980 -713198 -1369196
7196 -1369196 -1452021 -986768 -791335 -382011 -650078 -893307 -640842 -657372 -719960 -734403
7186 -734403 -743698 -558087 -278646 -58400 -271529 -484131 -150522 -469308 -1147462 -935020
7176 -935020 -626791 -1128946 -946561 -1070403 -1452190 -1124051 -841673 -1038857 -547515 -322062
7166 -322062 -571988 -399687 -365000 -749316 -605479 -515570 -564413 -137203 -983767 -800466
7156 -800466 -539892 -965386 -1229489 -662060 -991927 -1095495 -392649 -827578 -1515794 -590949
7146 -590949 -330005 -948252 -711636 -754759 -1119735 -958762 -893509 -929351 -715230 -407138
7136 -407138 -229295 -147029 -551337 -1033381 -1358957 -937299 -1223070 -1673941 -980477 -1104935
7126 -1104935 -2107096 -1523318 -1094078 -1397988 -1242186 -324142 -462626 -1244929 -790783
7117 -790783 -207272 -271141 -567220 -808786 -759371 -1204522 -1649837 -1460063 -1447069 -1393181
7107 -1393181 -987571 -1044052 -987769 -842981 -1008426 -990852 -287107 -580264 -616617 -161947
7097 -161947 -268464 -350787 -125908 -402841 -527607 -763269 -856960 -1068011 -583032 -280560
7087 -280560 -959381 -1113681 -674294 -1136824 -1539080 -1360813 -778570 -983976 -818252 -411037
7077 -411037 -460367 -97361 -82857 -19805 76526 -124245 -641377 -323253 -403262 -584189 -228968
7066 -228968 -558213 -1220940 -998709 -625275 -958626 -774736 -418647 -1059475 -676437 10644
7056 10644 -131559 -19048 43111 -641777 -837927 -664702 -356066 -1232653 -424697 -594262
7046 -594262 -1182762 -878985 -418230 -1100304 -1734629 -905686 -370259 -855058 -948849 41786
7036 41786 3395 -372598 -402114 -215017 -52559 -297869 -462996 -625035 -464623 -1252806
7026 -1252806 -1062277 -699349 -734351 -1147470 -571706 -740186 -806973 -694319 -685729 -646615
7016 -646615 -781528 -240849 -688086 -975061 -921936 -503520 -1267587 -1495503 -1121113 -962103
7006 -962103 -1212727 -452387 -508166 -1032636 -754159 -1322468 -1418904 -1178314 -1468697 -1341369
6996 -1341369 -971617 -1104759 -1002305 -852156 -1564686 -1685287 -1006561 -772992 -806030 -86106
6986 -86106 505806 -33035 -825775 -488975 -509943 -597671 -138475 49308 -510560 -902414
6976 -902414 -1087647 -569767 -370181 -901109 -812500 -130583 -304269 -365314 355392 420633
6966 420633 216916 488586 999622 718892 480266 956 79079 -160200 12234 -148837
6956 -148837 123565 350113 384616 182317 -131375 107671 209955 231033 -33583 547495
6946 547495 540123 478948 933873 943733 294052 46268 335036 511298 299950 136727 380433
6935 380433 298685 -115269 -745838 -312502 48510 -173036 -528626 25685 -332457 -719664
6925 -719664 180828 184347 -42420 -282536 -132165 -283056 -235330 -673778 -1330416 -1171098
6915 -1171098 -667153 -925702 -1025069 -1006799 -1108328 -1131742 -1354239 -997544 -810220 -1115790
6905 -1115790 -678434 -232697 -298511 -619494 -645877 -630411 -539249 -446896 -961994 -1095376
6895 -1095376 -1167965 -891275 -661042 -863273 -903236 -683321 -498875 -868431 -841894 -932782
6885 -932782 -1034761 -825525 -787167 -645020 -460167 -459922 -512110 -443889 -461695 -843961 -946951
6874 -946951 -1011613 -1034703 -1017400 -820324 -168204 -361621 -562271 -742169 -1131239 -1680386
6864 -1680386 -1111944 -469213 -612574 -639329 -908180 -691674 -677949 -629203 -998514 -830192
6854 -830192 -658780 -802154 -652411 -786500 -755675 -580268 -329266 62660 -210794 -806674
6844 -806674 -454492 -927808 -1035724 -541689 -710714 -1275152 -854626 -74629 -504601 -689846
6834 -689846 -580634 -455756 -584799 -296327 -93201 -398222 -1104332 -267441 -371306 -1243804
6824 -1243804 -938806 -748965 -1017765 -1754409 -1824677 -1211566 -884711 -1127801 -1088056 -895187
6814 -895187 -986172 -853196 -471737 -493569 -309895 119986 18152 -409630 -671597 -386592
6804 -386592 -546507 -1081627 -1101037 -833201 -1350300 -1544679 -1421598 -892517 -1168722 -1211888
6794 -1211888 -1301027 -1276038 -961062 -684062 -225911 -330519 -775336 -602075 -440830 -1030977
6784 -1030977 -1020768 -975906 -873925 -1026071 -315606 -540320 -1228345 -1112355 -967897 -1388124
6774 -1388124 -994594 -257616 -433846 -639343 -427997 -430061 -1158535 -815499 -1120048 -656468
6764 -656468 -701910 -960962 -1233673 -1236088 -996392 -1616974 -1224724 -1496724 -1366966 -1496888
6754 -1496888 -819090 -513601 -599763 -1099504 -458676 -543343 -841181 -556021 -322073 -562016
6744 -562016 -985504 -1271471 -1630430 -1218467 -1123389 -1318770 -1057131 -682705 -448363 -383031
6734 -383031 -412034 -1125581 -1380369 -1256885 -635481 38323 315724 -156817 -338481 -520400
6724 -520400 -597859 -804668 -1048756 -183558 -140839 197289 -22585 -707524 -575755 -1196453
6714 -1196453 -1257782 -595117 -415355 -503090 -533883 -794902 -925149 -1143731 -634163 -532008
6704 -532008 -579330 -614059 -62892 -191387 -607904 -868072 -1034758 -867947 -650535 -340364
6694 -340364 -436062 -473494 -789152 -754320 -429849 -449822 -674944 -618387 -627998 -426285 -201612
6683 -201612 -360503 -194104 -575023 -723843 -302719 -10629 48972 50921 251436 -120820
6673 -120820 -117837 -319453 -403759 -420468 -440929 -457242 -14518 -473259 -777275 -434108 -63747
6662 -63747 -428117 -457441 -232253 294590 532467 781536 627408 144254 186840 20154
6652 20154 -104922 471271 64693 -385613 -180793 -176122 -591829 -734536 -391687 359536
6642 359536 287055 201526 655715 534091 109535 -37045 -242640 -340176 -347100 -479059 -807426
6631 -807426 71401 -373123 -267093 -238859 -111877 -715253 -726564 -564506 -153836 80250
6621 80250 88999 571712 200606 -132635 -34192 223704 137012 447872 658147 267034 76043
6610 76043 -161290 -405814 -158764 290331 483466 880303 649595 672654 235761 33822
6600 33822 139461 374486 132922 26604 530219 196240 178654 405289 716780 238996
6590 238996 401553 64138 269288 520240 333236 207761 -53459 105887 889894 906874
6580 906874 751759 1079431 872791 683266 1448713 1343697 1536208 1853331 1445702 1604289
6570 1604289 2127142 1696165 2000977 1788750 1854610 1917581 1866993 1551216 1842041 2255592
6560 2255592 3027358 3123710 2792128 3032825 3122247 3057623 3110163 3322708 3605342 3577630
6550 3577630 3381893 2859917 2822952 2329905 2337230 2521333 3146717 2893282 3063598 3016290
6540 3016290 3033054 3052406 3116597 2897596 3095469 2794598 2497984 2343308 1972533 1816469
6530 1816469 1664742 1568420 1429354 1920221 1607858 1771706 1804744 1395654 1376497 1283752
6520 1283752 632652 1274420 1658115 1017838 852412 1001150 854936 193806 549629 1080604
6510 1080604 1270942 1082714 1261794 1027139 787697 1098344 1300084 1571599 1318600 1054575
6500 1054575 751925 1575417 2090664 1670181 1849884 1765601 1138824 1675070 2045413 2105458
6490 2105458 2294270 1839101 1273672 1932283 2146483 1913322 2234638 2016690 1732625 1824690
6480 1824690 2048581 2111898 1899059 2303004 2571473 2643449 2588965 3134780 3271811 3043761
6470 3043761 3071425 3325693 2538828 2752534 2887982 3158594 2523412 2670840 2991189 2976434
6460 2976434 2788086 2578532 2486749 2557153 2639319 2986591 2856291 2050393 2140712 2451369
6450 2451369 2374775 1930094 1527819 1469280 1145191 1400724 1753887 1511283 946217 990085
6440 990085 958550 964011 1156769 1031798 752051 967888 961462 986019 947946 990956 1188608
6429 1188608 727604 784203 573416 947607 1177713 1273272 1165773 857917 1202856 1325897
6419 1325897 1138270 908987 1330108 1559267 1442795 1494265 1340135 1495042 980441 1002265
6409 1002265 1601053 2064754 1563715 913361 836863 1053895 798887 1369433 1558391 1335478
6399 1335478 897413 1083793 1638112 1526584 1019499 1074200 1601764 1680155 1803441 2025445
6389 2025445 1990048 1751864 1557552 1405065 1944328 2369301 2474747 2768942 2352518 2734968
6379 2734968 3007845 3028350 3204745 3305241 3472802 3545403 4162773 4642290 4815157 4502508
6369 4502508 4124052 4331034 4170399 4122141 4625645 5185031 4934614 4735193 4956761 5330065
6359 5330065 5422083 4709815 4622501 4503941 4149346 3906556 4416567 3894788 3325265 3204217
6349 3204217 3823457 3826979 3712454 3555752 3172552 2619334 2527661 2929625 2813300 2861994
6339 2861994 2859660 3044074 3032384 2765808 2731852 2815813 2881982 2815010 3224112 3290361 3580688
6328 3580688 3190208 3140555 2731213 3156789 3503474 3792180 4008044 3689860 3678868 3902655
6318 3902655 4717424 4534736 4613245 3920276 4414954 4502323 4761111 4542285 4791782 4623957
6308 4623957 4549435 4584906 4626975 4445295 4001383 4205437 4337501 4065609 3559301 3730155
6298 3730155 3876700 3318447 3568913 4076087 3998173 3456003 3563327 3220788 2641985 2259224
6288 2259224 2580754 2359967 2669831 2174114 1533931 1168258 1296396 1518165 1451858 1600802
6278 1600802 2173958 1779129 1436501 1659880 1163872 1137112 1402912 1246732 1223855 1881341
6268 1881341 1745832 1903965 1470667 1293536 1158438 1447468 1685571 1642721 1244194 1175801
6258 1175801 1601843 1633073 1657203 1551460 1189900 843054 1319518 1505361 1491213 1475841
6248 1475841 1769387 1798940 1729053 1746108 1833745 1462003 1141514 1308072 1389002 706224
6238 706224 585188 1157154 892565 1061105 825895 1399350 1049490 1085692 775528 1061103
6228 1061103 1189773 1299054 766836 1100920 1120401 697978 811190 561740 1065774 992669
6218 992669 909957 983557 1035976 687682 499796 562236 1220190 1791484 1806364 1326486 966068
6207 966068 1184642 1169183 1657305 1464616 1273432 1351741 1376659 1432474 1363076 1475143 1722605
6196 1722605 1424037 1032622 1105934 806900 287950 508277 792582 701446 512727 503733
6186 503733 337245 238537 822434 1156685 880767 848557 1006878 1338311 964516 967104
6176 967104 1203178 1230526 709653 549160 200412 -137600 -120833 210495 612461 808209
6166 808209 262204 1068439 1055477 649060 884215 725727 507666 636612 968747 662934
6156 662934 443944 811780 1130459 563876 236231 854135 498252 -76988 313140 537809
6146 537809 -34460 465963 1512598 1556450 1604061 995954 775588 1032801 1225147 1579183
6136 1579183 1737770 1601973 1300182 1781240 2448360 2017634 1804976 1873441 2366834 2152031
6126 2152031 1814823 1510058 1420434 1211807 1515092 1347418 1170160 1312282 1714401 1620083
6116 1620083 1769012 1703772 1542514 1155961 1680668 1660100 1323898 1357592 1432860 154304
6106 154304 21737 549342 460020 67093 589796 748251 564632 872963 1438885 1307183
6096 1307183 1008849 693603 1263628 1579898 1651676 1707663 1216856 1274582 1402404 1527364
6086 1527364 1198883 1102620 1175188 1270817 1629350 1598351 1778676 1446425 1812961 2551824
6076 2551824 2860655 2179318 2020902 2010941 2125816 2858567 3019084 3013991 2473322 2321610
6066 2321610 2855118 2884897 2523327 3088323 3279021 2869364 3101921 3371490 2820470 2377307
6056 2377307 2390163 2151014 1823436 1563594 1523446 2150037 1674213 1647285 1700831 1256725
6046 1256725 1269261 1443599 888698 958362 1628641 1729142 1472988 1208806 662445 378569
6036 378569 553623 567294 1138820 1612413 1784932 1761535 1211233 1195257 632492 923784
6026 923784 1072861 1229951 911222 1313463 483818 655274 1527649 1163108 499956 939521
6016 939521 1448472 1500382 1516892 1139533 1013365 682510 847697 1704643 1769952 1090894
6006 1090894 1541695 1768383 1218298 1197913 1284300 683215 210635 1137095 1334537 1265385
5996 1265385 1301286 1320398 1079284 824409 293080 521662 854197 315526 447465 709585
5986 709585 497959 218728 333842 329842 -18863 489254 1242424 1125044 735576 675206
5976 675206 475549 476013 974276 1395141 542924 371835 602156 250137 687281 352487
5966 352487 -62616 -10083 503153 815830 636765 794457 1258555 1530949 1391236 1033011
5956 1033011 656917 311691 507999 381533 18253 -340234 -575827 -345280 -33694 18366
5946 18366 -134117 -232032 637341 926466 510136 341470 361872 489214 339683 689463
5936 689463 897146 510123 146658 383917 711867 361022 379140 847115 735924 281657
5926 281657 75862 571156 950988 -171424 192120 410562 485612 456598 914799 588301
5916 588301 428334 -147760 640064 1031182 51795 211827 511684 559548 159684 506267
5906 506267 162498 -210686 -707523 -354368 238882 -33999 -504693 -513126 60484 235446
5896 235446 171907 87591 -69188 259137 447473 711644 696138 391534 436178 86455
5886 86455 -233473 163622 56217 -140062 209306 -220 -392428 355392 199878 75397
5876 75397 -200634 14730 350059 379692 582532 60886 -109595 -669082 -180555 4871
5866 4871 -65410 79288 312092 352316 271246 716095 402738 346803 424312 602552 1046392
5855 1046392 1073817 619577 158176 294274 251314 48287 75798 926795 864818 925491
5845 925491 685544 808720 981616 1171546 747365 277556 746270 283412 -489855 463711
5835 463711 314910 -528149 -415527 -245754 -543132 -130563 574259 118536 69272 304612
5825 304612 433539 436577 860964 545199 103181 -67289 727718 1083752 816170 397487
5815 397487 -73866 -153855 -41608 253566 287603 169612 218561 326432 340268 1047396
5805 1047396 711024 1102524 1335739 796118 341140 658237 1127142 325232 104464 376992
5795 376992 528090 172004 410903 -175084 -509571 -24867 538841 357215 112036 85288
5785 85288 -379488 -17032 639113 785078 520009 513954 398667 709330 925967 812936
5775 812936 474841 321985 400872 236612 205400 -4512 186206 -90368 308142 516327
5765 516327 621057 575068 953157 1094597 1073996 408259 846964 1323650 1097097 851151
5755 851151 922713 486004 506757 750566 979757 1022995 451724 -345694 -168835 38196
5745 38196 -180058 490186 1467850 737239 230402 316220 499038 469808 656507 877557
5735 877557 933317 1095737 1744834 1619583 978002 497047 359649 667136 959497 769628
5725 769628 -214997 40282 848382 861385 623429 391275 604052 650445 421360 893727
5715 893727 937967 517897 590282 1466050 1103557 715988 -102869 154721 264674 197261
5705 197261 -119045 72790 55938 -562796 -465863 -59330 -319062 -509092 259872 213589
5695 213589 -228612 -33933 340445 945384 670933 847276 839999 731225 985860 1187642
5685 1187642 665629 985927 1159885 1119207 1015887 982588 1100337 1126609 1179749 1069249
5675 1069249 1053494 745166 740823 1117308 1437339 1488256 1514692 751057 1045472 1557251
5665 1557251 1052593 428209 285623 273803 -397509 192228 392068 -36421 163607 481452
5655 481452 364829 516511 979952 1146422 995662 1300065 1172871 1552835 2306695 2039590
5645 2039590 748825 996904 1166522 801622 1189715 1512461 854229 602812 408830
5636 408830 662762 792347 466271 925635 1425959 1435058 1519749 1788350 1222788 1389005
5626 1389005 1351587 959286 888295 1420433 843808 828357 1532512 520914 336971 1702863
5616 1702863 1558514 1113558 1599712 1438059 1136945 1845643 2197642 1350190 1193831 1834755
5606 1834755 2043687 2094593 2043172 1802721 1650950 1690090 1468833 1684398 1790606 1592096
5596 1592096 1268820 1231062 835847 1115613 1911527 1251708 578796 1008945 1606450 2025615
5586 2025615 1729337 1519494 1526294 1529916 1270881 1835213 1963524 1653840 1536601 1794266
5576 1794266 1888194 1948068 1950466 1199976 1054693 1695937 1545795 981231 1549383 1903702
5566 1903702 722577 1056816 1767062 1691522 1384740 1554751 1306004 1141466 1356938 1373954
5556 1373954 1449011 1680105 1620082 1484927 1932150 1534791 1673500 1637917 1311856 1010955
5546 1010955 996534 1308752 781443 1024044 1613102 1095980 893933 1564170 1791241 2111734
5536 2111734 1895522 1690336 1416347 1788980 1777936 1548566 1562969 933808 1173696 1697687
5526 1697687 1689887 986245 1251944 1410583 1612801 1776819 1723513 1750001 1951357 1783670
5516 1783670 2198212 2567246 2196175 1904007 1647643 1405715 1049529 1753377 1817884 1822652
5506 1822652 1441549 1217838 1240513 1435003 1695129 1741524 1720557 1325071 2010550 2319096
5496 2319096 2247387 2395226 2331244 1970771 2059541 2269368 2312544 1911954 2253050 2100020
5486 2100020 1715172 1488221 1391978 1752264 1981532 1772314 1537015 1985814 2455567 2046825
5476 2046825 2601940 2999104 2199665 2584999 3312085 3310468 2090075 2521971 2840966 2133479
5466 2133479 2287348 2156510 1701806 1678953 2337461 2625727 2382710 2158349 2340833 2626266
5456 2626266 3076673 3163295 3659988 3529474 2940450 2562860 2201726 2210656 2089780 2090513 1881016
5445 1881016 1470174 1318643 1372212 2104756 2719503 2490842 2353134 2532046 2830758 3093608
5435 3093608 3157290 2965013 2403295 3135888 3400743 3216549 3061200 3155336 3093497 3120913
5425 3120913 3104539 3713778 3352966 3083756 3534610 3907401 3852898 3666806 3906574 3744399
5415 3744399 3629976 3397357 3811036 3688921 3562731 3613316 3525156 3499602 3549744 3780049
5405 3780049 3940627 3317249 2849233 3034056 3152749 3059162 2957494 3195177 3145961 3189769
5395 3189769 3479252 3410569 3547600 3891639 3594541 3856555 3795659 3874816 4245494 4144110
5385 4144110 3502620 2688119 3392196 3399767 3243366 3499707 3541936 3066202 3584163 3903616
5375 3903616 3576626 3555384 4213914 3730910 3742146 3757860 4016322 3887503 3534146 3525333
5365 3525333 3707871 3494822 3048294 3892202 4255397 4052334 3369677 3317984 3308942 3564655
5355 3564655 3490363 3397141 3479043 3558635 4112480 3669801 3386781 3263914 3763285 3680939
5345 3680939 3478904 3296744 3299068 3677570 3864646 3870458 3819529 3679086 4047866 4445364
5335 4445364 3657066 3524439 3843395 3549410 3653867 4036384 3845053 4037403 4380945 5030373
5325 5030373 4927612 4890550 4479180 4777521 4816198 4533262 4788784 4898915 4352426 4313734
5315 4313734 4536699 4268662 4629223 4629958 4695438 4462248 4981958 5471000 5371563 5276100 5689934
5304 5689934 5888704 5086340 5435033 6117838 5382588 5147518 5499455 5401770 5124204 5119601
5294 5119601 4958282 4485773 4683817 5070444 5687378 5461197 5775763 5880273 5546975 5758107
5284 5758107 5784015 5937243 6042284 6483121 6114083 6379546 6475336 6456900 6108802 5826624
5274 5826624 5879480 5945788 6410894 6183270 6447081 6314949 6601068 6228934 6694620 6870350
5264 6870350 6511469 6754671 7198305 6855684 7128477 7856054 6981253 6842662 7240189 7275264
5254 7275264 6112747 6540255 6902282 6741498 6578592 6970089 7194506 6983094 7068695 7550382
5244 7550382 7576633 6894192 6996582 7476183 7703472 7670379 7569348 7131612 7400189 7357506
5234 7357506 7637495 7234332 6981461 7621508 8094238 7752479 7919803 8596119 8018467 7973471
5224 7973471 8428073 8284339 8016924 8392548 8376997 8213983 7447093 7747856 8184226 7668051
5214 7668051 7708834 8147058 8782860 8704860 8668010 8772732 8937751 8434928 8884116 9472379
5204 9472379 9419867 8790654 8790856 9317408 8576494 8067510 8494524 8422046 8631684 9267924
5194 9267924 9157493 8860969 8621719 9296755 9409057 9090813 9508750 9855264 9487349 9955437
5184 9955437 9647276 8786524 9368154 9631035 9849088 9867504 9770919 9778421 10255295 10043143
5174 10043143 10195664 10640617 10241512 10299899 10762372 11388660 11429971 11905149 11526824 11467405
5164 11467405 11028866 11738124 12192050 12050391 12155424 12014904 11582366 11273682 11785833
5155 11785833 11613809 11467007 11826272 12041311 12016142 12144639 11940968 12046572 12093726 12101392
5145 12101392 12409058 12622059 12440905 12310663 12223925 12001255 11855618 11852444 12428071 13295058
5135 13295058 12654379 12490408 13528496 13479532 12932562 13506241 13836364 14114619 14259088
5126 14259088 14985506 14850482 14940488 15059254 15051458 14953010 15273688 15017013 14889999 15075550
5116 15075550 15851282 15755866 15809420 16271606 15780624 16082326 17159229 17233862 16983942 17301432
5106 17301432 17749852 17368349 17033769 17167439 17131871 17366807 17424664 17299211 17182691 17313134
5096 17313134 17645883 18029261 18159123 18074141 17882567 18497986 18801420 18903968 18417077 18930473
5086 18930473 19165274 19535072 19698041 19900459 19895446 20464121 20505207 20613931 20260397 19961424
5076 19961424 19963891 20493526 20941254 20572002 20929989 21509181 21762848 21675552 21571043 21962449
5066 21962449 21880289 21855146 22536401 22964543 22766295 22497174 22885727 23157877 23017829 23019529
5056 23019529 23086932 23877710 23468598 23342322 24165867 23994119 24060241 24648163 24417506 24271244
5046 24271244 24563527 25033128 25268270 25037276 25132953 24712289 25378724 25460268 25350224 25381521
5036 25381521 25554508 25821865 25503822 26149487 26433281 25999813 26390129 27168060 27176404 27110385
5026 27110385 26887060 27670642 27751358 27429897 27711123 28861826 28989799 28807732 29281718
5017 29281718 29305763 29247933 29751765 30580741 30745728 30742706 30492453 31040298 31418461 31285546
5007 31285546 31968456 32412716 31450976 31645378 32151764 32061444 32348991 32838058 33109465 33355671
4997 33355671 33300448 34099963 33946216 33948075 34512438 34800160 34534836 35335490 35790598 35041325
4987 35041325 35392760 35876250 35892067 36773872 36976331 36475880 36857019 37941038 38723076
4978 38723076 39428145 39966423 40250346 40707223 41027134 41961319 42752446 43994490 44102847
4969 44102847 44635128 45737187 45972662 46099179 46948097 47483963 47798123 48040432 48554892
4960 48554892 48278978 47450758 47454731 46693777 45857600 45615709 45684813 44920295 45086175 44644255
4950 44644255 44008415 43404532 43362004 43467726 42680822 42395419 42309066 41713580 41127313 41437104
4940 41437104 41503885 41060794 40929581 40451668 39711957 39450913 39613653 39799843 39566606 39073482
4930 39073482 39286754 39508667 39812645 39237472 39103567 38853311 38561127 39158433 39655319
4921 39655319 39033477 38666555 38624098 38637885 38691643 38505173 38896274 38032667 37782051 38541713
4911 38541713 38971981 38653019 38977019 39223107 38508367 38440639 38729935 39172819 38610287 38556407
4901 38556407 38941058 38816227 37988286 38144590 38198389 37479814 36980058 37520735 37937720 37571100
4891 37571100 37665292 37409442 37152702 37110214 37844801 38007852 38466957 38463890 38508985 38159657
4881 38159657 38057391 38387958 38599261 38209782 37774461 38164114 37876659 37315588 37153157
4872 37153157 36895138 36209166 36011696 36038901 36332565 35882913 35390958 35615544 35664458 35878591
4862 35878591 36167626 36071192 35542887 35424580 35589507 35931384 35383866 36361721 36505613 36166772
4852 36166772 35809257 36351690 36297306 36431890 36917581 36812314 36541121 36759431 36948871 36792251
4842 36792251 36615562 36558347 36943838 36825582 37158006 37449822 37480511 37658475 38505033 38655278
4832 38655278 37968252 37726389 37818759 38036049 38304559 38739975 38886172 38550041 37764374 37970880
4822 37970880 37507736 37267672 36950432 36878302 36544904 36168564 35621943 34967852 34601083 33737553
4812 33737553 33394531 32591162 31948723 31708187 31473752 30318734 30084410 29729092 29100217
4803 29100217 29391841 29636306 29079169 28357712 28577213 28287459 28198474 27471043 27192630 27909911
4793 27909911 27484041 26594285 26829447 27070993 26163098 26016509 25933216 25645485 24847376 25107257
4783 25107257 25521064 24864341 24168548 24270553 24185647 23911841 23653263 23706881 23668099 23624516
4773 23624516 23321361 23491202 23118003 22148412 21854499 22496693 22344050 21993406 21780824
4764 21780824 21714191 21031990 20598058 20614566 21107038 21315738 21033438 21313428 21020147 21006704
4754 21006704 21472329 21502206 21785783 21748643 21465076 21121540 20905541 20594549 20525400 20440735
4744 20440735 20194150 19994952 19853692 19351407 19359228 19516875 19313128 19763729 20346775 19689802
4734 19689802 19271515 19931148 19737734 19067080 19088614 19283481 19213018 18786015 18424253 18382424
4724 18382424 18754574 18847416 18468814 18694803 18724727 18483989 19169895 20216128 19897742 19629529
4714 19629529 19763793 20058231 20343868 20620294 20733189 20220478 20021083 20229441 20094608
4705 20094608 19720585 19506593 19399734 19840579 19803998 20072765 19911387 20227490 20176349 19793234
4695 19793234 19843875 20607864 21464528 21500916 22119686 22255311 22285241 22461907 22965357 23001649
4685 23001649 23206093 23587288 23813067 23363897 23064799 23106338 23124358 23011298 23390454 23615373
4675 23615373 23243385 23477496 23487551 23550764 24379853 24642586 25036534 25616027 25118557 25240278
4665 25240278 25850972 25959263 25370403 24648392 24715530 24587884 24863661 24583743 24580351 24791037
4655 24791037 24688340 24330927 25464668 25593019 25257582 25575768 25635067 25669573 25543926 25591413
4645 25591413 25091072 25089993 24741167 24468461 24893872 24553687 24197353 23737167 23150347 22167514
4635 22167514 22624340 23167992 22555182 22825040 22963729 22858010 23266073 23218201 23124708 22564348
4625 22564348 22610983 22093022 22109092 22266308 21952255 21096979 20692888 20538060 20128817 19846260
4615 19846260 19664431 19401253 19399196 18848420 17952420 18377709 18117201 17970843 17791378 17413248
4605 17413248 17330742 17696265 18492460 18041782 17075413 17312294 17522714 17637073 17693528 17707678
4595 17707678 17499848 16881607 16291011 16314939 16476292 15782375 15752077 15625930 15744385 16157504
4585 16157504 15878704 15595005 15710724 15459900 15107668 15714858 15837022 14945250 14566205
4576 14566205 15056465 15177432 15501552 15638844 15817590 15822814 15385381 15880631 16746562 16547993
4566 16547993 16191046 15538716 15657662 15652174 15410653 16118991 16477616 15959207 15903101 16230227
4556 16230227 16249198 16346502 17615356 17853757 17546612 17580192 17859632 17978625 18472318 18301860
4546 18301860 18041419 18673360 19509073 19640593 20022306 20082500 19964948 20249348 21245078 21873826
4536 21873826 22220289 22255065 23319008 23800642 24286539 24885878 25603043 26287263 26656390
4527 26656390 27411250 28105821 28424095 29427785 29692437 30118057 30470792 30831862 31206350
4518 31206350 31584562 32702128 32197197 32251139 32858406 32965791 32827068 33645017 34104349
4509 34104349 33995095 34685141 35157594 34781254 34217742 34305519 34111952 34318573 34896333 35897274
4499 35897274 36070760 36019749 36727682 36867739 37152084 38044423 39240213 40071691 41100957
4490 41100957 41717164 43211298 44312046 45692226 47042990 48290104 50212260 52276629
4482 52276629 55198329 58250848 61252612 64755671 68418395 72711116 77202151 82225413
4474 82225413 87278332 92214327 97082567 101863108 105988409 109448226 112431061 114144150
4466 114144150 113715240 112802061 110281756 106715547 102475466 98582457 94177466 90156984
4458 90156984 86450965 82297424 77608346 73614845 69739775 66536552 63959115 61741000
4450 61741000 59895278 57904915 56788982 55538505 54203335 52923301 51581766 50566317
4442 50566317 49345410 48563755 47399515 46060614 44439065 43136506 42436000 41496271 40678531
4433 40678531 40091486 39392339 38606843 36951927 35973523 35819721 34564561 33869833 33970748
4424 33970748 33574436 32445732 32031210 31704626 31049796 30400028 30683445 30669014 30299079
4415 30299079 29387158 28820643 28932755 28953305 28991507 28360866 27892050 27398642 27586779 28127624
4405 28127624 27743235 27811171 28199314 27382345 26665879 27109873 27620009 27452595 28069479 29163233
4395 29163233 29708916 30022750 30704161 31742991 32853803 34262826 34974976 36854273 38990970
4386 38990970 40662946 42424241 44431802 46975616 49999732 53284908 55733505 57468498
4378 57468498 58443790 58508320 57695629 56842593 55363299 52689891 50163740 47137548 44577312
4369 44577312 42838815 41327501 40427697 40156869 39384144 39254078 39228425 39505208 39904514
4360 39904514 40870504 42116873 43924578 45933014 46837436 47854450 48418334 47638714 47106971
4351 47106971 47404371 46881723 46135016 45741797 44686620 42818908 41041816 38655437 35441512
4342 35441512 33272451 31119688 29571806 28234038 26982678 25162095 24398606 23847926
4334 23847926 22705018 22169944 21428752 20522277 20506954 20380045 19338337 19115456 19083133
4325 19083133 18099150 17878906 18575802 18446650 18265247 17274100 16596214 16383826 16038326
4316 16038326 15685794 15292372 15314133 14683499 14400567 14354127 14229277 13705972 13976187 14020956
4306 14020956 13551301 13892113 13752763 13738132 13634607 13781213 13213434 13309065 13324868 12834902
4296 12834902 12544459 12708440 12432209 12971202 13134400 12616826 12481675 12409956 11829127 11399204
4286 11399204 11448186 10771468 10776762 11325667 11271863 11047547 10913065 10698742 10874150 10712024
4276 10712024 10417680 10397468 10057621 10017688 10058878 10083563 9824710 9512557 9259125 9349572
4266 9349572 9290689 9320110 9000946 8649597 8533301 8633086 8528874 8138109 7626829 7590371
4256 7590371 8213396 7900661 7870297 8289534 8957580 7885593 7621763 8704873 8352116
4247 8352116 8141261 9033750 8762880 8014893 7958315 8413802 8629669 8597719 7993322 8283900
4237 8283900 8814101 8174466 8241223 8537535 7804789 7963274 8061109 8531289 8820602 8710472
4227 8710472 8444146 8374487 8387401 7975096 7815432 7567335 7412180 7842250 7644608 7363547
4217 7363547 7529956 7684099 7725724 7034652 6838562 7396670 7495695 7413857 7649527 7506858
4207 7506858 7570516 8048255 8356145 8139734 8459386 7810723 7829541 8299889 7998536 7617293
4197 7617293 7746928 7613852 7296793 6917325 7237882 6980313 6963552 6790917 7157115 7439136
4187 7439136 7309444 6995254 6954472 7127053 7341289 7436510 7068244 6929239 7036764 6786608
4177 6786608 7092192 6979082 7206043 6855915 6294990 6346705 7484621 7427468 6963834 7487231
4167 7487231 7211989 6866980 6882334 7803312 7854207 7134333 7141735 7228559 6970018 6425210
4157 6425210 6575767 6708192 6411398 6668688 7261450 6903289 6457315 6490460 6509639 6604362
4147 6604362 6114255 6608287 6830033 6727594 6552226 7114738 7330383 7151332 7762658 7781886
4137 7781886 7362378 7284478 7165404 7435224 7338323 6552802 6292898 6789010 6715210 6764791
4127 6764791 7007159 6881092 6531685 6529947 6206113 6356576 6529576 6658623 6225547 6114681
4117 6114681 6479552 6572338 6164084 6081581 5858364 5902702 5673636 6023296 6166606 5782024
4107 5782024 5349570 5935383 5967512 5790934 5959397 6393496 5852320 5310252 5899108 6126262
4097 6126262 6045205 5909941 5954957 6116488 6353513 6619010 6655398 6124318 5592186 5652902
4087 5652902 5882163 6392656 5957235 5298437 5103678 5280253 5073207 5139181 5636716 5601908
4077 5601908 5429797 5763970 6127343 5828924 5842701 6442904 6497324 6260334 6586290 6098709
4067 6098709 6394588 6708392 6264068 6375106 6848660 6597938 6864668 7318782 7303821 6913143
4057 6913143 7135678 7593815 7768358 8095169 7604070 7589880 7953629 7234975 7112368 6999313
4047 6999313 6693511 7039719 7362944 7174216 7173083 7200490 7142919 6433585 6211443 6119889
4037 6119889 6552062 6647974 6571846 6637136 6312934 6499429 6563065 6308626 6525857 6616047
4027 6616047 6896765 7352186 7251115 6954907 6937194 6699367 7516215 7717760 7456958 7274427
4017 7274427 6939860 7242894 7200869 7195376 7212207 7461435 7525129 7718224 8490633 8114634
4007 8114634 7432647 7551111 7688976 7639326 8210715 8431962 8270548 8247660 8391864 7830910
3997 7830910 7860861 7756092 7808511 7797663 8003165 8306394 8820522 8423901 8266231 7635454
3987 7635454 7468107 7737861 8103325 9246076 8856350 8542707 8667362 8724539 8053889 8272381
3977 8272381 8512671 9112594 8878589 9079683 9112934 8312943 7929406 7624270 7947438 8140268
3967 8140268 8204507 8370567 8440220 7742035 7725641 8067939 8054302 8312735 8727744 8405203
3957 8405203 8166956 8504665 8600926 8714819 8225099 8287786 8224318 8039132 7796759 8510504
3947 8510504 8255403 7795173 8279351 8543163 8308200 8446895 9330678 9159903 8863247 9086776
3937 9086776 9192796 8975530 9108372 9703617 10184379 10044573 9958834 10370291 9900153 9382685
3927 9382685 9672180 9756287 9580878 10033957 10599987 10348906 9479794 10143150 10827264 10452738
3917 10452738 10209739 10811753 10210902 9838379 10482767 10443320 9672737 9519274 9938667 10010523
3907 10010523 10338672 10165307 10473550 10298819 10479205 11245931 11955811 12168943 12516818
3898 12516818 13068070 13698138 14336120 14542966 15555748 15001955 13712513 13140811 12847043
3889 12847043 11874305 12103080 12303668 11698647 10532808 10440826 10564412 9901935 9612787
3880 9612787 9636432 9189939 9191737 9521745 9284093 8898861 8750654 9058578 9462361 9243411
3870 9243411 9123966 9592078 9089594 8684358 8783910 9424969 9417921 9436543 9578127 9206698
3860 9206698 8853419 9298709 10044432 9837953 9223769 9680687 10589044 9924113 9793575 10724829
3850 10724829 10303035 9622184 10526225 10922192 10443043 10605842 11112792 11096584 11305954 11933111
3840 11933111 11723331 11304875 10937294 11389652 11638673 11528469 11566700 12100806 12227501 11676370
3830 11676370 11700700 12490161 12205568 11516865 11859816 12552665 12273616 12049927 12659144 12875100
3820 12875100 12852587 13207417 13487488 13381980 13205750 14121285 14675045 14467020 14535017 15911593
3810 15911593 15797317 15126160 15857611 15899537 15685720 16403952 16368609 16195827 16421108 16782486
3800 16782486 16954740 17564960 17677855 17331707 17694592 18187311 18698693 19272366 19324709 19221614
3790 19221614 20029316 20275253 20204326 20689104 21037529 20907569 20080753 20567982 20282198 19764587
3780 19764587 20616726 20804985 20705388 21391268 21787699 22235615 22371970 22541396 22556581 23016594
3770 23016594 23749882 24019092 24725401 24924953 25078256 26198838 27391716 27893409 28268945
3761 28268945 29142853 30650407 30988580 31521601 32475234 33428258 32602545 32335125 32347974
3752 32347974 31683319 32022673 32782451 32823724 33209129 34153781 34980817 35575353 36181841 36566418
3742 36566418 37222697 38767227 40116362 40341646 40327232 40564375 40126986 39634675 39946844
3733 39946844 39819191 39640309 40335113 40562216 41188519 42750569 42988182 42071648 42604792
3724 42604792 43342718 43515727 44446605 45048161 45083548 45350948 46997201 47330670 47722132
3715 47722132 49188057 50355800 51325705 52348267 53839486 55492431 56950853 58418417
3707 58418417 60138538 61215226 62761581 65115012 67434918 69531471 71215542 73338703
3699 73338703 75394488 77313351 78494893 80009663 81543356 82837991 84019404 86765142
3691 86765142 89814182 92668946 95619228 99457446 102739820 106491203 110721324 115160773
3683 115160773 120538629 125537396 130586485 135532123 140316041 144793217 149815205 155102221
3675 155102221 160022201 164760178 170450698 175527225 180017140 184389352 187938996 189069874
3667 189069874 188390816 186333087 181890378 176170682 170490805 164202728 158134904 151881746
3659 151881746 145550633 140855199 135888148 129952710 124686692 118692997 112216338 105909843
3651 105909843 100837210 96073108 91907185 88194601 85440360 82621482 79511101 77872012
3643 77872012 76542551 73842431 72141089 71179253 69680086 68476596 67650645 66170430
3635 66170430 64255244 63090331 61664226 60566588 58998120 58112781 57571690 55896042
3627 55896042 55102588 54757831 53695870 52812504 52378488 52049532 51540168 50620957 50047702
3618 50047702 49646191 49149030 47522452 47598037 47285015 46444442 46257812 45982359 45598735
3609 45598735 44679575 44786691 44840444 44140957 43642179 43860566 42899994 42081179 42142021 42216283
3599 42216283 41488010 41211783 41577185 40737331 39532352 39585248 39906875 39273763 38635380
3590 38635380 38666400 38464057 37462929 37161686 37214066 36954891 36315190 36468717 36698661 36318710
3580 36318710 36165052 36494636 37251434 36817265 37035837 37634291 37946222 37309077 37526303
3571 37526303 38435149 38589363 39140358 40557226 40961209 41476888 43068675 42952968 42066003
3562 42066003 41424291 41001023 39517952 38830686 38428869 37225412 36378652 36100771 35324767
3553 35324767 35130879 34499526 33818370 33394695 33496997 33474600 32727981 32632810 32411896 32379105
3543 32379105 32289575 32258000 32354076 32648585 33177292 33619594 33789506 33877737 34200025 34124002
3533 34124002 34999156 35635157 36282530 36887313 37836233 38175455 38429513 39366648 39095486
3524 39095486 38856590 38160600 36931640 35643896 34930894 34158690 33412848 32798096 33335043
3515 33335043 32941405 32770643 33235657 33422331 33057097 33292113 33683005 33567933 33833712
3506 33833712 34042921 33974696 34157290 33670040 32834665 32216991 31227388 30256904 30220721 30496639
3496 30496639 30328141 30049936 30479740 29603954 29598410 29583699 29885699 29787528 30213839 30643121
3486 30643121 30969354 31136804 31570999 31930805 31751660 32100364 32700850 33067275 33216931
3477 33216931 34398732 34933858 35092416 34860326 35436282 35656956 35518843 35577051 36046915
3468 36046915 36382418 36321399 36232103 35802639 35167881 34653365 34446388 34463561 34282873 34108138
3458 34108138 34424605 34363420 33591747 33634162 33878202 34322856 34982406 36083307 36381113 36937046
3448 36937046 37495313 38357223 39297336 39552774 39779231 40981412 42062957 42801080 43933619
3439 43933619 44346952 45033924 46378939 47648241 48521261 49475137 50876256 52046194 53678601
3430 53678601 55287738 57143405 59467816 62318082 64966590 68257530 72459692 77007383
3422 77007383 81450048 86997262 93030029 99010655 105872345 113816793 122609003 132135829
3414 132135829 142559653 154832023 168759467 185213860 202005810 217167163 227924373
3407 227924373 229388580 219966059 203156677 183538092 164773855 148593758 135342356
3400 135342356 125224072 116519844 108836333 103823614 99146110 94301856 90833068 88152462
3392 88152462 85297450 83255791 82313401 80539273 79417484 78723764 77506483 76917967 77176700
3383 77176700 77100270 77810097 78951828 79054609 79879307 81489411 82388919 83174704 83718172
3374 83718172 83532447 81487882 79498283 77663307 75327530 73369225 71290237 69168973
3366 69168973 67644491 66489363 65339890 64685426 63651630 62401533 61858816 61334193 60703984
3357 60703984 60349913 60331532 59835334 60527763 60622719 60590857 60548539 60662723 60400390 61325368
3347 61325368 61959221 62345552 63608754 64126366 63981783 65299617 66996260 67748684 69514521
3338 69514521 70956415 71281772 72585745 74007588 75438945 76877180 78687186 80160348
3330 80160348 81909561 84276086 87085856 89130769 91383273 93813180 96764044 100754019
3322 100754019 104420220 108287218 112210360 116471682 121732945 126988209 132433526 138391672
3314 138391672 143742818 150113575 157422106 164744422 171905207 180313465 189180909 198003927
3306 198003927 207705008 219359504 231917140 245003069 259400303 272425958 281845327
3299 281845327 288887948 290943682 286208583 277119086 263299079 246461344 229467816 214060101
3291 214060101 199221715 186312069 175649793 166296132 158209514 150759210 143893902 137035695
3283 137035695 130833874 124822782 120912685 116697134 113076190 109682473 106967915 104311143
3275 104311143 102011587 99970006 98840486 97738968 96715741 95263702 94405253 94331352
3267 94331352 93323466 92390300 91494380 90124653 88445213 87366521 85406896 82304317
3259 82304317 80136621 77423328 74581027 73378023 71520145 69117506 67614245 66474512
3251 66474512 65217818 63954170 63354710 62085818 61785030 61349942 60231805 59476274 58633782
3242 58633782 58187996 57268043 56209429 55526599 54993348 54770048 53995926 52906035 52078820
3233 52078820 51613270 51553972 50737576 50407965 49215520 48664269 48514457 48033770 47497154
3224 47497154 46712745 46130482 45389025 44903090 44885786 45147049 44297342 43960721 44233579 43757042
3214 43757042 43215341 43609913 44266026 43570952 43544465 43022881 42829676 42685188 42702641 42663567
3204 42663567 42162527 42166451 42506213 42571632 42649161 41902225 41808693 42020394 41773860 41779686 41859084
3193 41859084 40777548 40600682 40823041 40776796 40943461 41296119 41040673 39810545 40456166
3184 40456166 41189710 41117154 40890569 40755078 40318231 40025150 39479482 39305413 38888434 38307524
3174 38307524 38006062 38006604 37403806 36599563 36728696 36848800 36422702 36260641 37584490 38499050
3164 38499050 37731406 37432592 38570673 38616895 38472252 38596176 38057022 37174377 35837802
3155 35837802 34443914 33818286 32982251 32223058 32389062 32544872 31852481 31781281 31653231
3146 31653231 31337274 31644582 30715222 30156107 30418670 29885970 28925890 28626858 28227569
3137 28227569 27658920 26950011 26397032 26155772 26062397 25650926 25600445 25601093 25416514 25797168
3127 25797168 25703543 25468946 24976879 25031774 25687485 25488966 25061910 24837875 24696832 23844145
3117 23844145 24018861 24252838 23674426 23741557 23855286 23303332 23289249 23799185 23425875 22943893
3107 22943893 22869587 22858988 22864426 22823826 22551971 22100837 22098541 21668980 22040829 22664431 22394379
3096 22394379 22310517 22341295 22500699 22705059 22723975 22677462 22674056 22303241 22411800 22495181 22804656
3085 22804656 22638983 22803708 23009056 23005101 23066063 23493212 23850865 23873359 24465557 24851974
3075 24851974 25110216 25496675 25185099 25019156 25887345 25848454 25466462 25567927 25508429 25079669
3065 25079669 24978095 24946158 24948398 25352815 25803957 26268359 26892513 27212830 27524990 28656586
3055 28656586 29024170 28860303 29038292 30213576 30443527 30756891 32199898 32823476 32090081
3046 32090081 32781314 33222069 33487555 35149341 35188975 35640487 36096920 36373977 37130731
3037 37130731 38166975 38501878 39180588 39787579 40338073 40845127 41265169 41013542 40415629
3028 40415629 40847099 41216341 41595399 42322057 43132718 43371198 43608602 44732993 44984314
3019 44984314 44972835 45384221 45661907 45480579 45986858 46599835 46263762 45951495 46802961 47339915
3009 47339915 47538916 48022463 49028273 49696314 49727935 49938886 50418060 49905047 49695170
3000 49695170 50396014 50496654 50669478 51338670 51908801 52060699 52287502 52676995 53673743
2991 53673743 54818445 55503459 56048872 56867474 57081059 56939300 57477618 58236277 58562680
2982 58562680 59117266 60193683 61388585 61951232 62454959 63465984 64123502 64669302 66174127
2973 66174127 67519607 68580577 69580440 70745303 71334627 71782819 72480449 73292557 73980842
2964 73980842 75511810 76150847 76409895 77055982 77976939 78217695 77777265 78111901 78831169
2955 78831169 79174884 79790512 80090640 79298751 78551389 78988231 79110873 79144331 79701113 79148672
2945 79148672 78865495 78956539 78356099 78014023 77930726 77263640 76361052 75955988 75531213 74826864
2935 74826864 74006329 72945707 72632227 72115249 71560095 71095840 70145462 69442584 68602625
2926 68602625 67958641 67786390 66863736 65723449 65312125 64804659 63534820 62839770 62503687
2917 62503687 61347332 59959498 58554222 57855748 57269777 56505738 55483411 54618924 54010148
2908 54010148 53020195 52249181 51941310 51037885 50275074 49342929 48885040 48208297 47288829
2899 47288829 46351473 45535495 44808727 44064422 43434564 42364505 41716167 40766384 40180732
2890 40180732 39689151 39350982 38752567 38522414 37834895 36806552 35983060 35879226 35235534
2881 35235534 34535478 34750670 34373795 33684304 32760755 32522346 31509286 30681524 30435679
2872 30435679 29872669 29594208 29068469 28327225 27558177 26558914 26147034 25889377 25654414
2863 25654414 25408558 25020482 24436671 23730133 23834818 23361321 22960340 22805068 22609050
2854 22609050 22149937 21903656 21288647 21311440 20958060 20434859 20022315 20027255 19603031 19786766
2844 19786766 20698500 20678486 20006335 19882854 20190153 19927484 19564468 19309206 19698084 19842011
2834 19842011 19662719 19063537 18154049 18093460 17888411 18155100 18316377 18725042 18550531 18452920
2824 18452920 18267188 18289468 18129550 18607246 18646066 18640247 19128160 18944517 19392834 19489028
2814 19489028 19311351 18929553 19265437 19827321 20291864 20048775 20431862 19994239 19565612
2805 19565612 20609281 21722409 21763785 22165786 22285512 21974757 22362262 22222315 22591045
2796 22591045 22844064 22891948 23120679 23278494 23557937 23328791 23206160 22733189 22402046 22349552
2786 22349552 22216815 22456915 22678443 22727131 23057714 22219134 22113684 22363348 22166045 21872959
2776 21872959 22070735 21787477 21231552 21513565 21008377 20415501 20818354 21190220 20933279
2767 20933279 20442423 20802805 20610961 20224633 20670723 20910158 20421024 20806823 20971081
2758 20971081 20477064 20366235 20371373 19950254 19692810 19269631 18976290 18663399 19125693 18897977
2748 18897977 19327646 19420813 18784144 19026777 18881301 18835674 18643298 18951932 18926238 18710303
2738 18710303 18438128 18294778 18434485 18387956 18289616 18485390 17858010 18272594 18978441 18414224
2728 18414224 18368929 18711781 18915357 18562237 18601339 18751479 18719163 18522093 19230467 19344539
2718 19344539 18577345 18810913 19068781 19478904 19507597 19740556 20046265 20026719 19826417 20123249
2708 20123249 19956562 20129947 20508291 20711478 20260513 20743347 21048686 21028697 21030859 21474171
2698 21474171 21400109 21517736 22233291 22421743 22948244 23209051 22819571 22935717 23541671 23632717
2688 23632717 23822902 24222705 24906757 25013094 25500551 25882210 25815699 26311924 27073229 27449895
2678 27449895 27035793 27685781 27791389 27701443 28094167 28587899 28875226 28665280 29084324 29919466
2668 29919466 30372887 30294027 30489497 30915089 31155549 30829405 31831003 32343477 32444204
2659 32444204 32997116 33560683 33998778 33794283 34677688 35121069 35575836 36267636 36821709
2650 36821709 37726304 38824574 39012571 39641499 40435165 41066476 41820746 42645844 43558203
2641 43558203 44111832 44941647 45458863 45984458 46897057 48189721 49384162 49869492 50918812
2632 50918812 52517209 52793703 53880610 55556475 56469177 57813335 58783219 60240324 61564913
2623 61564913 62588653 63603874 65459011 66314904 67207519 69125325 70657814 72031690
2615 72031690 73931879 75447832 76333728 78132126 79645284 80826448 81847880 83259834
2607 83259834 84644428 86294265 87273153 88320410 89402840 90350165 90704890 91932151 93055012
2598 93055012 93764922 94152525 95381787 96665351 97073109 97572339 98649348 99247793 99509472
2589 99509472 100328778 100851552 100817767 101553977 102598219 102937382 103046435 103821150 104376857
2580 104376857 104490168 105216646 106331793 107017988 107719453 107999976 108881539 109917006 111802245
2571 111802245 113852690 114762253 116265578 117824188 119392734 121397197 123394994 125076950
2563 125076950 127102722 129215922 131570776 133762068 135979339 137762671 140260002 143007851
2555 143007851 145159478 148025821 150855806 154228439 156779688 159278450 161874080 163955903
2547 163955903 166484362 168812958 171080739 173559697 175747970 177480763 179323631 180435789
2539 180435789 182178302 183798150 185100985 185683465 186515123 187757780 188721988 189253911 189402991
2530 189402991 189711613 190020891 189697141 189482684 189489889 189215732 188715432 188410427 188065293 186900852
2520 186900852 186636550 186813485 186023625 185564678 184925517 184341882 182694316 181915806 181336649
2511 181336649 180520998 180076469 179655925 178652321 177431016 176599660 175332160 174171032 174127745
2502 174127745 172913431 171519353 170866241 169844436 169308523 168139835 166731171 165333199
2494 165333199 164602276 163327507 161860213 161096036 160334265 158465196 157446287 156631580 155136958
2485 155136958 154028354 152713315 151773733 150409808 148734518 147658993 146524656 144272550
2477 144272550 143028299 141978169 140132256 138841342 137638791 136054536 134553598 133618925
2469 133618925 132405720 130899212 129415434 128276539 126873128 125671346 124262847 123448520
2461 123448520 122638664 121186408 119304975 118387311 117407407 115360436 114170634 113463656 112084207
2452 112084207 110388650 109878508 108438609 107508686 106373566 104752910 103596921 102364160
2444 102364160 101298614 100519935 100279617 98243161 97117322 96488627 95390784 93689020
2436 93689020 93182975 92502302 91362218 90118004 89122869 88360242 86565862 85502870 84871362
2427 84871362 83809162 83097956 82305501 81201771 80420958 80044596 79869420 79342178 79347508
2418 79347508 78864894 78948332 79129683 78948222 79041738 79050735 79485961 79789666 80221042 80915422
2408 80915422 81208872 81388489 81963892 82315959 83001286 83854264 84929478 85308288 86056764
2399 86056764 87060839 87080368 87017072 87071247 87480792 86990490 86680392 86491438 85742429 84443117
2389 84443117 83715404 82962867 81861683 80351904 79374499 78265545 76654006 75170511 74330347
2380 74330347 72697514 70447173 69413706 67863671 65368747 63236145 61344711 59308255
2372 59308255 57651704 55359577 53553972 51909684 50196532 48648457 47899933 46744429
2364 46744429 44793892 43584112 42776506 41235564 40141776 40374216 39203778 38057326
2356 38057326 37288275 37233931 36459961 35861966 35289380 35051611 34178326 33551128 33392976 32895639
2346 32895639 32375110 31475948 31148854 30693623 30411849 29785419 29902085 29484502 29581448 30153595
2336 30153595 30133391 29124986 29116244 29503460 28996316 29088796 29238445 29595462 29021237 28693661
2326 28693661 29020385 29057057 28380749 27997446 28029543 27927984 27832202 27885603 27509770 27246382
2316 27246382 27020288 27005313 27771110 27059601 26419626 26761293 26996007 26166112 26514769 26885134
2306 26885134 26020172 25932440 26428049 26052258 25342474 25733152 26047588 25295059 25768799 26646898
2296 26646898 26842902 26455781 26583981 27250110 27178301 27744599 28186130 28220719 28062119 28348829
2286 28348829 29116266 29816546 30056978 30047547 30803837 31514083 31644972 32519839 33721203 34687706
2276 34687706 34734175 35299198 36016444 35971879 36772615 37878027 37831705 37416697 38504255 38452463
2266 38452463 37891506 38967900 39380367 39172958 39218248 39471135 39228305 38968358 39650933
2257 39650933 39831973 39777406 39948508 40405289 40713296 40531968 40411792 40655750 41120345 41497898
2247 41497898 42029379 43291570 43955043 44106862 45007270 46183279 46945718 47794778 48538108
2238 48538108 49343776 50299921 51174896 52553813 53726451 54565485 56131979 58029147 60085611
2229 60085611 62219379 64726582 67031546 70290008 73235246 76316083 80868825 84524544
2221 84524544 87878937 92305052 97967642 102946530 107848500 113586447 119381274 124720846
2213 124720846 130967844 136847597 142483886 147989999 152423150 155551796 158217702 160890570
2205 160890570 162477152 164043544 165739815 167344000 169996049 173016460 175486148 178439548
2197 178439548 181516131 184050769 185958067 187214688 186479967 184422624 181708583 177132630
2189 177132630 171313227 164938002 158425463 151518576 144820124 138988045 134525142 129373209
2181 129373209 124996800 121180869 117548503 113948442 111780415 109422682 106901185 104828695
2173 104828695 101781384 98727934 94904826 91746926 89268974 86558523 83077934 79866375
2165 79866375 77104340 73686160 70291325 68086400 66222151 63590003 61212029 59815180
2157 59815180 58106302 55772893 54226975 52666404 50880552 49313739 48512529 47354285
2149 47354285 45518348 44290112 43161180 42209450 41233922 40764867 40231882 39524885 38639453
2140 38639453 38795175 37945935 36956773 36071600 35644445 35277141 34516338 34431395 34650463 33920391
2130 33920391 33636015 33797866 33143045 32851025 33238712 32821668 32727160 33528081 33089885 33131604
2120 33131604 33289912 32777135 32373636 32272731 32184008 32535420 32601878 32491295 32409568 31861661
2110 31861661 31800553 30967980 31220311 31388112 30851638 29862952 29324829 28665997 28213153 28440190
2100 28440190 28277566 27690796 27124575 26782247 26493105 26158101 25745250 25840106 24982644 24402348
2090 24402348 24283785 23822064 22926059 23119739 23114824 22791665 22653874 22452427 21711615 21261647
2080 21261647 21116449 21506933 21836992 21657847 21348225 21440775 21223692 20858809 20968507 21420889
2070 21420889 21738998 21503828 21799489 22576654 22157321 21726705 22466912 22752402 22191453
2061 22191453 22792446 23914683 23883275 23112400 24050100 24699109 24308441 24898312 26348264
2052 26348264 26693285 27587806 29079979 30204894 31328637 32927587 34705208 36509840
2044 36509840 38271203 39792353 41924343 44213228 45499002 46465036 48143862 48801044
2036 48801044 49941816 51248641 52226242 52637958 53512394 53443597 53026990 53518720 53381522
2027 53381522 53117764 52876327 53344656 52851638 51363414 50057616 48732371 47184489 45914136
2018 45914136 44024473 42475155 40948230 38038825 36025644 34449678 32034855 30079671
2010 30079671 29704360 28323042 26218832 25134977 24483817 23557667 22924675 22276783 21393241
2001 21393241 20342019 20062678 20443397 19885084 18684071 18773261 18312776 17125472 16971563
1992 16971563 16819443 16041450 15892468 15596458 15700019 15267939 14964931 14067884 13879294
1983 13879294 13722230 13719001 13940597 14634959 13938780 12718991 12940887 13175247 12821950 13143553
1973 13143553 13838383 13205686 12761494 12545750 12162706 12305085 12692490 12252487 12014479
1964 12014479 12622556 12927721 13124426 13373885 12444954 11729747 12242082 12432371 12418379 11739779
1954 11739779 11287221 10830744 10567470 10480436 10500603 10152962 9405663 9448950 8912373 9302609
1944 9302609 9180582 9519965 9441654 8684457 8164576 8537851 8474474 9025377 8783415 8333118
1934 8333118 8200616 8029264 7988031 8204683 7891339 7953523 8431887 8556187 8462351 8075198
1924 8075198 7740976 7439691 7599954 8137453 8457857 8073351 7477316 7652348 7475991 8202974
1914 8202974 8864942 8673563 8266809 8318136 8017632 8327895 8650548 8618935 8277999 8077722
1904 8077722 8086838 8161389 8367592 8488419 9157997 8670344 8533893 8280275 8476985 8535980
1894 8535980 8580905 8481502 8311284 8664880 8727148 8787763 8489148 8240274 8107019 8613963
1884 8613963 8753244 9141653 8714577 8455726 8344332 8533452 8645632 8618254 8498117 8587045
1874 8587045 8985103 8319599 8946245 8649427 7995917 7988921 8859603 8730368 8738183 9320075
1864 9320075 9217211 8826109 9078437 9661035 10071219 10104909 10029098 10476487 10493527 10928847
1854 10928847 11458684 11235895 11303539 11170479 11592567 11817731 12928210 13450598 13715392
1845 13715392 13091727 13260094 13168156 13391254 13989871 14453133 14769704 14702239 14424151 13987237
1835 13987237 14535227 14439825 14371590 14749150 15303421 15439264 16261551 16217685 16295469 16841812
1825 16841812 17266046 17230565 18057496 18540938 18262023 18743440 19108331 19801271 20756687 21321928
1815 21321928 21407170 21713520 22378508 23632518 24162493 24650436 25683623 26628482 27885689
1806 27885689 29050594 30060565 31003264 32499546 33727931 35263117 36983031 38436961
1798 38436961 40235131 41957649 43852650 46414613 48571539 51391299 54341707 57070669
1790 57070669 60332774 64342221 69053797 74204058 80369689 86595178 93914666 101716809
1782 101716809 110166442 119940470 130917632 141548211 152653384 164786534 178074274
1775 178074274 193020511 210183795 227749586 244044032 255679754 258648972 251908001
1768 251908001 235663276 214965175 193766270 173499325 155882664 142016041 130114797
1761 130114797 120029875 111419806 103650911 96559472 90497989 85102556 80221649 75810470
1753 75810470 71485934 67577498 64961375 62044665 58694005 56139286 53947292 51635812
1745 51635812 49467765 47641968 45641073 44055634 42727100 41343968 39684206 38616022
1737 38616022 37254807 36125837 34644456 33625441 32577416 31689194 31011060 29602719
1729 29602719 28754821 27578873 27133239 26639911 25803436 24326563 23968799 23827739 23033071
1720 23033071 22210352 21835667 21074948 20457386 20618746 19790153 19240389 18793659 18440235
1711 18440235 18026766 17602435 17323552 16753290 16393668 15594696 15465832 15207103 15137531 15090653
1701 15090653 14851235 14616825 14441772 13944584 13906163 13591552 13312161 13696143 12906042 11890112
1691 11890112 11574707 12137187 11921498 11388601 11869104 12139641 11855304 11666361 11969516
1682 11969516 11612599 11047220 11275838 10752598 10221918 10949336 10188286 9536656 9361712
1673 9361712 9305659 8443849 8781605 9124067 8155696 7943697 8725970 8331051 8121576 8793247
1663 8793247 8234274 7580381 7806467 8167998 7486893 7863330 7125867 6670029 6463040 6761019
1653 6761019 6920081 6677525 6815274 6594769 6160566 6269734 6328789 6028064 6708578 6487698
1643 6487698 6118288 6200530 6276681 5791710 5447361 5790393 5490606 5232402 5484225 6127698
1633 6127698 5553636 5397301 5685555 5423973 4904952 5582910 5362491 5040691 4947433 4916767
1623 4916767 4694186 4931062 5565416 5380641 5339661 4966855 4957333 5339066 5112031 4778113
1613 4778113 5046607 4567230 3895448 4031784 4409263 4518025 4071366 4471029 4254696 4156869
1603 4156869 4552681 4013249 3263822 4099664 4332247 3924492 4429010 4683833 3512942
1594 3512942 3210030 3815805 3080676 3692511 4204658 3900225 3407603 3694556 3777139 3473338
1584 3473338 3720298 3379203 3306818 3800802 4363478 4057280 3622754 3456712 3291231 2832905
1574 2832905 3578823 3523429 3059664 3327598 3382318 2653843 2578812 2841112 2550154 2293423
1564 2293423 2777286 3268200 2673183 2770532 3593531 2944251 1968050 3279430 2921352 2760270
1554 2760270 3348727 3393482 2618044 2416784 3005110 2447856 2356530 2726808 2780159 3201675
1544 3201675 3529677 2689840 2290798 2409683 2381721 2327566 2132618 2744209 2848975 2494553
1534 2494553 2208495 2379549 2295747 2503695 2774586 3018938 2643488 2552562 2700287 3190251
1524 3190251 2946544 2604309 2323765 2569522 2634241 2080209 3097842 3104716 2287281 3134018
1514 3134018 3282827 2900780 2431773 2778064 3118427 3033544 2976127 2936320 3056153 3284024
1504 3284024 2811185 2727315 2704663 2335864 2030101 2101411 2631270 2198913 2096525 2602036
1494 2602036 2336710 2009376 2167255 2329883 2727802 2983643 2979834 2248094 2847312 2974856
1484 2974856 2572649 3233759 3036067 2700384 2885823 3250599 2763173 2640914 2797544 3389544
1474 3389544 3693041 3617894 3751367 3178337 2916095 3580359 3767750 3802001 4025596 3867614
1464 3867614 3826959 3761937 3656845 3126661 2654302 2385430 2753536 2622497 2610153 2089456
1454 2089456 2573366 2210300 1860031 2434292 2490082 2522508 2479566 2605806 2401695 2517749
1444 2517749 2140617 2175675 2389478 2598631 2524922 2328731 2652098 2180108 2067760 1782780
1434 1782780 1604373 1288165 1321377 1324813 1630405 1949788 2405431 1928815 1760603 1843867
1424 1843867 2154856 2095171 1818304 1707848 1696006 2225237 1846659 1155055 864539 1429488
1414 1429488 1276194 1423471 1890511 2111335 1567812 1417651 1820159 1654002 1276644 1245004
1404 1245004 2230523 1644609 1672869 1931021 1747714 1098005 1550474 1433680 1808778 1584895
1394 1584895 1140513 1807523 1569648 914960 1353766 1811292 1144488 1252926 1429027 1920369
1384 1920369 2004514 1895357 1448471 1164164 564578 611855 1155421 1349020 1437324 1006836
1374 1006836 480816 731832 624402 768827 1252130 1064862 817575 815537 691708 630333
1364 630333 526016 549351 1011343 1300591 822091 787788 815901 577102 597595 1196772
1354 1196772 611605 688640 1099461 1305078 1318328 1061431 189024 147606 628483 1254775
1344 1254775 1389060 1189081 1042455 1320682 1672612 1780236 1520981 969141 697582 756208
1334 756208 1083519 1543775 1517475 1369163 567634 619112 809040 985823 1039343 1013534
1324 1013534 1105617 941877 1388767 1292979 604967 651887 966211 1275224 1806250 1391387
1314 1391387 928499 812880 342455 114424 1463823 1800928 996633 752925 922203
1305 922203 968451 1033162 1243678 1486230 1334351 1188175 1399636 1326166 1337612 1226372
1295 1226372 1380217 1824205 1271123 959032 1442797 1711519 759827 555434 653050 685231
1285 685231 127217 437442 468312 366498 815748 737911 1043168 1366033 864803 544507
1275 544507 888461 1071338 1552880 1437671 1275167 1556647 1134071 710483 685343 591434
1265 591434 494513 1034770 687201 996255 1033757 897391 1070762 1396077 1170430 1282695
1255 1282695 1760523 1760538 1404349 1188718 1414291 1076088 1087033 1252638 1115514 773435
1245 773435 906778 868710 1086946 945486 930821 570901 699449 935723 179816 416689
1235 416689 775840 754491 1044027 1561454 1296579 860152 980506 1180168 1008594 866795
1225 866795 683074 378175 544696 795563 970646 738837 840840 480111 575255 1034589
1215 1034589 503044 401980 1082984 866448 729704 1028903 1459558 1169391 837993 822954
1205 822954 623680 876907 685148 516154 56382 378737 697044 439247 501083 329388
1195 329388 -193647 -5475 563870 533251 363085 405457 644684 394677 698071 698950 589495
1184 589495 521943 754106 752553 488806 471121 656614 665950 478841 629647 255018 268593
1173 268593 41106 -23919 264171 399872 293127 510902 756111 315618 121440 -44195
1163 -44195 388244 405909 1086485 1284144 917489 509372 753063 833189 383329 671478
1153 671478 1189221 834351 321044 910748 627383 757270 878973 1094531 1082498 817092
1143 817092 1184557 1379692 929831 1084346 1224806 803981 762827 444438 144330 413277
1133 413277 396189 -420651 -492497 42093 -508738 -278233 178615 403400 20540 385487
1123 385487 755163 -19928 432262 835652 358216 683430 1413521 1021811 1016467 1284185
1113 1284185 1191250 559752 604237 304116 297106 891388 1087403 886606 819119 1392908
1103 1392908 1251580 1175350 1637188 1134416 1065194 1600659 1111413 1017724 1384978 1053223
1093 1053223 606270 1179579 1335913 778631 684667 943831 1283768 1443577 892125 968530
1083 968530 1758960 1828939 1587897 972050 844647 1174115 1280699 1602760 1554318 1351510
1073 1351510 943869 1281760 1311407 1018835 1686293 1412510 1655474 2078703 1564246 1013256
1063 1013256 1654124 2160342 1054500 1320116 1955663 1658487 1496114 1483870 965380 1312571
1053 1312571 1515969 1635304 1759338 1788297 1545896 1192256 1919271 1947245 1078073 1604456
1043 1604456 2303210 1558417 1606282 2237714 2373670 1988137 2415105 2013444 1796361 2525712
1033 2525712 2871704 2421163 2474258 2555844 2273530 2619642 2684605 3056532 2859678 3073672
1023 3073672 3647623 3788912 3515755 3514390 3450325 3576709 3432884 3521461 3568404 3407986
1013 3407986 3259214 3260198 3862360 3565122 3633479 4530092 4936791 4479112 4413090 4801892
1003 4801892 4850654 5162755 5471786 5840330 6119694 6144649 6945284 7051597 6686878 7163576
993 7163576 7262213 7702097 8397985 9363660 9962045 10447537 10991111 11575796 12274753 12866570
983 12866570 14082868 15406847 16435671 17690635 20102782 21691147 22865500 24867159
975 24867159 27385925 29733422 32678964 37540742 43245420 47809220 52800978 59659052
967 59659052 68241269 78833029 93005503 108307117 120607597 125455274 117448123 100856888
959 100856888 83103274 68218868 58416391 51265806 44873331 40676635 37410658 33943775
951 33943775 31819210 30164841 28552076 26915909 25850745 24892426 23422447 21633779
943 21633779 20271092 19253653 17759488 16500647 15936541 14882158 14321786 13885778 13174921
934 13174921 12383095 11316214 10901479 10684651 10443751 10492659 10536352 9923395 8685713 8784334
924 8784334 8848744 8129007 8400680 8204725 7669633 7618190 7499345 6935855 6420175 6545333
914 6545333 6568659 6529313 6324489 6429331 6483770 6093205 5238267 5408050 5581475 5295418
904 5295418 5387443 5641840 5503861 4990911 5101970 4786800 4352158 3889938 4136436 3779505
894 3779505 3527525 3779170 4156667 3249699 3104971 3440585 3448124 2936221 2821248 3217342
884 3217342 2723652 2571082 2516891 2886576 2567511 2620139 2782327 2628774 2630906 2910160
874 2910160 2549510 2451781 2824817 2571587 2934717 3032037 2754256 2129065 2880191 2316332
864 2316332 1952266 2229362 2577621 2073144 1807400 1915644 1888392 1659840 1715168 1386242
854 1386242 994176 1781115 1890416 1545829 1734152 1843461 956882 1403686 1974247 1308400
844 1308400 1010738 1243733 952298 517776 830954 1100300 785666 654334 1043901 693772
834 693772 1153600 1550037 1115689 728301 592510 872590 866274 1064098 1066868 473695 230703
823 230703 818341 309516 964627 1252046 507529 664104 1345648 1121551 1156942 1263091
813 1263091 921944 1417651 1897063 1903187 1422574 847691 472370 258375 416348 396338
803 396338 395347 545457 997594 502114 48939 -11627 316470 677275 540237 989192 1545770
792 1545770 1223415 713978 546343 545410 202700 180584 323946 295537 140891 418919 -53006
781 -53006 -20455 -206425 -313865 277668 952505 508423 391728 1088572 580751 539475
771 539475 103833 599355 769967 460309 685701 979780 459357 270309 654674 306238
761 306238 -36710 260312 645988 284002 591121 336726 253374 170639 30883 323024
751 323024 1050764 776396 354539 1133316 832894 328277 104104 211510 -67897 -193344
741 -193344 -258769 25275 40358 -408364 -4258 -280816 -228402 153283 -100129 -239899
731 -239899 130241 600759 -34111 48497 712608 84682 -220405 116995 551451 602096
721 602096 857243 924845 173483 -594475 -140567 724686 22086 256400 653192 174969
711 174969 5042 235773 -26972 99894 452659 -48624 -78169 345321 402250 538846
701 538846 64152 -171356 -277189 91632 361024 -138624 -434740 -575525 -246756 198738
691 198738 570234 268689 -316665 -385316 -134437 75776 500070 967004 -33435 -69218
681 -69218 213903 -201158 -118816 539670 533666 -48580 -227618 -245366 -312790 -780902 -530328
670 -530328 3312 -174039 -224548 -194482 -174955 35104 -264701 -39810 419265 512397 577586
659 577586 24949 -454969 -560498 214880 891209 718819 756837 548421 -357531 -421582
649 -421582 278493 159326 -302326 -348595 -245281 -500256 -317753 333477 205527 -37202
639 -37202 111292 149243 -203471 -320862 -257027 28774 -228638 -78071 -303259 -790465
629 -790465 -1176693 -872650 -741009 -254841 -123391 -58282 -513726 -1067520 -1063364 -464247
619 -464247 -124149 -296323 121313 -226409 -228644 -515912 -568265 -700690 -684813 -515948 -162086
608 -162086 -599883 57063 69030 -380275 -552192 -344419 234205 463447 207797 -212440
598 -212440 -155359 -504982 -630985 -138033 -25798 -411352 -8005 24152 -536930 159674
588 159674 257319 -144246 -238812 239422 -283461 -877374 -185244 -302896 -1127244 -1040161
578 -1040161 -638615 -868922 -1267769 -609098 -503739 -823289 -522707 -432862 -372295 -458590
568 -458590 -899777 -310319 50845 13816 14776 -356278 -1052035 -1234039 -737854 -526161 -513553
557 -513553 -528011 -261357 -319147 -551799 363984 84172 -379856 -361620 -167722 -519669
547 -519669 -512622 112639 -267024 -597440 -401696 -241948 -338158 -576887 -749254 -632997
537 -632997 -1145246 -846212 -561019 -496926 -1453373 -1233235 -833516 -401567 -561488 -795237
527 -795237 -762446 -1521419 -1325371 -351920 -162014 -605423 -464440 -785499 -839081 -534215
517 -534215 -749459 -1269938 -1221830 -1090063 -881554 -1012853 -1202430 -729935 -1119286 -1500641
507 -1500641 -702525 -278391 -658485 106617 -99412 -1188626 -1313382 -806081 -670333 -617797
497 -617797 -904150 -864126 -833436 -1126405 -988625 -975222 -1447515 -1292849 -792489 -799049 -762148
486 -762148 -1134649 -930049 -603286 -886300 -900764 -470868 -794227 -1171916 -639670 -637253
476 -637253 -868135 -399329 -376358 -1278061 -1399083 -1282865 -602022 -273966 -221708 -405903
466 -405903 -743896 -790611 -939568 -675805 -1051234 -1112050 -1264773 -1210264 -1225043 -1122621 -851261
455 -851261 -605904 -992004 -1082825 -737548 -812306 -1493296 -1178194 -840117 -1090441 -598927
445 -598927 -738567 -846702 -972382 -661581 -994183 -966304 -471149 -699952 -1243459 -1440274
435 -1440274 -918593 -1084101 -1171075 -966169 -1173189 -1169225 -139463 -313298 -679796 -560714
425 -560714 -827982 -851308 -398706 66270 -279800 -705962 -1010971 -1261679 -1762525 -1285062
415 -1285062 -1172244 -1194792 -1622082 -1223914 -1053677 -1216800 -1023333 -1029683 -1065161 -1049791 -965942
404 -965942 -1325147 -904383 -1067963 -1249349 -1392228 -1617443 -1477018 -958160 -1004993 -929327
394 -929327 -737560 -948551 -997201 -1343893 -1051318 -452614 -754289 -1138344 -1166623 -1242040
384 -1242040 -1352594 -1405568 -1011183 -880751 -907178 -775020 -928274 -1004635 -1232057 -1163379
374 -1163379 -846997 -929913 -868221 -309036 -557656 -1273446 -1271242 -1328827 -1064698 -1339104 -1120039
363 -1120039 -911310 -540321 -1160885 -1277260 -1514865 -1064944 -963547 -1237582 -563550 -856523
353 -856523 -1724361 -1618218 -1000408 -1585361 -1716305 -1593690 -1430191 -1980753 -1284264 -1012185
343 -1012185 -927198 -1652192 -1943126 -1306994 -1350719 -1531530 -1187348 -887124 -1314495 -859356
333 -859356 -621617 -1128721 -1700343 -1827837 -1488981 -709539 -773130 -1224634 -943118 -1475884
323 -1475884 -1684074 -1871136 -1659841 -1512806 -954333 -880382 -731815 -1273533 -1344091 -1510340
313 -1510340 -1333484 -1082388 -363992 -610056 -1116723 -898424 -1692548 -2486780 -2065786 -1941848
303 -1941848 -2369744 -2212300 -1773111 -1883584 -2563542 -1589950 -937841 -1431032 -1715083 -984608
293 -984608 -1002581 -1322648 -835681 -925826 -964408 -805403 -1288859 -1668917 -1198568 -1326274
283 -1326274 -1434933 -1234218 -1795590 -1830624 -1311877 -852551 -982314 -688369 -1232310 -1600835
273 -1600835 -1312910 -1106423 -1570053 -1910490 -1793888 -1608387 -1688554 -1410702 -1113902 -1951204
263 -1951204 -2252146 -1804115 -1795245 -2024041 -1556009 -1461445 -1917157 -1317353 -1118833 -1766903
253 -1766903 -1852309 -2077758 -2396257 -2153761 -1937815 -1896903 -1814616 -1495528 -1969091 -2031742
243 -2031742 -1768908 -2011797 -1976757 -1748344 -1817012 -1445266 -1472208 -1687910 -1998219 -2121805
233 -2121805 -1713908 -1160337 -1700317 -1765064 -1336684 -1817705 -1713870 -1499274 -1659716 -1857464
223 -1857464 -1882092 -1684237 -1771242 -2164950 -1664416 -1539104 -2294051 -1780492 -1542315 -1965094
213 -1965094 -1832248 -1491638 -2114992 -2351947 -1970644 -1665388 -1998097 -2148013 -1972162 -1641443
203 -1641443 -1823928 -1701127 -1744438 -1924634 -1684704 -1237484 -1490050 -1360600 -856301 -1151170
193 -1151170 -1160494 -1131315 -1561526 -2032828 -2009931 -2223940 -1756616 -1591415 -2438606 -1884568
183 -1884568 -1678501 -2152451 -2097312 -1485893 -1373449 -1505823 -1636878 -896373 -892439 -1950344
173 -1950344 -1629835 -1682063 -2386522 -2280109 -1876815 -1792828 -1919783 -2045060 -1976687 -2387708
163 -2387708 -2327393 -2326733 -1792644 -1446983 -1652640 -1955521 -1237892 -1127230 -1281105 -1781491
153 -1781491 -1811965 -1899578 -2146637 -2072174 -2060678 -2319427 -2254836 -2382892 -2518683 -2290302 -1890747
142 -1890747 -1716993 -1636659 -1916336 -2835623 -2646754 -2218554 -2019832 -2006425 -2202099 -2062911
132 -2062911 -2014859 -1977605 -2013772 -2220044 -2623506 -1974758 -1862074 -2055491 -2110470 -1959071
122 -1959071 -1958136 -1908521 -1926417 -1950387 -1975867 -1715752 -1538532 -1812952 -1711922 -1753168 -1874242
111 -1874242 -2197311 -2111264 -2180062 -2027244 -1632332 -1744463 -2010469 -2477709 -2234391 -2557544
101 -2557544 -2834986 -2383087 -2133312 -2741389 -2168782 -1904885 -2541555 -3268412 -2600462 -2485087
91 -2485087 -2497102 -1984587 -2455612 -2686177 -2201561 -2007447 -2312569 -2152076 -2645647 -2606333
81 -2606333 -2382134 -2212837 -2607741 -2562106 -2227017 -2658859 -3094795 -2677561 -2289126 -2284287
71 -2284287 -1974208 -1734888 -2141998 -2396178 -1935496 -1961417 -2017054 -2124550 -2044334 -2135366 -2203701
60 -2203701 -2065387 -2473125 -2672157 -2770070 -2718044 -2733948 -2225435 -2011502 -2241734 -2383924
50 -2383924 -2473910 -3060091 -2783184 -2293580 -1984491 -1972607 -1958802 -2082138 -2081952 -2203728 -2404753
39 -2404753 -2761661 -2754191 -2493363 -2043330 -2079745 -2289175 -2485748 -2927214 -2816584 -2814602 -2821089
28 -2821089 -2795663 -2875578 -2790354 -2451247 -1846496 -2207365 -2193668 -2523090 -2175696 -2173485 -2136282
17 -2136282 -1896513 -2137693 -2417016 -2494507 -2636259 -2847689 -2902692 -2778684 -2483314 -2763496
7 -2763496 -2687867 -2828901 -2525927 -2479269 -2480367 -2366850 -2379970
0 -2379970
$$ Imaginary data points
##PAGE= N=2
##DATA TABLE= (X++(I..I)), XYDATA
16383 -6770908 -6610532 -6451240 -6015771 -6281391 -6238054 -5938279 -6203319 -6366378 -6028084 -5499331
16373 -5499331 -5853573 -5846679 -5592710 -4987309 -5480513 -5609248 -5152705 -5382378 -5634924 -4983171
16363 -4983171 -4895933 -5044503 -4705144 -4665977 -4717128 -4720938 -4702938 -4673986 -4389823 -4449676 -4342255
16352 -4342255 -3853273 -3934255 -3791845 -3428493 -3487460 -3714355 -3437156 -3536284 -3455189 -3382763
16342 -3382763 -2704992 -3309946 -3300517 -2897169 -2811232 -2884771 -2427384 -2316179 -2869734 -2856761
16332 -2856761 -2513171 -2646473 -2713834 -2404371 -2192551 -2273616 -2373702 -2189959 -2384491 -2299501
16322 -2299501 -1792056 -1745905 -1582280 -1900648 -1921453 -1638380 -1336940 -1376613 -1479336 -1623231
16312 -1623231 -1346213 -1467980 -1405248 -1177813 -1292581 -1466282 -1317407 -1516975 -1527918 -1221903
16302 -1221903 -1394989 -1190515 -483068 -420374 -468460 -249417 -255103 -425626 -685989 49188
16292 49188 -123554 -432592 148605 461643 -479304 -506481 282556 203661 -63760 187935
16282 187935 456515 266590 146141 88197 361342 267450 641688 1012031 648468 682583
16272 682583 738549 968211 782013 1410450 1387576 1663722 1418851 1372247 1223559 1095813
16262 1095813 1037891 1424729 1095699 1135830 1012101 1268087 1602628 1493715 1186576 1234646
16252 1234646 1344205 1195399 1713880 1641828 1595419 1874257 1874303 1629788 1868510 2125194
16242 2125194 1908046 1845686 2056241 2662236 1947247 1750011 2419276 2314908 1871921 2110109
16232 2110109 2287753 2596708 2222147 2910646 2798093 2362158 2803409 2468395 2866797
16223 2866797 2339226 2353697 2664716 2749928 2550548 2874460 2777619 2787060 3022178 3251492
16213 3251492 3125738 3191432 3488252 3330491 3148648 3134508 3685118 3321963 3262287 3415995
16203 3415995 3107377 3207211 3450110 2985414 2589665 3153976 3263049 3577687 3593306 3809307
16193 3809307 3240708 3225954 3429287 3467008 3580617 3780681 4036336 3918541 3911294 4103175
16183 4103175 3952090 4025654 3892016 3489003 3628612 3838903 4188717 3978297 4550928 4054300
16173 4054300 3967193 3975818 3989322 4536807 4876909 4733222 4329842 4254064 4310351 4437841
16163 4437841 3755740 4485360 4713159 4300585 4190925 4369478 3603638 3016347 3515999
16154 3515999 3661539 3655023 3843403 4969378 4304731 4481689 4768705 4220231 4211374 4560044
16144 4560044 4581982 4486940 4997201 5181262 4979250 4545469 4821793 4570000 4795511 4915686
16134 4915686 5228955 5201714 5090543 5088618 5136064 4763208 4206691 4753986 4776278 4826288
16124 4826288 4777774 5582677 5246127 4444816 4752402 5013132 4450316 4403105 4928291 5507274
16114 5507274 5041172 4847849 5313381 4397549 4233569 4633659 5900180 5230656 5330547
16105 5330547 5681718 5024987 4440986 4557367 4852296 5328738 4984350 4874028 5246743
16096 5246743 4969312 5237345 5363842 4828471 4514583 5031940 4657040 4726418 5326913 5432268
16086 5432268 5553374 5676660 5094513 4025618 4540487 5077380 4854664 4213210 4654615
16077 4654615 4968607 4613876 4631802 5151916 4934760 5003950 5172045 5447310 5658562 5677883
16067 5677883 5040285 4601998 4487838 4375486 4679145 4732079 4781800 4449147 5141824 5216413
16057 5216413 5078300 5187696 5774741 5760183 5523105 6201489 6175361 5437934 4981714 5328835
16047 5328835 4880654 4560223 4534289 4740369 4552145 4456902 4408516 4346139 4801507 4451109
16037 4451109 4548087 4864325 5136211 4594111 4993237 4787309 4765442 4438786 4862818 5053763
16027 5053763 4784832 4468443 4661512 4978359 4909568 4914922 4994104 4986232 5054603 5026805 5306933
16016 5306933 5429996 4560123 4631033 5042006 4993594 4708767 4486378 4382401 4747127 5185140
16006 5185140 4695525 4741441 4913278 4483553 4478413 5263080 5072856 4388285 4882139 5473555
15996 5473555 4854114 4866814 4902641 5036046 5352061 5066553 5080775 4852467 5064314 5511604
15986 5511604 5568504 5639255 5377341 5080150 5239399 5620695 4487748 4209209 4934916 4695723
15976 4695723 4879021 5826852 5321358 5446017 5934634 5853949 5172371 5242450 5474515 5237172
15966 5237172 5116929 5458598 5040700 4413639 4823738 5210762 4916852 5001893 5604746 4940434
15956 4940434 5305788 5113406 5175704 5222890 5734353 5328322 4824690 5200258 4607300 4202213
15946 4202213 5283641 6045588 5334704 5019153 4766187 5274454 5639364 5666077 5967572
15937 5967572 6018134 5904058 5634740 5572313 5390733 5552195 4818117 5098033 5038922 4164412
15927 4164412 4368149 5494235 4561227 4898450 5965350 5694960 4974231 5392172 5694975
15918 5694975 5606411 5738649 5908566 5177482 4633233 4872495 4870902 5009362 5089851 5209483
15908 5209483 4850515 4780749 4938055 4325632 5062460 5001495 4928948 5450776 5599046 4750497
15898 4750497 4977600 5326514 4707732 5285649 5775434 5004202 4913579 5746752 5805167 5160603
15888 5160603 5042712 5401871 5156414 4796119 4930704 5296559 4517154 4748159 5210062
15879 5210062 5113946 4939026 5506675 5632141 5559745 5637009 5349760 5470368 5410114 4675295
15869 4675295 5003278 5201409 5285686 5038772 5327070 4796814 4332688 4866792 4855999 5228993
15859 5228993 5096669 5493218 5645215 5035099 5026963 5250297 4927558 4775213 4966879 5308066
15849 5308066 5218237 4803169 4777592 4494465 4556146 4395028 4996626 4939496 5038452 5859841
15839 5859841 6197472 5487060 5680408 6111222 5783273 5100381 5122078 5065416 4970208 4958976
15829 4958976 4956905 4773713 4727973 4595258 4437127 4632220 4950452 5432407 5352812 4869416
15819 4869416 4285924 4394108 4796237 5067706 5184985 5167433 4753864 4788751 5380185 5145266
15809 5145266 4624457 4904734 5275323 5455482 5112599 4933619 4885697 4525289 4543487 5168930
15799 5168930 5459796 5181198 5181278 5315153 5010927 4676800 4804397 5475723 5086285 4522149
15789 4522149 4584062 5055627 4506719 4166572 4789402 5308506 5382908 5395615 5858258 5250594
15779 5250594 4374668 4837623 5694592 5006072 5063974 5495168 5205101 4618029 5043992 5137197
15769 5137197 4942081 5070678 5790958 5935045 5085205 5101924 5066192 5228827 5477872 5875216
15759 5875216 5661200 5192531 5326909 5395786 5396166 5100860 4990322 5012948 5016157 5170749 5462834
15748 5462834 5059073 4889512 5294341 5046684 5222090 5347931 5316525 5263279 5579152 5116153
15738 5116153 5320422 5581661 5198322 5136097 5536162 5217061 5533488 5870252 5447251 5138586
15728 5138586 4762351 4813379 4980512 5157660 5215092 5801425 5368176 4680694 5400793 5538115
15718 5538115 4768276 4604396 5528547 5589612 5037034 5210589 5579483 5359450 5814419 6208789
15708 6208789 5341526 4813110 5404167 5282236 5151831 5205798 4927622 4655213 5069702 5365970
15698 5365970 5295288 5152421 5000639 4962222 4739618 4608386 4543545 4960938 4934843 5292073
15688 5292073 5119877 4660506 4949046 5153562 5120248 5348855 5338998 5317571 5551629 5263438
15678 5263438 5375720 5260413 5586016 5520309 5537765 5591534 5452084 5438993 5090830 4992122
15668 4992122 4855399 4983351 4777297 5590103 5302750 5338272 4705186 5220572 5038019 4865835
15658 4865835 5545632 5469677 4818776 4813031 5455527 4736088 4697952 4577279 5201529 5160224
15648 5160224 4794115 4266370 5079476 5113669 4745124 5223422 5204572 4808230 4336014 5141665
15638 5141665 5292430 5373978 4762444 5201925 5249103 5210640 5377477 5712463 5328641 5319873
15628 5319873 5764092 5042121 4899867 5068362 5503000 4643972 4607452 4784297 4817359 4832661
15618 4832661 5647670 5737853 5184342 5883235 5907677 5135670 5185014 5402910 4957566 4979851
15608 4979851 4914404 4950632 5069012 4713293 4647772 4461993 4488329 4965207 5357980 5201487
15598 5201487 5536873 5846789 5933021 5283773 5551243 5584315 5198053 5083806 5217843 5455443
15588 5455443 5285882 4640939 5068491 5418912 5042588 4997740 5335458 5593304 5162805 5189748
15578 5189748 5593351 5723330 4450009 4631669 4895316 5378274 5245265 4687501 4955678
15569 4955678 5655982 5617701 5765892 5864546 5829687 5863404 5948256 5668088 5397525 5813156
15559 5813156 5466327 5044011 4684332 5077434 4797426 5156415 5070968 4835540 5086276 5472504
15549 5472504 5681606 5492670 5983962 5863600 5604055 5475239 5977925 5555083 5112477
15540 5112477 5228826 4964097 4675861 4751702 5134804 4787342 4735489 4422026 4213494 4740166
15530 4740166 5769925 5509614 5139505 5436810 5133474 5044091 5941864 5872229 4855455
15521 4855455 5066258 5800977 5261484 4986555 5508528 5158151 4783647 4952962 5602596
15512 5602596 5911917 5989389 5815296 5081789 5228204 5995675 5738093 6038930 6043526 5373740
15502 5373740 5017807 5507125 5973844 5832982 5616753 5536901 5364835 5479589 6017128 5647064
15492 5647064 5305093 5058691 4885738 4938622 5517833 5535856 4892907 5217933 5644565 5416854
15482 5416854 5404928 5911899 5621033 5614558 5415136 5362864 5143164 5696425 5796599 5378979
15472 5378979 4852534 4959063 5309130 5145745 5190775 5138024 4953546 5290226 5992298 6151692
15462 6151692 6017949 5520815 5859984 6230562 6030648 5409669 5441933 5501684 5071260 5254154
15452 5254154 5775695 5712247 4829700 4855939 5157049 5079185 5334048 5798189 6114517 5805183
15442 5805183 5626552 5414372 5780393 5751841 5481902 5324109 5339302 5181780 5538227 6023651
15432 6023651 5213855 4591641 4485910 5132338 5207522 4886313 5275915 5501739 4758228 4848957
15422 4848957 5727068 5408030 5118248 5737179 5837186 5111957 5572005 6228884 5504956
15413 5504956 5265200 5443071 5505362 5250570 5933480 6241943 5664922 5271124 4960666 4887225
15403 4887225 5177536 4942005 4793836 5107241 5099668 5299525 5191667 5370474 5202901 5639976
15393 5639976 5466071 4930594 5067424 5431798 5274325 5030520 5111611 5302607 5250025 5415524
15383 5415524 5657312 5519020 5056303 5293771 5769109 5830419 5380310 5625297 5554483 5694478
15373 5694478 5484109 5476580 5679956 5070023 4888692 5779091 5733219 5179545 5025823 5039717
15363 5039717 4779573 4559742 5370740 5289751 4562956 4890902 5155355 4842009 5458809 6333520
15353 6333520 5947049 5165142 5680904 6153750 5339284 5465752 5524468 5025601 5044565 5284573
15343 5284573 5291352 5331264 5206969 4967347 5465687 5231006 5464580 5537138 5894550 5867469
15333 5867469 5664555 5390773 5180834 5337108 5391418 5563606 5404066 5852660 5761210 5584309
15323 5584309 5471779 5378991 4978223 5014130 5569893 5449041 5435481 5287656 5178068 4922372
15313 4922372 6093736 5860340 5067274 4989443 5273355 5702261 5794540 5400880 5536104 5619281
15303 5619281 5526580 5445860 5032636 5312903 5866204 6010499 5813735 5753538 5044066 4997955
15293 4997955 5840558 5683662 5547655 6028615 5979444 5671134 5793333 5583492 5268344 4974775
15283 4974775 5580805 5412150 5651852 5888080 6062392 5296732 5189982 5286692 4535071 4811590
15273 4811590 5530961 5221718 4375159 4763874 5082406 5082006 4993209 5194746 5295109 5389422
15263 5389422 5106605 5420589 5568330 5105858 4972794 5254281 4860754 4775769 4763771 5200027
15253 5200027 5887133 5642233 5859950 5808128 5344234 5560568 6053292 5697451 5761228 5781058
15243 5781058 5645927 5462439 5272187 4924372 5383631 6080686 5221973 5275992 5404793 5004659
15233 5004659 5176922 5417217 5461568 5786093 5599142 5275302 5587049 5508269 5122874 5094128
15223 5094128 5520806 5153468 5458413 5483379 5431930 5725381 5678251 5353105 5026814 5279806
15213 5279806 5194433 5029239 5054613 5353673 5291090 5330382 5677684 5132436 4712529 5022982
15203 5022982 5205113 5172901 5311860 5628412 5627970 5968991 5332681 4955074 5304169 5292750
15193 5292750 5488995 5610986 5112651 5309034 5437807 5505302 5367229 5519824 5232527 5280497
15183 5280497 5167175 5197770 5148780 5207163 5163031 5579034 5797030 5081790 5215666 5460507
15173 5460507 4848212 4905714 5510175 5402978 5079490 5947909 6098098 5583565 5352971 5858410
15163 5858410 6044955 5880820 5730119 6030122 5727958 5615334 5724487 5456006 5461560 5677318
15153 5677318 5590545 5753605 6089328 5907518 5624710 5843608 6109087 5272424 5335148 5271793
15143 5271793 5157904 4997802 5208844 5192488 4820819 5225678 5600541 5207454 5396904 5891224
15133 5891224 5243491 5766190 6214057 5457279 5512598 6360875 6147188 5533919 5800292 5944637
15123 5944637 5577633 5428493 5816435 5456412 5270391 5933036 6101491 5331253 5199158
15114 5199158 5191009 5651804 6034418 6173879 5828628 5624402 5426923 5358508 5574362 5713245
15104 5713245 5515070 5615375 6157364 5882072 5249773 4658937 5293578 5433388 4878814
15095 4878814 5192367 5306080 5205935 5121188 5041917 5088832 5257710 5450321 6005952 5747054
15085 5747054 5822092 5556808 6095214 6025656 5327528 4785807 5389246 5390003 5236722 5578007
15075 5578007 5284160 4937757 5162716 5290814 5380587 5720710 6109866 6044872 6019064 6331842
15065 6331842 5972063 5724267 6186632 5479830 5848716 5933753 5362683 5132291 5536736 5199201
15055 5199201 4627870 4587275 5419574 5453389 5127076 5471837 5431561 5527638 5963981 6149625
15045 6149625 5179783 5452704 5310398 5238413 5592546 5996136 5638976 5492655 5967074 5939836
15035 5939836 5405273 5671171 5689347 5736720 5500149 5116236 5378970 5104929 4954269 5377501
15025 5377501 5249544 4996315 5611081 6006822 5526451 5455440 5262653 6026716 6379701 5968053
15015 5968053 5977725 5730035 4930931 5101097 5494341 5483127 5059123 4905927 4623102 5077593
15005 5077593 6144039 5809013 6000922 6515567 5847236 5475095 5870722 5969228 6030584 5970333
14995 5970333 5790878 5554295 5792456 5976899 6184497 5827701 5648577 5563022 5717029 5879165
14985 5879165 5996854 5958056 5671716 6024193 5389541 5715700 5708507 5490542 5351390 5551305
14975 5551305 5587145 5399766 5749626 6157381 5357751 5074283 5517210 5656958 5352005 5661204
14965 5661204 5780236 5305776 5390835 5932387 5291530 4989170 5166143 5768275 5620488 6047366
14955 6047366 5875501 5759448 5856938 5763885 5755701 6100764 6158983 5957971 5357614 5107982
14945 5107982 5740422 5372389 5316690 5358120 4995698 4544545 5178987 5422144 5241335 5715460
14935 5715460 5737074 5819780 5965254 6121656 5842241 5441877 5788423 5976206 5553871 5909047
14925 5909047 5975849 4990320 5177119 5313607 5479827 5491711 6123334 5629764 5049805 5361211
14915 5361211 5544930 5620829 6091398 5945291 5832427 5376465 4930519 4741522 5386107 5195153
14905 5195153 5104226 5687500 5537642 5689903 5561211 5291267 5872663 6017163 5981269 6023290
14895 6023290 5692174 5103219 5112621 5682163 6054455 5605414 5730746 5770339 5911428 5602839
$$ [...]
##END NTUPLES=NMR SPECTRUM
##END=
