##TITLE=1H_CA-8864-A2
 CDCl3, 8 sc, 
 1.06.2021
##JCAMPDX= 6.0         $$ Bruker NMR JCAMP-DX V2.0
##DATA TYPE= NMR SPECTRUM
##DATA CLASS= NTUPLES
##ORIGIN= UXNMR, Bruker Analytische Messtechnik GmbH
##OWNER= root
$$ XWIN-NMR		Version 3.5
$$ Tue Jun  1 12:09:44 2021 Russian Standard Time (UT+4h)  she@DPX200
##.OBSERVE FREQUENCY= 200.131506
##.OBSERVE NUCLEUS= ^1H
##.ACQUISITION MODE= SIMULTANEOUS
##.ACQUISITION SCHEME= undefined
##.AVERAGES= 8
##.DIGITISER RES= 18
##SPECTROMETER/DATA SYSTEM= spect
##.PULSE SEQUENCE= zg30
##.SOLVENT NAME= CDCl3
##.SHIFT REFERENCE= (INTERNAL, CDCl3, 0, 15.9885)
##AUDIT TRAIL= $$ (NUMBER, WHEN, WHO, WHERE, WHAT)
$$ ##TITLE= Audit trail, XWIN-NMR		Version 3.5
$$ ##JCAMPDX= 5.01
$$ ##ORIGIN= Bruker BioSpin GmbH
$$ ##OWNER= she
$$ F:/spectra/data/she/nmr/H-F/1/pdata/1/auditp.txt
$$ ##AUDIT TRAIL=  $$ (NUMBER, WHEN, WHO, WHERE, WHAT)
(   1,<2021-06-01 12:08:25.79 +0400>,<she>,<DPX200>,
      <created by zg, POWCHK disabled, PULCHK disabled
       configuration hash MD5:
       00 E9 B6 7A A2 85 ED C7 34 08 36 98 17 FE 4E 26
       data hash MD5: 16K
       9D B1 07 80 F8 76 EE 78 4A F2 B8 C4 AC 20 36 D6>)
(   2,<2021-06-01 12:08:29.64 +0400>,<she>,<DPX200>,
      <Start of raw data processing
       efp BC_mod = 2 LB = 0.24 FT_mod = 6 PKNL = 1 PHC0 = -11486.2 PHC1 = 22.80099 SI = 16K 
       data hash MD5: 16K
       0A 54 7E 66 B7 FA BB CE 3B 5E F5 3B 71 85 E7 7D>)
(   3,<2021-06-01 12:08:53.18 +0400>,<she>,<DPX200>,
      <pk PHC0 = 4.370223 PHC1 = -7.800001 
       data hash MD5: 16K
       7D 5A 04 AC CF FC B6 40 EB 70 20 BE 7C A3 64 AD>)
(   4,<2021-06-01 12:08:56.90 +0400>,<she>,<DPX200>,
      <abs ABSG = 5 
       data hash MD5: 16K
       93 1F 4A C5 CB 59 7A CD 91 E2 48 65 1A DB 4C 10>)
(   5,<2021-06-01 12:09:23.54 +0400>,<she>,<DPX200>,
      <abs ABSG = 5 
       data hash MD5: 16K
       F0 B2 EA D6 DC E2 BD C4 DE E2 2C 57 C5 9D 95 94>)
$$ ##END=
$$ 
$$ hash MD5
$$ 70 DE 67 E6 A0 B7 EB 44 42 C9 74 32 27 B7 36 C2
##$RELAX= 
##$RELAX= 
##$RELAX= 
##$RELAX= 
##$RELAX= 
##$RELAX= 
$$ Bruker specific parameters
$$ --------------------------
##$DU= <F:/spectra>
##$EXPNO= 1
##$NAME= <H-F>
##$PROCNO= 1
##$TYPE= <nmr>
##$USER= <she>
##$AMP= (0..31)
100 100 100 100 100 100 100 100 100 100 100 100 100 100 100 100 100 100 
100 100 100 100 100 100 100 100 100 100 100 100 100 100 
##$AQSEQ= 0
##$AQ_mod= 1
##$AUNM= <au_zg>
##$AUTOPOS= <>
##$BF1= 200.13
##$BF2= 200.13
##$BF3= 200.13
##$BF4= 200.13
##$BF5= 200.13
##$BF6= 200.13
##$BF7= 200.13
##$BF8= 200.13
##$BYTORDA= 1
##$CFDGTYP= 0
##$CFRGTYP= 5
##$CHEMSTR= <none>
##$CNST= (0..31)
1 1 145 1 1 1 1 1 1 1 1 1 1 1 1 1 1 1 1 1 1 1 1 1 1 1 1 1 1 1 1 1 
##$CPDPRG= <>
##$CPDPRG1= <>
##$CPDPRG2= <>
##$CPDPRG3= <>
##$CPDPRG4= <mlev>
##$CPDPRG5= <mlev>
##$CPDPRG6= <mlev>
##$CPDPRG7= <mlev>
##$CPDPRG8= <mlev>
##$CPDPRGB= <>
##$CPDPRGT= <>
##$D= (0..31)
0 1.2 0 0 0 0 0 0 0 0.06 0 0.03 0 0 0 0 0.0002 0 0 0 0 0 0 0 0 0 0 0 0 
0 0 0 
##$DATE= 1622534905
##$DBL= (0..7)
$$ [...]
##$SUBNAM3= <"">
##$SUBNAM4= <"">
##$SUBNAM5= <"">
##$SUBNAM6= <"">
##$SUBNAM7= <"">
##$SUBNAM8= <"">
##$SUBNAM9= <"">
##$SW= 16.9725357007746
##$SWIBOX= (0..15)
0 0 2 0 0 0 0 0 0 0 0 0 0 0 0 0 
##$SW_h= 3396.73913043478
##$TD= 16384
##$TD0= 1
##$TE= 0
##$TE2= 300
##$TE3= 300
##$TEG= 300
##$TL= (0..7)
0 120 120 120 120 120 120 120 
##$TP= (0..7)
150 150 150 150 150 150 150 150 
##$TP07= 0
##$TPNAME0= <>
##$TPNAME1= <>
##$TPNAME2= <>
##$TPNAME3= <>
##$TPNAME4= <>
##$TPNAME5= <>
##$TPNAME6= <>
##$TPNAME7= <>
##$TPOAL= (0..7)
0.5 0.5 0.5 0.5 0.5 0.5 0.5 0.5 
##$TPOFFS= (0..7)
0 0 0 0 0 0 0 0 
##$TUNHIN= 0
##$TUNHOUT= 0
##$TUNXOUT= 0
##$USERA1= <user>
##$USERA2= <user>
##$USERA3= <user>
##$USERA4= <user>
##$USERA5= <user>
##$V9= 5
##$VALIST= <valist>
##$VCLIST= <CCCCCCCCCCCCCCC>
##$VD= 0
##$VDLIST= <DDDDDDDDDDDDDDD>
##$VPLIST= <PPPPPPPPPPPPPPP>
##$VTLIST= <TTTTTTTTTTTTTTT>
##$WBST= 1024
##$WBSW= 4
##$XGAIN= (0..3)
0 0 0 0 
##$XL= 0
##$YL= 0
##$YMAX_a= 221844
##$YMIN_a= -229331
##$ZGOPTNS= <>
##$ZL1= 120
##$ZL2= 120
##$ZL3= 120
##$ZL4= 120
##$ABSF1= 15.98853
##$ABSF2= -0.9841337
##$ABSG= 5
##$ABSL= 3
##$ALPHA= 0
##$AQORDER= 0
##$ASSFAC= 0
##$ASSFACI= 0
##$ASSFACX= 0
##$ASSWID= 0
##$AUNMP= <proc_1d>
##$AZFE= 0.1
##$AZFW= 0.1
##$BCFW= 0
##$BC_mod= 2
##$BYTORDP= 0
##$COROFFS= 0
##$CY= -3
##$DATMOD= 1
##$DC= 0
##$DFILT= <>
##$DTYPP= 0
##$F1P= 0
##$F2P= 0
##$FCOR= 1
##$FTSIZE= 16384
##$FT_mod= 6
##$GAMMA= 0
##$GB= 0
##$INTBC= 1
##$INTSCL= 1.334414e-10
##$ISEN= 128
##$LB= 0.24
##$LEV0= 0
##$LPBIN= 0
##$MAXI= 10000
##$MC2= 0
##$MEAN= 0
##$ME_mod= 0
##$MI= 1.114404
##$NCOEF= 0
##$NC_proc= -8
##$NLEV= 6
##$NOISF1= 3.799351
##$NOISF2= 2.8
##$NSP= 0
##$NTH_PI= 0
##$NZP= 0
##$OFFSET= 15.98853
##$PC= 1
##$PHC0= -11481.83
##$PHC1= 15.00099
##$PH_mod= 1
##$PKNL= yes
##$PPARMOD= 0
##$PSCAL= 0
##$PSIGN= 0
##$REVERSE= no
##$SF= 200.130004585828
##$SI= 16384
##$SIGF1= 3
##$SIGF2= 2
##$SINO= 5.538805
##$SIOLD= 16384
##$SREGLST= <1H.CDCl3>
##$SSB= 0
##$STSI= 16384
##$STSR= 0
##$SW_p= 3396.73913043479
##$SYMM= 0
##$S_DEV= 0
##$TDeff= 16384
##$TDoff= 0
##$TI= <>
##$TILT= no
##$TM1= 0
##$TM2= 0
##$TOPLEV= 0
##$USERP1= <user>
##$USERP2= <user>
##$USERP3= <user>
##$USERP4= <user>
##$USERP5= <user>
##$WDW= 1
##$XDIM= 16384
##$YMAX_p= 345491656
##$YMIN_p= -1301535
$$ End of Bruker specific parameters
$$ ---------------------------------
##NTUPLES= NMR SPECTRUM
##VAR_NAME=  FREQUENCY,     SPECTRUM/REAL,   SPECTRUM/IMAG
##SYMBOL=    X,             R,               I
##VAR_TYPE=  INDEPENDENT,   DEPENDENT,       DEPENDENT
##VAR_FORM=  AFFN,          ASDF,            ASDF
##VAR_DIM=   16384,         16384,           16384
##UNITS=     HZ,            ARBITRARY UNITS, ARBITRARY UNITS
##FACTOR=    0.207333158178282, 1,           1
##FIRST=     3199.78461404064, 0,            0
##LAST=      -196.954516394154, 0,           0
##MIN=       -196.954516394154, -1301535,    0
##MAX=       3199.78461404064, 345491656,    0
$$ Real data points
##PAGE= N=1
##DATA TABLE= (X++(R..R)), XYDATA
$$ [...]
4407C6530733m81448m63341J76217o21271J54158j2201N06157Q93572K39119Q85938
4397C7807633P34981R05599R27894J594482J196352R92935J575841J237318K162049
4388D9135084J885061K241901K532071K477265K060001Q90952M76946K31707k74386
4379F1656602k17221r4055j27713L05715P94928J016022O94603j88638q31146
4370F3009097j381369j084282j230263p71622p48944j56940J73541n8322O17386
4361E8368282N37980K38632l91013r89584j530017j609562j629030j720163j519919
4352D9755606n27563R3094P9794K87524K66603K75183R8484l83221j164787k040023
4342D6740694j922667j939457k109118k007331j754157j578783j323546m35451
$$ plain form
4407 36530733 36049285 35585944 35762161 35140890 35295048 35282847 35789004 36682576 36921695 37807633
4397 37807633 38542614 39448213 40376107 41970589 43166941 44159876 45735717 46973035 49135084
4388 49135084 51020145 53262046 55794117 58271382 60331383 61222335 61699281 61930988 61656602
4379 61656602 61439381 61345326 61217613 61523328 62318256 63334278 64028881 63840243 63009097
4370 63009097 61627728 60543446 59313183 58541561 57792617 57635677 57809218 57750896 58368282
4361 58368282 58906262 59144894 58753881 57764297 56234280 54624718 52995688 51275525 49755606
4352 49755606 49228043 49321137 49400931 49688455 49955058 50230241 50328725 49945504 48780717 46740694
4342 46740694 44818027 42878570 40769452 38762121 37007964 35429181 34105635 33670184
4334C3670184j239315r23011o77102j65592J48437J16890m14597o87723k83680
4325B9544491J50037k57147r74643q47061m70884l32927j65481l7575l05757p75798
4315B5527255m58669k42504m40865n01334J26344r3966p14910J05607k04143n00611
4305B2602204K04988N55626M3449m13697k83431l13055L80330j0664k30811j24642
4295B2410297n20718m09310m97562K29532r0465k21466l99026M7011l16449p41448
4285A9490396r2446n60606n96599j41231L63459N49228j54106j26795P1695P60004
4275A9562999p6449n64902j77981K61321J5309n73070k52126K39417o6004j19246
4265A8249268K23891q8018p11919m97480j8797o42097n36824j4232m98489j37522
$$ plain form
4334 33670184 32430869 31507858 30830756 30665164 30813601 30930491 30515894 29828171 29544491
4325 29544491 29694528 29437381 28462738 27615677 27144793 26811866 26646385 26608810 26303053 25527255
4315 25527255 25068586 24826082 24385217 23883883 24010227 23916261 23201351 23306958 23102815 22602204
4305 22602204 22807192 23362818 23406267 22992570 22709139 22396084 22776414 22765750 22534939 22410297
4295 22410297 21889579 21480269 20982707 21212239 21121774 20900308 20501282 20548293 20231844 19490396
4285 19490396 19397950 18837344 18240745 18099514 18462973 19012201 18858095 18731300 18802995 19562999
4275 19562999 19486550 18921648 18743667 19004988 19020297 18447227 18195101 18434518 18368514 18249268
4265 18249268 18473159 18385141 17673222 17175742 17156945 16514848 15978024 15963792 15465303 15327781
4255A5327781m54633l02424j5229M12401j43909N9509J19862r5263L31943n10853
4245A4729185n326J81683O6167M09839K15943J22925J93874K36087J10775K67483
4235A6528635L92779N56583M49360O3676J27161J36860M08660L95489p0265k42790
4225A8746148j014176p91557l768l63233j90196o21560j17990o5045l04265n53463
4215A4720895n78493N8161J17936M54879J89190n13894p6728K05518K8951N17549
4205A5123964k66925j13352N50905K11930K98351O0786O13977R0715L39720L65573
4195A7275644m7771k25352q11020k56856n54674j147074k95608m92085q24787
4186A2620417K2928l61505k22802l07368k95472m97463K59148N25710o98381m39998
$$ plain form
4255 15327781 14873148 14570724 14555495 14967896 14823987 14883496 15003358 14908095 15240038 14729185
4245 14729185 14723859 14905542 14971709 15381548 15597491 15720416 15914290 16150377 16261152 16528635
4235 16528635 16921414 17477997 17927357 17991033 18118194 18255054 18663714 19059203 18988938 18746148
4225 18746148 17731972 16940415 16936647 16573414 16383218 15761658 15643668 15578623 15274358 14720895
4215 14720895 14142402 14200563 14318499 14773378 14962568 14448674 14371946 14577464 14606415 15123964
4205 15123964 14857039 14743687 15294592 15506522 15804873 15865659 16479636 16570351 16910071 17275644
4195 17275644 17227873 17002521 16191501 15934645 15379971 14232897 13937289 13445204 12620417
4186 12620417 12643345 12281840 12059038 11751670 11456198 10958735 11217883 11743593 11045212 10605214
4176A0605214l36844K36067K97068m32627k08507n32573k00860M26678n9762m43951
4166I349903R4934K0826Q1423K95945k62980o35310j63193J63978j00804n95502
4156H249220L8948k28406O467M82530p5603K46424j913J14652j6269j19539J04802
4145H801313m38115l87726k28626M93277O65436o17272j41742j51598O05186J52183
4135H752316L78294k57012o86214M70249N02305L29702m22207k61120J04996L80438
4125I291747P38238m99302l41269j1068N36337K73219l05927l85517j18185n2313
4115I125960J86731J64752K8947k72838P7209l0599j62323K87137m18178J98969
4105I185767k1194K6828j92269M9416l16237k49238Q16911J79351M80150m35914
$$ plain form
4176 10605214 10268370 10504437 10801505 10368878 10160371 9627798 9426938 9853616 9793854 9349903
4166 9349903 9444837 9465663 9547086 9843031 9580051 8944741 8781548 8945526 8844722 8249220
4156 8249220 8288168 8059762 8066229 8548759 8473156 8719580 8717667 8832319 8816050 8696511 8801313
4145 8801313 8363198 7975472 7746846 8240123 8905559 8288287 8146545 7994947 8600133 8752316
4135 8752316 9130610 8873598 8187384 8657633 9159938 9489640 9067433 8806313 8911309 9291747
4125 9291747 10029985 9530683 9189414 9178346 9714683 9987902 9681975 9296458 9178273 9125960
4115 9125960 9312691 9477443 9506390 9233552 9310761 9280162 9117839 9404976 8986798 9185767
4105 9185767 9164573 9191401 8999132 9048548 8732311 8483073 9299984 9479335 9959485 9523571
4095I523571k61528L72929P21970J95504m62932O9553p0224K15534L02625r6034
4085A0510968k33502l35943K31580K52117N02378K04292k52071L36402O4521K88118
4075A1568860k42364l6278J9475P10313L07614r9155j90193M27305J45883o3737
4065A2547723J240L12669L15734n7694k02108L15116O31221L73666M49262M20640
4055A5107469O51004L36342P23218M00917K16440R71010P72790J170347J37062
4046B0486599M08598P10328M12323P02510j70981k25575L02807j91756l12276
4037B2122577m70170j140326q70699k56594m47350j035986n50781l0453k0477
4028A7299741o42354l67646m90521m09483K1006j56442K1015j1577l24691O4434
$$ plain form
4095 9523571 9262043 9634972 10356942 10552446 10089514 10159067 10088843 10304377 10607002 10510968
4085 10510968 10277466 9941523 10173103 10425220 10927598 11131890 10879819 11216221 11280742 11568860
4075 11568860 11326496 11290218 11309693 12020006 12327620 12228465 12038272 12465577 12611460 12547723
4065 12547723 12548963 12861632 13177366 13119672 12917564 13232680 13863901 14237567 14686829 15107469
4055 15107469 15758473 16094815 16818033 17218950 17435390 18406400 19179190 20349537 20486599
4046 20486599 20895197 21605525 22017848 22720358 22549377 22323802 22626609 22434853 22122577
4037 22122577 21652407 20512081 19641382 19384788 18937438 17901452 17350671 17320218 17299741
4028 17299741 16657387 16289741 15799220 15389737 15410743 15254301 15275316 15263739 14939048 15003482
4018A5003482k4382l00459j2145M306j42211K54530l90268L10558j91923k49512
4008A4261976K94170j96476M02063k20919k61990k78797k66938M76347K4040k90027
3998A3943449j10668N5551N08126K00195k39254J76630M92410l5825j66694Q9378
3988A4913298J12902J18626M48483K53410M81276o3979J01508M75577O46539L27098
3978A7814738P97052K13349J12962L49384j98305p4264m9651Q4243K0219j14172
3968A8955555k26624J20663L1970m37415L31473o93085l77764k10232m69469J79701
3958A7204773m78587J48420J26362J44862N5026j5117l45136m48510q8931K69466
3948A6572628l11461l86446l9095m82079n6088M51638j7205k6532k03299k86761
$$ plain form
4018 15003482 14979100 14678641 14666496 14670802 14528591 14783121 14392853 14703411 14511488 14261976
4008 14261976 14556146 14359670 14761733 14540814 14278824 14000027 13733089 14209436 14233476 13943449
3998 13943449 13832781 13888332 14396458 14596653 14357399 14534029 15026439 14990614 14823920 14913298
3988 14913298 15026200 15144826 15593309 15846719 16327995 16264016 16365524 16841101 17487640 17814738
3978 17814738 18611790 18825139 18938101 19287485 19089180 19014916 18965265 19049508 19069727 18955555
3968 18955555 18728931 18849594 18881564 18444149 18775622 18082537 17704773 17494541 17025072 17204773
3958 17204773 16726186 16874606 17000968 17145830 17200856 17185739 16840603 16392093 16303162 16572628
3948 16572628 16261167 15874721 15835626 15353547 15297459 15749097 15731892 15705360 15502061 15215300
3938A5215300M6870l8229j98332K06106k17454J81586J39484k59909l96135r7660
3928A4581627j9234j8859k69533j18360m9153J99092K44012J59612L0465j95511
3918A4544158m3092M6434j26388L36040N01462L56710P05814j49345j86062L1425
3908A6017156j49583j48651p44529Q1724l68068j42182Q7133o5006L50684o3385
3898A4855293J80341Q6396j02313J77852j2421k41358R0798j03377L95100L50604
3888A5676915j45807j84141m2982L83224J62061K0962K94048k3884J65906K94323
3878A6600625K3963K14463J10933M18744M42163J94535J33917J44474j44393J7954
3868A8157378J23127k50550j64722q1982j37186J71927n0242R841j9742k54317
$$ plain form
3938 15215300 15262170 15223941 15025609 15231715 15014261 15195847 15335331 15075422 14679287 14581627
3928 14581627 14562393 14543534 14274001 14155641 14106488 14305580 14549592 14709204 14739669 14544158
3918 14544158 14501066 14547500 14421112 14757152 15258614 15615324 16321138 16171793 15985731 16017156
3908 16017156 15867573 15718922 14974393 15056117 14688049 14545867 14633000 14567994 14918678 14855293
3898 14855293 15035634 15122030 15019717 15197569 15185148 14943790 15034588 14931211 15326311 15676915
3888 15676915 15531108 15346967 15303985 15687209 15849270 15870232 16164280 16140396 16306302 16600625
3878 16600625 16624588 16839051 16949984 17368728 17810891 18005426 18139343 18283817 18139424 18157378
3868 18157378 18280505 18029955 17865233 17783251 17646065 17817992 17767750 17777591 17757849 17503532
3858A7503532K71394R0381n3175j10269L83828J36536k04873L79155L46404J3775
3848A8756688M7472K90359L39172K75155N37013J23932J34787m5469L46995L23494
3838B1129598L05088l8374K55366J180470N69692J02390M02637N04687O63965
3829B5075519M95823R46505K66955Q19169O22643O51467L93088K98000Q17106
3820C0386275M31069J35322r5950K76785J10499L64488L95151O76129K32427N27516
3810C3439711R64581J264441J136016N80932Q12405M76786J030343M91126J100141
3801D1296482R39901p37690l28905r18269j725346j467559j349266j480954q57139
3792C3371255o16301k95767k46218l64328L35834p8521K90229J92726l08246K23405
$$ plain form
3858 17503532 17774926 17865307 17812132 17701863 18085691 18222227 18017354 18396509 18742913 18756688
3848 18756688 18804160 19094519 19433691 19708846 20245859 20369791 20504578 20459109 20806104 21129598
3838 21129598 21434686 21396312 21651678 22832148 23401840 23504230 23906867 24411554 25075519
3829 25075519 25571342 26517847 26784802 27603971 28226614 28878081 29271169 29569169 30386275
3820 30386275 30817344 30952666 30856716 31133501 31244000 31608488 32003639 32679768 32912195 33439711
3810 33439711 34404292 35668733 36804749 37385681 38198086 38674872 39705215 40196341 41296482
3801 41296482 42236383 41498693 41169788 40251519 38526173 37058614 35709348 34228394 33371255
3792 33371255 32754954 32459187 32212969 31848641 32184475 32105954 32396183 32588909 32280663 32504068
3782C2504068O66285Q91994J80970O63917K87183Q25868M86872Q35287Q87765
3773C8230209O01926J090260R34994P35578J385205J174081Q64681J244802J121197
3764D7382933J104205K14481K43778K35201l30116o3565j10046k14651j82888
3755D8279332k81110N74773M58892N32561L11172K44940L48732N80339M92521
3746E1542152K35868m03331k30196j91070l73111m56672q48446k20389N90580
3737D9645385O41223K03793O51508O92477M07367J294365P72472N43570J480164
3728E6332324O04442L42151l65927p79424j151244j008433o27463p69597p02204
3719E1874625l13701L00058M36898k74475J97414m8854J36930K39156j80229k37104
$$ plain form
3782 32504068 33170353 34062347 34243317 34907234 35194417 36020285 36507157 37342444 38230209
3773 38230209 38832135 39922395 40857389 41592967 42978172 44152253 45016934 46261736 47382933
3764 47382933 48487138 48701619 48945397 49180598 48850482 48786917 48676871 48462220 48279332
3755 48279332 47998222 48572995 49031887 49564448 49875620 50120560 50469292 51049631 51542152
3746 51542152 51778020 51374689 51144493 50953423 50580312 50123640 49275194 49054805 49645385
3737 49645385 50286608 50490401 51141909 51834386 52241753 53536118 54308590 54852160 56332324
3728 56332324 56936766 57278917 56912990 56133566 54982322 53973889 53346426 52576829 51874625
3719 51874625 51560924 51860982 52297880 52023405 52220819 52171965 52308895 52548051 52367822 52130718
3709E2130718Q6339N85213k38280l65222Q0444M07788K72835n9337n6370j73422
3699E2670706q3364M37391M2035R5052J4542J25365j28836l4570l41626m71673
3689E2325022k12403l70267q63762m18666j70440m83380r74577m62741n38800
3680D7829986q2336L00212l91082m62705j80963Q63081n7456M50009k43622m9841
3670D7975283M77906M31065P36706J05290M92010Q11721N18622L60620R12349
3661E2821572J76939J90755P13449m03906M56208N28125M39971r2364O6309N04550
3651E5401608Q6286l72740j74989K15880K39222L71635k2920l53298M0701K63330
3641E5694715J66633L46077J8853N32K23577M46386j2871n19001k48268j40389
$$ plain form
3709 52130718 52217057 52802270 52563990 52198768 52279212 52687000 52959835 52900498 52844128 52670706
3699 52670706 52587342 53024733 53066768 53161820 53176362 53301727 53172891 53138321 52796695 52325022
3689 52325022 52112619 51742352 50878590 50459924 50289484 49806104 48831527 48368786 47829986
3680 47829986 47747650 48047862 47656780 47194075 47013112 47876193 47818737 48268746 48025124 47975283
3670 47975283 48453189 48884254 49620960 49726250 50218260 51029981 51548603 51909223 52821572
3661 52821572 52998511 53189266 53902715 53498809 53955017 54483142 54923113 54830749 54897058 55401608
3651 55401608 55487894 55115154 54940165 55156045 55395267 55766902 55743982 55390684 55431385 55694715
3641 55694715 55861348 56207425 56226278 56226810 56450387 56896773 56883902 56364901 56116633 55976244
3631E5976244M91995L91462k07592L08672L1149O86016N18273q00872r39106p32829
3621E5723412p33006o82685q82246j275615j054347r02738m31585p98753p43152
3612D8219285o60303n70350l20544o4812o1255n42967J09L09961k65028m47102
3602D5596994l26642r29502n77349m20208Q37050n6595j11819k90568l47750K77745
3592D3651356M23729M33862K66018M43665K89782P56843N17737o35014R4644P4369
3582D6316991n72146q02462n64070r04414j123012l30658L4310l04360n76991
3573D1173188k67590o1997j35371R330L0605n07119k98013l66557j067429j364423
3563C7144624q61890j259000r82573p42284p79617n62766p99677k03802l10909
$$ plain form
3631 55976244 56468239 56859701 56652109 56960781 56991930 57677946 58196219 57395347 56456241 55723412
3621 55723412 54990406 54307721 53425475 52149860 51095513 50192775 49761190 48962437 48219285
3612 48219285 47558982 46988632 46668088 46603276 46542021 45999054 45999163 46309124 46044096 45596994
3602 45596994 45270352 44340850 43763501 43343293 44180343 44123748 44011929 43721361 43373611 43651356
3592 43651356 44075085 44508947 44774965 45218630 45508412 46265255 46782992 46147978 46242622 46316991
3582 46316991 45744845 44942383 44378313 43473899 42350887 42020229 42054539 41750179 41173188
3573 41173188 40905598 40843601 40708230 40717560 40748165 40241046 39943033 39576476 38509047 37144624
3563 37144624 36282734 35023734 34041161 33298877 32519260 31956494 31156817 30953015 30642106
3554C0642106l63613j72462p84120o10900m23247m6678k71244j05580k96010n45329
3544B7022923N8578o632J58857l4974o85827R0656r0352N30206L69193k43000
3534B7169628o7931R08037K66191J91068K96493Q7103L46339j15186j29464n97378
3524B8354900j52402m21047j032459n61344j98938q22237l74272l81986n84093
3515B3826122n74106n76166r5622J8082m38883J47165M26368n89013q09862K04798
3505B1538883l29220N31043k99792l37501r6312K0927K95594o23718j40664l10841
3495B0248399n762j24761J71178l02608J26854N32171J64734K70694J32793M74199
3485B1687891n8892K59070Q03300k14011K92325R53849R24754M36737P52258O50973
$$ plain form
3554 30642106 30278493 30106031 29321911 28711011 28287764 28241086 27969842 27864262 27568252 27022923
3544 27022923 27081501 27074869 27233726 27198752 26512925 26603581 26513229 27043435 27412628 27169628
3534 27169628 27101697 28009734 28275925 28466993 28763486 28850589 29196928 29081742 28952278 28354900
3524 28354900 28202498 27781451 26748992 26187648 25988710 25166473 24792201 24410215 23826122
3515 23826122 23252016 22675850 22580228 22598310 22159427 22306592 22732960 22143947 21334085 21538883
3505 21538883 21209663 21740706 21440914 21103413 21007101 21028028 21323622 20699904 20559240 20248399
3495 20248399 20242637 20117876 20289054 19986446 20113300 20645471 20810205 21080899 21213692 21687891
3485 21687891 21628999 21888069 22691369 22477358 22769683 23723532 24648286 25085023 25837281 26488254
3475B6488254R87834J121175J569328J573564J434606N29737j114369k135892
3467C0454237j492245j625431j304963q27813j112802k92541l90358N03255j99316
3458B3712023o70920N94349N39786r2868J65306k07956K6108L1642J15849K36208
3448B4449527J75826L19981L89506O66830l34289K02512M89033j86426P15261
3439B6887761p1878l22309j00613L44061L05300j18436J72047J80691J63940J43509
3429B7584073L20871j66423Q31509M97308K90533K68709K22758P87760P96489
3420C1433587P28553M20751P18250Q31775J431306N73239L78188J691846J227503
3411C9434998J416042Q79965L95080R52737N94150K98116L66164K58334R54723
$$ plain form
3475 26488254 27476088 28597263 30166591 31740155 33174761 33704498 32590129 30454237
3467 30454237 28961992 27336561 26031598 25203785 24090983 23798442 23408084 23911339 23712023
3458 23712023 23041103 23635452 24175238 24082370 24247676 24039720 24065828 24097470 24213319 24449527
3448 24449527 24625353 24945334 25334840 26001670 25667381 25869893 26358926 26172500 26887761
3439 26887761 26815883 26493574 26392961 26737022 27042322 26923886 27095933 27276624 27440564 27584073
3429 27584073 27904944 27738521 28570030 29067338 29357871 29626580 29849338 30637098 31433587
3420 31433587 32162140 32582891 33301141 34132916 35564222 36137461 36515649 38207495 39434998
3411 39434998 40851040 41731005 42126085 43078822 43672972 43971088 44337252 44595586 45550309
3402D5550309M90211n3353j49481Q8722L61651p8178J4793p10854m53250k11325
3392D4849245K09343P20405M08954N32039M39869R39214O92323M83531J626949
3383E0901872J264172J611957J874562J599634K079299K534667K546243L210701
3375F7623107L408844L531702M023793L893616M490390M652307M561902M234569
3367A00420230L060572J398661m45410k467970l944861m881457m965703m296579
3359H3877483m089482l736167l023252k851274k759073j683509k184964j943541
3351F1606221j679666j274282n10457o34688q20939l34818o76697m26939J89970
3342E5437705q53250K86415R4708q282M09916j24602K65587M98220J94304j72259
$$ plain form
3402 45550309 46040520 45987167 45837686 45926408 46288059 46209881 46224674 45513820 45060570 44849245
3392 44849245 45058588 45778993 46187947 46719986 47159855 48099069 48791392 49274923 50901872
3383 50901872 52166044 53778001 55652563 57252197 59331496 61866163 64412406 67623107
3375 67623107 71031951 74563653 78587446 82481062 86971452 91623759 96185661 100420230
3367 100420230 103480802 104879463 104434053 101966083 98021222 93139765 88174062 83877483
3359 83877483 79788001 76051834 73028582 70177308 67418235 65734726 63549762 61606221
3351 61606221 59926555 58652273 58141816 57507128 56686189 56351371 55674674 55247735 55437705
3342 55437705 54584455 54870870 54965578 54957296 55367212 55242610 55508197 56006417 56200721 56028462
3332E6028462L03258M67526O22674K45362J42400P84768J033839Q90655Q47778
3323F1366722J100463J095932J128759J862852J494828J212949J586884J492112
3315G2341501J929223J742924J595203K917776K899543K578122K668114K800187
3307I1472593K328712K707790K394018K150803J804830J348472J897580J585105
3299A07689903J199977R98045O81028P36135P36092K8251O13982P31822M66745
3290A13881980O30838O12464J304714J214160J168890R24955J204032J577446
3282A22519479K435981K386828K564620L296237K906674L674151K061494J076188
3274A42921652j65796j872305l777088m660339o238289o842398o519314n703930
$$ plain form
3332 56028462 56331720 56799246 57421920 57667282 57809682 58594450 59628289 60518944 61366722
3323 61366722 62467185 63563117 64691876 66554728 68049556 69262505 70849389 72341501
3315 72341501 74270724 76013648 77608851 80526627 83426170 86004292 88672406 91472593
3307 91472593 93801305 96509095 98903113 101053916 102858746 104207218 106104798 107689903
3299 107689903 108889880 109887925 110568953 111305088 112041180 112069431 112683413 113415235 113881980
3290 113881980 114512818 115125282 116429996 117644156 118813046 119738001 120942033 122519479
3282 122519479 124955460 127342288 129906908 133203145 136109819 139783970 141845464 142921652
3274 142921652 142755856 140883551 137106463 132446124 126207835 119365437 112846123 107142193
3266A07142193m745018m304694l703419k481006k204059j621890j668446k404965
3258H4008696k311751l021281l141767k722068l059708k198728k052462k340163
3250F3160768j869272k023755j519838r80729j196757q57253r35145r16241n40257
3241E2321521m57669r67367n76754k95151m46193m10866p30136m92838m98848
3232D7445699n91877l35360j05435j29558j0822l11908k81478K65562j05068k40065
3222D5599690q5124l44246R1851J11195K61400k87517k22522j6686K13933l70708
3212D4951266j3846j19170J91407J94268l5694j92987j45730L09136j85844n44445
3202D4408361j38675m47084o94140n65318o47524q30909J85640j96003j52586
$$ plain form
3266 107142193 102397175 98092481 94389062 91908056 89703997 88082107 86413661 84008696
3258 84008696 81696945 78675664 75533897 72811829 69752121 67553393 65500931 63160768
3250 63160768 61291496 59267741 57747903 56767174 55570417 54713164 53778019 52861778 52321521
3241 52321521 51863852 50896485 50319731 50024580 49578387 49167521 48437385 47944547 47445699
3232 47445699 46853822 46518462 46413027 46283469 46272647 45960739 45679261 45944823 45839755 45599690
3222 45599690 45514566 45170320 45262171 45373366 45634766 45347249 45124727 45108041 45321974 44951266
3212 44951266 44937420 44818250 45009657 45203925 45168231 44975244 44829514 45138650 44952806 44408361
3202 44408361 44269686 43822602 43128462 42563144 41915620 41084711 41270351 41074348 40921762
3193D0921762R0075n33222M73539m20440l54099j25927k54305n30693J26121q3253
3183C9309558o35498J96243J15414R1076q8311k51222K82069L13284O77099L88285
3173D0397997O438L13156L02875J75395R2257m9716M33507Q56891K55870q4776
3163D2699894j48640N29124K5292Q37727J341814O79412O65563J146130R30852
3154D8707168J172366O33887K82182L70447K9029n47482j253621j323595j201092
3145D6869289j573607j753154j258560j663353j470603j172960n00015k62120
3137C7214917k62757m97285l72066o23123O3861J84235p52640o2857q2805J18762
3127C4928242P16203l77244o01140K43352M00847r6911m90603r66285q21724l94297
$$ plain form
3193 40921762 41011837 40478615 40952154 40531714 40177615 40051688 39797383 39266690 39392811 39309558
3183 39309558 38674060 38870303 38985717 39076793 38988482 38737260 39019329 39332613 40009712 40397997
3173 40397997 40404435 40717591 41020466 41195861 41288118 41238402 41671909 42528800 42784670 42699894
3163 42699894 42551254 43080378 43105670 43943397 45285211 45964623 46630186 47776316 48707168
3154 48707168 49879534 50513421 50795603 51166050 51195079 50647597 49393976 48070381 46869289
3145 46869289 45295682 43542528 42283968 40620615 39150012 37977052 37477037 37214917
3137 37214917 36952160 36454875 36082809 35459686 35523547 35707782 34955142 34892285 34809480 34928242
3127 34928242 35644445 35267201 34666061 34909413 35310260 35213349 34722746 33756461 32934737 32540440
3117C2540440n3742J61611o26684o17806P2912l57489M14938L24814j76650k97856
3107C1384488L01544l42780L19102L39425l46602L31246K75236R93965M94490
3098C3750114K43186K07445J4959M48347J70973m9568M02560o38952j61996J90149
3088C4577217k81437n53788m37990k7286J80192L3700p22038j3166n57063K2887
3078C2221228O16053l3368J56647l4674N13807L39369m1569K5888L25574M46655
3068C4535610M50633j07412M52818K94482K51973K76230O07047M77732R06604
3059C8145717K59665M02810J022895L53350N47132P32169q8311N78160Q87000
3050D2840587M25655P24657L29687R55017J253558M75340P69493J416717K87113
$$ plain form
3117 32540440 32486698 32648309 32021625 31403819 31476731 31119242 31534180 31858994 31682344 31384488
3107 31384488 31686032 31343252 31662354 32001779 31655177 31986423 32261659 33255624 33750114
3098 33750114 33993300 34200745 34215704 34664051 34835024 34785456 35188016 34549064 34387068 34577217
3088 34577217 34295780 33741992 33304002 33276716 33456908 33490608 32768570 32755404 32198341 32221228
3078 32221228 32837281 32803913 32960560 32925886 33439693 33779062 33737493 33763381 34088955 34535610
3068 34535610 34986243 34878831 35331649 35626131 35878104 36154334 36761381 37239113 38145717
3059 38145717 38405382 38808192 39831087 40184437 40731569 41463738 41375427 41953587 42840587
3050 42840587 43266242 43990899 44320586 45275603 46529161 47004501 47773994 49190711 49477824
3041D9477824P53541O47338O17981P60196N51681L66761L73563J84962O40420
3032E4374267Q28043N91188J54287Q16326P47500M63747K66076J191428N48491
3023E9981353K24522L57827R8576O02745L24064M25711O5731J52051J19142L34359
3013F2686081k936L50007O48948L18906K84032M54417K34370M75539K66183k46968
3003F5468579l1435K80556M16229J90642J80566K56937J00956M19023N14715Q50611
2993F8647379M95152M61874R5698J38806J98915M83857O54368L77334N32058M51930
2983G2537371L51293R19149P78543o0636M55566J064873O85207N11014O02542
2974G7844922Q49357P40297M76672Q74628O39180R85271O81172P72873K57883
$$ plain form
3041 49477824 50231365 50878703 51496684 52256880 52808561 53175322 53548885 53733847 54374267
3032 54374267 55202310 55793498 55947785 56764111 57511611 57975358 58241434 59432862 59981353
3023 59981353 60205875 60563702 60662278 61265023 61589087 62014798 62080529 62232580 62351722 62686081
3013 62686081 62683145 63033152 63682100 64001006 64285038 64739455 64973825 65449364 65715547 65468579
3003 65468579 65437144 65717700 66133929 66324571 66505137 66762074 66863030 67282053 67796768 68647379
2993 68647379 69142531 69604405 69700103 69838909 70037824 70521681 71176049 71553383 72085441 72537371
2983 72537371 72888664 73807813 74586356 74525720 74981286 76046159 76731366 77242380 77844922
2974 77844922 78694279 79434576 79911248 80785876 81425056 82410327 83091499 83864372 84122255
2965H4122255N14328L84113Q23890J080076O32801J58266Q32045Q55960j69330
2956H9234404P38371P07792M83046L09279J56992L38593j5198j2568k798K29784
2946I2167697l58023n8578R2700p25356l25694m02372l16617n70432p24855o89186
2936H8089284j095255n54960m06857r01425r32673j915907j426058r94116q95029
2927G8967004j291093j520532j787654q49783j512029j191005j280897k026825
2919F7507186j154974j189687j140853j044004j476178j480189j154169p90186
2911E8076946j387787j160567p89154j099419o40958j397033r13490j587425p52183
2902D8348930o51194q30841n27844r72389j439117m19428m18103j119571q66591
$$ plain form
2965 84122255 84636583 85020696 85844586 86924662 87557463 87715729 88547774 89403734 89234404
2956 89234404 89972775 90680567 91163613 91472892 91629884 91968477 91953279 91940711 91937913 92167697
2946 92167697 91809674 91751096 91843796 91118440 90792746 90390374 90073757 89503325 88778470 88089284
2936 88089284 86994029 86439069 86032212 85130787 84198114 82282207 80856149 79862033 78967004
2927 78967004 77675911 76155379 74367725 73517942 72005913 70814908 69534011 67507186
2919 67507186 66352212 65162525 64021672 62977668 61501490 60021301 58867132 58076946
2911 58076946 56689159 55528592 54739438 53640019 52999061 51602028 50688538 49101113 48348930
2902 48348930 47697736 46866895 46339051 45366662 43927545 43508117 43090014 41970443 41103852
2893D1103852j127057n12615m75560j010441l43192m62639o65711n27836j56414
2884C5822387m56249k43601p61528j73012j93297l96127M08346j91106l7263n6331
2874C3722219p47804o81884M41103n07955m24734l04269l59884J32124m8104k78642
2864C0942170j95219q5569L899n44033J18466m26675j9406k6882m36j41677k60923
2853B9363715o7726l46015J18460p8647m00895J91782j69488l81829K27407J16999
2843B8573763l8422M8626J7286K13435K9326J3519N26702k20080k61319N7149
2833B8959985K82409J33647L05838k61923K32448M23987M93866j23110L71157
2824C0818304n5281R9991L22315m4189O51072P89495P61122J38777L37100N94137
$$ plain form
2893 41103852 39976795 39464180 38988620 37978179 37634987 37172348 36506637 35978801 35822387
2884 35822387 35366138 35122537 34361009 34187997 33994700 33598573 34006919 33815813 33778550 33722219
2874 33722219 32974415 32292531 32733634 32225679 31800945 31496676 31136792 31268916 31220812 30942170
2864 30942170 30746951 30661382 30665281 30121248 30239714 29813039 29793633 29766751 29766315 29624638 29363715
2853 29363715 29295989 28949974 29068434 28989787 28588892 28780674 28611186 28229357 28456764 28573763
2843 28573763 28535341 28583967 28601253 28814688 28844014 28857533 29384235 29164155 28902836 28959985
2833 28959985 29242394 29376041 29681879 29419956 29652404 30076391 30570257 30447147 30818304
2824 30818304 30763023 30863014 31185329 31141140 31792212 32581707 33342829 33481606 33818706 34412843
2814C4412843O30778Q48042M49531L86686J258819J082759J079123P08933R25298
2805D1782812R39528J044737Q42818Q18963O79796P24373N05858J196443P05951
2796D9241279j97879N46057J001726O52895N93169K72943O58761K12691K25012
2787E3206654L31904M44535O03631N25700J86804l11060l89590o4527K15258k98597
2777E4450712K58215K4603l47210J04503j0994o53593m28362j73769l52035n72623
2767E2299447o21330n67268K6909m64115j63337k09849m04126o77241r73117q30103
2757D7415870p29484p54805j59279p18233j131329m98882l55509l49099o32185
2748D2087065j081332k06075l00399n12333p16432m78910l85684k59002m34274
$$ plain form
2814 34412843 35043621 35891663 36341194 36727880 37986699 39069458 40148581 40857514 41782812
2805 41782812 42722340 43767077 44609895 45428858 46108654 46833027 47338885 48535328 49241279
2796 49241279 49043400 49589457 50591183 51244078 51837247 52110190 52768951 52981642 53206654
2787 53206654 53538558 53983093 54586724 55112424 55299228 54988168 54598578 54534051 54749309 54450712
2777 54450712 54708927 54733530 54386320 54490823 54479829 53826236 53397874 53224105 52872070 52299447
2767 52299447 51678117 51110849 51137758 50673643 50510306 50300457 49896331 49219090 48245973 47415870
2757 47415870 46686386 45931581 45772302 45054069 43922740 43423858 43068349 42719250 42087065
2748 42087065 41005733 40799658 40499259 39986926 39270494 38791584 38405900 38146898 37712624
2739C7712624k98081o73109q30338j95592m28513j72319p28551n83963Q47829
2730C4649987l7408p74361m39718j85651L89757K86820L3262J11225J42215m71353
2720C3704775k4384j07363n9686J51100P36941J03072o7155J16508K36825K34568
2710C5025201l63331k49719L5917P34014N30890o4178J63150M25962L61585N52150
2700C7151641j81295p9833q4533M48003M15382K73080R817J33213K19128O74677
2690C8979280P54553k40605M19945K2418K42595N24490J54428K13931K00765K7555
2680D1299355O31600N17525K23076N23749L59427K40032O86870O66300K19599
2671D5367533L37787N0055N67099M52630M84462L55708M27797L77870N04051J095930
$$ plain form
2739 37712624 37414543 36741434 35911096 35715504 35286991 35114672 34386121 33802158 34649987
2730 34649987 34612579 33838218 33398500 33212849 33602606 33889426 33922688 34033913 34176128 33704775
2720 33704775 33680391 33573028 33513342 33664442 34401383 34504455 34437300 34553808 34790633 35025201
2710 35025201 34661870 34412151 34448068 35182082 35712972 35648794 35811944 36237906 36599491 37151641
2700 37151641 36970346 36890513 36805980 37253983 37669365 37942445 37952262 38085475 38304603 38979280
2690 38979280 39733833 39493228 39913173 39935591 40178186 40702676 40857104 41071035 41271800 41299355
2680 41299355 41930955 42448480 42671556 43195305 43554732 43794764 44481634 45147934 45367533
2671 45367533 45705320 45755375 46322474 46775104 47259566 47615274 48043071 48420941 48924992 50020922
2661E0020922J53600j93102O47098J010962L29061K39892P28669P47701Q74939
2652E4559742Q41264j24416L63437P89291J055435M89173M88788O66919P22003
2643E9851636P01231Q03947N82131N23097J44387O29734M47464J164108O21065
2634F5468800Q07130N85370J073047P52484J323443R91738N32570R54707P02669
2625G3191958R27652N87285J356425Q61906R54149J057511R97908R55834J047953
2616H1938581O58619O78433J293614J083180M93071Q68170N49157J524731J223433
2607I0310989Q06121R33587J739144J337143Q55106R07117O07229R17979J397863
2598I9812278N64171J265093J152544J388350J348985O76273J094929J238091
$$ plain form
2661 50020922 50174522 49981420 50628518 51639480 51968541 52208433 52937102 53684803 54559742
2652 54559742 55401006 55276590 55640027 56429318 57484753 57973926 58462714 59129633 59851636
2643 59851636 60552867 61356814 61938945 62462042 62606429 63236163 63683627 64847735 65468800
2634 65468800 66275930 66861300 67934347 68686831 70010274 71002012 71534582 72489289 73191958
2625 73191958 74119610 74706895 76063320 76925226 77879375 78936886 79934794 80890628 81938581
2616 81938581 82597200 83275633 84569247 85652427 86145498 87013668 87562825 89087556 90310989
2607 90310989 91117110 92050697 93789841 95126984 95982090 96889207 97496436 98414415 99812278
2598 99812278 100376449 101641542 102794086 104182436 105531421 106207694 107302623 108540714
2590A08540714J149716J062471J234795J167064J986194J654130R04914J168043
2582A18868041K084787J792144J775033J739782J747088J545527J624048J626427
2574A32802877J349573J693516J553214J632885J440582J669919J534649J630941
2566A45308156K025489J763707J465973J459636J722833J362944J233057J302908
2558A57644703R83508Q93691R16386J094524J133470J085004Q04895J207300J471304
2549A67234785J242533J334734Q81584R03800R56351Q60468J055808N64063O28629
2540A75662755K32956O69293O70684M63122N34343N93992N94338R43409Q60895
2531A81225787j1527O4039J44778N93790J36213k66346m30322J05140M06488n01889
$$ plain form
2590 108540714 109690430 110752901 111987696 113154760 115140954 116795084 117699998 118868041
2582 118868041 120952828 122744972 124520005 126259787 128006875 129552402 131176450 132802877
2574 132802877 134152450 135845966 137399180 139032065 140472647 142142566 143677215 145308156
2566 145308156 147333645 149097352 150563325 152022961 153745794 155108738 156341795 157644703
2558 157644703 158628211 159521902 160438288 161532812 162666282 163751286 164556181 165763481 167234785
2549 167234785 168477318 169812052 170693636 171597436 172553787 173414255 174470063 175034126 175662755
2540 175662755 175895711 176565004 177235688 177698810 178233153 178827145 179421483 180364892 181225787
2531 181225787 181214260 181278299 181423077 182016867 182153080 181886734 181456412 181561552 181968040 181466151
2521A81466151q15504q09000k299k79873o99976Q4677p64611n36103n72013l68849
2511A76702600o18953q81427j034746j094116j054796p00509p68764j138770q81259
2502A68529260j145354q28618j019569j354162j313634j522137j082464n32053
2494A59731269r70263j416524j252796j273580p22587k93212q50084r63647j084312
2485A50904264l66251m27729p71439n81142J0922j80092N53334M46627M32735
2476A50021229J81137p5842N07042L05296K84162L82568N5393J82584j46014O14867
2466A52312422M84159j53152k24484p4508n89951m05778q9143r46315r24657j649481
2456A47739112j402154j046600j254177j520028j274119j562017j631440j748317
$$ plain form
2521 181466151 180650647 179841647 179839348 179559475 178859499 178944176 178179565 177643462 177071449 176702600
2511 176702600 176083647 175202220 174167474 173073358 172018562 171318053 170549289 169410519 168529260
2502 168529260 167383906 166555288 165535719 164181557 162867923 161345786 160263322 159731269
2494 159731269 158761006 157344482 156091686 154818106 154095519 153802307 152952223 151988576 150904264
2485 150904264 150538013 150110284 149338845 148757703 148768625 148588533 149141867 149588494 150021229
2476 150021229 150202366 150126524 150633566 150938862 151223024 151605592 151660985 151843569 151697555 152312422
2466 152312422 152796581 152643429 152418945 152344437 151754486 151348708 151259565 150313250 149388593 147739112
2456 147739112 146336958 145290358 144036181 142516153 141242034 139680017 138048577 136300260
2448A36300260j945192j463842j204556j752102j642929k372191k501593j655391
2440A21762464j531467k141595j695214j738570j149599j225914j677346j512405
2432A09090354j435741j104582j424724j503032o71018j291663j148635j022819
2424I9488140l45442m69078o53150m91663o40079n55137q60274o61109r03299
2415I3908909j55423Q059l20235k22445j01778q01627L36387j89476j31010l07761
2405I2023600q17155j32107M2794l62359n81459K46870k93247L06832M55613j3576
2395I0875806k42019m38839j13849l89496q50464q29107q32466m10652m71558
2386H6297356q55614j073708q24900n33720n14493j085925j454361q35294j901077
$$ plain form
2448 136300260 134355068 132891226 131686670 129934568 128291639 125919448 123417855 121762464
2440 121762464 120230997 118089402 116394188 114655618 113506019 112280105 110602759 109090354
2432 109090354 107654613 106550031 105125307 103622275 102951257 101659594 100510959 99488140
2424 99488140 99142698 98673620 98020470 97528807 96888728 96333591 95473317 94812208 93908909
2415 93908909 93753486 93761545 93441310 93218865 93117087 92315460 92651847 92462371 92331361 92023600
2405 92023600 91206445 91074338 91117132 90754773 90173314 90420184 90126937 90433769 90889382 90875806
2395 90875806 90633787 90194948 90081099 89691603 88841139 88012032 87179566 86768914 86297356
2386 86297356 85441742 84368034 83543134 83009414 82494921 81408996 79954635 79119341 77218264
2377G7218264j223248j147185j819315j350288j323001j044457j636145j444682
2369F6229943j394392j049812q29630q42759q29939j366441j267991j231249j296762
2360E6120968p16347q05349q21313j026564j232655o83410k10292l69805p26831
2351D9528402m16182k25274n15196n87191q32100m11492K360j28552n98781l18526
2341D5497468j19174k15092R9338q3898m93241l85505K6436n20255k02554p24983
2331D2878540o55114j21659k86889q54352L0159J74332K04493j16265l8363N1371
2321D1266253j22663J99322M08550R46o42391M80197K82710J40194N43921L18429
2311D2875468N06095Q22217Q95085K70970L59927Q75945M68643P69266Q38060
$$ plain form
2377 77218264 75995016 74847831 73028516 71678228 70355227 69310770 67674625 66229943
2369 66229943 64835551 63785739 62956109 62113350 61283411 59916970 58648979 57417730 56120968
2360 56120968 55404621 54599272 53777959 52751395 51518740 50835330 50625038 50255233 49528402
2351 49528402 49112220 48886946 48371750 47784559 46952459 46540967 46543327 46414775 45815994 45497468
2341 45497468 45378294 45163202 45262540 45178642 44685401 44299896 44326332 43806077 43603523 42878540
2331 42878540 42223426 42101767 41814878 40960526 40990685 41165017 41369510 41253245 41214882 41266253
2321 41266253 41143590 41342912 41751462 41752408 41110017 41590214 41872924 42013118 42557039 42875468
2311 42875468 43381563 44203780 45098865 45369835 45729762 46605707 47074350 47843616 48681676
2302D8681676J021610J435248J147967Q49011J357463J813005J553555J595553
2294E9455088J971882J586408K087833K168949K304772K176486J864098K748031
2286G6363547K254195K101921K561296K514795K419680K801536K484474K350421
2278I5851865J756071K123453K498099K440963K436946K675784K815665K831208
2270A15430054L209543L235497L300663L474793L812911L514133L021650L082516
2262A42081760K322743K140522J407790R76061P02986J36507q69024j082374q98614
2253A46918357j926414r94927j723867j726454j119183j339223j013596k77694
2245A36796999n95547n90384M63955N12795M30823M68598K02584L97657Q51534
$$ plain form
2302 48681676 49703286 51138534 52286501 53135512 54492975 56305980 57859535 59455088
2294 59455088 61426970 63013378 65101211 67270160 69574932 71751418 73615516 76363547
2286 76363547 78617742 80719663 83280959 85795754 88215434 91016970 93501444 95851865
2278 95851865 97607936 99731389 102229488 104670451 107107397 109783181 112598846 115430054
2270 115430054 118639597 121875094 125175757 128650550 132463461 135977594 138999244 142081760
2262 142081760 144404503 146545025 147952815 148928876 149631862 149768369 148899345 147816971 146918357
2253 146918357 144991943 143997016 142273149 140546695 139427512 138088289 137074693 136796999
2245 136796999 136201452 135611068 136075023 136587818 137018641 137487239 137689823 138087480 138939014
2236A38939014P48348O92926J285788P28971L40536L60902K36786N19154R53850
2227A44806275J540138J768214K237110K472514L229521L823375L567667M459570
2219A67904384M643244N023681N640467M872028N073320N153600M461645L402801
2211B06175170K640446K142050J420844M94045m26630p64631q78904j416171r61115
2202B08425104j118008r19396p49434o72970n63980j588950j887682k522714l178564
2193A95223406l778813m527251m421975m650816n269737n461469n394579n044681
2185A56674085m559882m269089m144350l988793l806633l245828l170353k862869
2177A26626288k839291k752512k487892k308153j817900j917837k161198j613214
$$ plain form
2236 138939014 139687362 140380288 141666076 142395047 142735583 143096485 143333271 143852425 144806275
2227 144806275 146346413 148114627 150351737 152824251 156053772 159877147 163444814 167904384
2219 167904384 172547628 177571309 183211776 188083804 193157124 198310724 202772369 206175170
2211 206175170 208815616 210957666 212378510 212872555 212445925 211681294 210802390 209386219 208425104
2202 208425104 207307096 206387700 205638266 204965296 204401316 202812366 200924684 198401970 195223406
2193 195223406 191444593 186917342 182495367 177844551 172574814 167113345 161718766 156674085
2185 156674085 152114203 147845114 143700764 139711971 135905338 132659510 129489157 126626288
2177 126626288 123786997 121034485 118546593 116238440 114420540 112502703 110341505 108728291
2169A08728291j775338j262136j172525j427273j361642j351050j638722j495609
2161I7243996j326084j470251j461519k194335k412772k049742k216304k439875
2153H1673114k491115j687509j711145k131720k691515k007347j837735k006623
2145F5108405j752953j903618j838031j407525j500798j508403j524586j255851
2137E2416640j268146q48924o95809j040551j130197r11166j318348q35153j025933
2128D3342413j369772p23904o04121m26563r64446p85108p07683m80060o26900
2119C6653856o13084k35231k63975l13005q76400m94019J24289k74786l50099
2110C3357546m59709J59009k75578J57146k16102q1391m85782l3757J45811O4086
$$ plain form
2169 108728291 106952953 105690817 104518292 103091019 101729377 100378327 98739605 97243996
2161 97243996 95917912 94447661 92986142 90791807 88379035 86329293 84112989 81673114
2153 81673114 79181999 77494490 75783345 73651625 70960110 68952763 67115028 65108405
2145 65108405 63355452 61451834 59613803 58206278 56705480 55197077 53672491 52416640
2137 52416640 51148494 50299570 49603761 48563210 47433013 46521847 45203499 44368346 43342413
2128 43342413 41972641 41248737 40644616 40218053 39253607 38468499 37760816 37280756 36653856
2119 36653856 36040772 35805541 35541566 35228561 34352161 33858142 33982431 33707645 33357546
2110 33357546 32897837 33056846 32781268 32938414 32722312 32640921 32155139 32121382 32267193 32331279
2100C2331279n3615l99494j95649j22132l56651m61072m28288j60016j00577j51833
2090B9901952m12835J55435k15578r0221P7311p02815K01093J50197r897K27556
2080B9282198k29197j23553M49474N3641K95683N72071O56301l54537j18332N93048
2070C1076797J060263P97909L23930N05523K60107P70052O51229M31933J73896
2061C6051639P418M74063J161503N67581J245390R25435J297938J724671J351178
2052D4806816J198668J145868J489602J922997K242164J873432K363443K923513
2044E9966503L014676K733734K250479K057067K084419K120634J099375J737844
2036G7064731J110644N53941L33124p95037k95051l85475m28416j410734j761901
$$ plain form
2100 32331279 32277664 31878170 31682521 31560389 31203738 30742666 30314378 30154362 30053785 29901952
2090 29901952 29489117 29644552 29428974 29338753 29416064 28713249 28914342 29064539 29054642 29282198
2080 29282198 29053001 28929448 29378922 29432563 29728246 30300317 30956618 30602081 30483749 31076797
2070 31076797 32137060 32934969 33258899 33764422 34024529 34794581 35445810 35877743 36051639
2061 36051639 36059057 36533120 37694623 38262204 39507594 40433029 41730967 43455638 44806816
2052 44806816 46005484 47151352 48640954 50563951 52806115 54679547 57042990 59966503
2044 59966503 62981179 65714913 67965392 70022459 72106878 74227512 75326887 77064731
2036 77064731 78175375 78729316 79062440 78267403 77972352 77586877 77158461 75747727 73985826
2027G3985826k050051k276352k576705k665152k709093k845645k689524k210427
2019E3962877k409421k941817j907725k175743j919012j354771k001224j699871
2011C7553293r36676j047699j522865j443784j016749p62086o41376r62027q99406
2002B8320625r08907q05192l85881n44794l45920m95594m64763q2145l48377m01841
1992B3537211j57232n44925m61855m96927m96642m11606K28444m16074p91718
1983A9988676k01213j11351p68932l53304o27808K3577K95014N76805l34675o15084
1973A7871705R5237K2083n93832k03347l25449q4298J20002j49264k97420j093028
1963A5362389k21106J25342l93990j14585j64817o11065m28745K0410k65468o27491
$$ plain form
2027 73985826 71935775 69659423 67082718 64417566 61708473 58862828 56173304 53962877
2019 53962877 51553456 48611639 46703914 44528171 42609159 41254388 39253164 37553293
2011 37553293 36616617 35568918 34046053 32602269 31585520 30823434 30182058 29220031 28320625
2002 28320625 27411718 26606526 26220645 25675851 25329931 24834337 24369574 24287429 23939052 23537211
1992 23537211 23379979 22835054 22373199 21876272 21379630 20968024 21196468 20780394 19988676
1983 19988676 19787463 19676112 18907180 18553876 17926068 17949645 18244659 18821464 18486789 17871705
1973 17871705 17966942 17989025 17395193 17191846 16866397 16782099 16902101 16752837 16455417 15362389
1963 15362389 15141283 15266625 14872635 14758050 14593233 13982168 13553423 13573833 13308365 12680874
1953A2680874l1096l56206p4340m43244p07100j53472l38953K81142K14080k99653
1943A0772032k72546l65649j75271J68572k469J11305J93938n65165M5078k81769
1933I628056k32482J6272k87044L23746j13716L20660o81101k86674M05270m4239
1923I048748j059k33744M1698l30726J82786l1217j23020J23592L54736N5205
1913I086999j29451l19098m70195N25728K30915J66825j92637J9887j1908l1428
1903H875637L45762k56683L22936L0088k2131j14316m10039j14830J07219L99439
1893I163082k50628J32065L05549K84806L5266j33888J015l24062k3575p6888
1883I112742l39371j84622R26511o9018j94629j21304L40839m0331M34814o4160
$$ plain form
1953 12680874 12649778 12293572 12219232 11775988 11068888 10915416 10576463 10857605 11071685 10772032
1943 10772032 10499486 10133837 9958566 10127138 10124669 10235974 10429912 9864747 9909825 9628056
1933 9628056 9395574 9411846 9124802 9448548 9334832 9655492 8974391 8687717 9092987 9048748
1923 9048748 9047689 8813945 8855643 8524917 8707703 8676486 8553466 8677058 9031794 9086999
1913 9086999 8957548 8638450 8168255 8693983 8924898 9091723 8899086 8918973 8907065 8875637
1903 8875637 9221399 8964716 9287652 9317740 9295609 9181293 8771254 8656424 8763643 9163082
1893 9163082 8912454 9044519 9350068 9634874 9670140 9536252 9537267 9213205 9189630 9112742
1883 9112742 8773371 8588749 9515260 9446242 9251613 9130309 9471148 9430817 9865631 9801471
1873I801471j27082L54621k14137J45225O15434l6252L92382L90305l94483J42746
1863A1070230J2934L40018O29379K6296j33911M1258L18224N50252Q00553J7259
1853A3672492K43923L19570N93267L67504K89266L46758M33885N26530M89196
1844A7282391L90052l60500O87717O26569M03699M24269J65963O85942O67174
1835B0973276R61605R45767M45843O04699O67821M07167K86581P01806K96726
1826B6291291P66623M07612M17232J059737N80384L42641R71248J056755N20253
1817C2413776J090318O21480J106530J229176P19030J179703J329718J726251
1809D1415982J214578J977194J891637J410306J428418J427535K501170K408756
$$ plain form
1873 9801471 9674389 10029010 9814873 9960098 10575532 10539280 10931662 11321967 10927484 11070230
1863 11070230 11083164 11423182 12052561 12078857 11944946 11986204 12304428 12854680 13655233 13672492
1853 13672492 13916415 14235985 14829252 15196756 15486022 15832780 16266665 16793195 17282391
1844 17282391 17672443 17311943 17999660 18626229 19029928 19454197 19620160 20306102 20973276
1835 20973276 21934881 22880648 23326491 23931190 24599011 25006178 25292759 25994565 26291291
1826 26291291 27057914 27465526 27882758 28942495 29522879 29865520 30836768 31893523 32413776
1817 32413776 33504094 34125574 35232104 36461280 37180310 38360013 39689731 41415982
1809 41415982 42630560 44607754 46499391 47909697 49338115 50765650 53266820 55675576
1801E5675576K231517K769603K842783K223663L109672L377859L599714M024594
1793G9854981L898253L928648L451380L766062L524458M434741M657196M629380
1785A12145099N776176O383205P111849P474992Q825947R778957J0315208J2064259
1777A79875692J2767036J4170877J4534085J6322301J7639274J9060756J9810641
1770B94180662J9381647J7308510J1484968L135869o819115j4950720k0886016
1763C02835805k4844977k4279909k3319965k1154488j8310842j5345956j3465050
1756A62114618j1638541j0110828r277848q117353p588442o878734o378751o043300
1748I6080821n735374m688126m755465m486302l701211l342267k967057k858394
$$ plain form
1801 55675576 57907093 60676696 63519479 65743142 68852814 72230673 75830387 79854981
1793 79854981 83753234 87681882 91133262 94899324 98423782 102858523 107515719 112145099
1785 112145099 117921275 124304480 131416329 138891321 147717268 157496225 167811433 179875692
1777 179875692 192642728 206813605 221347690 237669991 255309265 274370021 294180662
1770 294180662 313562309 330870819 342355787 345491656 338672541 323721821 302835805
1763 302835805 277990828 253710919 230390954 209236466 190925624 175579668 162114618
1756 162114618 150476077 140365249 131087401 122970048 115381606 108502872 102124121 96080821
1748 96080821 90345447 85657321 80901856 76415554 72714343 69372076 66405019 63546625
1740F3546625k436734k136463j985845k382821k175070j767371j861319j222638
1732D7578364j481457j770727j413757j329625j479410j684675j140112j247881
1724C6030720r77687o77822j069459j335321n43092p52511j156598j93968r43018
1715B8381244l17648q25181p53746o45190r06801l35772n51975j81755k43098
1706B3620078j40949p59522k78684q8527p09138j9103n85870n11418q58884o01812
1696A9066171l94650k26331n97452q08447J58323l21381k5585r3026n66505r35385
1686A5255732m40581K34775l92853r1800p53720q8098j06107L24116n68224m22444
1676A2950796R9330L1613j16548q68771l80618J35863q4229m4434j78662o37171
$$ plain form
1740 63546625 61109891 58973428 56987583 54604762 52429692 50662321 48801002 47578364
1732 47578364 46096907 44326180 42912423 41582798 40103388 38418713 37278601 36030720
1724 36030720 35053033 34375211 33305752 31970431 31427339 30674828 29518230 29324262 28381244
1715 28381244 28063596 27238415 26484669 25839479 24932678 24596906 24044931 23863176 23620078
1706 23620078 23479129 22719607 22440923 22352396 21643258 21624155 21038285 20526867 19667983 19066171
1696 19066171 18671521 18445190 17847738 17039291 17197614 16876233 16850648 16757622 16191117 15255732
1686 15255732 14815151 15049926 14657073 14565273 13811553 13723455 13617348 13941464 13373240 12950796
1676 12950796 13050126 13081739 12965191 12096420 11715802 11851665 11767436 11723002 11544340 10907169
1666A0907169m30214q4672j2763J1638J51065o42125j26011m33663k08503J41915
1656I273836q8996j19943N4917M3739j1638k54096o66508m41042j46222M84737
1646H128784j30263m83183j97218k74500M09044J27883k15679j97581l33613j83057
1636F650617K52883k01556l83791J81300j85472M84018J49350o44527n99685P23784
1626F426921j32647n03933M33327k55974k25624j63238J58976p9468k12515j11939
1616E333886K30251L76845r4202R6194l46297k43738k64650L67538K39128m4336
1606E650619k52177n23708K09561k52805j6529N0047o52025Q9164m942j37401
1596D159804J89651K3727m72115K87477L87009k29987o4643R4233k2710p1053
$$ plain form
1666 10907169 10476955 10392283 10379520 10391158 10542223 9900098 9774087 9340424 9131921 9273836
1656 9273836 9184840 9064897 9119814 9163553 9151915 8897819 8231311 7790269 7644047 8128784
1646 8128784 7998521 7515338 7318120 7043620 7452664 7580547 7364868 7167287 6833674 6650617
1636 6650617 6903500 6701944 6318153 6499453 6313981 6797999 6947349 6302822 5703137 6426921
1626 6426921 6294274 5790341 6223668 5967694 5742070 5578832 5737808 5658340 5445825 5333886
1616 5333886 5564137 5940982 5846780 5942974 5596677 5352939 5088289 5455827 5694955 5650619
1606 5650619 5398442 4874734 5084295 4831490 4814961 4865008 4212983 4302147 4297205 4159804
1596 4159804 4349455 4373182 3901067 4188544 4575553 4345566 4280923 4375156 4352446 4281393
1586D281393M05811l52476k12969o90964K24935K94227o7272q87176l14703O03201
1576C284007r1135l52444o2177J52084K38759o00915M25362O8184m70352o05441
1566A985932K71412J17571L951L46659n32950r4349K70284K88441K84922j01023
1556B840850m47919j58589P26238k13096m94532J42872J71368N45532n20856k30628
1546B361240l231q4211m29976P56851k67149o94494K53923n0451Q9035J1667m4123
1535A899081j91846L17867J63749k63420l7500K81641o611p1559K22660Q8527
1525B402589o9049k18203j21879q9525J08705k4799k11085j87957L11787L08412
1515B208996j15054k79598k77357j06442L96593j38585O32k40461O4386K93391
$$ plain form
1586 4281393 4687204 4334728 4121759 3430795 3655730 3949957 3882685 2995509 2680806 3284007
1576 3284007 3192872 2840428 2778251 2930335 3169094 2568179 2993541 3061725 2591373 1985932
1566 1985932 2257344 2374915 2378866 2725525 2192575 2098226 2368510 2656951 2941873 2840850
1556 2840850 2392931 2234342 2960580 2747484 2252952 2395824 2567192 3112724 2591868 2361240
1546 2361240 2358009 2273798 1843822 2600673 2333524 1639030 1892953 1842502 1931537 1943204 1899081
1535 1899081 1707235 2025102 2188851 1925431 1887931 2169572 2162961 2091402 2314062 2402589
1525 2402589 2333540 2115337 1993458 1903933 2012638 1987839 1776754 1588797 1900584 2208996
1515 2208996 2093942 1814344 1536987 1430545 1827138 1688553 1689185 1448724 1513110 1806501
1505A806501q2384o1219k24088K54982k79530J53277j96997l72899M01065M35827
1495A834535L9021k89117L89676j61639K69477k710J6445p36886Q0665L51814
1485A791281R292j18090k50209L41446K97463O0340j49087K05016n573J59649
1475B341528k72984j47707L01290J50440j36925L28420L5734M977N57020L632
1465C165425l63084J9168l23976N75388r6127n99386l19425O7232k81550j83933
1455A659732L7430P5443N572m782o1530l04403k12468r5623P1505P9016j38713
1444A111179o2021K03543k19846Q6640K8165r0964K19428R6726N598k99709j40102
1433I38637K5930K31842L7387J1342K09019k37360k52411J2793k45968R7692K71247
$$ plain form
1505 1806501 1724117 1662898 1438810 1693792 1414262 1567539 1370542 997643 1398708 1834535
1495 1834535 1873556 1584439 1974115 1812476 2081953 2079243 2095688 1358802 1439467 1791281
1485 1791281 1800573 1682483 1432274 1773720 2071183 2131523 1982436 2187452 2181879 2341528
1475 2341528 2068544 1920837 2222127 2372567 2235642 2564062 2599796 2604773 3161793 3165425
1465 3165425 2802341 2821509 2497533 3072921 2976794 2377408 2057983 2125215 1843665 1659732
1455 1659732 1697162 1772605 1778177 1773395 1711865 1407462 1194994 1099371 1170876 1249892 1111179
1444 1111179 1049158 1252701 1032855 1119495 1147660 1056696 1276124 1372850 1378448 1078739 938637
1433 938637 964567 1196409 1233796 1245138 1454157 1216797 964386 977179 731211 828903 1100150
1422A100150m86611R6550J14729M1336K01068k31609m48338k98755N82813L86083
1412A057416j6706k08943J60879N32608J32570q63362m89308K04062J67226J74335
1402H50777l97274j14426J6066L69189J80630j23607j81517J13742N17640j4531
1392A216689k93350j50269l9599k5562o6124K17480l05391L31098o8528K32891
1382A049335l03221m97447K22395L56006N83551l17513o79781J82274N53723l84502
1372G64820n80857Q62239K30975J43251k65113l57314R466J94022r3721m41722
1362D66046K47278O3039J90044O61595n46525m67614J58965P34128l63895l96729
1352G46332m3111K85202K36558m06822l92335k78223L03907M12326L68884n11967
$$ plain form
1422 1100150 613539 710089 824818 866154 1067222 835613 387275 88520 671333 1057416
1412 1057416 1040710 831767 992646 1525254 1657824 794462 305154 509216 676442 850777
1402 850777 453503 339077 355143 724332 904962 781355 599838 713580 1231220 1216689
1392 1216689 923339 773070 733471 707909 641785 859265 553874 884972 816444 1049335
1382 1049335 746114 248667 471062 827068 1410619 1093106 413325 595599 1149322 764820
1372 764820 183963 1046202 1277177 1420428 1155315 798001 807467 1001489 907768 466046
1362 466046 713324 776363 966407 1628002 1081477 613863 772828 1506956 1143061 746332
1352 746332 703221 988423 1224981 818159 425824 147601 451508 863834 1232718 720751
1342G20751k1430j27466K31199J91620M54284k43113k54567k92450m82715j58809
1332A7304L96406M99985m353l07367J89174l2648J40766m44367p9885r9067M43119
1321G19067O7894k44693k82031j56006N29693J9576J04494l21160k20038M77748
1311F94544J3496O7439j901n35016j00420N36530O1441n14482m50985L06056N48298
1300F25000m3402P5292j65339J37679M9261j91972l0179J4670j6524L8064l0276
1289D62274P759j4514L1000J07011K77996M6483K86261K2548m67282n89483K58820
1278D28873J19649k72492K84792k48379p164m85K19391j32049J53944R8356O14450
1267A258886n01187q89242O21877k40388M66155J99252k12052l60746j16677K64124
$$ plain form
1342 720751 699321 571855 803054 994674 1448958 1205845 951278 658828 176113 17304
1332 17304 413710 913695 909342 601975 791149 758501 899267 454900 375015 275948 719067
1321 719067 786961 542268 260237 104231 633924 653500 757994 436834 216796 694544
1311 694544 708040 775479 773578 238562 138142 674672 736113 221631 -229354 76702 625000
1300 625000 581598 656890 491551 629230 678491 486519 456340 471010 454486 492550 462274
1289 462274 470033 455519 486519 593530 871526 918009 1204270 1226818 759536 170053 428873
1278 428873 548522 276030 560822 312443 305279 304794 524185 392136 546080 644436 1258886
1267 1258886 757699 -131543 490334 249946 716101 915353 703301 342555 225878 490002
1257D90002M51327J80599m25661J33289k02480j72746m5996m37874J93603M34002
1247E98065l0984l29616L71354R4604p5350j2582K25271L94265k81686l54071
1237E99270o2381J72263K57947L33515j76986j6034o0374M30441K40384j90870
1227A527175l68819o39265j33221j45494j61732o5179j23573k3155K49750J65287
1217B81774K83408L93279k39238J69742n6127p23519j10272K45676j408J21926
1207C65241j17257L5450L33534J32679j50512L78700J33369m24314j31812k26618
1197C28460j41108k54275K8191K81438K60849N5604l41123p6710K13565M3237
1187C98128k1357J04585J45580k35188q8493m86880M3409K99310J06825l24874
$$ plain form
1257 490002 941329 1121928 696267 829556 627076 454330 408334 -29540 164063 598065
1247 598065 567081 237465 608819 703423 628073 615491 840762 1235027 953341 599270
1237 599270 536889 709152 967099 1300614 1123628 1107594 1047220 1477661 1718045 1527175
1227 1527175 1158356 519091 385870 240376 78644 13465 -110108 -133263 116487 281774
1217 281774 565182 958461 719223 888965 832838 109319 -953 244723 243315 365241
1207 365241 247984 283434 616968 749647 599135 977835 1111204 686890 555078 328460
1197 328460 187352 -66923 -38732 242706 503555 559159 218036 141326 354891 398128
1187 398128 376771 481356 626936 391748 303255 -183625 -140216 159094 265919 -58955
1177e8955K01577K48714N05149m79238j35612K86135l12019j64319n6660o1938
1167b7166o1490J88979Q5973J10067L1251p9584K36056N8626J24737m74500M0085
1156B33034O56026P8250m32410j88762q6925J1070J12150M40023J36047l99753
1146E58750J17655m3392l76766J43959j43093j64828L29767k95645R7739k17487
1136F659J3029j09431Q4148K81085K68433k5911r1048r4171K04598J82149N8209
1125G77749l95851k67571n0305M14498l41990l14017M93779q8752k9982L32156
1115E29714k06399k38563R632L01055p8099k04065m7426N3006K64081J16978j77027
1104C22887j45759J25779j54321J13849P30978M5297r9035j87474j79333O3866
$$ plain form
1177 -58955 142622 391336 896485 417247 281635 567770 255751 91432 34772 -27166
1167 -27166 -88656 100323 186296 296363 327614 248030 484086 542712 667449 192949 233034
1156 233034 889060 967310 534900 346138 259213 270283 382433 822456 958503 558750
1146 558750 676405 633013 256247 400206 257113 92285 422052 126407 224146 6659
1136 6659 19688 -89743 -5595 275490 543923 518012 426964 332793 537391 719540 777749
1125 777749 381898 114327 64022 478520 136530 -177487 316292 227540 197558 529714
1115 529714 323315 84752 94384 395439 317340 113275 65849 118855 382936 499914 322887
1104 322887 177128 302907 148586 262435 993413 1038710 939675 752201 572868 636734
1094F36734K76506m96857n42977O16162P4248m5182M6771K59490J55593K33609
1084A214097R7142k77394m77882K12066L96247M14694q6094J87072J8020o09727
1074A088241l0659K16633m00549J11989K30389J55154k22598m40926j78844M43338
1064I72168M75755l1937J2008j74608J77245j72741n97266J29784P64136m03579
1054A150965R0811j3801N82794k5366j5801j35774k58072J08826k78728M5997
1044A251851J58998L0390j4594J46758j34970k96498m30917O25225O54246l67908
1034A622581K28295L66261j07590j11585M8198q0889J20221L72633K56260k64821
1024B449564m48660m2914K08063L93531M97409R622M29473J74616o15918K49868
$$ plain form
1094 636734 913240 416383 -126594 489568 563816 518634 565405 824895 980488 1214097
1084 1214097 1311239 1033845 555963 768029 1164276 1578970 1492876 1679948 1697968 1088241
1074 1088241 1057582 1274215 873666 985655 1216044 1371198 1148600 707674 528830 972168
1064 972168 1447923 1415986 1427994 1253386 1430631 1257890 660624 790408 1554544 1150965
1054 1150965 1241776 1227975 1810769 1785403 1769602 1633828 1375756 1484582 1205854 1251851
1044 1251851 1410849 1441239 1426645 1573403 1438433 1141935 711018 1336243 1990489 1622581
1034 1622581 1850876 2217137 2109547 1997962 2046160 1965271 2085492 2458125 2714385 2449564
1024 2449564 2000904 1957990 2166053 2559584 3056993 3066615 3496088 3670704 3054786 3304654
1014C304654l1513N3879q2966N2365L24247o9614o3301K91171j45219j56995O49294
1003D126002j99672O0771J06553K98490J3972M1753M22943n35169L49137N95040
993E279820N84005l33228K09959M69717K32291L05945K48005P4075j26016J40125
983G084698P31327M31146L23660M85763p3164N85980J161650L34325Q10191J230565
973A3106141R80068Q29202O94213J177973J544050J588467J595436J742249J581198
964B4838997J913478K112498K449275L529358L623183M172735M979144N345602
956E2964270N711582O822862P592780Q703042J0816297J2952734Q304131l787245
948A10080453j2308049j4754446j3502795j1571295r090407p185485o034090m010890
$$ plain form
1014 3304654 3273141 3327020 3244054 3296419 3620666 3551052 3487751 3778922 3633703 3476708 4126002
1003 4126002 3926330 3987101 4093654 4392144 4406116 4447869 4870812 4335643 4684780 5279820
993 5279820 5863825 5530597 5740556 6210273 6442564 6748509 6996514 7070589 6944573 7084698
983 7084698 7816025 8247171 8570831 9056594 8983430 9569410 10731060 11065385 11875576 13106141
973 13106141 14086209 14915411 15609624 16787597 18331647 19920114 21515550 23257799 24838997
964 24838997 26752475 28864973 31314248 34843606 38466789 42639524 47618668 52964270
956 52964270 58675852 65498714 73091494 81794536 92610833 105563567 113867698 110080453
948 110080453 97772404 83017958 69515163 57943868 48853461 41667976 35633886 31622996
940C1622996k706004k503636k148941j060762j084950n44019m00868j380573j345347
931A8447896j185827j281972j042956q42469r43922r22291q65186n71129o11742
922A0180402r3883l37068n26414n61378O3379j75774r9728m84190p15231l35961
912F914154o3174j99311k59812m57302J2394J43510m84145k47693R3195K0901
902E472717L124k04365k25628k89003n09718K40366q5671l65162j31474K46366
892D151552N337l61906n93611J30760N65737m9686k92443r5633n15861l78008
882B566238l3186M56143Q9897j89822J464k79919l66916K78016M18994m2056j65314
871B733539n84860m44760J47413k72506J38588J76259j01739R7045K89227Q7303
$$ plain form
940 31622996 28916992 26413356 24264415 23203653 22118703 21574684 21173816 19793243 18447896
931 18447896 17262069 15980097 14937141 14094672 13150750 12228459 11363273 10792144 10180402
922 10180402 10086519 9749451 9223037 8661659 8725038 8549264 8449536 7965346 7250115 6914154
912 6914154 6850980 6651669 6391857 5934555 5946949 6090459 5606314 5358621 5451816 5472717
902 5472717 5475841 5271476 5045848 4756845 4247127 4487493 4401822 4036660 3905186 4151552
892 4151552 4156889 3794983 3201372 3332132 3897869 3848183 3555740 3460107 2944246 2566238
882 2566238 2533052 2989195 3079092 2889270 2890734 2610815 2243899 2521915 2940909 2898853 2733539
871 2733539 2148679 1703919 1851332 1578826 1717414 1893673 1791934 1888979 2178206 2265509
861B265509O5039j4518j07469l79369j9141j53698J06915L53092n31647l31604
851A253109J82684K17410j11655N26788k76870j51101r0852p486m08480n50014
841E83533J07985N52465K05517l963M25831o6221j96492J63517m61049J24216
831A435339Q0242m98160k64219o415m24000K43105M81589N8171o3149L87978k67703
820A162778k89684M83209j53336l75314o2403K39542L3766l59707j33477J92756
810G38130J05291p0418K41281J60456k966q3371p5942o88057l077J47487K10094
799F78908J25920n35483L58494K15231J18801k78708K64262k02838K01183k99686
789F46084r7135M52134l18878k53257o068j25713j28369M97608J25756o41177
$$ plain form
861 2265509 2330548 2316030 2208561 1829192 1810051 1656353 1763268 2116360 1584713 1253109
851 1253109 1435793 1653203 1541548 2068336 1791466 1640365 1549513 1542027 1133547 583533
841 583533 691518 1243983 1449500 1445537 1871368 1805147 1608655 1772172 1311123 1435339
831 1435339 1515581 1017421 753202 746787 322787 565892 1047481 1105652 1042503 1430481 1162778
820 1162778 873094 1356303 1202967 827653 765250 1004792 1038558 678851 545374 738130
810 738130 843421 773003 1014284 1174740 1171774 1088403 1012461 324404 321327 468814 678908
799 678908 804828 269345 627839 843070 961871 683163 947425 744587 945770 646084
789 646084 548949 1001083 682205 428948 422880 297167 168798 666406 792162 150985
779A50985J97623J74999j15441j3557L12002n4029Q5953k09182l80739p81727
769f33113N9919L03845N32221O99743n60764l37708K101J72498R8123L0660l56458
758A1067J69782L190L27481M6370m04932K70674R2653K85695j99845N5193m60673
747A96655j45002J30981J24514j26638n00612O07071j7145n81330K60783K53127
737B02404k62589M47806k68640L5026j96249P0230o4699l06705L02229k8113P53
726f8547M46214K55355l97212M3721L4226m25506J20470j23096M9620k84465K00564
715a48656L62506l02567o6065L60791k18337r4120J49125K8890J3171N6040j90495
704d9717P5144J36844n10201J50400j63171M07253Q248k40137J35453J92664k7759
$$ plain form
779 150985 348608 523607 408166 394609 706611 652582 738535 529353 148614 -633113
769 -633113 -573194 -269349 262872 962615 401851 64143 66244 238742 336865 367525 11067
758 11067 180849 184039 511520 557890 152958 423632 516285 801980 602135 657328 196655
747 196655 51653 182634 307148 180510 -320102 286969 269824 -311506 -50723 202404
737 202404 -60185 387621 118981 154007 -42242 27988 -36711 -343416 -41187 -69300 -68547
726 -68547 377667 633022 235810 279531 313757 -111749 8721 -114375 -64755 -349220 -148656
715 -148656 213850 -88717 -154782 206009 -12328 -106448 42677 71567 84738 140778 -49717
704 -49717 25427 162271 -347930 -197530 -360701 46552 54800 -185337 -49884 142780 115021
693A15021l33520L0111L46007Q0256r4649J223j54777j1902J01624j56327J40557
682F3624l34927j15068J16248M19068J1765J2020k78202m9424J73920n22887M89984
671a3879K92866N2816K36787l38809m99657K37894M32317j53660J79558J08388
661E34621m09667j44197Q4988j97772k63754M48794L38869o43262J06336L28823
651A83779O5703k24742j63164l34721K46194j71983J80584m08825l16057Q23048
641a20184J90671q5696k41317R6866l89388N94769K9485m91504k21636p8245L31133
630c85046K20509l52937l31716q416K96579O5768L9497k00308K37245J34150j25355
619d10030q3092k11107J45459J55532J89156O4269j19137J71116K20683l90398
$$ plain form
693 115021 -218499 -188388 157619 237875 143226 144449 -10328 -22230 79394 -76933 63624
682 63624 -271303 -386371 -270123 148945 160710 172730 -105472 -154896 19024 -503863 -13879
671 -13879 278987 331803 568590 229781 -269876 -31982 400335 246675 426233 534621
661 534621 124954 -19243 65745 -132027 -395781 53013 391882 -251380 -145044 183779
651 183779 249482 24740 -138424 -473145 -226951 -398934 -218350 -627175 -943232 -120184
641 -120184 70487 -15209 -256526 -159660 -549048 45721 75206 -416298 -637934 -716179 -385046
630 -385046 -164537 -517474 -849190 -857606 -561027 -495259 -455762 -656070 -418825 -284675 -410030
619 -410030 -493122 -704229 -558770 -403238 -214082 -149813 -268950 -97834 122849 -267549
609b67549K263J84692k62502N6835m52582N2111J90947K29051j25893J77353n7623
598b72897J41525J34210k44898R1206k60924N48697k6666l68409n7616O750J64220
587a44802L8740l170m82062q3279J3787L77890k58181K8852J93290l89302J16494
576e91743K56734M8294J80465K83323p66107k40997L48572O2297n0808r0100J71410
565c88660Q226j58745M46655n85628j57882K28692j29533M03575M5927m67004
555g54377m373N66426K58505R8454n99756m5247J29010k21000L60133m29962j31511
544g73698J20890J93934l8581K56122n95489J61704M01708n88836J92677o31966
534a301535J03450O33402J8231M32307J30123o58854J94010N34100k46691L1898
$$ plain form
609 -267549 -265286 -80594 -343096 -286261 -738843 -686732 -495785 -266734 -392627 -215274 -272897
598 -272897 -131372 2838 -242060 -150854 -411778 136919 110253 -258156 -315772 -309022 -144802
587 -144802 -106062 -109232 -591294 -674573 -660786 -282896 -541077 -512225 -318935 -708237 -591743
576 -591743 -335009 -286715 -106250 177073 -589034 -830031 -481459 -419162 -469970 -560070 -388660
565 -388660 -380434 -539179 -92524 -678152 -836034 -607342 -736875 -333300 -287373 -754377
555 -754377 -758750 -192324 66181 164635 -435121 -480368 -351358 -572358 -212225 -642187 -773698
544 -773698 -652808 -458874 -497455 -241333 -836822 -675118 -273410 -862246 -669569 -1301535
534 -1301535 -1198085 -564683 -546452 -114145 15978 -642876 -448866 85234 -161457 -129559
524a29559n7982J88824m82686m28757M38952R9645J76084j39360L5541K73304
514b5994Q5356o14759K42041M7394l84717K94331l30057J24130J126L12107K54065
503E023l82276l44976L09843O01546m73317o2941q2525J8083J08645l23832m6501
492f73228M51777j70316J27594J00018n15909k7209L43027q6547J46444j44740
482d49089m77951N74306l35470j41920L75591j92894Q4887j48443k62355N22248
472d51090J41380j09032M6512o9715n28819l8816M78787j17311j23752l14685
462a086541L17077M29673l50948r0724L2801O53487j17901r8419j04434J56223
452b59706j57393l26808n23124J48025N47855l3221n0482J4401k83630L04798
$$ plain form
524 -129559 -187541 1283 -481403 -910160 -471208 -371563 -195479 -334839 -299298 -25994
514 -25994 59362 -555397 -313356 -265962 -650679 -356348 -686405 -562275 -561149 -249042 5023
503 5023 -377253 -722229 -412386 189160 -284157 -347098 -429623 -411540 -302895 -626727 -673228
492 -673228 -221451 -391767 -264173 -164155 -680064 -707273 -364246 -450793 -304349 -449089
482 -449089 -927040 -352734 -688204 -830124 -454533 -647427 -562540 -710983 -973338 -451090
472 -451090 -309710 -418742 -372230 -441945 -970764 -1009580 -530793 -648104 -771856 -1086541
462 -1086541 -769464 -339791 -690739 -781463 -748662 -95175 -213076 -311495 -415929 -259706
452 -259706 -417099 -743907 -1267031 -1119006 -571151 -604372 -654854 -640453 -924083 -619285
442f19285j16368R7125j25171M5846J38396m07589J57514j77408J37160K00327
432f69453J24762l48155K81777j27801J21713L45682j61179l12946j07630j20694
422i73924L57290j44480l59766J23664J02879J16268l6744J5030L0476j08763
412h78070J44450M2241J24192k19229L4549k59012P9047K34141j18588r9949M7029
401h69199r5841J77075p5152K9602J98126k76567M75256J48828l61831J26224
391e23479m10586M03729M83911o85424O35901l70125n26461J21274j16955q877
381i97092L3816m7680r3207K94150j95303O1446M44444j51480P9417n87959N4176
370a105272O04408k37698j14069n15301j51843L83039L82106J33016J35902k21823
$$ plain form
442 -619285 -735653 -638528 -763699 -717853 -579457 -987046 -829532 -1006940 -869780 -669453
432 -669453 -544691 -892846 -611069 -738870 -617157 -271475 -432654 -745600 -853230 -973924
422 -973924 -616634 -761114 -1120880 -997216 -894337 -778069 -814813 -799783 -769307 -878070
412 -878070 -733620 -691379 -567187 -786416 -751867 -1010879 -931832 -697691 -816279 -916228 -869199
401 -869199 -965040 -787965 -863117 -833515 -635389 -911956 -436700 -287872 -649703 -523479
391 -523479 -934065 -530336 -46425 -731849 -95948 -466073 -992534 -871260 -988215 -997092
381 -997092 -963276 -1010956 -1104163 -810013 -1005316 -943870 -499426 -650906 -571489 -1159448 -1105272
370 -1105272 -500864 -738562 -852631 -1367932 -1519775 -1136736 -754630 -621614 -485712 -707535
360g07535M1079l98116l84643L81180K76674N31239k19225o89846L60121M05419
350d03653k65401j45979k09279j52892N04647J2839k54403J21336n61085K74179
340a079691J33926k42968K9874k35345q3463j61603M65120P3531N35086N5980
330e09553n56457j77255O67165n0783l10724L13548m25568j99289J38801M75930
320f34185j42673R1837m5738k57030M1932k71635k16173J13246K65670K0824o26
309a034551L58610K7656j63648J75750l5929m86930K51685l27757j3964L0473
299a218605m03797L88560J65982l50766m2946J48596N12853J42718m34543m6832
289a138780J18762R492j43413J15369m11766J37822L23501k18309M7480K14146
$$ plain form
360 -707535 -666456 -1064572 -1449215 -1068035 -791361 -260122 -479347 -1169193 -809072 -403653
350 -403653 -669054 -815033 -1024312 -1177204 -672557 -659718 -914121 -792785 -1353870 -1079691
340 -1079691 -945765 -1188733 -1158859 -1394204 -1477667 -1639270 -1174150 -1100619 -565533 -509553
330 -509553 -1066010 -1243265 -576100 -626883 -937607 -624059 -1049627 -1248916 -1110115 -634185
320 -634185 -776858 -685021 -730759 -987789 -945857 -1217492 -1433665 -1320419 -1054749 -1033925 -1034551
309 -1034551 -675941 -648285 -811933 -636183 -672112 -1159042 -907357 -1235114 -1249078 -1218605
299 -1218605 -1622402 -1233842 -1067860 -1418626 -1461572 -1312976 -800123 -657405 -1091948 -1138780
289 -1138780 -1020018 -1010526 -1153939 -1038570 -1450336 -1312514 -989013 -1207322 -1159842 -945696
279i45696j45078Q7231l01927J25817J49214k7886Q6782j29511j68325K87201
269i82178n7040J34539K51304l83862k37106q5388k5443k09611L64745j13240
259a343280Q2767L16620J45553J17849l20303k39572j36897k43036L21012k43866
249a543153L82192J52997K53162J29164R3864K07824j87214j73845m21501q1126
239a187636J52975l17762j8698K0478N04804K81641m93947m07680K01702n5899
229a320022J14804k93906m9024P24470k26880J8215k77323j6579K33046m72190
219a565389J22449j40189l10618K18644J14116M30562k57345j93692K83015L19880
209i78567l4756m7642K73816k27772J61509n98862j72054K11791m2850M71769
$$ plain form
279 -945696 -1090774 -1003543 -1305470 -1179653 -1030439 -1058325 -971543 -1101054 -1269379 -982178
269 -982178 -1039218 -904679 -653375 -1037237 -1274343 -1359731 -1385174 -1594785 -1230040 -1343280
259 -1343280 -1260513 -943893 -798340 -680491 -1000794 -1240366 -1377263 -1620299 -1299287 -1543153
249 -1543153 -1160961 -1007964 -754802 -625638 -531774 -323950 -511164 -685009 -1106510 -1187636
239 -1187636 -1034661 -1352423 -1371121 -1350643 -845839 -564198 -1058145 -1465825 -1264123 -1320022
229 -1320022 -1205218 -1499124 -1548148 -823678 -1050558 -1032343 -1309666 -1326245 -1093199 -1565389
219 -1565389 -1442940 -1583129 -1893747 -1675103 -1560987 -1130425 -1387770 -1581462 -1298447 -978567
209 -978567 -1013323 -1060965 -787149 -1014921 -853412 -1452274 -1624328 -1412537 -1455387 -983618
199i83618k86058k88935J33352J62285r4807o642k64565J23715Q0901N2160N4275
188a317937R0393m0223o3292L4805j23906j03197k25946K07704K34498j90557
178a497658k2468J30195K80643k39569l15109j28056M56273l1626q9146j85647
168a642168J6535N42878q41922L7772L21476J28502K51742o1867L5453j18437
158a330036j36237K8426m0549p24524K76099M95226L16891m02201m76521N8435
148a934991L99857k0587o160m9836K14830M19718n1985L4634K6742k94496o5876
137a328150L35261L9281k89696m4788l376K26264m29338k67705L57903K47832
127a156512j62753l29023M1756n6237P4734j11045Q4990L40758l31132o5148K90590
$$ plain form
199 -983618 -1269676 -1558611 -1425259 -1262974 -1357781 -1364423 -1628988 -1505273 -1424372 -1372212 -1317937
188 -1317937 -1227544 -1267767 -1331059 -1296254 -1420160 -1523357 -1749303 -1541599 -1307101 -1497658
178 -1497658 -1520126 -1389931 -1109288 -1348857 -1663966 -1792022 -1335749 -1367375 -1456521 -1642168
168 -1642168 -1625633 -1082755 -1924677 -1886905 -1565429 -1436927 -1185185 -1247052 -1211599 -1330036
158 -1330036 -1466273 -1437847 -1478396 -2202920 -1926821 -1431595 -1114704 -1516905 -1993426 -1934991
148 -1934991 -1535134 -1555721 -1561881 -1611717 -1396887 -977169 -1029154 -994520 -967778 -1262274 -1328150
137 -1328150 -992889 -953608 -1243304 -1288092 -1291468 -1065204 -1494542 -1762247 -1404344 -1156512
127 -1156512 -1319265 -1648288 -1606532 -1662769 -1588035 -1699080 -1614090 -1273332 -1604464 -1669612 -1379022
116a379022l06834m6118Q8595j01649j26451L6758J46688J89664P0710m8487j78030
105a654176J46806J39601k19671j39488p1123J34699J23730Q1249m8193j24559
95a631125J468J96517k59834K7040M64157Q41l29004l73430j8568p4919K57608
84a739249P6453J31481k8609L09216M0390k84485k31031j39193K00674K24982
74a439371k0683j10153n32645K00158N38054k35922j16044j39150J12104K39449
64a504203o350l03828K83811J90354j33386J28968l77352L7381k69093l4384J05117
53a882965J03155j73375j44195K22803n6575J85942R2739N7303j15111l14327
43b024606R1497L6192o131O2571K10070J68748r9169n9316l5487k74078L4020
$$ plain form
116 -1379022 -1685856 -1731974 -1643379 -1745028 -1871479 -1834721 -1688033 -1498369 -1427659 -1476146 -1654176
105 -1654176 -1507370 -1367769 -1587440 -1726928 -1798051 -1663352 -1539622 -1458373 -1506566 -1631125
95 -1631125 -1629657 -1433140 -1692974 -1665934 -1201777 -1200936 -1529940 -1903370 -1921938 -1996857 -1739249
84 -1739249 -1662796 -1531315 -1559924 -1250708 -1210318 -1494803 -1725834 -1865027 -1664353 -1439371
74 -1439371 -1460054 -1570207 -2102852 -1902694 -1364640 -1600562 -1716606 -1855756 -1743652 -1504203
64 -1504203 -1510553 -1814381 -1530570 -1340216 -1473602 -1344634 -1721986 -1684605 -1953698 -1988082 -1882965
53 -1882965 -1779810 -1953185 -2097380 -1874577 -1931152 -1745210 -1652471 -1595168 -1710279 -2024606
43 -2024606 -1933109 -1896917 -1903048 -1840477 -1630407 -1461659 -1560828 -1620144 -1655631 -1929709 -1895689
32a895689M3815K86955j24811l87953J27480K26673J44629j59058J09655J53496
22a474808J3048m5678m63754n2409j05149j7593K29362J3622q1706L20717j20906
11a785254l65684J9387M17489L91813k46266n14369k5327K86053P2512J1894J14595
0a623157
$$ plain form
32 -1895689 -1851874 -1564919 -1689730 -2077683 -1950203 -1723530 -1578901 -1737959 -1628304 -1474808
22 -1474808 -1461760 -1507438 -1971192 -2023601 -2128750 -2146343 -1916981 -1903359 -1985065 -1664348 -1785254
11 -1785254 -2150938 -2131551 -1714062 -1322249 -1568515 -2082884 -2108211 -1822158 -1749646 -1737752 -1623157
0 -1623157
$$ Imaginary data points
##PAGE= N=2
##DATA TABLE= (X++(I..I)), XYDATA
16383h185284M74528j37531K062k18430J64561M20947L22606k33063j04461K57399
16373g236666J79193r1399J40200o4497j08828L22371L13760K51224k79956K06343
16363f368255J79834K40088K86848j02202k62669J51391J79780M0000o8247K02446
16353e520986J50691K32772K15326l0276Q0975r6975j3414Q0003J81995p2129
16343d792018r3816l4664N78887J03886o0652p788J33596K34323p9784K03059
16333c814971M61123n5341n5805K06213L70067j19829O4026J04899R2284p9482
16323b826816r7252P5209j33963O7926K86391n934l6543M05968p3261J12626K7202
16312b198447j49943Q8091J48530Q6385K21327J02560J0188K37971L9819K1028
$$ plain form
16383 -8185284 -7710756 -7848287 -7846225 -8064655 -7900094 -7479147 -7156541 -7389604 -7494065 -7236666
16373 -7236666 -7057473 -7148872 -7008672 -7073169 -7181997 -6859626 -6545866 -6294642 -6574598 -6368255
16363 -6368255 -6188421 -5948333 -5661485 -5763687 -6026356 -5874965 -5695185 -5655185 -5723432 -5520986
16353 -5520986 -5370295 -5137523 -4922197 -4952473 -4871498 -4968473 -4981887 -4901884 -4719889 -4792018
16343 -4792018 -4885834 -4920498 -4341611 -4237725 -4298377 -4306165 -4172569 -3938246 -4018030 -3814971
16333 -3814971 -3353848 -3409189 -3464994 -3258781 -2888714 -3008543 -2944517 -2839618 -2747334 -2826816
16323 -2826816 -2924068 -2848859 -2982822 -2914896 -2628505 -2634439 -2670982 -2265014 -2338275 -2225649 -2198447
16312 -2198447 -2348390 -2260299 -2111769 -2025384 -1804057 -1701497 -1691309 -1453338 -1413519 -1392491
16302a392491J06269l3592k6693j28269K29167K00295M4789j38050j76192K3287
16292a291480N31273J95978j21396o2220k00795K01492J15411M56046L90818k22950
16282g823M0077J09090K76748O6273o1165m27658N5252L60672j85921M52111J08871
16271G86527k18642J65978k6045L37138k37677O3415M84058j22432k45076k3157
16261I64087k68864M2704M87198L05371n140j82832p9805L31188j49180M3353
16251A488080J67939J62800l03876k14221L52243L20595k67983k77942k1867K49117
16241A654885M51993j43057J21706k09840J48570L33371l11800j26733K05029
16232B124124L71021J93301J04110k85308J67167J95299O7124N79508j22494n85352
$$ plain form
16302 -1392491 -1286222 -1319814 -1346507 -1474776 -1245609 -1045314 -1000525 -1138575 -1314767 -1291480
16292 -1291480 -760207 -564229 -685625 -747845 -948640 -747148 -631737 -175691 215127 -7823
16282 -7823 32254 141344 418092 484365 423200 -4458 50794 411466 225545 677656 786527
16271 786527 567885 733863 707818 1044956 807279 870694 1354752 1232320 987244 964087
16261 964087 695223 737927 1225125 1530496 1525356 1342524 1262719 1593907 1444727 1488080
16251 1488080 1656019 1818819 1514943 1300722 1652965 1973560 1705577 1427635 1405768 1654885
16241 1654885 2106878 1963821 2085527 1875687 2024257 2357628 2045828 1919095 2124124
16232 2124124 2495145 2688446 2792556 2507248 2674415 2869714 2936838 3516346 3393852 2808500
16222B808500L55961l0334J8699J33183p9826J43464N13424j92354j0422k98452
16212C361843m9049q875k51097K91524l14433r137L94603K1186j7102L74646p1847
16201C722262R8017M584J32883N111N2581j68628j32502r3741Q0930K40941j05517
16190C836921M8223K35683n6221j66169m6357J02727J42053J32411j82557k91182
16180C755532p212J3564N78324L56836L19925l06198J48529j3978l75821m875
16170D464626m50511P37788l45665J47685m11387K61133O70415k57280j29205
16161D687599r2110j09841o7735R296L16520j39034J29154K79324J0445l292o06322
16150D414004k826N25886j65532K83364j7764J73274J04111n91248k10334j15182
$$ plain form
16222 2808500 3164461 3134127 3152826 3286009 3206183 3349647 3863071 3670717 3660295 3361843
16212 3361843 3312794 3303919 3052822 3344346 3029913 3020776 3415379 3436565 3419463 3794109 3722262
16201 3722262 3820279 3824863 3957746 3962857 4015438 3846810 3714308 3620567 3701497 3942438 3836921
16190 3836921 3885144 4120827 4064606 3898437 3852080 3954807 4096860 4229271 4046714 3755532
16180 3755532 3748320 3761884 4340208 4697044 5016969 4710771 4859300 4845322 4469501 4464626
16170 4464626 4014115 4751903 4406238 4553923 4142536 4403669 5074084 4816804 4687599
16161 4687599 4595489 4485648 4417913 4427209 4743729 4604695 4733849 5013173 5023618 5020326 4414004
16150 4414004 4411178 4937064 4771532 5054896 5037132 5210406 5314517 4723269 4512935 4397753
16140D397753J71624J54840j19323O7257R5850J22514o373J92174k56723K91366
16130E110959K99838j15142R2193l14984J44551n3693k80842J30577J3866k61472
16120D765851M10028o4145k36671K43527k2344J57973l18920k88366K38606j42627
16110D742912M53831J78379k5216l61027K28271j28893N9643K03230K2279k82475
16100E090934m64829M63203n7167o3696J20753N3108K64316j60934K35953M95610
16090E977251q5679p56639q7292K5815O52424l0245p32771P7213K99013M09000
16080E748090l00522k19060Q9989L92085j5660Q4412n46559k11613N16812j56324
16070E381650K20164o18219K0377N31556k95000K95139k15215j15097L4700N26640
$$ plain form
16140 4397753 4569377 4724217 4604894 4672151 4768001 4890515 4884142 5076316 4819593 5110959
16130 5110959 5410797 5295655 5387848 5072864 5217415 5163722 4882880 5013457 5027323 4765851
16120 4765851 5175879 5111734 4875063 5118590 5096246 5254219 4935299 4646933 4885539 4742912
16110 4742912 5196743 5375122 5349906 4988879 5217150 5088257 5147900 5351130 5373409 5090934
16100 5090934 4626105 5089308 5032141 4968445 5089198 5142306 5406622 5245688 5481641 5977251
16090 5977251 5891572 5134933 5047641 5073456 5725880 5695635 4962864 5040077 5339090 5748090
16080 5748090 5447568 5228508 5318497 5710582 5694922 5779334 5232775 5021162 5537974 5381650
16070 5381650 5601814 4983595 5003972 5535528 5240528 5535667 5320452 5205355 5240055 5766695
16060E766695j75329k15071J10468l01220O32696j70509k50947N7595k43815R8427
16050E308990Q1309K57160M63066l77300p34891K13031K41675r7519J70807p48266
16040D778062J51246n6049J71296K44699r3728K35990M74624N30973j03647m20837
16030E912629n45804K90465J60203j38252R5020q7769K11425l36450o85320P46128
16020E622275k9951k70971J73209j62410m6209L2507K60236K4456n59032M30931
16010E475041M01768O9773j97009k45133O0345Q361K16094l32067o5923m9199
16000E342051N07270l60799j15380J95039j19241N72378k20906p7310j29384n95392
15990D998326M7470L17092r6069K26288K90126l11404R8797J31720l34448M11743
$$ plain form
16060 5766695 5591366 5376295 5486763 5185543 5818239 5647730 5396783 5454378 5210563 5308990
16050 5308990 5390299 5647459 6110525 5733225 4998334 5211365 5453040 5355521 5526328 4778062
16040 4778062 4929308 4873259 5044555 5289254 5195526 5431516 5906140 6437113 6333466 5912629
16030 5912629 5366825 5657290 5817493 5679241 5774261 5686492 5897917 5561467 4876147 5622275
16020 5622275 5592324 5321353 5494562 5332152 5285943 5318450 5578686 5603142 5044110 5475041
16010 5475041 5876809 5946582 5749573 5504440 5564785 5573146 5789240 5457173 5391250 5342051
16000 5342051 5849321 5488522 5373142 5568181 5448940 6021318 5800412 5723102 5593718 4998326
15990 4998326 5045796 5362888 5266819 5493107 5783233 5471829 5570626 5702346 5367898 5779641
15980E779641k22853o6747J23771m44710r5682K61470L56417m21139J34647l20385
15970E084430J89982j04754J97271K28459j23633J11074k991M2809k24784K0934
15960E418797N1665o6281k06281J97761R921j3304n4340L4369K91963J25400n80715
15949E208955l55679L26225K89808O4096l96932J57244J25269L23928L26908n57299
15939E512523J14755j04930K849Q9758n36794J91200J17036K7820K35844J0748
15929E660809K31604o6687M58712k45307P1822n01772J70642j51989l26282L26790
15919E628342k03767o5027J88576m64543L56045O8984J82987k39220j72547J83673
15909E463503J5324K4505k00174L16911m75411M64959K44810r1525k92108j50585
$$ plain form
15980 5779641 5556788 5490041 5613812 5169102 5073420 5334890 5691307 5270168 5404815 5084430
15970 5084430 5274412 5169658 5366929 5595388 5471755 5582829 5579838 5622647 5397863 5418797
15960 5418797 5470462 5404181 5197900 5395661 5405582 5392278 5337938 5372307 5664270 5789670 5208955
15949 5208955 4853276 5179501 5469309 5533405 5136473 5293717 5418986 5742914 6069822 5512523
15939 5512523 5627278 5522348 5525197 5614955 5078161 5269361 5386397 5414217 5650061 5660809
15929 5660809 5892413 5825726 6284438 6039131 6110953 5609181 5779823 5627834 5301552 5628342
15919 5628342 5424575 5359548 5548124 5083581 5439626 5508610 5691597 5452377 5279830 5463503
15909 5463503 5478827 5503332 5303158 5620069 5144658 5609617 5854427 5762902 5470794 5320209
15899E320209J01013J77245J62901o2850K16887m7218L5938k99103k17016J94210
15889E582216l12091K18201K37011k76835R1365l59616Q3734N86927j05139L9885
15879E785658l40488m9619K33261k51088M3149L0237K43067M3938M01566j90403
15869E949278p92175L80526j58909M04025O2587l51472l8312k31621M1882J99423
15859E465232L8590J01038l09529j1876N92263J78j55060j29107j75999N4917
15849E470647j31741L72300J96038k02503Q2018j00051j69205M10644J46102k75455
15839E798794j85852J08921R9588K22092m87277J10631L12694k00612N7002n44008
15829E291973k16471J17091L73714L41412l04305k12421M2269L64733L64097l70763
$$ plain form
15899 5320209 5421222 5598467 5761368 5698518 5915405 5868187 5904125 5605022 5388006 5582216
15889 5582216 5270125 5488326 5725337 5448502 5539867 5180251 5263985 5850912 5745773 5785658
15879 5785658 5445170 5395551 5628812 5377724 5420873 5451110 5694177 5738115 6139681 5949278
15869 5949278 5157103 5537629 5378720 5782745 5845332 5493860 5455548 5223927 5265809 5465232
15859 5465232 5503822 5604860 5295331 5283455 5875718 5875896 5720836 5591729 5415730 5470647
15849 5470647 5338906 5711206 5907244 5704741 5786759 5686708 5517503 5928147 6074249 5798794
15839 5798794 5612942 5721863 5821451 6043543 5556266 5666897 5979591 5778979 5835981 5291973
15829 5291973 5075502 5192593 5566307 5907719 5603414 5390993 5433262 5797995 6162092 5791329
15819E791329n66620L15140J38898o0888L82061j63744m70164K24006j96915k0630
15809E372473K28613l28893K46714K72040n7269j95259P7853j70618J4354k93777
15799E166231K15460Q70166o06632j10789K69042J83151L5297m30041L97603l10590
15789E678898J10677J50967Q1874m08509m71365N74953J37660M4493r5411k09741
15779E594496R6601K2002j60146k2580k89623Q9818K9960K2340P5041j26206k18000
15768E113703N69090p5613K0065n5333M32728j91569l97222J9164K1050k1473
15758E434590J7339n7363N8809L72401k44429r5042K04163M82735n02965L5145
15748E705383o30583l44109M78065M61377J90661k43747P0455N05185K42947m08320
$$ plain form
15819 5791329 5224709 5539849 5678747 5617859 5999920 5836176 5366012 5590018 5393103 5372473
15809 5372473 5601086 5272193 5518907 5790947 5733678 5538419 5616272 5445654 5460008 5166231
15799 5166231 5381691 6251857 5645225 5534436 5803478 5986629 6021926 5591885 5989488 5678898
15789 5678898 5789575 5940542 6022416 5613907 5142542 5717495 5855155 5899648 5804237 5594496
15779 5594496 5691097 5713099 5552953 5530373 5240750 5330568 5360528 5382868 5457909 5331703 5113703
15768 5113703 5682793 5607180 5627245 5571912 6004640 5813071 5415849 5435013 5456063 5434590
15758 5434590 5451929 5394566 5453375 5825776 5581347 5486305 5690468 6173203 5670238 5705383
15748 5705383 5074800 4730691 5208756 5670133 5860794 5617047 5687502 6192687 6435634 6027314
15738F027314k67004k08127m7299L34266J89993p5627k71247K42585N4565O3834
15728F043253m29098K44495K27188q9394k94023j39419j6312j68667n8603L73763
15718E693183K14490K63399k26685k61293K06455j26444K1855K94389k20415L3624
15708E892558j6416j20267n3888L50149j32993m25322M88173j56116J00356n69146
15698E357088k57K58753L96917K31802q46702k24424M91039M44749k39089p98035
15688E071841N3151J78809N67443J38957k59119k48182N23124J06681n44008P9363
15678E668060k22786k18271J47964R0082L15782R0386j40794K97561j50221L107
15668E880870M70529o0161k37502P0222m95440J90968L688m99622O6653R1252
$$ plain form
15738 6027314 5760310 5552183 5504884 5839150 6029143 5953516 5682269 5924854 5979419 6043253
15728 6043253 5614155 5858650 6085838 5996444 5702421 5563002 5546690 5378023 5319420 5693183
15718 5693183 5907673 6171072 5944387 5683094 5889549 5763105 5784960 6079349 5858934 5892558
15708 5892558 5876142 5755875 5701987 6052136 5919143 5493821 5981994 5825878 5926234 5357088
15698 5357088 5356831 5615584 6012501 6244303 5397601 5173177 5664216 6108965 5869876 5071841
15688 5071841 5124992 5303801 5871244 6010201 5751082 5502900 6026024 6132705 5588697 5668060
15678 5668060 5445274 5227003 5374967 5465049 5780831 5871217 5730423 6027984 5877763 5880870
15668 5880870 6351399 6291238 6053736 6123958 5628518 5819486 5823174 5323552 5390205 5481457
15658E481457J08917R1815J02108j68883j29197J87021q7527l2532j57687M6929
15648E442421N05018l0017j69986P8471K08040M21609L1349k39979m79467j59315
15638E608144J00733J02360L93293p73840l09982M65222L09846k48897j12343
15629E534536K08752J25807K70519o9370M17340n88781J23960J82754q09311L94735
15619E790941K67334n26257k78366N18676N0267J01202K45012P6879n64615J38166
15609E819239K75676j53373l07865M9044q5935J0926Q01152m05776k51969K73889
15599F025008L74499J61555m91435l9818k90009k09405J52889K24261k63841p1990
15589E571714K38313j08875j94172l43700L96374M36049k17365k05795M38327
$$ plain form
15658 5481457 5590374 5682189 5784297 5615414 5486217 5673238 5585711 5553179 5395492 5442421
15648 5442421 5947439 5917422 5747436 5825907 6033947 6455556 6486905 6246926 5767459 5608144
15638 5608144 5708877 5811237 6204530 5430690 5120708 5585930 5895776 5646879 5534536
15629 5534536 5743288 5869095 6139614 6070244 6487584 5898803 6022763 6205517 5396206 5790941
15619 5790941 6058275 5532018 5253652 5772328 5822595 5923797 6168809 6245688 5681073 5819239
15609 5819239 6094915 5941542 5633677 5682721 5596786 5607712 6408864 6003088 5751119 6025008
15599 6025008 6399507 6561062 6069627 6029809 5739800 5530395 5683284 5907545 5643704 5571714
15589 5571714 5810027 5701152 5506980 5163280 5559654 5995703 5778338 5572543 6010870
15580F010870n3487Q4743k15999L0819M32949k09070m50322K57418j39488J15474
15570E863907L20463m96225l89660R4590K95654l94351L37010j99838O9406P48370
15560F249326k50158J17064k03847j1433N29585J84166l72501q54431o8658j16343
15550E202770O01540n8643N1013L97224J13042j79749j85469j16185j3849K89168
15540F100862l83953k32916l4862P83613J48952o8917m96902j34045J30689j75431
15530E637090L10266j77527l91734L69249K30973m19481M3535n5594K81933K03028
15520F031738l26066J25278n2981K47133k21583r0161N8066j41903O47904l94334
15510E883091k37714O1590K40623J11084M7565L2951m78765M29716R0338K3882
$$ plain form
15580 6010870 5957383 6042126 5826127 5856946 6289895 6080825 5630503 5887921 5748433 5863907
15570 5863907 6184370 5688145 5298485 5393075 5688729 5294378 5631388 5431550 5500956 6249326
15560 6249326 5999168 6116232 5912385 5900952 6430537 6614703 6242202 5387771 5319113 5202770
15550 5202770 5804310 5745667 5796680 6193904 6306946 6127197 5941728 5825543 5811694 6100862
15540 6100862 5716909 5483993 5449131 6232744 6381696 6312779 5815877 5681832 5812521 5637090
15530 5637090 5947356 5769829 5378095 5747344 5978317 5558836 5602371 5546777 5828710 6031738
15520 6031738 5705672 5830950 5777969 6025102 5803519 5713358 5771424 5629521 6277425 5883091
15510 5883091 5645377 5706967 5947590 6058674 6106239 6139190 5660425 6090141 6180479 6204361
15500F204361k64967l23706K62751k07678O9499J28641J21039J8767K61079k00517
15490F069269l60248j70614J30087N20051m10526O1176R4669n13239L84355j24510
15480E680470J34060J78129R8382K73984l34036n53534Q9752P91947j82651j03325
15470F073178j49021k17872L1422L71645O3815r9616m48058J1330k2042j68918
15460E445863P245M45780J54593p7686L3849k56556L86047K01659j042407P9435
15450E377822O4949K267K34820O6698P8606k89034M85448j05326j84626k10744
15440E520880J01005J25027m6746p5929l19907N2784N1928n1001j99737N95003
15430E753307P11214m12784K27331k18392R3599l6718L44519m76452l61274L38007
$$ plain form
15500 6204361 5939394 5615688 5878439 5670761 5740260 5868901 5989940 6008707 6269786 6069269
15490 6069269 5709021 5538407 5668494 6188545 5778019 5839195 5933864 5420625 5804980 5680470
15480 5680470 5814530 5992659 6091041 6365025 6030989 5477455 5567207 6359154 6176503 6073178
15470 6073178 5924157 5706285 5737707 6109352 6173167 6073551 5625493 5636823 5614781 5445863
15460 5445863 5453108 5898888 6053481 5975795 6009644 5753088 6139135 6340794 5298387 5377822
15450 5377822 5442771 5445038 5679858 5746556 5825162 5536128 6021576 5916250 5731624 5520880
15440 5520880 5621885 5746912 5700166 5624237 5304330 5357114 5409042 5358041 5158304 5753307
15430 5753307 6464521 6051737 6279068 6060676 6154275 6117557 6462076 5985624 5624350 5962357
15420E962357K26838J91648m21584k05568j11334J3494k12986M68728K03575K93134
15410F408302J08617l77848n41946k30250J65348O28484M31231p58629j78431
15401E654878M65304N7942l9777j06745J37452j08518J55943J04217K6814n77322
15391E770188l00697N73722K46429q9042l27629K94396o557j10029k75805j16739
15381E658237N57239k97933p9553l24495q2004K66234j2700k0591Q9532L17510
15371F071476J85347l74556k46012l478J9942J74152K54147j75982l07388J32036
15361E729684k4769M32619q1543j11558J90746J9749n49183N6590n0213r2915
15351E519207K49384P8173o2290k02576j33859J94180Q2241n772J02256J61036
$$ plain form
15420 5962357 6189195 6380843 5959259 5753691 5642357 5655851 5442865 5911593 6115168 6408302
15410 6408302 6516919 6139071 5597125 5366875 5532223 6160707 6591938 5833309 5654878
15401 5654878 6120182 6178124 6138347 6031602 6169054 6060536 6216479 6320696 6347510 5770188
15391 5770188 5469491 6043213 6289642 6200600 5872971 6167367 6160810 6050781 5774976 5658237
15381 5658237 6215476 5917543 5837990 5513495 5431491 5697725 5685025 5664434 5753966 6071476
15371 6071476 6256823 5882267 5636255 5632777 5652719 5826871 6081018 5905036 5597648 5729684
15361 5729684 5704915 6137534 6055991 5944433 6135179 6154928 5605745 5662335 5612122 5519207
15351 5519207 5768591 5846764 5784474 5581898 5448039 5642219 5724460 5718688 5820944 5981980
15341E981980k85683J05593J29542k2740J50818n10090l03063O91229J23875K82640
15331F344101l07000m75140J42878L28393M92726k52873l27479R7200k04559K24335
15321F062582K4323l07303J05011J81420O3078K34871L10018n13155O9096L20256
15311F550197j94366l4638k26908k59728K08310q0423j7096m8187j390K28470
$$ plain form
15341 5981980 5696297 5801890 5931432 5908692 6059510 5549420 5246357 5937586 6061461 6344101
15331 6344101 6037101 5561961 5704839 6033232 6525958 6273085 5945606 6042806 5838247 6062582
15321 6062582 6086905 5779602 5884613 6066033 6129111 6363982 6674000 6160845 6229941 6550197
15311 6550197 6355831 6321193 6094285 5834557 6042867 5962444 5945348 5897161 5895771 6124241
$$ [...]
##END NTUPLES=NMR SPECTRUM
##END=
