##TITLE=1H_CA-8864-3
 CDCl3, 8 sc, 
 31.05.2021
##JCAMPDX= 6.0         $$ Bruker NMR JCAMP-DX V2.0
##DATA TYPE= NMR SPECTRUM
##DATA CLASS= NTUPLES
##ORIGIN= UXNMR, Bruker Analytische Messtechnik GmbH
##OWNER= root
$$ XWIN-NMR		Version 3.5
$$ Mon May 31 11:14:11 2021 Russian Standard Time (UT+4h)  she@DPX200
##.OBSERVE FREQUENCY= 200.131506
##.OBSERVE NUCLEUS= ^1H
##.ACQUISITION MODE= SIMULTANEOUS
##.ACQUISITION SCHEME= undefined
##.AVERAGES= 8
##.DIGITISER RES= 18
##SPECTROMETER/DATA SYSTEM= spect
##.PULSE SEQUENCE= zg30
##.SOLVENT NAME= CDCl3
##.SHIFT REFERENCE= (INTERNAL, CDCl3, 0, 15.9709)
##AUDIT TRAIL= $$ (NUMBER, WHEN, WHO, WHERE, WHAT)
$$ ##TITLE= Audit trail, XWIN-NMR		Version 3.5
$$ ##JCAMPDX= 5.01
$$ ##ORIGIN= Bruker BioSpin GmbH
$$ ##OWNER= she
$$ F:/spectra/data/she/nmr/H-F/1/pdata/1/auditp.txt
$$ ##AUDIT TRAIL=  $$ (NUMBER, WHEN, WHO, WHERE, WHAT)
(   1,<2021-05-31 11:11:41.60 +0400>,<she>,<DPX200>,
      <created by zg, POWCHK disabled, PULCHK disabled
       configuration hash MD5:
       00 E9 B6 7A A2 85 ED C7 34 08 36 98 17 FE 4E 26
       data hash MD5: 16K
       5B AB 04 B9 02 EF E2 F5 F3 88 07 E9 98 9F 1E C4>)
(   2,<2021-05-31 11:11:44.34 +0400>,<she>,<DPX200>,
      <Start of raw data processing
       efp BC_mod = 2 LB = 0.24 FT_mod = 6 PKNL = 1 PHC0 = -11117.63 PHC1 = 9.000991 SI = 16K 
       data hash MD5: 16K
       73 7E B4 E9 A4 EE 79 36 C1 F5 3E 12 6A C8 3E C8>)
(   3,<2021-05-31 11:12:01.00 +0400>,<she>,<DPX200>,
      <pk PHC0 = -6.922501 PHC1 = 9 
       data hash MD5: 16K
       7E 21 62 E1 C1 12 CD 26 A8 03 6D 9E 5A 84 05 E3>)
(   4,<2021-05-31 11:12:03.95 +0400>,<she>,<DPX200>,
      <abs ABSG = 5 
       data hash MD5: 16K
       2E B5 7F 61 F8 C7 A7 46 10 B4 74 B3 7C 83 BA 11>)
$$ ##END=
$$ 
$$ hash MD5
$$ 91 1C F4 BA A8 A8 81 95 9C 74 2B 08 E4 D0 9C 52
##$RELAX= 
##$RELAX= 
##$RELAX= 
##$RELAX= 
##$RELAX= 
##$RELAX= 
$$ Bruker specific parameters
$$ --------------------------
##$DU= <F:/spectra>
##$EXPNO= 1
##$NAME= <H-F>
##$PROCNO= 1
##$TYPE= <nmr>
##$USER= <she>
##$AMP= (0..31)
100 100 100 100 100 100 100 100 100 100 100 100 100 100 100 100 100 100 
100 100 100 100 100 100 100 100 100 100 100 100 100 100 
##$AQSEQ= 0
##$AQ_mod= 1
##$AUNM= <au_zg>
##$AUTOPOS= <>
##$BF1= 200.13
##$BF2= 200.13
##$BF3= 200.13
##$BF4= 200.13
##$BF5= 200.13
##$BF6= 200.13
##$BF7= 200.13
##$BF8= 200.13
##$BYTORDA= 1
##$CFDGTYP= 0
##$CFRGTYP= 5
##$CHEMSTR= <none>
##$CNST= (0..31)
1 1 145 1 1 1 1 1 1 1 1 1 1 1 1 1 1 1 1 1 1 1 1 1 1 1 1 1 1 1 1 1 
##$CPDPRG= <>
##$CPDPRG1= <>
##$CPDPRG2= <>
##$CPDPRG3= <>
##$CPDPRG4= <mlev>
##$CPDPRG5= <mlev>
##$CPDPRG6= <mlev>
##$CPDPRG7= <mlev>
##$CPDPRG8= <mlev>
##$CPDPRGB= <>
##$CPDPRGT= <>
##$D= (0..31)
0 1.2 0 0 0 0 0 0 0 0.06 0 0.03 0 0 0 0 0.0002 0 0 0 0 0 0 0 0 0 0 0 0 
0 0 0 
##$DATE= 1622445101
##$DBL= (0..7)
120 120 120 120 120 120 120 120 
##$DBP= (0..7)
150 150 150 150 150 150 150 150 
##$DBP07= 0
##$DBPNAM0= <>
##$DBPNAM1= <>
##$DBPNAM2= <>
##$DBPNAM3= <>
##$DBPNAM4= <>
$$ [...]
##$SUBNAM3= <"">
##$SUBNAM4= <"">
##$SUBNAM5= <"">
##$SUBNAM6= <"">
##$SUBNAM7= <"">
##$SUBNAM8= <"">
##$SUBNAM9= <"">
##$SW= 16.9725357007746
##$SWIBOX= (0..15)
0 0 2 0 0 0 0 0 0 0 0 0 0 0 0 0 
##$SW_h= 3396.73913043478
##$TD= 16384
##$TD0= 1
##$TE= 0
##$TE2= 300
##$TE3= 300
##$TEG= 300
##$TL= (0..7)
0 120 120 120 120 120 120 120 
##$TP= (0..7)
150 150 150 150 150 150 150 150 
##$TP07= 0
##$TPNAME0= <>
##$TPNAME1= <>
##$TPNAME2= <>
##$TPNAME3= <>
##$TPNAME4= <>
##$TPNAME5= <>
##$TPNAME6= <>
##$TPNAME7= <>
##$TPOAL= (0..7)
0.5 0.5 0.5 0.5 0.5 0.5 0.5 0.5 
##$TPOFFS= (0..7)
0 0 0 0 0 0 0 0 
##$TUNHIN= 0
##$TUNHOUT= 0
##$TUNXOUT= 0
##$USERA1= <user>
##$USERA2= <user>
##$USERA3= <user>
##$USERA4= <user>
##$USERA5= <user>
##$V9= 5
##$VALIST= <valist>
##$VCLIST= <CCCCCCCCCCCCCCC>
##$VD= 0
##$VDLIST= <DDDDDDDDDDDDDDD>
##$VPLIST= <PPPPPPPPPPPPPPP>
##$VTLIST= <TTTTTTTTTTTTTTT>
##$WBST= 1024
##$WBSW= 4
##$XGAIN= (0..3)
0 0 0 0 
##$XL= 0
##$YL= 0
##$YMAX_a= 302538
##$YMIN_a= -333321
##$ZGOPTNS= <>
##$ZL1= 120
##$ZL2= 120
##$ZL3= 120
##$ZL4= 120
##$ABSF1= 15.98127
##$ABSF2= -0.9913921
##$ABSG= 5
##$ABSL= 3
##$ALPHA= 0
##$AQORDER= 0
##$ASSFAC= 0
##$ASSFACI= 0
##$ASSFACX= 0
##$ASSWID= 0
##$AUNMP= <proc_1d>
##$AZFE= 0.1
##$AZFW= 0.1
##$BCFW= 0
##$BC_mod= 2
##$BYTORDP= 0
##$COROFFS= 0
##$CY= -3
##$DATMOD= 1
##$DC= 0
##$DFILT= <>
##$DTYPP= 0
##$F1P= 0
##$F2P= 0
##$FCOR= 1
##$FTSIZE= 16384
##$FT_mod= 6
##$GAMMA= 0
##$GB= 0
##$INTBC= 1
##$INTSCL= 1.334414e-10
##$ISEN= 128
##$LB= 0.24
##$LEV0= 0
##$LPBIN= 0
##$MAXI= 10000
##$MC2= 0
##$MEAN= 0
##$ME_mod= 0
##$MI= 1.114404
##$NCOEF= 0
##$NC_proc= -7
##$NLEV= 6
##$NOISF1= 3.799351
##$NOISF2= 2.8
##$NSP= 0
##$NTH_PI= 0
##$NZP= 0
##$OFFSET= 15.97092
##$PC= 1
##$PHC0= -11124.55
##$PHC1= 18.00099
##$PH_mod= 1
##$PKNL= yes
##$PPARMOD= 0
##$PSCAL= 0
##$PSIGN= 0
##$REVERSE= no
##$SF= 200.130008108627
##$SI= 16384
##$SIGF1= 3
##$SIGF2= 2
##$SINO= 5.538805
##$SIOLD= 16384
##$SREGLST= <1H.CDCl3>
##$SSB= 0
##$STSI= 16384
##$STSR= 0
##$SW_p= 3396.73913043479
##$SYMM= 0
##$S_DEV= 0
##$TDeff= 16384
##$TDoff= 0
##$TI= <>
##$TILT= no
##$TM1= 0
##$TM2= 0
##$TOPLEV= 0
##$USERP1= <user>
##$USERP2= <user>
##$USERP3= <user>
##$USERP4= <user>
##$USERP5= <user>
##$WDW= 1
##$XDIM= 16384
##$YMAX_p= 282328360
##$YMIN_p= -2785780
$$ End of Bruker specific parameters
$$ ---------------------------------
##NTUPLES= NMR SPECTRUM
##VAR_NAME=  FREQUENCY,     SPECTRUM/REAL,   SPECTRUM/IMAG
##SYMBOL=    X,             R,               I
##VAR_TYPE=  INDEPENDENT,   DEPENDENT,       DEPENDENT
##VAR_FORM=  AFFN,          ASDF,            ASDF
##VAR_DIM=   16384,         16384,           16384
##UNITS=     HZ,            ARBITRARY UNITS, ARBITRARY UNITS
##FACTOR=    0.207333158178282, 1,           1
##FIRST=     3196.26027086537, 0,            0
##LAST=      -200.478859569416, 0,           0
##MIN=       -200.478859569416, -2785780,    0
##MAX=       3196.26027086537, 282328360,    0
$$ Real data points
##PAGE= N=1
##DATA TABLE= (X++(R..R)), XYDATA
$$ [...]
6134d33247Q09409j66359m93599j16101L50102K45539p3493l50020J27489K48873
6124A48593M47121o96350n6128K57852M34944k55124K2668K15099k74000L8584
6114B83259l81275P3654J81657j96183j34911j85373J02407L39065k11316P1642
6104e7374M2009k54398K75947N80660l8210J98652l41411K02630n0231l06927
6094B51347l64462k15151J23311L39210j06827m09258j41358K09079K42715m5337
6084a16731k83726K11590m0556o7779J29265K94221N17836j17658r979K14632
6074G31115K27731k94664k11425j38554L03339m3011n15038K65401L75634l66664
6064C33864J08920m77135r8954L16826o1568J79974j89612k38735O4212j41748
$$ y = [-433247, 376162, 209803, -283796, -399897, -49795, 195744, 122251, -227769, -100280, 148593, 595714, -100636, -156764, 101088, 536032, 280908, 303576, 518675, 244675, 283259, -98016, -24362, 157295, -38888, -173799, -359172, -256765, 82300, -129016, -57374, -15365, -269763, 6184, 586844, 548634, 747286, 405875, 608505, 558274, 251347, -113115, -328266, -204955, 134255, 27428, -381830, -523188, -314109, -71394, -116731, -400457, -188867, -229423, -297202, -167937, 126284, 644120, 526462, 516483, 731115, 958846, 664182, 452757, 314203, 617542, 574531, 59493, 324894, 700528, 333864, 442784, -34351, -133305, 183521, 121953, 301927, 112315, -126420, -62208, -203956]
6054b03956J46435r57n86647n5929J59119J38741k36684J72119r375J03814O3645
6043c09675M18859J4283J13861K49021j72542J8099L52553M6191K7532l28025
6033D30157l65339k66017j66782J75324m0854k73612M2500K47519j76444N2709
6023c40839r3686L29870N46679j95779P242K6919j66833M06669r0839J57235K44839
6012H31477l18905k89718k77147r9343J27029J63207m60292J69465L76315j03254
6002A18834j38530j89280J34365L49530j12311o9154k79948j36767N3592R5948
5992a73721q4274O1545J87884J00673j87400j79072L91045M3148j0915j43345
5982E568J02010j72677J17116M18546M37650m60092k52173k04467o4342O8035
$$ y = [-203956, -57521, -58478, -645125, -701054, -541935, -403194, -639878, -467759, -477134, -373320, -309675, 109184, 123467, 237328, 486349, 313807, 331906, 684459, 730650, 758182, 430157, 64818, -201199, -367981, -192657, -233511, -507123, -464623, -217104, -393548, -340839, -434525, -104655, 442024, 246245, 253487, 280406, 113573, 520242, 429403, 586638, 831477, 512572, 222854, -54293, -153636, -26607, 136600, -323692, -154227, 222088, 118834, -19696, -208976, -74611, 274919, 162608, 93454, -186494, -323261, -269669, -173721, -257995, -196450, -8566, 92107, -95293, -274365, 116680, 159828, 148913, 5568, 107578, -65099, 52017, 470563, 908213, 448121, 195948, -8519, -72861, -4826]
5972d826J8254j39159K01768L3061j73156K8773j99653M07374j41176l25797L44643
5961E0106l2471j02260L20416o17557o6390M83915j03377o4235k121p4184J03571
5950a04587J40783j78928K09637n951R4180k60479j51751K26475K03059J3371
5940A85809L5552j29620J49002l54235k674R5619j14479o4214K27571k27272q7554
5929b86495J82670j30501P8520j97193j92680J95848J78323L4343n1270p2915
5919b61350J35920J43887l59418q1999J92022M45325K83482J36653k27136q7997
5909C19389L46426k31472K37398r5792j38039n67088K90043j16334l3598J79341
5899A90274L8120j37002J90470l90546k27309J93963m41597N2142K09983K00733
$$ y = [-4826, 13428, -125731, 76037, 109098, -64058, -35285, -234938, 172436, 31260, -294537, 50106, 17635, -84625, 235791, -381766, -448156, 35759, -67618, -131853, -133974, -208158, -104587, 36196, -142732, 66905, 60954, 155134, -105345, -257096, -30621, 172438, 185809, 221361, 91741, 240743, -113492, -116166, -20547, -135026, -199240, 28331, -198941, -286495, -103825, -234326, -155806, -352999, -545679, -349831, -171508, -137165, -188435, -261350, -125430, 18457, -340961, -422960, -230938, 214387, 497869, 634522, 407386, 319389, 665815, 434343, 671741, 575949, 437910, -129178, 160865, 44531, 10933, 190274, 228394, 91392, 281862, -108684, -335993, -142030, -583627, -531485, -321502, -120769]
5889a20769M3960O6607k0804P92036K98385l26586n24411q2616K93264m17872
5879A194l72536P361O8045L0061l6224K5248K31713j49393K71282j16414P9394
5868C9731j30759K14778j83809K11190J60381l25278j33099Q2230P8791j04563
5858i0407k51294K85626o6879k90320k18032J17310L61404o8231J37460J4562
5848f8801L58899k32569j66502j51998O6294L13845o0321n33734q420K47085R8608
5837a37614k27866j42508L37307j5209k12787j01952K94054M07657L7376r3947
5827A44511K01449j84891K64954M7560k22673J04694j8186j03553m8394M6380
5817B31851l50194L9935Q5969p615j30864Q9469R4197p6483K37652l5065N1417
$$ y = [-120769, -76809, -10202, -31006, 761030, 1059415, 732829, 208418, 125802, 419066, 1194, -371342, -363981, -295936, -265875, -302099, -276851, -45138, -194531, 76751, -39663, 39731, -91028, 123750, -60059, 151131, 311512, -13766, -146865, -64635, 14156, -90407, -341701, -56075, -122954, -413274, -631306, -513996, -152592, -220823, -83363, -68801, 290098, 57529, -108973, -260971, -194677, 119168, 58847, -474887, -483307, -236222, -137614, -365480, -507988, -170681, -185890, -398677, -500629, -206575, 201082, 238458, 144511, 345960, 161069, 426023, 473583, 250910, 355604, 337418, 233865, 185471, 231851, -118343, -78408, 7561, -54, -130918, -41449, 52748, -23735, 213917, 178852, 230269]
5806B30269k8183L74914M6433J13978k64482K12605J66970k30291q502n3151k40812
5795C19748j26014K38115j39677L0769m62679K77470j15732J25979k82081J58281
5785B4179k84887P7491j7445K70802j19824j23237j51344K78036J40009k41849
5775a48069o4310j03743K35553j8594n3649j5166q2946K4961N26265k95772K91719
5764B96249m6646J34596j60809j15158p7352K09685N7274q1485M1458k36484M34585
5753D55913q4918l61597L126j6722m06717K34325O755q1657k18148l6524K65701
5742b40463N74770l7546o2974j07488J14491L31522n2146l4890j20203k05296
5732A59777j59964J33816K86327J19225l05647q9448j62031K06558k22005j71797
$$ y = [230269, 202086, 577000, 623433, 737411, 472929, 685534, 852504, 622213, 613711, 560560, 319748, 193734, 431849, 292172, 322941, -139738, 137732, 22000, 147979, -134102, 24179, -260708, -183217, -200662, 70140, -49684, -172921, -324265, -46229, 93780, -148069, -212379, -316122, -80569, -99163, -152812, -167978, -250924, -225963, 300302, 4530, 296249, 249603, 384199, 223390, 108232, 30880, 240565, 297839, 216354, 257812, 21328, 455913, 370995, 9398, 12524, -4198, -410915, -176590, -169835, -251492, -469640, -506164, -240463, 334307, 296761, 233787, 126299, 240790, 572312, 520166, 485276, 365073, 159777, -187, 133629, 419956, 539181, 233534, 144086, -17945, 188613, -33392, -205189]
5722b05189k27034L1978N8158J61082m28354N79564J68275j19349K39072N2865
5712C11068j98089L00048K37712l03160K47046O0676j37530k83044l104n275J39571
5701C65919k32517L26034l21335k32430n232l4709K35504q3819j44435r419K6419
5690a10020j54230M86281L9137k56240m0075l5802O7562J78380j92935k33985
5680b51927N34461N9961k65899j36034j23022N37473N0666j81334l89528K17017
5670E1834K12847K26424P4900r6142J16749j39103k19632q2829j77251k83389
5660c15592K42760k4200R5127K63242j45483q6884R061K82406L38188l19466R1211
5649D30370j6192l72847j60819K57376L49420k88863Q6614j032n3826K04730q1383
$$ y = [-205189, -432223, -400245, -342087, -181005, -609359, -29795, 138480, 19131, 258203, 311068, 112979, 413027, 650739, 347579, 594625, 655301, 517771, 234727, 231623, 226348, 365919, 133402, 459436, 138101, -94329, -99561, -134270, 101234, 17415, -127020, -136439, -110020, -264250, 222031, 261168, 4928, -35147, -70949, -3387, 174993, -17942, -251927, 282534, 342495, 76596, -59438, -182460, 355013, 405679, 224345, -165183, 51834, 264681, 491105, 566005, 469863, 586612, 447509, 227877, 145048, -32203, -315592, -72832, -97032, -1905, 261337, 115854, 28970, 38031, 320437, 658625, 339159, 430370, 414178, 41331, -119488, 137888, 487308, 198445, 285059, 284027, 230201, 434931, 353548]
5638C53548k1389N2889j25605k6404O740K32545J59765J69548J06402M4675M9681
5627A002395k64473m5515J63164j30831p0118k70924J69914J66151m01255j88162
5617A30346J10467J65942q6012j25178n4788K64156k21195j76009p3098M884J29479
5606F8994N117J62474m8345k84711R8657j66964L48731Q4690o5515j54746j56333
5595a07951j58328K92375j88155p5513M70876L18190P7023n25592L98770J28755
5585F30450j16384J91980M222K3894R8406j16813J96108L13484l16410l85628
5575E23309j3344J66319K74385m92043M5967Q1632k15074J53808k59730K24987
5565D90216K38321P3547k21470J53532O0462L15073l12589k61345p2454j53795
$$ y = [353548, 332159, 385048, 259443, 233039, 239779, 472324, 632089, 801637, 908039, 952714, 1002395, 737922, 692407, 855571, 724740, 654622, 383698, 553612, 719763, 318508, 130346, 240813, 406755, 320743, 195565, 140777, 404933, 183738, 7729, -65369, -60485, 68994, 74111, 236585, 188240, -96471, 2186, -164778, 183953, 268643, 203128, 48382, -107951, -266279, 26096, -162059, -237572, 233304, 551494, 628517, 102925, 501695, 630450, 514066, 706046, 710268, 734162, 832568, 715755, 911863, 1225347, 908937, 523309, 509965, 676284, 950669, 458626, 504593, 586225, 371151, 524959, 265229, 490216, 728537, 802084, 580614, 734146, 794608, 1109681, 797092, 535747, 463293, 309498]
5555C09498Q3519m37189j95267K22390M3361N3920k45667p9786J50489k53324
5545c48056L86189K28755k09601K61314J30255r5157M10485L7277k6700o4120
5535G10641m69954Q009q4690j44400J11828L9877j777K32634R8801k60011Q5086
5524C26044N2886m1720q1298J78844k44783L3924m2173M4230r7688J18478N25699
5513G72443j5430l85562K32632L62682r3804l7045o5834J64529R6614k51042O6672
5502H46855J96359l05777l48425K36835L2781k98629r427j6068l08207j40180
5492a13883m0288K43280M25157L5688j98414k7781J75950L74409M681k99513O4836
5481F44122p0785j35146l682J57433J97688k39204N822J44768L2540J53535j10068
$$ y = [309498, 393017, -44172, -239439, -17049, 26312, 80232, -165435, -245221, -94732, -348056, 38133, 266888, 57287, 318601, 448856, 353699, 764184, 801461, 774761, 710641, 240687, 248696, 164006, 19606, 131434, 171311, 169534, 402168, 500969, 240958, 326044, 378930, 337210, 255912, 434756, 189973, 223897, 181724, 225954, 128266, 246744, 772443, 757013, 371451, 604083, 966765, 872961, 835916, 770082, 934611, 1031225, 780183, 846855, 1043214, 737437, 389012, 625847, 658628, 359999, 350572, 334504, 26297, -113883, -154171, 89109, 514266, 549954, 351540, 323759, 499709, 874118, 878799, 579286, 644122, 573337, 438191, 434509, 591942, 789630, 550426, 556248, 701016, 733556, 887091, 777023]
5470G77023l05715N5015M1984J2303J41369J8628K82912q0830n48851l18804L80166
5459D55200k42039L1754J47543l3311n4285k96931k3191J42638L45313j6945j82571
5448B73175K84017J00045J72829l88M4825L32410p9558J12381M55126j13779m18284
5437A162799k74219n8659L7201k18313l36451p2288J14804K05554J13285k47582
5427D26131J84675j2861p7337K0310J73113k7120P7197K13992J96855P2169m9177
5416A197947Q362L8779J24933J89976j56744j75682K4464k55642m939k44063k31232
5405E16159q5777j16312j59391J06836Q1040j77935k4517J67256J21308j35863
5395B92804j24258K46490m2380k39696N20422R0367K53237p9388j98142K48107
$$ y = [777023, 471308, 526323, 568307, 580610, 721979, 740607, 1023519, 942689, 393838, 75034, 455200, 213161, 244915, 392458, 359147, 304862, 7931, -15260, 127378, 472691, 455746, 273175, 557192, 657237, 830066, 829678, 874503, 1206913, 1127355, 1239736, 1694862, 1581083, 1162799, 888580, 829921, 867122, 648809, 312358, 240070, 354874, 560428, 673713, 426131, 610806, 597945, 520608, 540918, 714031, 686911, 764108, 978100, 1174955, 1247124, 1197947, 1206309, 1245088, 1370021, 1559997, 1403253, 1227571, 1252035, 996393, 991454, 747391, 516159, 430382, 314070, 154679, 261515, 342555, 164620, 140103, 307359, 428667, 292804, 168546, 415036, 372656, 132960, 653382, 743749, 996986, 917598, 719456, 967563]
5385I67563L4457j72299j29900Q5748N7750L20981k45927l2339n1825J5401j60085
5374F89525M3221k8956Q3805j11641J68694J13360l35243k6307P5131J31997J37386
5363I40972K45797l11832K19279J44503K34351j88107K66210l7128k16751l9597
5353A257697J55603R5098n46633k30522J70192K07053j96043k90608N3449J47504
5343H22790J2612J11912k71086j69004r7743J30017j6013N8412J09081K15817
5333I06795J53598r395j10706M37j04037r4682N2607K60410q2130L2410J34631
5322A139938K15869J82288k38193K3731k98490q9055K77925j11213j59190O094
5312I49704q6727k33333O4143K91781j9047j85272k1841J1307J53145J22307j46190
$$ y = [967563, 1002020, 829721, 699821, 785569, 843319, 1164300, 918373, 886034, 834209, 849610, 689525, 732746, 703790, 787595, 675954, 844648, 958008, 622765, 596458, 671589, 803586, 940972, 1186769, 874937, 1094216, 1238719, 1473070, 1284963, 1551173, 1514045, 1297294, 1257697, 1413300, 1508398, 961765, 731243, 901435, 1108488, 912445, 621837, 675286, 822790, 835402, 947314, 676228, 507224, 409481, 539498, 523485, 581897, 690978, 906795, 1060393, 1050998, 940292, 940729, 836692, 742010, 794617, 1055027, 972897, 1005307, 1139938, 1355807, 1538095, 1299902, 1323633, 1025143, 936088, 1214013, 1102800, 943610, 949704, 862977, 629644, 693787, 985568, 966521, 781249, 759408, 770715, 923860, 1046167, 899977]
5301H99977k68776K00684M23009l18k5421o8031J30335j4428l3039J2265k5747
5290A230510q0010L1625j23656K62931N80014K44447j58512J27243p9842K95517
5280B330267P8445k53641K26718J48927J40058m81261k68490N7138J99956l12535
5270A865582J48111J58317K41254N836l21653k64867K48173n7022O5681j79701
5260A909711l37308L79241j40791q8988j62623K10066L83q3630k7837K3504K83810
5249A965538J25581r1582j04132J77727N35818l07873M4815j0235k2990Q7302
5239B399969k58447J90555j15978l02596J35830j85524L99450j78098O1335O01784
5229B748280J67308K02700j02084l41429K27099J41933l39051J16098K92767K39520
$$ y = [899977, 631201, 831885, 1254894, 1254576, 1229155, 1161124, 1291459, 1277031, 1243992, 1256257, 1230510, 1150500, 1182125, 1058469, 1321400, 1901414, 2145861, 1987349, 2114592, 2034750, 2330267, 2408712, 2155071, 2381789, 2530716, 2670774, 2189513, 1921023, 1978161, 2178117, 1865582, 2013693, 2172010, 2413264, 2419100, 2097447, 1832580, 2080753, 2023731, 2089412, 1909711, 1572403, 1951644, 1810853, 1721865, 1559242, 1769308, 1769691, 1686061, 1658224, 1681728, 1965538, 2091119, 1999537, 1895405, 2073132, 2608950, 2301077, 2345892, 2335657, 2312667, 2399969, 2141522, 2332077, 2216099, 1913503, 2049333, 1863809, 2263259, 2085161, 2146496, 2748280, 2915588, 3118288, 3016204, 2674775, 2901874, 3043807, 2704756, 2820854, 3113621, 3353141]
5219C353141j14530K1523l78510M0636j62545q9666J29170L85046L17806k47830
5209C254241P9948N24377M06641J93072J74206q0645L2094K85405j05143o05126
5199D159070n9740R9348J55056k08691l7775R6086M0112K64560m4687l68383j9188
5188D075768J27536K20004j20736J38048J02087K02678N35816J50903K5304r0123
5178E367285L94169j01399J17818N9576L41013r468J34259j68433R3781k28806
5168E999795l05723J56969l90992p818R0078l28652P2618K36955m67678l4039
5158E021513m70098m0435r4816L0452J15139m5613k73002N96445K20287K43248
5148E303120J35462k4053J57547N7651K20544p6636j84794j51724j3754l90456
$$ y = [3353141, 3238611, 3260134, 2881624, 2922260, 2759715, 2670049, 2799219, 3184265, 3502071, 3254241, 3334189, 3858566, 4265207, 4458279, 4632485, 4551840, 4583934, 4869339, 4764196, 4159070, 4099330, 4198678, 4353734, 4145043, 4107268, 4203354, 4243466, 4508026, 4463339, 4094956, 4075768, 4203304, 4423308, 4302572, 4440620, 4542707, 4745385, 5281201, 5432104, 5457408, 5367285, 5761454, 5660055, 5777873, 5837449, 6178462, 6168994, 6303253, 6134820, 6228601, 5999795, 5694072, 5851041, 5460049, 5452231, 5542309, 5213657, 5286275, 5523230, 5055552, 5021513, 4551415, 4510980, 4416164, 4446616, 4561755, 4516142, 4243140, 4839585, 5059872, 5303120, 5438582, 5414529, 5572076, 5629727, 5850271, 5773635, 5588841, 5437117, 5423363, 5032907]
5138E032907K13096j61281M7147k29765J7745J8197j80682k20508j19192k54708
5128D162956l5262J93988m8566j15208k01702k20287J77884K75486j70062m32816
5118C586411j43763K90973J34239r3277k94099J8177l1242l62394K5494r5276
5108C035243O20745K8183m87408p5594J43489J0221k22007k8221K27268L18151
5098C570070l21254n38739j12559J10420J1180J48217m72707J13440M67021J51133
5088C126222n48202l47436J87180J42537p7965o7766L31017J72573K4041J32063
5078C074264j88177Q0294m4653k41243K41909K39601q2831l12932K18177P8942
5068C063351K51210J66952j93375J42651L554k70849K58161l32957Q9239K74987
$$ y = [5032907, 5246003, 5084722, 5131869, 4902104, 4919849, 4938046, 4757364, 4536856, 4417664, 4162956, 4127694, 4321682, 4273116, 4157908, 3956206, 3735919, 3913803, 4189289, 4019227, 3586411, 3442648, 3733621, 3867860, 3774583, 3480484, 3498661, 3467419, 3105025, 3130519, 3035243, 3655988, 3684171, 3196763, 3121169, 3264658, 3274879, 3052872, 3024651, 3251919, 3570070, 3248816, 2710077, 2597518, 2707938, 2719118, 2867335, 2394628, 2508068, 2975089, 3126222, 2578020, 2230584, 2417764, 2560301, 2482336, 2414570, 2745587, 2918160, 2942201, 3074264, 2886087, 2966381, 2921728, 2680485, 2922394, 3161995, 3079164, 2766232, 2984409, 3063351, 3314561, 3481513, 3288138, 3430789, 3434343, 3163494, 3421655, 3088698, 3177937, 3452924]
5058C452924l0045J48506j80701J02432l738Q3608o2299L83911l5932j97532p0199
5047C590935R5312K95418j84194k40329N78737j25938l0387J07045j88198K6777
5037C925178j03360J4016J96372j31528j37897M2751m827N6570k10664p5790k6441
5026C544380k36826J45927Q002O6891N5607l91162P4044K15057J23030j8944q0389
5015C505617L62563r962j22285K33916J26679J36192l6031J3824k39038j22284
5005C849191q299J6719J41974J04651j18687j78907l6374L26362k59832J61040
4995C997838J17756K20804K28316K12104L6272r1763M10299K57701M8617K5510
4985E463454K87145J17820N8039R2042J37631j29195K53463l12524P7826j27599
$$ y = [3452924, 3422879, 3571385, 3390684, 3493116, 3489378, 3572986, 3510687, 3894598, 3858666, 3661134, 3590935, 3686247, 3981665, 3797471, 3557142, 4135879, 4009941, 3979554, 4086599, 3898401, 3925178, 3821818, 3835834, 4032206, 3900678, 3762781, 3805532, 3800705, 3857275, 3646611, 3570821, 3544380, 3307554, 3453481, 3461483, 3528374, 3583981, 3192819, 3266863, 3481920, 3604950, 3586006, 3505617, 3868180, 3858218, 3735933, 3969849, 4096528, 4232720, 4196689, 4210513, 3971475, 3849191, 3840892, 3857611, 3999585, 4104236, 3985549, 3806642, 3770268, 4096630, 3836798, 3997838, 4115594, 4336398, 4564714, 4776818, 4813090, 4721327, 5131626, 5389327, 5437944, 5463454, 5750599, 5868419, 5926458, 6018500, 6156131, 6026936, 6280399, 5967875, 6045701, 5918102]
4975E918102J97830j50968m47500K48824J86897P6650m57601K06094N3311K04806
4965F036445M56551j90849O8315N37102M83432J61850m38629J89066N85283K53557
4955H142123J41339M4177j38097Q2146N0570j29912L99439Q4839j98769J7712
4945H495567n31112L04250K2615l94613L01519k97280N75935M34287k80234j22774
4935H508160L55039L406m93669m6753p4294o1155k90564p8595l11393j19390K80268
4924G671060p3711l63584l0491M3964K21162J69884L08537k0154m38453K03965
4914G692179K62467j62814O4597j77499O7402J80454l494K5402j76269n3888L95014
4903H113551O1853r8298k649L23906N57663N4680K31227j13990k10740m0357j49595
$$ y = [5918102, 6115932, 5964964, 5517464, 5766288, 5953185, 6029835, 5572234, 5778328, 5831639, 6036445, 6492996, 6302147, 6370462, 6907564, 7390996, 7552846, 7114217, 7303283, 7888566, 8142123, 8283462, 8327639, 8189542, 8271688, 8322258, 8192346, 8591785, 8676624, 8477855, 8495567, 7964455, 8268705, 8291320, 7896707, 8198226, 7900946, 8476881, 8911168, 8630934, 8508160, 8863199, 8866605, 8372936, 8326183, 8251889, 8190734, 7900170, 7821575, 7510182, 7390792, 7671060, 7597349, 7233765, 7203274, 7247238, 7468400, 7638284, 7946821, 7926667, 7488214, 7692179, 7954646, 7791832, 7856429, 7678930, 7746332, 7926786, 7923292, 7948694, 7772425, 7718537, 8113551, 8175404, 8077106, 8074457, 8398363, 8956026, 9010706, 9241933, 9127943, 8917203, 8876846, 8727251]
4892H727251j92250L58954J82455m5486j3913L11138J69184R9155J6871K75887
4882I889246M25532J77252J28405l79018J95690M62688P3947J43895K09650N13551
4872A1840838K05211L49151J87291j60996K92056J88651k6805M7126L45757M22978
4862A3691258J62415K0332M80450P12910j96584j67251O23462L24317M00096L18658
4852A6370063L82393M36486M88040M86000N07321R54790Q11168O91496R29688
4843B2057445R40506J364696J128713J073021R82472J229217J963348J591749
4835C2331167J365224J399682J580339Q47080Q74314R39337O52312J046961R04021
4826D1940437N40474O73527P30640L74012K6337j23067k5906p4407k77753k41653
$$ y = [8727251, 8535001, 8893955, 9076410, 9030924, 9017011, 9328149, 9497333, 9596488, 9613359, 9889246, 10314778, 10492030, 10620435, 10241417, 10437107, 10899795, 10973742, 11117637, 11327287, 11840838, 12046049, 12395200, 12582491, 12421495, 12713551, 12902202, 12875397, 12922523, 13268280, 13691258, 13853673, 13874005, 14354455, 15067365, 14870781, 14703530, 15326992, 15651309, 16051405, 16370063, 16752456, 17188942, 17676982, 18162982, 18670303, 19625093, 20436261, 21127757, 22057445, 22997951, 24362647, 25491360, 26564381, 27546853, 28776070, 30739418, 32331167, 33696391, 35096073, 36676412, 37523492, 38397806, 39337143, 39989455, 41036416, 41940437, 42480911, 43154438, 43885078, 44259090, 44285427, 44162360, 44136454, 44062047, 43784294, 43542641]
4816D3542641J01578N50269N44929O64322R69550J295575K093461J685810J374557
4807E2822692K019141K489418K708818K629015J859657K350014K343569J962769
4799G1185093J532149L24291n54183j365237j780529k536413l010568k921328
4791F0873275k606217k683925k653353k390008j691889k062528j621690j490116
4783D3673549j341027j566432j284807j177580j152490p49309r56875o34857p23586
4774C4086586p38410l32122m96894p56663m48895p9192j9445k082n48303n49107
4764C0115473l99714k9969K46304l83942l77720j21829q4572m1665m49730k59594
4754B8213042L30649j55949K45146o090K11235M70425K683M9650Q9196j55532
$$ y = [43542641, 43644219, 44194488, 44739417, 45403739, 46373289, 47668864, 49762325, 51448135, 52822692, 54841833, 57331251, 60040069, 62669084, 64528741, 66878755, 69222324, 71185093, 72717242, 73041533, 72487350, 71122113, 69341584, 66805171, 63794603, 60873275, 58267058, 55583133, 52929780, 50539772, 48847883, 46785355, 45163665, 43673549, 42332522, 40766090, 39481283, 38303703, 37151213, 36401904, 35445029, 34810172, 34086586, 33348176, 33016054, 32519160, 31762497, 31313602, 31234410, 31214965, 31212883, 30664580, 30115473, 29715759, 29685790, 29932094, 29548152, 29170432, 29048603, 28964031, 28922366, 28472636, 28213042, 28543691, 28387742, 28632888, 28626798, 28838033, 29308458, 29311141, 29360791, 29449987, 29294455]
4744B9294455K04418k96083l06198k53088J67258p3866l85958k23203j07043J75926
4734B8196618l32892k98517k34044l01460q7053m34377q56916j051117l62410
4725B4237832k67215o95934m90284m74673k957k81325l16467k81129l01006k96133
4715B0830709k29675m26946J0809k83771k88436k05799k08869l77845j03903J7748
4705A8734022o1350k82952k11467J3149o58340m19278m07877k54992m47693k61881
4695A5741341o02353q7366j01877l64187k44632j82547m25073j85330j06163p1149
4685A3370664k57209j63694l2553M4410l96876l65339q2408k93041k98218J14284
4675A1640020j32809r4610N90863m23970m72227m74899O4766p4443l38668P09
$$ y = [29294455, 29498873, 29202790, 28896592, 28643504, 28810762, 28736896, 28350938, 28127735, 28020692, 28196618, 27863726, 27565209, 27331165, 27029705, 26942652, 26508275, 25651359, 24600242, 24237832, 23970617, 23274683, 22784399, 22309726, 22306769, 22025444, 21708977, 21427848, 21126842, 20830709, 20601034, 20174088, 20184897, 19901126, 19612690, 19406891, 19198022, 18820177, 18716274, 18734022, 18672672, 18389720, 18178253, 18191402, 17533062, 17113784, 16705907, 16450915, 16003222, 15741341, 15138988, 15051622, 14949745, 14585558, 14340926, 14158379, 13733306, 13547976, 13441813, 13370664, 13113455, 12949761, 12917208, 12961618, 12564742, 12199403, 12116995, 11823954, 11525736, 11640020, 11507211, 11412601, 12003464, 11579494, 11107267, 10632368, 10697134, 10622691, 10284023, 10284732]
4665A0284732J19464j12982J35794j22961m78276K09242l25900n41316K5813j9286
4655I174324m800K2908l19670n0025p8853P10844J28529m27124q0396K89965k53169
4644I112533j6753J9683J74657M36566j16624L31668j68407J04564j86350k1486
4634I670051l46709k420r4660N25248j05579j46437L34424M5093M14692l75571
4624I918132j87174K49419j6997J48747n8992M188o87Q1799K59486M282p3737
4613A0328466K5003M04663M1223j88602K63584J03657j72287m0754P4263J66324
4603A1005540M1709K03347K59548k40355j93878k3083r3704l3798j14045P6637
4593A0887918l86771L45046K82814J33570k6317L41081Q4962J1492L25967N8259
$$ y = [10284732, 10404196, 10291214, 10427008, 10304047, 9825771, 10035013, 9709113, 9167797, 9193610, 9174324, 9169524, 9192432, 8872762, 8822737, 8743884, 9454728, 9583257, 9156133, 9075737, 9365702, 9112533, 9095780, 9115463, 9290120, 9726686, 9610062, 9941730, 9773323, 9877887, 9691537, 9670051, 9323342, 9320922, 9226262, 9751510, 9645931, 9499494, 9833918, 9879011, 10293703, 9918132, 9730958, 9980377, 9963380, 10112127, 10053135, 10057323, 10056636, 10138435, 10397921, 10402203, 10328466, 10353469, 10758132, 10799355, 10610753, 10874337, 10977994, 10805707, 10764953, 10839216, 11005540, 11047249, 11250596, 11510144, 11269789, 11075911, 11052828, 10959124, 10925326, 10811281, 10887918, 10501147, 10846193, 11129007, 11262577, 11236260, 11577341, 11662303, 11673795, 11999762, 12058021]
4583A2058021Q4995J05384K97361J28737J99030J21032J27838m8954K37594p2137
4573A3238901P2181M42786L00050o59009J52947J59575K63311K5931L27653M43411
4563A4767737K51596J16514L24736K43575K49339M79441r5478J53863L59964M70967
4553A7322254M9660N46595o581K93383M08409N37379p4223M17856N93707Q5552
4543B0173991o4651L26235L55157l3327L32917j84156J79178J47948J11669J38934
4533B1483895J98373k15441K85620N3731k6504j93990l186K56607J24179J08292
4523B2071576J0850N0450K16784M24854j13346L269J38459J77308L33108J48197
4513B3461509K27846L68910J41417M86339J01242K51002j35246M41993J23759
$$ y = [12058021, 12143016, 12248400, 12545761, 12674498, 12873528, 12994560, 13122398, 13073444, 13311038, 13238901, 13311082, 13753868, 14053918, 13394909, 13547856, 13707431, 13970742, 13996673, 14324326, 14767737, 15019333, 15135847, 15460583, 15704158, 15953497, 16432938, 16337460, 16491323, 16851287, 17322254, 17371914, 17918509, 17911928, 18205311, 18613720, 19151099, 19076876, 19494732, 20088439, 20173991, 20109340, 20435575, 20790732, 20757405, 21090322, 20906166, 21085344, 21233292, 21344961, 21483895, 21682268, 21466827, 21752447, 21806178, 21779674, 21585684, 21582498, 21839105, 21963284, 22071576, 22082426, 22132876, 22349660, 22774514, 22661168, 22664437, 22802896, 22980204, 23313312, 23461509, 23689355, 24058265, 24199682, 24686021, 24787263, 25038265, 24903019, 25345012, 25468771]
4504B5468771L94763J46789J56819J10668J75015M34402M68746K48911J03690
4495B7708574L28865N72595N11717N02588P28468M36148O16823R10163O67026
4486C2982967P91474P72622Q67531J248440Q11892R48936P15000R43665J135819
4477D1218346J507067J911904J228574J327567K061480K222985K462275K356937
4469E6297135K687939K793841L165779K921319K751187L099681L500301L307555
4461H0524737L086821K653500J865402J505861N06217J36070J76354N67601P08202
4452I1730765J083956J557516J655737J107178R05084J252656J032232R71619
4444A01296743L66001L81325j80765j78332m42781q52522j282880k354995k746421
$$ y = [25468771, 25863534, 26010323, 26167142, 26277810, 26452825, 26887227, 27355973, 27604884, 27708574, 28037439, 28610034, 29121751, 29624339, 30352807, 30788955, 31405778, 32315941, 32982967, 33774441, 34547063, 35414594, 36663034, 37474926, 38423862, 39138862, 40082527, 41218346, 42725413, 44637317, 45865891, 47193458, 49254938, 51477923, 53940198, 56297135, 58985074, 61778915, 64944694, 67866013, 70617200, 73716881, 77217182, 80524737, 83611558, 86265058, 88130460, 89636321, 90142538, 90278608, 90454962, 91022563, 91730765, 92814721, 94372237, 96027974, 97135152, 98040236, 99292892, 100325124, 101296743, 101662744, 102044069, 101863304, 101684972, 101242191, 100389669, 99106789, 96751794, 94005373]
4435I4005373k462538l146434l066986l475777l581487l514899k828191k888973
4427F9040088l079234k881025k397156j992903k350286k177720j777540j569264
4419E0814960j409419j397474j351797j038175j088889j079600j196327m87198
4411D1766081j044335m13633n77549p42183n53371j30915m01371n60257p08491
4402C6633976k43728k24704o20526l35286m24959j77117M3550k25166n19551R613
4392C3916102K10137j40096o60452L27983K1309k09088l3205o975O5579k42704
4382C3248590L5364k5340j59001k59614K23350m11106P687K74576M12499o0569
4372C3286436k92835K04955j95874j52839j08231j38575j72558j51638k54543
$$ y = [94005373, 91542835, 88396401, 85329415, 81853638, 78272151, 74757252, 71929061, 69040088, 65960854, 63079829, 60682673, 58689770, 56339484, 54161764, 52384224, 50814960, 49405541, 48008067, 46656270, 45618095, 44529206, 43449606, 42253279, 41766081, 40721746, 40308113, 39730564, 38988381, 38435010, 38304095, 37902724, 37342467, 36633976, 36390248, 36165544, 35545018, 35209732, 34784773, 34607656, 34651206, 34426040, 33906489, 33916102, 34126239, 33986143, 33325691, 33653674, 33674983, 33465895, 33432690, 33425715, 33491294, 33248590, 33283954, 33258614, 33099613, 32839999, 33063349, 32652243, 32659930, 32934506, 33347005, 33286436, 32993601, 33198556, 33002682, 32849843, 32741612, 32603037, 32430479, 32278841, 32024298]
4363C2024298L2119J64199N17675J74031k31383K75390M17011j01083J03030l23143
4353C3052144k7260k05468m90410l95048n33013k35484n3510m74396M7776j47283
4343C0538048k87783j3882J432j34468r2819K28556k32523J89574m0677O6430
4333C0221888J26975R3583M08106K01560j71343l23517j38994j21427j48416M5042
4323C0193457k33099o43583l0586K88087j81708k16697j53038Q2927j69029R8516
4313B9035247J18115j41686L71269j13947j81317J95723j04610k31548l61233
4304B8586013O0458M2421k49545o73115k35942P0043k53836j03758k01779n9239
4294B6981721m810l6627n56546L7930J44318R8812l90397K84m303R1614l2459
$$ y = [32024298, 32056417, 32220616, 32738291, 32912322, 32680939, 32956329, 33373340, 33272257, 33375287, 33052144, 33024884, 32819416, 32329006, 31933958, 31400945, 31165461, 31111951, 30637555, 30685331, 30538048, 30250265, 30236383, 30237815, 30103347, 30010528, 30239084, 30006561, 30196135, 30155458, 30221888, 30348863, 30442446, 30850552, 31052112, 30880769, 30557252, 30418258, 30296831, 30148415, 30193457, 29960358, 29316775, 29286189, 29574276, 29392568, 29175871, 29022833, 29105760, 28936731, 29035247, 29153362, 29011676, 29382945, 29268998, 29087681, 29283404, 29178794, 28947246, 28586013, 28646471, 28688892, 28439347, 27766232, 27530290, 27600333, 27346497, 27242739, 27040960, 26981721, 26976911, 26940284, 26383738, 26421668, 26565986, 26664798, 26274401, 26274685, 26270382, 26361996, 26329537]
4283B6329537R6770L66613O69299L35376j48397j50649R2611L89899m30265j11432
4273B7439362j57781M24122L23353j02372k10596q7250m0061L40912n48428l93945
4263B6987316n6552j16958m20785m44684l34583o65702p18225o90650l97867n66117
4253B2575193j11286k29825l98685J91838l76013j66335J39051R4137N2984l46060
4243B1424999q0099L70572k04603M1957J08941j28078j23640l0659k37596j58893
4233B0982901J33797J6532n56218p18643k5177l61713p33348o44575n94592j23277
4223A7375687j90104k99742m87598l00632M3983j93952n39361l49810L93089l15874
4213A5135686k80062o0837k62717j6008j73110m6569J57193k53284k0631j81187
$$ y = [26329537, 26426307, 26792920, 27462219, 27797595, 27649198, 27498549, 27591160, 27981059, 27550794, 27439362, 27281581, 27705703, 28029056, 27926684, 27716088, 27628838, 27588777, 27929689, 27381261, 26987316, 26930764, 26813806, 26393021, 25948337, 25613754, 24948052, 24229827, 23539177, 23141310, 22575193, 22463907, 22234082, 21835397, 22027235, 21651222, 21484887, 21623938, 21718075, 21771059, 21424999, 21344900, 21715472, 21510869, 21552826, 21661767, 21533689, 21410049, 21379390, 21141794, 20982901, 21116698, 21133230, 20577012, 19858369, 19833192, 19471479, 18738131, 18093556, 17498964, 17375687, 17185583, 16885841, 16398243, 16097611, 16141594, 15947642, 15408281, 15058471, 15451560, 15135686, 14855624, 14794787, 14532070, 14516062, 14342952, 14296383, 14453576, 14200292, 14179661, 13998474]
4203A3998474l53883N5663k44051k71620m9456j05725k24969j89827J47018j11092
4193A2650532n680k17373k0966m17179o2605n9731l45833k87835K86941j97894
4183A1322377l39357j12703M6877K2962j87495j24349j85941K4526l84434k17418
4173I865045l26860L29859l304n5186j5029R8511o2217j79043Q1397j2254O9797
4162I790716j7348j37989M156O5438K24443j62276L2182K95676n92483j66306
4152I336209J2126n3832r9448l69943J04282K30336l29659K50217r1812k7285
4142H961191l170K73331M5815l38859K18353L20319m83207j75928L82357J90621
4132I390823m08511k38499N23017J87075l21580k98813k09770K4948J61700k27856
$$ y = [13998474, 13644591, 13700254, 13456203, 13184583, 13135127, 13029402, 12804433, 12614606, 12761624, 12650532, 12644852, 12427479, 12406513, 11989334, 11926729, 11866998, 11521165, 11233330, 11520271, 11322377, 10983020, 10870317, 10917194, 10940156, 10752661, 10628312, 10442371, 10466897, 10082463, 9865045, 9538185, 9868044, 9864740, 9809554, 9794525, 9893036, 9830819, 9651776, 9733173, 9720919, 9790716, 9773368, 9635379, 9639535, 9704973, 9929416, 9767140, 9799322, 10094998, 9502515, 9336209, 9348335, 9294503, 9195055, 8825112, 8929394, 9159730, 8830071, 9080288, 8988476, 8961191, 8958021, 9231352, 9277167, 8938308, 9156661, 9476980, 8993773, 8817845, 9200202, 9390823, 8982312, 8743813, 9266830, 9453905, 9132325, 8833512, 8623742, 8648690, 8810390, 8582534]
4122H582534J04171r3382k7407j63831k05291J28382J22967l4153j80371j21005
4112H112614M0148K08061O6068m50657r7739J18009K33439K20278O847j67807
4102H289261k5085M1270p7171K56143j1200m01457Q0598O0314k25287j84330j84406
4091G618650K63696k9911k13441j09926k4260j94759j0923j27437j17500L99972
4081G454161m108p4093p0023l17286K85909N24659k94390J25483R0892k04858
4071G516346J1358j71118n6929j29471L3616L82068J3723k00562L8783K10757
4061G648571L8916k7488P0740L56650J71532J02325k07417K12116K98795j02169
4051H562571j83653M31365L16886j17472K26588K59052L67552O25174Q1730K15731
$$ y = [8582534, 8686705, 8593323, 8565916, 8402085, 8196794, 8325176, 8448143, 8413990, 8233619, 8112614, 8152762, 8360823, 8426891, 7976234, 7878495, 7996504, 8229943, 8450221, 8457068, 8289261, 8264176, 8305446, 8228275, 8484418, 8473218, 8071761, 8152359, 8212673, 7987386, 7803056, 7618650, 7882346, 7852435, 7638994, 7529068, 7504808, 7310049, 7299126, 7171689, 7054189, 7454161, 7450053, 7375960, 7305937, 6988651, 7274560, 7799219, 7504829, 7630312, 7721204, 7516346, 7527704, 7356586, 7299657, 7170186, 7203802, 7585870, 7599593, 7399031, 7437814, 7648571, 7687487, 7659999, 7730739, 8087389, 8258921, 8361246, 8153829, 8365945, 8664740, 8562571, 8378918, 8810283, 9127169, 9009697, 9236285, 9495337, 9862889, 10488063, 10569793, 10785524]
4041A0785524J99387L21990N86876K57662J19190K78874o064L02323k10658k46126
4031A2388978j48849k18234J43685J18713k83900k29917j5251Q5574r5263m40758
4021A1304778n4327M446L66023q5468M8195j68652K81279J96043K11497O46119
4011A2749933K51734J34792Q5444K12653N95924L64520k18358k28234J4802K93260
4001A4256470j236k66861j55467L26173k46207m97967n37807j60234j8286k73359
3991A2425219J43256j87249j09172l37192l82202l42253K92136k29878l36199
3982A0936466k12601N2968j67034k45941k69812K75622j94661j46117j71386j66356
3972I691148N24792N801n14499k03695J35994r1667K64713k44779L02098L88652
$$ y = [10785524, 10984911, 11306901, 11893777, 12151439, 12270629, 12549503, 12543439, 12845762, 12635104, 12388978, 12240129, 12021895, 12165580, 12284293, 12000393, 11770476, 11755225, 11840799, 11745536, 11304778, 11250451, 11254897, 11620920, 11535452, 11583647, 11414995, 11696274, 11892317, 12103814, 12749933, 13001667, 13136459, 13221903, 13434556, 14030480, 14395000, 14176642, 13948408, 13963210, 14256470, 14255234, 13988373, 13832906, 14159079, 13912872, 13414905, 12877098, 12716864, 12698578, 12425219, 12568475, 12381226, 12272054, 11934862, 11552660, 11210407, 11502543, 11272665, 10936466, 10723865, 10776833, 10609799, 10363858, 10094046, 10369668, 10175007, 10028890, 9857504, 9691148, 10215940, 10221741, 9707242, 9503547, 9639541, 9547874, 9812587, 9567808, 9869906, 10258558]
3962A0258558j12419Q3537J01551j44299j90175r39544J10697L12222n49133k32017
3952H698978m47968j84178N1397k75762k62101p2651p1123L60438m09992o3520
3942G323518j43202K9029J80372k81906k31739j85260q2210P835J1800k25563
3932F402674O662R9337p8174k40229n6437k04445k77428k83883K07781R7474l47291
3921E326041J07238k44845k33544P176J16297L5103Q0394J52319n0896j45266
3911E150017L9232R4633L01541J5621l26293M8212K23384K12005k05159J56439
3901E709632q171l14243N9044k94519k0716m6468n4739K89328N1660L01007K45201
3890E917016j9949j56442K34007Q896j56068J06535k65554J64505K72436j39385
$$ y = [10258558, 10146139, 10229676, 10331227, 10186928, 9996753, 9057209, 9167906, 9480128, 8930995, 8698978, 8251010, 8066832, 8118229, 7842467, 7580366, 7507715, 7436592, 7797030, 7387038, 7323518, 7180316, 7209345, 7389717, 7107811, 6876072, 6690812, 6608602, 6616437, 6628237, 6402674, 6409336, 6508673, 6430499, 6190270, 6133833, 5929388, 5651960, 5368077, 5575858, 5673332, 5326041, 5433279, 5188434, 4954890, 4962066, 5078363, 5113466, 5193860, 5346179, 5295283, 5150017, 5189249, 5283882, 5585423, 5601044, 5274751, 5322963, 5546347, 5758352, 5553193, 5709632, 5701461, 5387218, 5446262, 5151743, 5131027, 5084559, 5029820, 5319148, 5370808, 5671815, 5917016, 5897067, 5740625, 5974632, 5983528, 5827460, 5933995, 5668441, 5832946, 6105382, 5965997]
3880E965997J58926k06124L28138j41732K2076l14509m42568K14723L28878j35463
3870E778342l856O8462P7040L42588q3450M85413j5307l07802J45245J07754l74804
3859F219625n6441J15357j11691K7904r9235J93041J13090Q599L75991K78145
3849G064385j81906n8945j4083L07094K64276j64136M2714J1459M3548J64723
3839G479129k6768J2693K15489J38806m1806j2127K60162K35780J09224N93875
3829H964457J12864L5023R0513J37412l5204J04529k08478J68897J12392J91087
3819I673492L00976L68093M7562k44231q8340M29266K93085K35411J21030m84182
3809A0652162L94712J16999P4532M4808M44336J84947K57337K2982j09360L5045
$$ y = [5965997, 6124923, 5918799, 6246937, 6105205, 6127281, 5812772, 5370204, 5584927, 5913805, 5778342, 5774486, 5842948, 5919988, 6262576, 6179126, 6664539, 6649232, 6341430, 6486675, 6594429, 6219625, 6163184, 6278541, 6166850, 6194754, 6095519, 6288560, 6401650, 6410249, 6786240, 7064385, 6882479, 6823534, 6809451, 7116545, 7380821, 7216685, 7259399, 7270858, 7314406, 7479129, 7452361, 7465054, 7680543, 7819349, 7777543, 7765416, 8025578, 8261358, 8370582, 8964457, 9077321, 9112344, 9202857, 9340269, 9305065, 9409594, 9201116, 9370013, 9482405, 9673492, 9974468, 10342561, 10390123, 10145892, 10057552, 10486818, 10779903, 11015314, 11136344, 10652162, 11046874, 11163873, 11238405, 11283213, 11727549, 11912496, 12169833, 12192815, 12083455, 12118500]
3799A2118500j50354j42344J76595k04002o6571Q0108J88740j7138J61435K05810
3789A2350779M712j39722J33161O39827l5279p7699J24411K96062J77239J21433
3779A3594924L74675M57071N58741O4329J4183K9071J86209K48496J08230k7889
3769A5608040L46921K18136N24491M08591L71395J45105L02429K76339L15869
3760A8517316J19315m6422j10115Q4897M22540J53902m9296K59816L16730J92632
3750A9861315M37342J39411K42197R5974M91278P18996L44543O84155N83162N14008
3740B4112381N87516L46140P16297P88873P04707P06199M63547J63963J97199
3731B8786822K43329M82650K36050Q8415Q5930L45698M7024k83738m75497L23695
$$ y = [12118500, 11968146, 11825802, 12002397, 11798395, 11731824, 11811932, 12000672, 11983534, 12144969, 12350779, 12355491, 12215769, 12348930, 12988757, 12953478, 12875779, 13000190, 13296252, 13473491, 13594924, 13969599, 14426670, 14985411, 15049740, 15063923, 15092994, 15279203, 15527699, 15635929, 15608040, 15954961, 16173097, 16697588, 17106179, 17477574, 17622679, 17925108, 18201447, 18517316, 18636631, 18590209, 18480094, 18564991, 18987531, 19141433, 19092137, 19351953, 19668683, 19861315, 20298657, 20438068, 20680265, 20776239, 21267517, 21986513, 22331056, 23015211, 23598373, 24112381, 24699897, 25046037, 25762334, 26551207, 27255914, 27962113, 28425660, 28589623, 28786822, 29030151, 29512801, 29748851, 29837266, 29923196, 30268894, 30315918, 30032180, 29556683, 29880378]
3721B9880378L11826o6265M7433K9243O38703L04425J77856L19385J43841O73906
3711C2460731J95052r5184N24220K20270J29350k37951k00428K39993L29679K7047
3701C3592779m72371j32171J15800J22719r58L64964L43058L33871O15127P37573
3691C5620391P62428P35587P22670J089467M21610N61947Q43472O37979M06458
3682D1802009P52414P32327Q34245Q28797N23112Q23605K04362M20903J58304
3673D7080078K28352M33613L68775J44633J78546K57332K50857K54484K81622
3664D9478292K58595N44409Q94587P78144P85070J218113J553302J405529J735054
3655E8651095K100308K486506K295675K809945L242210L391965L080424L603014
$$ y = [29880378, 30192204, 30125939, 30173372, 30202615, 30841318, 31145743, 31323599, 31642984, 31786825, 32460731, 32655783, 32560599, 33084819, 33305089, 33434439, 33196488, 32996060, 33236053, 33565732, 33592779, 33120408, 32988237, 33104037, 33226756, 33225798, 33590762, 33933820, 34267691, 34882818, 35620391, 36382819, 37118406, 37841076, 38930543, 39352153, 39914100, 40757572, 41395551, 41802009, 42554423, 43286750, 44120995, 44949792, 45472904, 46296509, 46500871, 46921774, 47080078, 47308430, 47742043, 48110818, 48255451, 48433997, 48691329, 48942186, 49196670, 49478292, 49736887, 50281296, 51175883, 51954027, 52739097, 53957210, 55510512, 56916041, 58651095, 60751403, 63237909, 65533584, 68343529, 71585739, 74977704, 78058128, 81661142]
3647H1661142L862013M313241M430347M262383M497645M319742L691810K215364
3639A13253687R14766P5738j510025l461501m993001n856114n797031o179226
3631H6447293n800068n154910m226024l182951k231586k378893k060198j193507
3623F0219156r84935p17853l75802K47512l2586K17126L05025J30934N92463O22664
3613F0223704M65954L42373Q24895J122430R84648J069489J270458J428982J861227
3604F9594160J606952J822737J757932J672877J431068R88199L87234P56427P17969
3595H0735555J81989J13453K29222K3348J25280l59553q23733j054494q50127
3586G8320940r75869j420747j065247j097428j077183j018521j059744q38213
$$ y = [81661142, 85523155, 89836396, 94266743, 98529126, 103026771, 107346513, 111038323, 113253687, 114168453, 114244191, 112734166, 109272665, 104279664, 98423550, 92626519, 86447293, 80647225, 75492315, 71266291, 68083340, 65851754, 63472861, 61412663, 60219156, 59234221, 58516368, 58140566, 58388078, 58355492, 58572618, 58877643, 59008577, 59601040, 60223704, 60689658, 61032031, 61856926, 62979356, 63964004, 65033493, 66303951, 67732933, 69594160, 71201112, 73023849, 74781781, 76454658, 77885726, 78873925, 79261159, 80017586, 80735555, 80917544, 81030997, 81260219, 81283567, 81408847, 81049294, 80225561, 79171067, 78320940, 77345071, 75924324, 74859077, 73761649, 72684466, 71665945, 70606201, 69767988]
3578F9767988n28269p94659o32602m33373m43491n35790j47386n62722k80243
3569F5409453k98412n25884j26747n2678M06516k121j33994p2112l05976j77561
3559F4120484l68656j080126o87811p38323j140517p05360q92976l34470q06294
3550E7365951p06632j47935p35972r68499j147229j394019j240668j116826k010850
3541D7897321k040617j737944j455987j679889j538306j259547j204397j333805
3533C5646829j183088j241380j259290l31246q07627p18418p27943o98559o06750
3524B8072528p20782r03874n5928k15137o06342p2100n15300j27460l02995n5815
3514B4496795k11963m87528j67667j72552j91870J86637k8000r0503p7276l99313
$$ y = [69767988, 69239719, 68445060, 67812458, 67379085, 66935594, 66399804, 66252418, 65689696, 65409453, 65111041, 64585157, 64458410, 64405732, 64812248, 64810127, 64676133, 64604021, 64298045, 64120484, 63751828, 62671702, 61983891, 61245568, 60105051, 59399691, 58506715, 58172245, 57365951, 56659319, 56511384, 55775412, 54806913, 53659684, 52265665, 51024997, 49908171, 47897321, 45856704, 44118760, 42662773, 40982884, 39444578, 38185031, 36980634, 35646829, 34463741, 33222361, 31963071, 31631825, 30824198, 30105780, 29377837, 28679278, 28072528, 27351746, 26447872, 26391944, 26176807, 25570465, 25498365, 24983065, 24855605, 24552610, 24496795, 24284832, 23797304, 23629637, 23457085, 23265215, 23451852, 23423852, 23333349, 23256073, 22856760]
3504B2856760J82896J71548J84559j24405n28863o17292M01222P7792q5684n70051
3494B1948482l95690K1566j57030j95482j25149K56366J29903q8734K92849M3160
3484B1730241J78713m3953K95426N12230j87076M27914O52831N58757K30546K82566
3474B4638195K67303O86646O88303O94836P63855N11210M83131R60954J115500
3465C0809933P98126L28423M98124R10076J149491J98040K61317K29124K25498
3456C5408152j72586k54714k38793n95938k31548k33218n63792j03668K39594
3447C3253489N3803m82230p3868O07217k42487l59410P13122M13375J99472N09739
3437C4592222o2491L46071O48863Q07498M94976L50150J049018J011886L11724
$$ y = [22856760, 23039656, 23211204, 23395763, 23271358, 22742495, 22125203, 22526425, 22604217, 22518533, 21948482, 21552792, 21574358, 21417328, 21221846, 21096697, 21353063, 21482966, 21394232, 21687081, 21730241, 21908954, 21865001, 22160427, 22672657, 22485581, 22913495, 23566326, 24125083, 24355629, 24638195, 24905498, 25592144, 26280447, 26975283, 27739138, 28250348, 28733479, 29694433, 30809933, 31608059, 31936482, 32434606, 33344682, 34494173, 34692213, 34953530, 35182654, 35408152, 35235566, 34980852, 34742059, 34146121, 33914573, 33681355, 33117563, 33013895, 33253489, 33307292, 32825062, 32751194, 33358411, 33115924, 32756514, 33469636, 33883011, 34082483, 34592222, 34529731, 34875802, 35524665, 36332163, 36827139, 37177289, 38226307, 39238193, 39549917]
3428C9549917R46684J535237J244935J255509J539584J688310J301913J508752
3420E0570841J880359P26037P45430R60827O11843Q16808J153780J330655J218848
3411F0015428J784888K057316K090112K678185L388057L790082L869053M707875
3403H4380996O134242P277187P732884O738892L443327j532249o170286q369569
3395I9635424q795103p485728o117580n505459m398513l198769k162111j542272
3387F0429889j667718j458466q04884j050730l72664k77732l24949j12924r2425
3378E4267397l30892L81534O53043J87620P21248N01691N20751J036151J272776
3369E9211319J179358R93440J111734J270567Q25181J792877J813025J485992
$$ y = [39549917, 40496601, 42031838, 43276773, 44532282, 46071866, 47760176, 49062089, 50570841, 52451200, 53177237, 53922667, 54883494, 55495337, 56312145, 57465925, 58796580, 60015428, 61800316, 63857632, 65947744, 68625929, 72013986, 75804068, 79673121, 84380996, 90515238, 97792425, 105525309, 112264201, 115707528, 114175279, 108004993, 99635424, 90840321, 83354593, 77237013, 71731554, 67333041, 64134272, 61972161, 60429889, 58762171, 57303705, 56498821, 55448091, 55075427, 54797695, 54472746, 54359822, 54267397, 53936505, 54318039, 54971082, 55158702, 55879950, 56381641, 56902392, 57938543, 59211319, 60390677, 61384117, 62495851, 63766418, 64591599, 66384476, 68197501, 69683493]
3361F9683493J685456K169517K459048K797090L167661L670426L787590M113700
3353I3533981M489282M838601N943279O235450O550935P098802Q761460R540681
3345A46992471J0385457J1108599J2121309J1431752Q993599N355495k34968o027741
3337B00125973r441739j0811769j1343556r843665q101554o730251n047292l770893
3329A35035254k747222j565611j286200j03582l05323l90889N22802J081495J761403
3320A32002127K146140K902401M185184M959125N867441O830595Q267810J0031110
3312A77191933J1724253J3437537J5146531J7530886J7085746J4496903J0718478
3305B77332267M996093j386351q121222j3656817j8374690k0659824k1149167
$$ y = [69683493, 71368949, 73538466, 75997514, 78794604, 81962265, 85632691, 89420281, 93533981, 98023263, 102861864, 108805143, 115040593, 121591528, 128690330, 137451790, 146992471, 157377928, 168486527, 180607836, 192039588, 201033187, 206388682, 206153714, 200125973, 190684234, 179872465, 168528909, 158685244, 150583690, 143853439, 138806147, 135035254, 132288032, 130722421, 129436221, 129332639, 129027316, 128636427, 129159229, 130240724, 132002127, 134148267, 137050668, 141235852, 146194977, 152062418, 158893013, 167160823, 177191933, 188916186, 202353723, 217500254, 235031140, 252116886, 266613789, 277332267, 282328360, 280942009, 272820787, 259163970, 240789280, 220129456, 198980289]
3298A98980289k0360236j7576437j4793399j2028056j0108500q388903o923405
3291A08801353o007523n962209n147352m533553m177566m017532l870136l686503
3283G1398979l141755k425974k389059k470446k231624j910347k078802k003416
3275E2747556j276314j444743j887053j283384j132769r90088j238308j088447
3267D2406450j029438j020862r83144r49729q95474p99590n58035n99096n96792
3258C4974290q84202o08984m58010k44090l70355o70748l41012l04684n70726
3249C0521479k97341l35966o55076j18381L9637l68192o12795m31643j8450k92773
3239B7430499J07689q9530k11516J6268j35887M04326K17676k56685J45488M24645
$$ y = [198980289, 178620053, 161043616, 146250217, 134222161, 124113661, 115724758, 108801353, 102793830, 96831621, 91684269, 87150716, 82973150, 78955618, 75085482, 71398979, 68257224, 65831250, 63442191, 60971745, 58740121, 56829774, 54750972, 52747556, 51471242, 50026499, 48139446, 46856062, 45723293, 44733205, 43494897, 42406450, 41377012, 40356150, 39373006, 38423277, 37527803, 36728213, 36170178, 35571082, 34974290, 34090088, 33481104, 33023094, 32779004, 32408649, 31737901, 31396889, 31092205, 30521479, 30224138, 29888172, 29233096, 29114715, 29154352, 28786160, 28173365, 27741722, 27723272, 27430499, 27538188, 27448658, 27237142, 27253410, 27117523, 27521849, 27739525, 27482840, 27628328, 28052973]
3229B8052973J80277Q388j7594j38961k48899L6809o48698o51991l81267k9635
3219B6161402n99968o00245j2414k13847n73851q47325m59839n85094r14203m72897
3209B0881719n06373p64457m51907o96812m72773k62053m22542m56889Q757j06886
3199A6749784l98212j80159k18959k88826K740m2675l80986j62133j29177k28409
3189A4722988m58821k67577N0845K2678j94149k50403l0444P011j73704l43880
3179A3084544k90588p0940n3284l03372j85009j60171J18024q9361N9822M97931
3169A2607596J17234m44564k95276J03623j72012j61217P6295l21053o6919l91374
3159A1052333j75998N3067k30587j23782j99529J89184Q8138r494O5068J13160
$$ y = [28052973, 28233250, 28241638, 28224044, 28085083, 27836184, 27872993, 27224295, 26572304, 26191037, 26161402, 25561434, 24961189, 24948775, 24734928, 24161077, 23313752, 22853913, 22268819, 21354616, 20881719, 20375346, 19610889, 19158982, 18462170, 17989397, 17727344, 17304802, 16847913, 16856670, 16749784, 16351572, 16171413, 15952454, 15663628, 15666368, 15623693, 15242707, 15080574, 14951397, 14722988, 14264167, 13996590, 14047435, 14070113, 13875964, 13625561, 13595117, 13602128, 13428424, 13084544, 12793956, 12723016, 12669732, 12366360, 12181351, 12021180, 12139204, 12049843, 12109665, 12607596, 12724830, 12280266, 11984990, 12088613, 11916601, 11755384, 11831679, 11510626, 11443707, 11052333, 10876335, 10929402, 10698815, 10575033, 10375504, 10564688, 10652826, 10643332, 10708400, 10821560]
3149A0821560r5039K16901q4674k32915k09141J16662j64750n9743q4207j80501
3139A0044153N0268k68718J36276j15551J01250L8998o2040j3206k01955J38420
3129I847895L77355k03339k30009l47590K89528K91141J0070R8749l24865q0384
3119I728551j80126n944p2779M02356K12188K7445k35091P6001K19633k9007p1830
3108A0071397R814L54658K06375j11983j15952L40753N19236N15093O308L04278
3098A2099977m1709J81055M20723J9956J20010L01362N00890K9585J82691M25041
3088A4239581K06096j2860M32398J23664L01721M23158N52849M63444R28086R05234
3078A8563371Q57253O24300J337744J448730J214462J102742J294082K076354
$$ y = [10821560, 10726521, 10943422, 10858748, 10625833, 10416692, 10533354, 10368604, 10308861, 10224654, 10044153, 10094421, 9825703, 9961979, 9846428, 9947678, 9986676, 9924636, 9911430, 9709475, 9847895, 10225250, 10021911, 9791902, 9444312, 9733840, 10024981, 10035051, 10133800, 9808935, 9728551, 9548425, 9542481, 9469702, 9872058, 10084246, 10111691, 9876600, 9952601, 10172234, 10143227, 10071397, 10081211, 10435869, 10642244, 10530261, 10414309, 10755062, 11274298, 11789391, 11795699, 12099977, 12058268, 12239323, 12660046, 12680002, 12800012, 13101374, 13602264, 13631849, 13814540, 14239581, 14445677, 14432817, 14865215, 14988879, 15290600, 15713758, 16266607, 16730051, 17658137, 18563371, 19420624, 20044924, 21382668, 22831398, 24045860, 25148602, 26442684, 28519038]
3070B8519038J929127K427282K450504L096056L441906M712400O142421Q395133
3062F1113867R256202N265463k610273q697118j0120837p739317n961136m768033
3054C5738818l216147k001036j671539j649428q81407l78400n17924j187543m03184
3045B3832210o06623p89510k11075n83628p55860j34146J07936j1526k89247j01801
3035B0456730K79679j09964N5878j40158K16573l0946l77789k20738j83543l86015
3025A9559707o2222k35111J49903K54244L95482N1180j22724n4225J01217K39192
3015B0276643l57111M29399r3272K0562K36987j8755j99413L04194N9080N2364
3005B0710678J96665k96552K41384P1122P22J105J34577k9215K56227L5326K0070
$$ y = [28519038, 30448165, 32875447, 35325951, 38422007, 41863913, 46576313, 52718734, 61113867, 70370069, 75635532, 73025259, 64328141, 54207304, 46467987, 40506851, 35738818, 32522671, 30521635, 28850096, 27200668, 26319261, 25940861, 25422937, 24235394, 23832210, 23225587, 22436077, 22225002, 21641374, 20885514, 20751368, 20859304, 20847778, 20558531, 20456730, 20736409, 20626445, 20682323, 20542165, 20758738, 20727792, 20350003, 20129265, 19945722, 19559707, 19497485, 19262374, 19412277, 19666521, 20062003, 20113183, 19990459, 19936234, 20037451, 20276643, 19919532, 20348931, 20255659, 20276221, 20513208, 20494453, 20295040, 20599234, 20658314, 20710678, 20907343, 20610791, 20852175, 20923297, 20924019, 20925124, 21059701, 21030486, 21286713, 21322039, 21342109]
2994B1342109m22994j2633N95465P3239j57097J91643O84921K97297K50105K01003
2984B3043058M99824J21664M17295M33759M17541M15404O01978L51106N70518
2975B6872147N16947N94373M21147K31502O57067O57665L99451N65531Q66463
2966C1782293O80122J164596J010122Q38146J014831J304647J511544J513271
2958D0819572J248063J134022J341883J899733J411468J220078J928378J976602
2950E2979799J740475J391251K057177J890927J639891J761650K021270J960876
2942F7443316J955102K486745J788280J425330K244503K127075J688499K009964
2934H3168814K034565J440496J293247J550941J374846J250896Q79045Q66366
$$ y = [21342109, 20919115, 20906482, 21501947, 21575186, 21418089, 21609732, 22294653, 22591950, 22842055, 23043058, 23542882, 23664546, 24081841, 24515600, 24933141, 25348545, 25950523, 26301629, 26872147, 27389094, 27983467, 28404614, 28636116, 29293183, 29950848, 30350299, 30915830, 31782293, 32462415, 33627011, 34637133, 35475279, 36490110, 37794757, 39306301, 40819572, 42067635, 43201657, 44543540, 46443273, 47854741, 49074819, 51003197, 52979799, 54720274, 56111525, 58168702, 60059629, 61699520, 63461170, 65482440, 67443316, 69398418, 71885163, 73673443, 75098773, 77343276, 79470351, 81158850, 83168814, 85203379, 86643875, 87937122, 89488063, 90862909, 92113805, 92992850, 93859216]
2926I3859216P21275J031339P78492K65840N30457l9958K82192q9626p06170l77640
2916I6255417n27605j054375j008029j327087r55592r67580j133757j350178j798747
2907H6132467k048020j797852j828088j762955j804313k203089j820784k445512
2899G0421854k144090k170036k015144j954778k031788j999050j937937k174324
2891E3994707j833920j991373j719501j616161j672319j694821j619029j556928
2883D0290655j695338j466492k003999j462819j144995r55568j402576j199478
2875B8959390p84725q84838j144654j039119j077964j008881r40617p24935n87889
2866B0765768r52759m99079q26011o74790l62740l7152m98956n35583j87373j10167
$$ y = [93859216, 94580491, 95611830, 96390322, 96656162, 97186619, 97146661, 97428853, 97339227, 96633057, 96255417, 95727812, 94673437, 93665408, 92338321, 91382729, 90415149, 89281392, 87931214, 86132467, 84084447, 82286595, 80458507, 78695552, 76891239, 74688150, 72867366, 70421854, 68277764, 66107728, 64092584, 62137806, 60106018, 58106968, 56169031, 53994707, 52160787, 50169414, 48449913, 46833752, 45161433, 43466612, 41847583, 40290655, 38595317, 37128825, 35124826, 33662007, 32517012, 31561444, 30158868, 28959390, 28174665, 27289827, 26145173, 25106054, 24028090, 23019209, 22078592, 21353657, 20765768, 19813009, 19313930, 18487919, 17813129, 17450389, 17413237, 16914281, 16378698, 16191325, 16081158]
2856A6081158l65722m83008m65719j86788k67869m29242j40563n32625q1704j46546
2846A2981372m95874k82927k34690j97620o7327o7350j94521r2979m8658j41005
2836A1158421P2846j9014k72596l55376K23810J45793k88776k13455l02619n6980
2826A0092054k2840J32994k26729k32262j74737n197m5544n86465l73130n9504
2816H498640l45834j57635Q9781k88765n5876l32207M9821K68030k8306Q0979
2806G778628j30784K9614J12391M1822l08030k54908K32279L92471R4491j37199
2796G850775k30351k25009k67490r4056J73827k8728l09128O6082m8444O7931
2786F955409J4832k28569J60337L1801K8380j02301K131k10168J49212N8909o4464
$$ y = [16081158, 15715436, 15232428, 14766709, 14579921, 14312052, 13882810, 13742247, 13209622, 13127918, 12981372, 12485498, 12202571, 11967881, 11770261, 11702934, 11635584, 11441063, 11348084, 11299426, 11158421, 11231267, 11212253, 10939657, 10584281, 10808091, 10953884, 10665108, 10451653, 10149034, 10092054, 10069214, 10202208, 9975479, 9743217, 9568480, 9563283, 9517739, 8931274, 8558144, 8498640, 8152806, 7995171, 8084952, 7796187, 7740311, 7408104, 7457925, 7725955, 7697649, 7778628, 7647844, 7677458, 7789849, 7831671, 7523641, 7268733, 7501012, 7893483, 7987974, 7850775, 7620424, 7395415, 7127925, 7033869, 7207696, 7178968, 6869840, 6935922, 6887478, 6955409, 6970241, 6741672, 6902009, 6933810, 6962190, 6859889, 6862020, 6651852, 6801064, 6859973, 6795509]
2775F795509k89945P5121N548O3711k40567Q9995N40379m33916p6968l93992m8091
2764F086784K15502K49988l6285k48768J19199N3440k96447l2483K88057L6009
2754F434996j60659m65606k15499K99861p4909n976K72953O7923M12286q6938
2744F478432k69585l3887K67926j25330J10351k15219j42535K88002L48482M4096
2734F750733J54268k88071r9155k01824l7032R2930j92399L58283K46276K25922
2724G009931l22651L74404k94423l29076J05181L63660J94670j42511m11434l62744
2714F185007J89976L03846R406j02862j95264N39410M16513j69415j85609J6090
2704G007098p5651j4978P8014M79279N1817o22205L26820L85255k19048j05714
$$ y = [6795509, 6505564, 6580685, 6586233, 6649944, 6409377, 6499372, 7039751, 6605835, 6528867, 6134875, 6086784, 6302286, 6552274, 6515989, 6267221, 6386420, 6439860, 6143413, 6110930, 6398987, 6434996, 6274337, 5808731, 5593232, 5893093, 5818184, 5812208, 6085161, 6153084, 6565370, 6478432, 6208847, 6174960, 6442886, 6317556, 6427907, 6212688, 6070153, 6358155, 6706637, 6750733, 6905001, 6616930, 6517775, 6315951, 6278919, 6371849, 6179450, 6537733, 6784009, 7009931, 6687280, 7061684, 6767261, 6438185, 6543366, 6907026, 7101696, 6959185, 6547751, 6185007, 6374983, 6678829, 6688235, 6585373, 6390109, 6929519, 7346032, 7176617, 6991008, 7007098, 6931447, 6916469, 6994483, 7473762, 7525579, 6903374, 7230194, 7615449, 7396401, 7290687]
2694G290687P0990r8495j2775Q3620k90752m2187J99150L70278K7546k0063J84247
2683G762246R2793k48118J91174L00483K10935L04939k2371J00238K01503K46170
2673I139992n32762K62331K68360M67688J94433j79400k17128K53845N06247k25966
2663I937640l31861P4833L84821K41464k1269Q1078K85251L44966J04715K45382
2653A1347020k0988j21032j23793J32210L56933J62183j06003J74203M43481m4478
2643A2199736J71721M00335K89144L67171K46039k21481J73691M90081K54723
2634A4371160J22393M83461K55271M09343N53511N03245M21994L55975L92519
2625A7868872M04643n1381L01773R63300P4364P13392L99709L79355Q11969M74857
$$ y = [7290687, 7361677, 7263182, 7250407, 7334027, 7043275, 7001088, 7200238, 7570516, 7598062, 7577999, 7762246, 7855039, 7606921, 7798095, 8098578, 8309513, 8614452, 8592081, 8692319, 8893822, 9139992, 8607230, 8869561, 9137921, 9605609, 9800042, 9620642, 9403514, 9657359, 10163606, 9937640, 9605779, 9680612, 10065433, 10306897, 10285628, 10366706, 10651957, 10996923, 11101638, 11347020, 11326032, 11205000, 11081207, 11213417, 11570350, 11732533, 11626530, 11800733, 12244214, 12199736, 12371457, 12771792, 13060936, 13428107, 13674146, 13452665, 13626356, 14116437, 14371160, 14493553, 14977014, 15232285, 15641628, 16195139, 16698384, 17120378, 17476353, 17868872, 18273515, 18222134, 18523907, 19487207, 19561571, 20274963, 20674672, 21054027, 21865996, 22340853]
2615B2340853M72758Q18450P37269N97526J037640Q11674Q94320J123587R25008
2606B9759085P38251J061731J252621J273534O60299O57902J195983J107197J086286
2597C8792889L62896M25476R07422R76461J254775N82150J23813Q95071R43941
2588D5264894M74636P12990L20399R15908O60321J84540M00761P36937J89369
2579D9860755O10431M13244K1022K88773R4359M49692L92723Q09287N54378L4255
2569E3528919K87717J283870L26813L8343P86336O00746P68538R13775Q64674
2560E9399731P63267J200094J756859J227404J483023K086257J801131J791970
2552G1509736K266691K758567K596975K838171K599363L281812L545799L033147
$$ y = [22340853, 22813611, 23632061, 24369330, 24966856, 26004496, 26816170, 27710490, 28834077, 29759085, 30497336, 31559067, 32811688, 34085222, 34745521, 35403423, 36599406, 37706603, 38792889, 39155785, 39581261, 40488683, 41465144, 42719919, 43302069, 43425882, 44320953, 45264894, 45739530, 46452520, 46772919, 47688827, 48349148, 48533688, 48934449, 49671386, 49860755, 50471186, 50884430, 50905452, 51194225, 51288584, 51738276, 52130999, 52940286, 53494664, 53528919, 53816636, 55100506, 55427319, 55465662, 56251998, 56852744, 57621282, 58535057, 59399731, 60162998, 61363092, 63119951, 64347355, 65830378, 67916635, 69717766, 71509736, 73776427, 76534994, 79131969, 81970140, 84569503, 87851315, 91397114, 94430261]
2544I4430261K712566K994476L428329L396381K924318K922784K957893L210434
2536A18977442K824967K550710K570728K857924K737741K407163K474893K188685
2528A39590253K397782J634663J848946J402909J513293J403344O99216P25232
2520A51215638Q08879P49261R37081P25977M95065P94751J017830N50374M84649
2511A57779505L93619N45319J201316K84248M68795M32120M50087N15380K66471
2502A62336860N972J91742L56375M53114N74633K71774P36954N00488L83454M73131
2492A66284497N31633K87808N5741p09106j89938o71630p91120j320701j215064
2483A62262120j163281j677716j365999j113267j193625j490448r75987p36822
$$ y = [94430261, 97142827, 100137303, 103565632, 106962013, 109886331, 112809115, 115767008, 118977442, 121802409, 124353119, 126923847, 129781771, 132519512, 134926675, 137401568, 139590253, 141988035, 143622698, 145471644, 146874553, 148387846, 149791190, 150490406, 151215638, 152024517, 152773778, 153710859, 154436836, 154931901, 155726652, 156744482, 157294856, 157779505, 158173124, 158718443, 159919759, 160204007, 160672802, 161104922, 161555009, 162070389, 162336860, 162342832, 162534574, 162890949, 163344063, 163918696, 164190470, 164927424, 165427912, 165811366, 166284497, 166816130, 167103938, 167159679, 166450573, 166260635, 165589005, 164797885, 163477184, 162262120, 161098839, 159421123, 158055124, 156941857, 155748232, 154257784, 153281797, 152544975]
2475A52544975j011622o74026n02511n27887M3650j92880M03992L15642J209420
2466A51608753Q66326Q39297J644889K196758K419434L043808L463473M197890
2458A70280628M412853M343278N175198N498131N805703N816259N332285N459518
2450B12123853N898925N070837M690559L823895L074911L422327K765893J333244
2442B42204444R06561P4899j74916m21705j586027j882970k502380l290673l213473
2433B30113760l660051m428046m828357n663474n626259o076883o649859p000419
2425A86180412o905230o792398o782298o973272o673212o154914n952380n914726
2417A34031982n891089n282157m867895m887799n004920m451889m129279l867029
$$ y = [152544975, 151533353, 150859327, 150356816, 149828929, 149872579, 149679699, 150083691, 150399333, 151608753, 152475079, 153314376, 154959265, 157156023, 159575457, 162619265, 166082738, 170280628, 174693481, 179036759, 184211957, 189710088, 195515791, 201332050, 206664335, 212123853, 218022778, 223093615, 227784174, 231608069, 234682980, 238105307, 240871200, 242204444, 243111005, 243185904, 243010988, 242589283, 241003256, 239120286, 236617906, 233327233, 230113760, 226453709, 222025663, 217197306, 211533832, 205907573, 199830690, 193180831, 186180412, 179275182, 172482784, 165700486, 158727214, 152054002, 145899088, 139946708, 134031982, 128140893, 122858736, 117990841, 113103042, 108098122, 103646233, 99516954, 95649925]
2409I5649925m101336l512416k580621k880084l135954k554174k630249k317062
2401G1938029k228436k003062k117459j863504j538520j224400j722964q73743
2393E8365941j050657j228350r89903q99899r10514r98190j235932q68775r86331
2384D9197390j047921j043235o66221q43133j028143n81459j031896q39348n85540
2375D1530494o26615p16445m09651r00173q09923r48347p3940q59645m13851o23689
2365C5148215o56421m43526m95895n69292q14590p58669q19345o75112p23311
2356B9192054o61691r55634j000848l00133l27676p69706l98552l11682l78615
2347B4087517k59503k30171m75040m46637J65988J87772J5528K893q4270j4245
$$ y = [95649925, 91548589, 88036173, 85455552, 82575468, 79439514, 76885340, 74255091, 71938029, 69709593, 67706531, 65589072, 63725568, 62187048, 60962648, 59239684, 58365941, 57315284, 56086934, 55097031, 54197132, 53286618, 52288428, 51052496, 50183721, 49197390, 48149469, 47106234, 46440013, 45596880, 44568737, 43987278, 42955382, 42116034, 41530494, 40903879, 40187434, 39777783, 38877610, 38067687, 37119340, 37045400, 36185755, 35771904, 35148215, 34491794, 34048268, 33552373, 32983081, 32168491, 31409822, 30590477, 29915365, 29192054, 28530363, 27574729, 26573881, 26273748, 25946072, 25176366, 24777814, 24466132, 24087517, 23828014, 23597843, 23122803, 22676166, 22842154, 23029926, 23045454, 23048347, 22964077, 22949832]
2337B2949832L95288k04788l201j85808J82147K24599L29422j10024J39467M7216
2327B3764150J24972M04244j71223l72873j56059Q5817k56376q0122j02448J13840
2317B3353922m67682j13862Q3959K34667n84915K1416J0138j94702k38128l30490
2307B1774323l41565n57110k97997k10846k58256r8462n42206m47103K23530j42804
2297A9101504k58438k92533j06537k37367P0582k5446J12159J08175L30017J55103
2287A8957219n9417J91081K48743L76032L95547N32594L44241N93779M58954O52605
2277B2691378R54887O03521Q75976M99894N94863O09774m4720M6358Q4753J10109
2267B7026793m5086l28358J52167j5382l48221J9689K53613m3696l39857J31354
$$ y = [22949832, 23345120, 23140332, 23137131, 22951323, 23133470, 23358069, 23687491, 23577467, 23716934, 23764150, 23889122, 24293366, 24122143, 23749270, 23593211, 23679028, 23422652, 23342530, 23240082, 23353922, 22886240, 22772378, 22856337, 23091004, 22506089, 22527505, 22537643, 22342941, 22104813, 21774323, 21432758, 20875648, 20577651, 20366805, 20108549, 20010087, 19467881, 19020778, 19244308, 19101504, 18843066, 18550533, 18443996, 18206629, 18277211, 18251765, 18363924, 18472099, 18802116, 18957219, 18897802, 19088883, 19337626, 19713658, 20109205, 20641799, 20986040, 21579819, 22038773, 22691378, 23646265, 24249786, 25125762, 25625656, 26220519, 26830293, 26785573, 26831931, 26916684, 27026793, 26981707, 26653349, 26805516, 26790134, 26441913, 26461602, 26715215, 26671519, 26331662, 26463016]
2257B6463016M5904R1373l90475n54089l62001o2379K4512l43492r18159o22785
2247B3371425l07408m99476m32005k07227l8732m73015j35812o2477P2045n0537
2237B1236781k50613m13274R9131L51538j98788j86607L69615K79655L027K04943
2227B1495408J09351L81745R9995M22968M01531O35401K3650J32223M81259J000366
2217B5183897L67891K98403M93294O74521Q98017N99375L34458K55356L65495
2208B9470707R56820O03849L61442L85149P23947J019025K84507J200719R71041
2199C5977206R06977P24339J011162O53877O79559J228060J286893J313183J383296
2190D5164552J694065J993026J668477J815216K215743K010215J686630J367521
$$ y = [26463016, 26508920, 26600293, 26209818, 25655729, 25293728, 25231349, 25255861, 24912369, 23994210, 23371425, 23064017, 22564541, 22132536, 21925309, 21886577, 21413562, 21277750, 21215273, 21287318, 21236781, 20986168, 20572894, 20672025, 21023563, 20824775, 20638168, 21007783, 21287438, 21290465, 21495408, 21604759, 21986504, 22086499, 22509467, 22910998, 23546399, 23570049, 23702272, 24183531, 25183897, 25551788, 25850191, 26343485, 27018006, 27916023, 28515398, 28849856, 29105212, 29470707, 30427527, 31031376, 31392818, 31777967, 32501914, 33520939, 33805446, 35006165, 35977206, 36884183, 37608522, 38619684, 39273561, 39953120, 41181180, 42468073, 43781256, 45164552, 46858617, 48851643, 50520120, 52335336, 54551079, 56561294, 58247924, 59615445]
2182E9615445J532668J412223J362437N64731M37086L62255P74991K86776m69035
2173F5879577j315543j986576j735514j733872j600863j504575j211307j390954
2165E3400373j406244j357471j662361j969676j651869j496126j695726j699254
2157D0461646j744953j833091j369995j454448j551096j365883j323330j174716
2149B8644134o47195p41877o69793n91609j72183m38951m24631l77834l11402
2140B4268659j1690J16764j01996J47177K50249l0433N108M50547M62207J85312
2130B5741904N00659K99845R5421J78416K50384m3799n2906M16694L0303j81204
2120B7235717j42967k00536n34386l60627q6344k87403m80019j41423m10066k21563
$$ y = [59615445, 61148113, 62560336, 63922773, 64487504, 64924590, 65286845, 66061836, 66348612, 65879577, 64564034, 62577458, 60841944, 59108072, 57507209, 56002634, 54791327, 53400373, 51994129, 50636658, 48974297, 47004621, 45352752, 43856626, 42160900, 40461646, 38716693, 36883602, 35513607, 34059159, 32508063, 31142180, 29818850, 28644134, 27996939, 27255062, 26585269, 25993660, 25821477, 25382526, 24957895, 24580061, 24268659, 24256969, 24373733, 24271737, 24418914, 24669163, 24638730, 24643838, 25094385, 25556592, 25741904, 26242563, 26542408, 26637829, 26816245, 27066629, 27022830, 26969924, 27386618, 27416921, 27235717, 27092750, 26892214, 26357828, 25997201, 25910857, 25623454, 25143435, 25002012, 24591946, 24370383]
2110B4370383j70031k59703p21754l99518j29238j8428k97304m84488p60731q0742
2100B1048446k6751p42033m58818l55491m92387l98818k70998k65902n2533m76030
2090A7508685p0417l7572L15042J58756k6002k172O65925N11514J09686k06876
2080A8926569N53349Q18817O03293M22890N28807P49502R34308P67822N15284
2071B4820641R50432O33484J006813Q65859R09907R07189O62000M83679R48006
2062C2188010R47264O82850P30953p4008L41788O89561K40488k66370q0882Q5999
2052C5485653m5300l45189J3235n80649l48445l64164m57929n76150n64376r64062
2042C1252624r25932n32217o52558j263837j076937n37157n52425o46598n11293
$$ y = [24370383, 24200352, 23940649, 23218895, 22819377, 22690139, 22671711, 22374407, 21889919, 21129188, 21048446, 21021695, 20279662, 19820844, 19465353, 18972966, 18574148, 18303150, 18037248, 17984715, 17508685, 17438268, 17400696, 17715738, 17874494, 17848492, 17846320, 18512245, 19023759, 19133445, 18926569, 19479918, 20298735, 20902028, 21324918, 21853725, 22603227, 23537535, 24305357, 24820641, 25771073, 26404557, 27411370, 28277229, 29187136, 30094325, 30756325, 31240004, 32188010, 33135274, 33818124, 34549077, 34475069, 34816857, 35506418, 35746906, 35480536, 35399654, 35485653, 35440353, 35095164, 35108399, 34527750, 34179305, 33815141, 33357212, 32781062, 32216686, 31252624, 30326692, 29794475, 29141917, 27878080, 26801143, 26263986, 25711561, 25064963, 24553670]
2033B4553670k72236n72944k9559l7282O7173O9636l54311O97068K68673o9069
2023B4320819J24590j26711J72064l09730J4659M9543k78407m86864k55544j76190
2013B3048229n58405m85183o40005k88172K06827o36845l90894l89533k51109
2004A9614910J4635J9325J84990j24553J63188j68716m9105m8164k0943r5482
1994A9490085K8636K52947k52237j59451j15055m60832L25907j79103m14744k56929
1984A8259224p79176m71078l24306l37033n68867o46645o08467o58045m96131
1975A3369476l91728k95756n02481n62297l55175m73203m93433p04254n6095J6339
1965I551393k02112n99275j79382l8971k28227l44606J18259n47569l43238M08775
$$ y = [24553670, 24281434, 23708490, 23678931, 23641649, 23708822, 23778458, 23424147, 24121215, 24389888, 24320819, 24445409, 24318698, 24490762, 24181032, 24195691, 24245234, 23966827, 23479963, 23224419, 23048229, 22489824, 22004641, 21364636, 21076464, 21283291, 20646446, 20255552, 19866019, 19614910, 19629545, 19648870, 19833860, 19709307, 19872495, 19703779, 19654674, 19606510, 19585567, 19490085, 19518721, 19771668, 19519431, 19359980, 19244925, 18784093, 19110000, 18930897, 18516153, 18259224, 17480048, 17008970, 16684664, 16347631, 15778764, 15132119, 14523652, 13865607, 13369476, 12977748, 12681992, 12179511, 11617214, 11262039, 10788836, 10295403, 9591149, 9535054, 9551393, 9349281, 8750006, 8570624, 8531653, 8303426, 7958820, 8077079, 7529510, 7186272, 7595047]
1955G595047j29308m45977K7487q9064q22849j03480M43133M81207n58662o75733
1945E721801L21795L62366m6055m41297k349M59117K88073k95314O3986n1135
1935F380988j98213O7818J23968p8061k15209l47193l63914K65101K53761K17378
1925F106424o2980p0920J34975L35817q4371j83733q4021l31998j11441q2263
1915E565489n8802R6470p2137j72903L87205j4595m54107k70930l0383n7756k22911
1904D694640j81262j72734q7142L85724Q5913k17189K6950K59926l3344J82587
1894D944069L1858k91951J04199l827q258j9693o4389J01302K37497j27976K13898
1883E116729l04540l64599K88784k7947l4619J39070L08241Q8362k25400K2185
$$ y = [7595047, 7465739, 7019762, 7047249, 6958185, 6135336, 6031856, 6474989, 6956196, 6397534, 5721801, 6043596, 6405962, 6359907, 5918610, 5916261, 6375378, 6663451, 6368137, 6432123, 6380988, 6182775, 6250593, 6374561, 6296500, 6081291, 5734098, 5370184, 5635285, 5889046, 6106424, 6043444, 5972524, 6107499, 6443316, 6358945, 6175212, 6091191, 5759193, 5647752, 5565489, 5506687, 5603157, 5531020, 5358117, 5745322, 5730727, 5276620, 5005690, 4975307, 4917551, 4694640, 4513378, 4340644, 4253502, 4639226, 4725139, 4507950, 4534900, 4794826, 4761482, 4944069, 4975927, 4683976, 4788175, 4784348, 4776090, 4756397, 4692008, 4793310, 5030807, 4902831, 5116729, 4812189, 4447590, 4736374, 4708427, 4673808, 4812878, 5121119, 5209481, 4984081, 5006266]
1873E006266J96546l1153j30195j82471o015M06990K80952m20274o4411L73451
1863E429686P7801p4095n9264n0206K17383K41127K70510K43269j13027J95476
1853F378660K69505j2385J35064k3785Q0415K49245O4877J90737J70306Q7637
1843G590276j05298P7139L56773M4991K11819j05905K62939K92250K33141J57550
1833I015675j38917K40597K06507K94096J61274J15927N5527L49730K88079K29975
1823A0818470L4181N89612J92252P70888K63297M6267M19452M6971J62207R74941
1813A4318538K56616j18612L57041L46275O97461K06529K76980K75286L77909
1804A6994023N44872P51700Q86459N87393J144340R65259J220787R73526J499482
$$ y = [5006266, 5202812, 5171659, 5041464, 4858993, 4852978, 5259968, 5540920, 5120646, 5056235, 5429686, 5507487, 5433392, 5374128, 5323922, 5541305, 5782432, 6052942, 6296211, 6183184, 6378660, 6648165, 6635780, 6770844, 6747059, 6827474, 7076719, 7141596, 7332333, 7502639, 7590276, 7484978, 7562117, 7918890, 7963881, 8175700, 8069795, 8332734, 8624984, 8858125, 9015675, 8876758, 9117355, 9323862, 9617958, 9779232, 9895159, 9950686, 10300416, 10588495, 10818470, 10852651, 11442263, 11634515, 12405403, 12668700, 12714967, 13134419, 13181390, 13343597, 14318538, 14575154, 14456542, 14813583, 15159858, 15857319, 16063848, 16340828, 16616114, 16994023, 17538895, 18290595, 19177054, 19764447, 20908787, 21874046, 23094833, 24068359, 25567841]
1795B5567841J372551R18764J727248K069796K159894K133326K566838K571214
1787D1087472K909336K896623L557779M105059M605657N049611N363045O089235
1779G5663817O652684O383160N965641L478819L13854k650438m712435n663955
1771H5431147n457093m773695l738034k544866k361666j596685j725812k218015
1763F1015281k420113k234981j983769j260845m63943K73338L22578o64275j840281
1754E0742990l304903m294414m227259l411081k919948k622498k319737j899248
1746B5743902j320905j322177j000743j155912r53965r32675j019395m50506n25512
1737A7062112k91658m69472o45744n46610j83048n90717p68576o98973p40241
$$ y = [25567841, 26940392, 27859156, 29586404, 31656200, 33816094, 35949420, 38516258, 41087472, 43996808, 46893431, 50451210, 54556269, 59161926, 64211537, 69574582, 75663817, 82316501, 88699661, 94665302, 98144121, 98457975, 95807537, 91095102, 85431147, 79974054, 75200359, 71462325, 68917459, 66555793, 64959108, 63233296, 61015281, 58595168, 56360187, 54376418, 53115573, 52651630, 52924968, 53247546, 52583271, 50742990, 47438087, 43143673, 38916414, 35505333, 32585385, 29962887, 27643150, 25743902, 24422997, 23100820, 22100077, 20944165, 19990200, 19057525, 18038130, 17587624, 17062112, 16770454, 16300982, 15655238, 15108628, 14925580, 14334863, 13566287, 12867314, 12127073]
1728A2127073Q983o44103n48622k7603j56464l6636m77195m12266j53969l80006
1718I299192m11818l82426j02363R951j35619m68983m72969L92260j04608m03069
1708G219548n17347r9967j31296k79282j15048k53004k57742L16851l07008J46351
1698E722056P2670j88877k99389K5961j08900M880k92049l6199k9916l78705k54097
1687D237435k03108m638o4385l1413k88746J67445l43528O0808m9385j14799o7977
1676C297709j0169L4374J06465p5125R1503j57747j44954L0636k68933L2944P332
1665B944035k49365q157L65885M4634m08976k11761K25888J28006O2142j17666
1655B774665k58321k0132K95579o3452k64828M2315M4202N8483l95135J19941
$$ y = [12127073, 12136056, 11491953, 10943331, 10915728, 10759264, 10722628, 10245433, 9833167, 9679198, 9299192, 8887374, 8504948, 8402585, 8412536, 8276917, 7807934, 7334965, 7727225, 7622617, 7219548, 6702201, 6602234, 6470938, 6191656, 6076608, 5823604, 5565862, 5882713, 5575705, 5722056, 5794726, 5605849, 5306460, 5332421, 5223521, 5228401, 4936352, 4900153, 4870237, 4491532, 4237435, 4034327, 4029689, 3965304, 3933891, 3645145, 3812590, 3469062, 3529870, 3480485, 3365686, 3297709, 3287540, 3321914, 3428379, 3353254, 3444757, 3287010, 3142056, 3172692, 2903759, 2936703, 2944035, 2694670, 2686513, 3052398, 3097032, 2688056, 2476295, 2702183, 2830189, 2892331, 2774665, 2516344, 2496212, 2791791, 2728339, 2463511, 2505826, 2550028, 2608511, 2213376, 2333317]
1645B333317O0056m251j31415P7097O7499Q8151o4606o41181J66232K57862J68476
1634B377237j85129q9345K95594M4996j93690M9080n17166R4575R2400l41864
1624A626688J91346K3979R1127r910k6503j7300O5977m06432M2997N2617j66774
1613A467812k56200Q3915L2553J12599k28175q2337p1397j16072M7388l80909
1603F09177J01635L16911L03547k43142J04430l37685O0341N5039o7646N2881
1593I55488J47866J63954K20873j57572k62093J59719p6446Q5104k12603k22457
1583H01833j38638K79694K15120j17984l21065K94921k4656l63909l39872M7812
1573C33256K5918M83347q8153m6607O28500N6016O8721k15597K02473J6801M7315
$$ y = [2333317, 2393373, 2389122, 2257707, 2334804, 2402303, 2490454, 2425848, 1784667, 1950899, 2208761, 2377237, 2192108, 2102763, 2398357, 2443353, 2249663, 2298743, 1781577, 1876152, 1968552, 1626688, 1818034, 1842013, 1933140, 1923230, 1896727, 1879427, 1945404, 1538972, 1581969, 1634586, 1467812, 1211612, 1295527, 1328080, 1440679, 1212504, 1130167, 1058770, 942698, 990086, 609177, 710812, 1027723, 1331270, 1088128, 1192558, 854873, 915214, 970253, 902607, 955488, 1103354, 1267308, 1488181, 1330609, 1068516, 1228235, 1151789, 1236893, 1024290, 801833, 663195, 942889, 1158009, 1040025, 718960, 1013881, 989225, 625316, 285444, 333256, 359174, 842521, 754368, 707761, 1336261, 1392277, 1460998, 1245401, 1447874, 1464675, 1511990]
1562A511990J49487k1398j49699k05452J05334j33776M28001n8820k78216j60230
1552A187221n3172o287p876m90916K70r60n2824j24755J87635J71077j26312J55757
1540H38858j67303j45656K6381K31238l15245O9149L95021L8799o1224Q4055K21066
1529A215139K00843j23053k50185M8467K37173j3498l94022l02624j8203K81925
1519H81962N0677j68072J84461O8988r4255j13037n7906k11892k17132k37355
1509H6439j31344K43566J82690k85394j6183K4203L03877o1047L26200j42240
1499E30767J95117K57582P9486l48377j24648p8496J3200J59332k2185K48356
1489I10134k03945k86841K80044k611l89359m7749L41450N29702k69852R3096
$$ y = [1511990, 1661477, 1640079, 1490380, 1284928, 1390262, 1256486, 1684487, 1625667, 1347451, 1187221, 1134049, 1127762, 1119886, 628970, 629240, 628280, 575456, 450701, 638336, 809413, 683101, 838858, 671555, 525899, 552280, 783518, 468273, 537422, 932443, 971242, 910018, 994073, 1215139, 1415982, 1292929, 1042744, 1091211, 1328384, 1314886, 920864, 618240, 600037, 881962, 932639, 764567, 949028, 1018016, 923761, 810724, 752818, 540926, 323794, 86439, -44905, 198661, 381351, 95957, 79774, 103977, 407854, 346807, 673007, 530767, 725884, 983466, 1062952, 714575, 589927, 511431, 524631, 683963, 661778, 910134, 706189, 419348, 699392, 696781, 307422, 259673, 601123, 1130825, 860973, 954069]
1479I54069J38907j77763K1015K24647j59547R7876L62348q3069r5391l50263
1469I32829J26895j44873k92263j2470O9003N4174L06972k12035k10304L804K56977
1458H78709K48983j55457n7089l45140J25511L02196l94778p0320M3235j16526
1448D59324k94953K18976L09939l68315J68638J55876r7189M785P4754j02233
1438E29602k9268J22396j69504j50649j86350R4318K77517n10360K9536J2588
1428A9826J75334J1693M4179j66142l12592K97482L96784j44880K23099M19623
1418I64406K43101M5267k68181m4362j50262J49130k35379J19880j21714m6373
1408F55513k73845k45525j03532K06436K27395o0211O5705J41511k46316K02643
$$ y = [954069, 1092976, 915213, 936228, 1160875, 1001328, 1099204, 1461552, 1378483, 1283092, 932829, 1059724, 914851, 622588, 610118, 679121, 733295, 1040267, 828232, 617928, 621732, 878709, 1127692, 972235, 915146, 570006, 695517, 997713, 602935, 532615, 575850, 459324, 164371, 383347, 693286, 324971, 493609, 649485, 552296, 557081, 631835, 529602, 500334, 622730, 453226, 302577, 116227, 210545, 488062, -22298, 7238, 19826, 195160, 206853, 251032, 84890, -227702, 69780, 466564, 321684, 544783, 964406, 1207507, 1252774, 984593, 940231, 789969, 939099, 703720, 823600, 701886, 655513, 381668, 136143, 32611, 239047, 466442, 406231, 471936, 613447, 367131, 569774]
1398E69774J6410l87033K4853J6141J435J3656K56852O489L09439j79592k50211
1387C98213m17275K88522K50746K69764m35768R5732q2289j09396j71018M32925
1377E20156p7172l22437K7709j15553l16116k16430J4700o525L64538r3752M75856
1366B54974J66554p9274J91805L1689k58344J96375M1782k21417l76234K33847
1356A81757M71902j05376k99873J62490M74248l88498j36680j27770k27074k48502
1346b43376K79035j00132J7167j47405L46912m00940j37091K17790N5575j60133
1336b72598j76320k9965K84510M37411l60124K7973J9195K00147K23710J54912
1326E08851k83284P8721K10729J58945k94907J14298k31438J86936j91516j02244
$$ y = [569774, 586184, 199151, 224004, 240145, 241580, 255236, 512088, 518577, 828016, 648424, 398213, -19062, 269460, 520206, 789970, 354202, 449934, 367645, 258249, 87231, 520156, 442984, 120547, 148256, 32703, -283413, -499843, -485143, -491668, -127130, -220882, 254974, 421528, 342254, 534059, 565748, 307404, 503779, 545561, 324144, -52090, 181757, 653659, 548283, 248410, 410900, 885148, 496650, 359970, 232200, 5126, -243376, 35659, -64473, -47306, -194711, 152201, -248739, -385830, -168040, -112465, -272598, -448918, -478883, -194373, 243038, -117086, -89113, -69918, 130229, 353939, 508851, 225567, 304288, 515017, 673962, 379055, 493353, 261915, 448851, 257335, 155091]
1316A55091k3588J19207j13481J89284J91531j11747J26905L37721k28115o0044
1306E82764R9455K8331N3100j89539J19621R8076o5563k91099k7335J9866P4059
1295E01736J5253k61283p1921l5791K7399K40722k53734k04905P7157L69298J96137
1284F00068l61636j57145j53578L16163j20478j88862l73441O2958M38318K2461
1274H4828m82303k00098M39333M2699r8804n3052k3174L96092K69949K79954j71386
1263D84038k03777k17745p0255K29932n8250K59218q2623j70578J84697K8948
1253C83605j6724m3031L32246L87027m22715j64910k09605p0855N1734p2589q4065
1242G0118O9554J95672j63262o0268M97727P1463j68096m05489N3493M20746K25806
$$ y = [155091, 131503, 250710, 137229, 326513, 518044, 406297, 533202, 870923, 642808, 582764, 682219, 710550, 763650, 574111, 693732, 791808, 726245, 435146, 407811, 427677, 501736, 516989, 255706, 183785, 147994, 175393, 416115, 162381, -42524, 34633, 403931, 600068, 238432, 81287, -72291, 243872, 123394, -65468, -438909, -375951, 62367, 84828, -397475, -597573, -158240, -115541, -214345, -267397, -290571, 105521, 375470, 655424, 484038, 280261, 62516, -7739, 222193, 163943, 423161, 340538, 169960, 354657, 383605, 366881, 323850, 656096, 1043123, 620408, 455498, 245893, 175038, 226772, 154183, 70118, 139672, 335344, 172082, 111814, 609541, 681004, 512908, 107419, 160912, 581658, 807464]
1231H07464r0274j06589N67458r5589l47386j09265l0632J06404k84305M3139
1221D60425J24121o0701j64590k18962n9834Q9929Q7931N07820L1543k37885n5797
1210E04000j4047J71886J668l49683r2451R8856p2480k85411j87940M02841k6927
1199A50312j14726K03358l01106J64865j24806K78256J38564m4913m496l61136
1189a5828n636j62242M3484J36866L82684K11943j17278n22737j4758O2576l21403
1178c22329k07682J56342J15327R1695m0017k03982l20393J74253K92129j93702
1168d58359m04L23591M51186n81j33464K22408M46425j19691j49849k85151N4118
1157C50229L49129k15659p5522j7546J2140N9045j25800j76709k34752K34524
$$ y = [807464, 717190, 610601, 1178059, 1082470, 735084, 625819, 595187, 701591, 417286, 460425, 584546, 523845, 359255, 140293, 80459, 170388, 258319, 766139, 797682, 559797, 504000, 489953, 661839, 663507, 313824, 221373, 320229, 247749, -37662, -225602, 177239, 150312, 35586, 238944, -62162, 102703, -22103, 256153, 394717, 349804, 345308, -15828, -21464, -183706, -140222, -3356, 379328, 591271, 473993, -48744, -63502, -926, -322329, -530011, -373669, -258342, -166647, -206664, -410646, -731039, -556786, -264657, -458359, -458763, -135172, 316014, 315433, 181969, 404377, 850802, 731111, 581262, 296111, 350229, 699358, 483699, 408177, 390631, 402771, 461816, 336016, 159307, -75445, 159079]
1147A59079o8695j69669J4776K43364k2713j80496L02797J84816K85299L36086
1137A084644j85268J47331L0208L39525q8349k62725j3689L84906l78584o00997
1127D57002J03316l44032O9802J0808j4785k28960j81507M85443q9748o48716
1117c81377N29492L43943J59699n5936R150r0441j8638L57007L6897n3864K22936
1106A058868k93225j93795p4383k5155J30653k1252M58502k35187J29355j60357
1096G74024J38968L04253k54132l64284j24768l0277R5031m5309j42026K1195
1086C72675k6090K5289q5566K15525J77443n0383k2334L22537j29188L56420L74918
1075A531246L2513J7014O29342o3800l10173n46591n1432k4663j15927N3425k25123
$$ y = [159079, 90384, -79285, -64509, 178855, 156142, -24354, 278443, 463259, 748558, 1084644, 899376, 1046707, 1076915, 1416440, 1328091, 1065366, 1051677, 1436583, 1057999, 457002, 560318, 216286, 286088, 296896, 282111, 53151, -128356, 357087, 267339, -381377, 148115, 492058, 651757, 595821, 604971, 514530, 495892, 852899, 889796, 835932, 1058868, 765643, 571848, 497465, 472310, 602963, 581711, 1040213, 805026, 934381, 774024, 912992, 1217245, 963113, 598829, 474061, 443784, 538815, 493506, 351480, 372675, 346585, 371874, 286308, 501833, 679276, 628893, 606559, 929096, 799908, 1156328, 1531246, 1563759, 1580773, 2210115, 2146315, 1836142, 1289551, 1238119, 1213456, 1097529, 1150954, 925831]
1064I25831k48907M1190n1172K49216J80688P9226L00140n7921M9646L03793J28338
1053A900068j51995J10123M4053J79010M8293O9573n1634j1096j85258K07581
1043B158718J7267J01194k59881j16553L24697j7546L0849L04132j75296o6532
1033B301049N52060j59319j02920J79676k7941j03983j4111R3605j31367j10896
1023B475853M74680p1819l14516L59359N89424M47165J15361J62450O80966Q4340
1013E003263j71038N74537J48804J5138L50234l21828o659L45719o7430J26751
1003E997491R7976Q8195O64629R3152J24544N07097L73688N47428O63825L41699
993I499724N18690M05480N93827P45815Q02532R23444R86974J414760J660486
$$ y = [925831, 676924, 718114, 666942, 916158, 1096846, 1176072, 1476212, 1418291, 1467937, 1771730, 1900068, 1748073, 1858196, 1902249, 2081259, 2129552, 2199125, 2147491, 2136395, 1951137, 2158718, 2175985, 2277179, 2017298, 1900745, 2225442, 2207896, 2238745, 2542877, 2367581, 2301049, 2853109, 2693790, 2590870, 2770546, 2742605, 2638622, 2624511, 2718116, 2586749, 2475853, 2950533, 2878714, 2564198, 2923557, 3512981, 3960146, 4075507, 4237957, 4918923, 5003263, 4832225, 5406762, 5555566, 5570704, 5920938, 5599110, 5592451, 5938170, 5870740, 5997491, 6095467, 6183662, 6848291, 6941443, 7065987, 7573084, 7946772, 8494200, 9158025, 9499724, 10018414, 10423894, 11017721, 11763536, 12566068, 13489512, 14476486, 15891246, 17551732]
984A7551732J523488J329325K077770J642078J790112J748120K238577K330431
976C2231633L179900M203824M428967M759300N904124P931963J0400768J4128065
968H7168544J5738022R618679l409612j4271584j6978570j3410308j0506148p696525
960D6252498o135129m869206l806492k522906k475181k016684j782610j437381
952B1206909q65739j054123q39790j448739r67116j358858j039167o16302l68715
943A2648360j142528n51499p93174n06579j12952j91529q17926n75032k375k60316
933G694450m90118o00455M2464m02363J21736J8268n43989q6717m1266N7712l23541
922E446181l62728R8108k85833o9484R1883j92622j07795j28190k07979k60358
$$ y = [17551732, 19075220, 20404545, 22482315, 24124393, 25914505, 27662625, 29901202, 32231633, 35411533, 39615357, 44044324, 48803624, 54707748, 62639711, 73040479, 87168544, 102906566, 112525245, 109115633, 94844049, 77865479, 64455171, 53949023, 46252498, 40117369, 35248163, 31441671, 28918765, 26443584, 24426900, 22644290, 21206909, 20341170, 19287047, 18447257, 16998518, 16031402, 14672544, 13633377, 13017075, 12648360, 11505832, 10954333, 10161159, 9654580, 9541628, 9350099, 8532173, 7957141, 7954766, 7694450, 7204332, 6603877, 6646341, 6243978, 6365714, 6383982, 5839993, 5753276, 5712010, 5769722, 5446181, 5083453, 5181561, 4895728, 4826244, 4918127, 4725505, 4617710, 4489520, 4281541, 4021183]
912D021183M1511p5515j90237l5957J93520j32297l90994n04782K59977m2973
902C143436o4245k09625j33411K24869k91673k25542L513j43032k61449j34147
892A908694k51183M143J00771n94m7126K97711J38007j65458Q343K69442j80444
881B082306K8930M5871q2881J5422K8438j44150k65868k50148j97963k27787j18471
870I13699j30763m5655J29166J26201j27850K02845L74821n2712N0140m637j1010
859A424245j64842j45264o1734j64444J87050N8777k91800j89641k2306J42603
849G72644r0680j80830l51184Q949K39892j7074Q4265r084J0661K02632j13331
838E56860Q6427q2237o9400K81816k79534K83496j79093L04472k23113L1130Q2867
$$ y = [4021183, 4062694, 3987179, 3796942, 3760985, 3954505, 3822208, 3431214, 2926432, 3186409, 3143436, 3079191, 2869566, 2736155, 2961024, 2669351, 2443809, 2447322, 2304290, 2042841, 1908694, 1657511, 1661654, 1762425, 1761831, 1714705, 2012416, 2150423, 1984965, 1993308, 2262750, 2082306, 2111236, 2157107, 2074226, 2089648, 2118086, 1973936, 1708068, 1457920, 1259957, 1032170, 913699, 782936, 737281, 866447, 992648, 864798, 1067643, 1442464, 1389752, 1439892, 1435255, 1424245, 1259403, 1114139, 1052405, 887961, 1075011, 1133788, 841988, 652347, 630041, 772644, 681964, 501134, 149950, 158899, 398791, 381717, 465982, 456898, 467559, 670191, 556860, 643287, 561050, 491650, 773466, 493932, 777428, 598335, 902807, 679694, 710824, 793691]
827G93691K14678k91143N6676k42412J51547M15150p516m17561q5610J44413q6730
816F45183j67175m17941K93678M63334j8651l73210J44814N6214k22788k84193
806A19265o8757L9720J34221k37947J05657l9353Q5382M4396J04910j22661K18243
795C83076o1792L1874k84613M7010J54618j10504K9700q8134n6284j69474j18930
784b43453n0965J26574K23603N2821N3176J17627l21231J05847l0177J66125L79485
773E79432k17857P6044k5592K16872l71316j03921q3306L05263k1337l08948k06708
762a61374l34980M16233k0841k33507j49297L66081J06807j61765n95150R6694
752f71099N81397n0428l69115J59209L45171L7119j22053k01767J95627K09872
$$ y = [793691, 1008369, 717226, 773902, 531490, 683037, 1098187, 1090671, 673110, 587500, 731913, 645183, 478008, 60067, 353745, 817079, 798428, 425218, 570032, 626246, 403458, 119265, 50508, 90228, 224449, -13498, 92159, 52806, 138188, 182584, 287494, 164833, 383076, 321284, 353158, 68545, 115555, 270173, 159669, 189369, 101235, 44951, -124523, -243453, -294418, -167844, 55759, 108580, 161756, 279383, -41848, 63999, 33822, 199947, 579432, 361575, 437619, 412027, 628899, 257583, 153662, 70356, 375619, 354282, 45334, -161374, -496354, -80121, -100962, -334469, -483766, -117685, -10878, -172643, -767793, -671099, -89702, -140130, -509245, -350036, -4865, 32254, -89799, -291566, -95939, 113933]
742A13933P5673j95517k12498K77310K6282m12735L31990j00617M13783J32166
732D49770k01907j94760j74510j89792J30916J87557k65852j2418J0002M53946
722A92952k09508r3527J98106O8544m41181K38072P7349q8996M5436j47516J68525
711H256J11849o0777l53021n0553O4821j05429k7230K62974J27169n5096o3793
700a40830J40696J09951J45850J6455K52955k26185j41793j98230l68877P11973
690C01965K10697m11266m74693L12703L06100K12570k46924p1418K66626K6855
680D33215J78894q6833p3478j78101k91597j14386J01213l02282R1321j26191
670c68225M4156j43217L45841n62419k6173K11127M2082K8519m9741j56623R0532
$$ y = [113933, 189606, -5911, -218409, 58901, 85183, -327552, 4438, -96179, 317604, 449770, 247863, 53103, -121407, -311199, -180283, 7274, -258578, -270996, -260994, 192952, -16556, -110083, 88023, 156567, -284614, -46542, 30807, -58189, -12753, -160269, 8256, 120105, 59328, -293693, -344246, -279425, -384854, -412084, -149110, -21941, -77037, -140830, -134, 109817, 255667, 272122, 525077, 298892, 157099, -41131, -410008, 301965, 512662, 101396, -373297, -60594, 245506, 458076, 211152, 139734, 406360, 433215, 612109, 525276, 451798, 273697, -17900, -132286, -31073, -333355, -242034, -368225, -324069, -467286, -121445, -683864, -710037, -498910, -456828, -428309, -478050, -634673, -544141]
659e44141M40076Q3230K202l06907K75008M14169J02794n15017K68066l58982
649a39502j63243j17771m4638k36475J49758O7707j73711q839p2351L0000L94371
638c14694l3077k16206J87051M57575L04882j84291j79372p3547L15225n3075
628B10471P618k41906J76879J46683n27511p4373M67980j01230n55141l05726
618g96256N4280k2521m15049Q9649p6738L67725Q4056K9192j82993K41647L40394
607b86614k47529j92412J50894J64897j73545L21616N07916o6538l6744K87632
597D29573r5931N5277o7618k89683l25778J68807J45908r526j84164l62627n09752
586a045514o1350j07111N3992J78810O1685L17899k36484J69630k30444N63N9259
$$ y = [-544141, -104065, -20835, -18633, -325540, -50532, 363637, 466431, -48586, 219480, -139502, -302745, -420516, -465154, -701629, -551871, -484164, -657875, -666714, -739065, -709065, -314694, -347771, -563977, -376926, 80649, 385531, 201240, 21868, -51679, 263546, 210471, 218089, -23817, 153062, 299745, -227766, -302139, 165841, 64611, -490530, -796256, -741976, -764497, -1179546, -1089897, -1166635, -798910, -714854, -685662, -868655, -627008, -286614, -534143, -726555, -575661, -410764, -584309, -262693, 245223, 178685, 141941, 429573, 333642, 388919, 321301, 31618, -294160, -125353, 20555, 11029, -173135, -535762, -1045514, -1106864, -1213975, -1159983, -981173, -919488, -601589, -838073, -668443, -898887, -898324, -839065]
575h39065Q4454L31576O0415k44836L16493L69084k78583K61272j68026o3853
565a71069K15318N3779k47278q8629l5718L21085k71498m9971k6802L259M06879
554A09355m37019l08439K09100l51849k41522L75561n7258L82686l43712k88515
544i51612N85569J94646o7709j72642m6375K44007K35374k50042n30786J41660
534f17910N04382l30687l50180k28903K56969j62903J01179M3443R92K78441J69898
523c35279k06580k05853l00040R6842o0530p8741N26826O7158J45073J64147K02303
512A5326k81124K81261K58230K28098l77781j46603Q4230J77013j68510N464j53034
501g7430j71634j68649l87622O1004J31737L42558j52462k6045n02539M34706
$$ y = [-839065, -754611, -423035, -362620, -607456, -290963, 78121, -200462, 60810, -107216, -171069, 44249, 98028, -149250, -237879, -273597, 47488, -224010, -273981, -300783, -297524, 109355, -327664, -636103, -427003, -778852, -1020374, -644813, -702071, -319385, -663097, -951612, -366043, -171397, -239106, -411748, -458123, -214116, 21258, -228784, -759570, -617910, -113528, -444215, -794395, -1023298, -766329, -929232, -828053, -784610, -783618, -505177, -335279, -541859, -747712, -1047752, -950910, -1011440, -1090181, -563355, -496197, -351124, -186977, 15326, -265798, 15463, 273693, 501791, 124010, -22593, 61637, 238650, 70140, 75604, -77430, -249064, -417713, -805335, -744331, -612594, -270036, -422498, -448543, -951082, -516376]
$$ [...]
##END NTUPLES=NMR SPECTRUM
##END=
