##TITLE=1H_CA-8864-2
 CDCl3, 8 sc, 
 31.05.2021
##JCAMPDX= 6.0         $$ Bruker NMR JCAMP-DX V2.0
##DATA TYPE= NMR SPECTRUM
##DATA CLASS= NTUPLES
##ORIGIN= UXNMR, Bruker Analytische Messtechnik GmbH
##OWNER= root
$$ XWIN-NMR		Version 3.5
$$ Mon May 31 11:07:03 2021 Russian Standard Time (UT+4h)  she@DPX200
##.OBSERVE FREQUENCY= 200.131506
##.OBSERVE NUCLEUS= ^1H
##.ACQUISITION MODE= SIMULTANEOUS
##.ACQUISITION SCHEME= undefined
##.AVERAGES= 8
##.DIGITISER RES= 18
##SPECTROMETER/DATA SYSTEM= spect
##.PULSE SEQUENCE= zg30
##.SOLVENT NAME= CDCl3
##.SHIFT REFERENCE= (INTERNAL, CDCl3, 0, 15.9813)
##AUDIT TRAIL= $$ (NUMBER, WHEN, WHO, WHERE, WHAT)
$$ ##TITLE= Audit trail, XWIN-NMR		Version 3.5
$$ ##JCAMPDX= 5.01
$$ ##ORIGIN= Bruker BioSpin GmbH
$$ ##OWNER= she
$$ F:/spectra/data/she/nmr/H-F/1/pdata/1/auditp.txt
$$ ##AUDIT TRAIL=  $$ (NUMBER, WHEN, WHO, WHERE, WHAT)
(   1,<2021-05-31 11:04:56.12 +0400>,<she>,<DPX200>,
      <created by zg, POWCHK disabled, PULCHK disabled
       configuration hash MD5:
       00 E9 B6 7A A2 85 ED C7 34 08 36 98 17 FE 4E 26
       data hash MD5: 16K
       CE E0 07 34 FD 8E D0 0F 9E 33 4B 74 A7 4D E9 D7>)
(   2,<2021-05-31 11:04:58.90 +0400>,<she>,<DPX200>,
      <Start of raw data processing
       efp BC_mod = 2 LB = 0.24 FT_mod = 6 PKNL = 1 PHC0 = -11124.23 PHC1 = 14.40099 SI = 16K 
       data hash MD5: 16K
       79 18 89 FE AB 5D B7 89 EE 65 08 9F A0 8C C8 C6>)
(   3,<2021-05-31 11:05:22.42 +0400>,<she>,<DPX200>,
      <pk PHC0 = 1.261858 PHC1 = 1.2 
       data hash MD5: 16K
       B4 4A 6E 40 75 EE BB DB 6C 38 D4 60 B2 DE 86 A8>)
(   4,<2021-05-31 11:05:26.07 +0400>,<she>,<DPX200>,
      <abs ABSG = 5 
       data hash MD5: 16K
       F7 E5 66 CA 21 E9 95 04 9D CC 1B B7 AC 65 30 42>)
(   5,<2021-05-31 11:05:47.34 +0400>,<she>,<DPX200>,
      <pk PHC0 = 48.66225 PHC1 = 0 
       data hash MD5: 16K
       CE E8 4C 1D A9 F6 84 27 AD 32 8B 53 6E CD AC 2A>)
(   6,<2021-05-31 11:06:11.76 +0400>,<she>,<DPX200>,
      <pk PHC0 = -43.32338 PHC1 = -6.599999 
       data hash MD5: 16K
       12 00 E1 EF 08 D8 20 0A 2C A8 A6 D4 39 61 58 9C>)
(   7,<2021-05-31 11:06:14.96 +0400>,<she>,<DPX200>,
      <abs ABSG = 5 
       data hash MD5: 16K
       7C EE BE C4 9D 62 16 87 DB 03 83 2D 58 38 AB EC>)
$$ ##END=
$$ 
$$ hash MD5
$$ 86 88 68 46 9A 21 5F 7A 5B C1 AA 21 84 F2 D6 2C
##$RELAX= 
##$RELAX= 
##$RELAX= 
##$RELAX= 
##$RELAX= 
##$RELAX= 
$$ Bruker specific parameters
$$ --------------------------
##$DU= <F:/spectra>
##$EXPNO= 1
##$NAME= <H-F>
##$PROCNO= 1
##$TYPE= <nmr>
##$USER= <she>
##$AMP= (0..31)
100 100 100 100 100 100 100 100 100 100 100 100 100 100 100 100 100 100 
100 100 100 100 100 100 100 100 100 100 100 100 100 100 
##$AQSEQ= 0
##$AQ_mod= 1
##$AUNM= <au_zg>
##$AUTOPOS= <>
##$BF1= 200.13
##$BF2= 200.13
##$BF3= 200.13
##$BF4= 200.13
##$BF5= 200.13
##$BF6= 200.13
##$BF7= 200.13
##$BF8= 200.13
##$BYTORDA= 1
##$CFDGTYP= 0
##$CFRGTYP= 5
##$CHEMSTR= <none>
##$CNST= (0..31)
$$ [...]
##$SUBNAM3= <"">
##$SUBNAM4= <"">
##$SUBNAM5= <"">
##$SUBNAM6= <"">
##$SUBNAM7= <"">
##$SUBNAM8= <"">
##$SUBNAM9= <"">
##$SW= 16.9725357007746
##$SWIBOX= (0..15)
0 0 2 0 0 0 0 0 0 0 0 0 0 0 0 0 
##$SW_h= 3396.73913043478
##$TD= 16384
##$TD0= 1
##$TE= 0
##$TE2= 300
##$TE3= 300
##$TEG= 300
##$TL= (0..7)
0 120 120 120 120 120 120 120 
##$TP= (0..7)
150 150 150 150 150 150 150 150 
##$TP07= 0
##$TPNAME0= <>
##$TPNAME1= <>
##$TPNAME2= <>
##$TPNAME3= <>
##$TPNAME4= <>
##$TPNAME5= <>
##$TPNAME6= <>
##$TPNAME7= <>
##$TPOAL= (0..7)
0.5 0.5 0.5 0.5 0.5 0.5 0.5 0.5 
##$TPOFFS= (0..7)
0 0 0 0 0 0 0 0 
##$TUNHIN= 0
##$TUNHOUT= 0
##$TUNXOUT= 0
##$USERA1= <user>
##$USERA2= <user>
##$USERA3= <user>
##$USERA4= <user>
##$USERA5= <user>
##$V9= 5
##$VALIST= <valist>
##$VCLIST= <CCCCCCCCCCCCCCC>
##$VD= 0
##$VDLIST= <DDDDDDDDDDDDDDD>
##$VPLIST= <PPPPPPPPPPPPPPP>
##$VTLIST= <TTTTTTTTTTTTTTT>
##$WBST= 1024
##$WBSW= 4
##$XGAIN= (0..3)
0 0 0 0 
##$XL= 0
##$YL= 0
##$YMAX_a= 574569
##$YMIN_a= -674379
##$ZGOPTNS= <>
##$ZL1= 120
##$ZL2= 120
##$ZL3= 120
##$ZL4= 120
##$ABSF1= 16.06623
##$ABSF2= -0.9064331
##$ABSG= 5
##$ABSL= 3
##$ALPHA= 0
##$AQORDER= 0
##$ASSFAC= 0
##$ASSFACI= 0
##$ASSFACX= 0
##$ASSWID= 0
##$AUNMP= <proc_1d>
##$AZFE= 0.1
##$AZFW= 0.1
##$BCFW= 0
##$BC_mod= 2
##$BYTORDP= 0
##$COROFFS= 0
##$CY= -3
##$DATMOD= 1
##$DC= 0
##$DFILT= <>
##$DTYPP= 0
##$F1P= 0
##$F2P= 0
##$FCOR= 1
##$FTSIZE= 16384
##$FT_mod= 6
##$GAMMA= 0
##$GB= 0
##$INTBC= 1
##$INTSCL= 1.334414e-10
##$ISEN= 128
##$LB= 0.24
##$LEV0= 0
##$LPBIN= 0
##$MAXI= 10000
##$MC2= 0
##$MEAN= 0
##$ME_mod= 0
##$MI= 1.114404
##$NCOEF= 0
##$NC_proc= -7
##$NLEV= 6
##$NOISF1= 3.799351
##$NOISF2= 2.8
##$NSP= 0
##$NTH_PI= 0
##$NZP= 0
##$OFFSET= 15.98128
##$PC= 1
##$PHC0= -11117.63
##$PHC1= 9.000992
##$PH_mod= 1
##$PKNL= yes
##$PPARMOD= 0
##$PSCAL= 0
##$PSIGN= 0
##$REVERSE= no
##$SF= 200.130006037202
##$SI= 16384
##$SIGF1= 3
##$SIGF2= 2
##$SINO= 5.538805
##$SIOLD= 16384
##$SREGLST= <1H.CDCl3>
##$SSB= 0
##$STSI= 16384
##$STSR= 0
##$SW_p= 3396.73913043479
##$SYMM= 0
##$S_DEV= 0
##$TDeff= 16384
##$TDoff= 0
##$TI= <>
##$TILT= no
##$TM1= 0
##$TM2= 0
##$TOPLEV= 0
##$USERP1= <user>
##$USERP2= <user>
##$USERP3= <user>
##$USERP4= <user>
##$USERP5= <user>
##$WDW= 1
##$XDIM= 16384
##$YMAX_p= 387376883
##$YMIN_p= -1391496
$$ End of Bruker specific parameters
$$ ---------------------------------
##NTUPLES= NMR SPECTRUM
##VAR_NAME=  FREQUENCY,     SPECTRUM/REAL,   SPECTRUM/IMAG
##SYMBOL=    X,             R,               I
##VAR_TYPE=  INDEPENDENT,   DEPENDENT,       DEPENDENT
##VAR_FORM=  AFFN,          ASDF,            ASDF
##VAR_DIM=   16384,         16384,           16384
##UNITS=     HZ,            ARBITRARY UNITS, ARBITRARY UNITS
##FACTOR=    0.207333158178282, 1,           1
##FIRST=     3198.33372829336, 0,            0
##LAST=      -198.40540214143, 0,            0
##MIN=       -198.40540214143, -1391496,     0
##MAX=       3198.33372829336, 387376883,    0
$$ Real data points
##PAGE= N=1
##DATA TABLE= (X++(R..R)), XYDATA
$$ [...]
7258 339469 136723 -171907 -212584 -211104 -96395 58609 -11566 -108630 312605 241243 405525
7247 405525 35999 -136477 -227724 -211860 -263579 -147145 -147720 -166675 38874 -24680 -31743
7236 -31743 26367 -138798 -469490 -182682 -232250 -14773 -28829 -179318 -165930 -390747 -279227
7225 -279227 -270901 -227648 -253262 -65844 -372117 -425612 -166763 -350235 -522621 -633837 -764233
7214 -764233 -744501 -418572 -380519 -91356 -222652 -295917 -140722 -57500 -253804 -352220 -402813
7203 -402813 -578342 -707966 -573129 -434977 -357612 74982 13515 -79358 -204891 -162710
7193 -162710 -374626 -486606 -560026 -706198 -664086 -594495 -496434 -527962 -662790 -617292 -491411
7182 -491411 -440545 -157830 -198756 -431150 -430061 -301475 -748697 -758956 -1115374 -1358748 -823080
7171 -823080 -986943 -934531 -833788 -765986 -492321 -173714 -443282 -575810 -525981 -487964
7161 -487964 -481907 -795505 -835013 -866879 -966978 -948828 -638492 -644490 -499206 -350585 -486694
7150 -486694 -303565 -166538 -768077 -557722 -552898 -1113795 -975070 -660162 -685799 -1015985
7140 -1015985 -841327 -808610 -308350 -290726 -319961 -169301 -322810 -490759 -703755 -682503
7130 -682503 -857092 -1037478 -789199 -761967 -627841 -587814 -862266 -818713 -885246 -663815
7120 -663815 -729433 -891211 -700351 -622241 -507814 -691034 -537279 -1041317 -1071388 -894394
7110 -894394 -801153 -520449 -30945 -366991 -665944 -470123 -873800 -719175 -498141 -733176
7100 -733176 -651356 -692727 -988967 -905081 -833614 -965767 -786213 -776868 -675860 -613796 -829985
7089 -829985 -655051 -508453 -529102 -597629 -584944 -699144 -600191 -503299 -696542 -393638 -185727
7078 -185727 -619985 -511321 -680210 -403817 -619936 -557261 -556474 -740805 -287217 -247847 -438280
7067 -438280 -192540 -407627 -676143 -728894 -497095 -507310 -312612 -564561 -839553 -768580
7057 -768580 -664301 -765775 -812774 -940018 -836451 -774179 -399644 -444163 -703853 -617187
7047 -617187 -525929 -834174 -908468 -928376 -1080882 -1006962 -1097096 -965774 -673842 -270387 -262702
7036 -262702 -581973 -629737 -652814 -589675 -747217 -502720 -682261 -701899 -739636 -934528 -770844
7025 -770844 -785417 -616480 -548025 -231055 -226364 -244437 -540084 -847185 -965139 -943601 -1163489
7014 -1163489 -1005754 -1076067 -914663 -821080 -727107 -742803 -587033 -633158 -422296 -676264
7004 -676264 -745551 -733124 -818650 -954321 -643180 -1016013 -1078546 -1009902 -862995 -604807 -651788
6993 -651788 -742766 -210426 -383392 -634020 -624458 -849363 -997043 -913029 -1039360 -988912 -1055528
6982 -1055528 -861546 -530215 -748281 -980707 -959410 -953433 -472127 -358977 -542750 -600325
6972 -600325 -770310 -1008767 -807080 -635909 -816542 -565715 -618384 -467065 -399478 -428353
6962 -428353 -445000 -68669 -458210 -255390 -444520 -536746 -477094 -466772 -409819 155331 26355
6951 26355 -175256 49854 228290 488238 826166 313702 572089 603015 727213 426488
6941 426488 89 123875 -29866 -176636 107440 386960 541086 499029 303708 665241
6931 665241 697855 228708 549598 616158 472621 304874 34303 -7343 245 -68198 -313359
6920 -313359 -344296 -470473 -473871 -270424 -45194 -215241 -77447 -224145 -486506 -486284 -592852
6909 -592852 -837348 -733867 -429621 -272909 -286268 -324798 -36270 44550 -411239 -166749
6899 -166749 -486320 -1026327 -802818 -737514 -719019 -440348 -524188 -518141 -496874 -511882 -256947
6888 -256947 -307202 -718903 -451927 -537357 -274828 -458241 -702829 -618932 -342680 -270446
6878 -270446 -344023 -236753 93362 14907 -41754 -418998 -532647 -547393 -529802 -932993 -620140
6867 -620140 -205831 -323003 -353410 -565177 -759912 -1074954 -1136436 -1242137 -1037600 -924439
6857 -924439 -596149 -365335 -388709 -616984 -371478 -551550 -983471 -804472 -568091 -649061
6847 -649061 -591567 -529302 -511148 -507266 -651343 -446340 -326097 -319974 -230767 -443825 -214973
6836 -214973 -313125 -152009 -459996 -478477 -896669 -823132 -685290 -628382 -581125 -405531 -292917
6825 -292917 -417623 -711091 -753203 -895203 -783319 -882593 -786612 -696273 -825185 -907034 -635038
6814 -635038 -814063 -905794 -806119 -919239 -731802 -920958 -1027645 -649013 -374407 -644989
6804 -644989 -931849 -1159532 -711261 -386053 -191096 -324168 -367859 -464995 -449668 -750853
6794 -750853 -876748 -897167 -915170 -828493 -935833 -708140 -528565 -558372 -388483 -363540 -403881
6783 -403881 -303558 -312575 -252141 -39117 -162943 -100158 -395980 -706548 -858133 -485019
6773 -485019 -476708 -269359 -489365 -567737 -175047 -24706 67475 -48950 -333922 -290255 -28963
6762 -28963 -217393 -309877 -107937 -504017 -563273 -688266 -686482 -556568 -379912 -277278 -61158
6751 -61158 -107252 -174188 -103706 -137451 -233600 -649392 -1069737 -938603 -954626 -855720 -395549
6740 -395549 -164305 -35968 -87705 -203557 -403332 -198924 -548860 -572879 -331441 -513809
6730 -513809 -828924 -816086 -619389 -750250 -773034 -304224 -145774 134347 91500 -338847
6720 -338847 -715882 -621123 -820376 -750750 -854141 -974116 -743685 -590214 -604691 -398217
6710 -398217 45383 226901 22049 -242712 -326046 -272111 -966685 -1188536 -1304630 -1391496
6700 -1391496 -1104720 -721508 -478883 -348947 133237 162536 181950 297160 -81023 -138304
6690 -138304 -573232 -950464 -1229952 -1166367 -962028 -869882 -398033 -464622 -136240 104409
6680 104409 286555 194199 -99110 -44115 -72854 15758 -237389 -789504 -689042 -820985
6670 -820985 -590948 -391131 -413478 -445940 -51025 248441 437593 314896 307580 227637 93598
6659 93598 -114134 -186775 -350884 -536741 -741609 -690288 -591077 88918 104768 122704 241259
6648 241259 -208192 107301 384052 220046 -137667 -327714 -253876 -110990 84854 -187905
6638 -187905 -16193 112924 281948 483064 550116 654455 139568 233042 204203 146533
6628 146533 18607 13081 420486 251589 192571 613235 787418 1191554 991025 858516
6618 858516 826558 810177 441404 495154 571185 432880 642703 744951 1337183 1667679
6608 1667679 1807982 1959475 1814177 2158142 2179200 2595841 2665571 2733723 2953829 3137142
6598 3137142 3396555 3845083 4075254 4489149 4716827 4728653 4534141 4605533 4798574 4757132
6588 4757132 4472243 4357515 4365390 4054833 3967125 4270498 4478649 4663341 4744188 5099557
6578 5099557 4940470 4752870 4536342 4208734 3750511 3665050 3580344 3961799 4108752 3647056
6568 3647056 3775557 3733866 3464524 3055336 2642211 2517011 2515003 2487449 2225499 1578912
6558 1578912 1395063 1235779 1099348 906375 1334939 1125482 1510202 1526973 1636162 1652638
6548 1652638 1493853 1251155 1484722 1476261 1041142 1078790 1213691 951384 962656 933232
6538 933232 776367 936709 1305664 1278097 1333918 1335087 1369901 1228244 1173572 1028060 927724
6527 927724 1265717 1143699 1226396 1579790 1767568 1797348 1944129 2113730 2396106 2591366
6517 2591366 2968809 3106659 2854257 3034453 3213822 3331476 3151278 3271921 3341636 3577802
6507 3577802 3884405 3967003 3847800 4389568 4372340 3895515 4009666 3765017 3741414 3455005
6497 3455005 3033072 3123689 3177743 3248253 3883449 3672711 3644084 3736117 3767906 3803995 3714783
6486 3714783 3614514 3760877 3382632 3329432 3268483 2884366 2815087 2553104 2121982 1926501
6476 1926501 1802470 1487759 1588665 1214866 1125292 1107486 1007013 1237415 1074211 988923
6466 988923 1015807 1032300 803915 730527 401161 94001 256500 201976 121292 377270 646827
6455 646827 705563 710328 568701 344267 451792 194159 88323 379931 357567 244650
6445 244650 50445 -11718 275243 348511 273502 538307 151986 350942 429555 334223 518780
6434 518780 463968 111262 74493 -11019 179921 148301 9689 325485 337628 268569 419982
6423 419982 623328 406366 782138 365784 446173 166042 -159130 275386 187434 111320
6413 111320 145133 71326 160359 308962 179095 245077 636288 594210 444416 576404 648702
6402 648702 476604 447711 470489 278718 544873 712476 590420 763782 935643 980482
6392 980482 656097 943616 1063826 937854 767848 1014522 987732 793068 1119407 1061300
6382 1061300 1087569 1164241 1297474 1758066 1584075 1691649 1867007 1920281 1950692 1790429
6372 1790429 1878869 2094028 2516563 2528023 2672332 2804961 3122648 3486287 3488757 4070460
6362 4070460 3989908 4194878 4873132 5547595 6176642 6396450 6897190 7440833 7440734 7305180
6352 7305180 7595600 7711518 7653507 7801908 7502873 7536192 7229670 6415972 5973817 5718212
6342 5718212 5439810 4921865 4415287 4237135 4095254 3628428 3545084 3376127 3183337 2879462
6332 2879462 2688656 2663137 2587594 2404542 2230394 2302513 2609039 2793644 2878331 2798806
6322 2798806 2756325 2756562 2687872 2687871 2653475 2304857 2453672 2465083 2579867 2492125 2699257 3176515
6310 3176515 3629439 3384119 3852158 4194075 4476757 4962373 5006455 5081781 5447299 5746539
6300 5746539 6234385 6789615 6749049 6863721 6926677 7048147 7309282 6833391 6711462 6674423
6290 6674423 6659288 6154088 5918133 5400612 4826568 4410865 4203434 3773234 2928217 2571578
6280 2571578 2534760 2342785 2512872 2366840 1976907 2071253 1886298 1762828 1771681 1369428
6270 1369428 1470498 1502833 986336 1456524 1426927 1173826 1462282 1580099 1411499 1107473
6260 1107473 1162466 844811 1074748 989037 607428 809291 566376 614269 564338 745270
6250 745270 947745 1081011 968890 629685 774723 771646 408979 304257 155765 304028
6240 304028 254175 349486 135037 245228 373154 306620 216396 506423 204939 70807
6230 70807 175192 111053 208409 349869 104983 389088 438515 752079 536114 205164
6220 205164 291214 218697 -33666 130084 -139411 -273581 55877 68862 106435 755470
6210 755470 871496 941162 839489 439152 607053 570348 529438 302893 342101 402543 205482
6199 205482 214511 15404 253911 565467 523956 379523 205753 504468 378834 106209
6189 106209 2158 -162932 -70144 39964 -189455 53027 239184 -109458 293743 426934
6179 426934 123685 287661 -190920 -65326 370597 -21378 -34939 653 -547770 -152928
6169 -152928 -142198 -310739 -30012 -203184 -15888 483584 430396 563362 669851 35880
6159 35880 -234896 -137698 -129220 -49864 -67011 -153941 -62914 -195000 18893 -60425 49389
6148 49389 96438 79186 -15426 -81533 86058 -252649 -290502 -620068 -814332 -677836 -211547
6137 -211547 -34533 -90178 120541 465811 353507 142528 -264155 -329654 3220 202162
6127 202162 -93931 -257536 -154170 -355452 -144400 158728 444285 471678 -28241 -40553
6117 -40553 198141 -50524 -288259 -246664 -457526 -128294 -307430 -201018 77231 358178
6107 358178 398510 615168 458280 260266 140429 -121428 -66752 -234617 -214611 117757
6097 117757 64006 -176196 178819 101628 -102398 -85853 -306970 -180148 76371 -84325
6087 -84325 -243652 -92805 -120711 21319 -83329 -53582 -153703 -131917 -53331 51089 41241
6076 41241 -26102 6727 -159520 -430845 -170164 -40249 -182426 373334 350344 366001 263647
6065 263647 114845 388766 727648 665596 793952 1029354 677251 561661 493994 663762
6055 663762 863190 728599 1021747 1071789 863992 651862 345830 359389 278308 319310
6045 319310 -198751 -164280 9098 -65635 541345 521202 331765 766007 601203 249581
6035 249581 434001 25681 -191773 -137435 -447694 -306441 -115322 -145928 69829 -348918
6025 -348918 -484948 -512053 -221109 -137741 104027 -42532 -93128 -106131 -130335 -579030 -419428
6014 -419428 -174384 -216892 -180804 -443649 -409869 -191992 -207335 60646 256159 230890 246784
6003 246784 151549 283159 181580 -191262 -122467 -266366 -217930 30382 -21344 -207313
5993 -207313 -279767 -191670 56761 -32813 -336029 -365087 -490266 -316854 -192997 -389390
5983 -389390 -206109 -95400 -71349 81605 80916 -120532 -208630 -63732 79329 -131940 -416963
5972 -416963 -194007 -22159 -423103 -306574 -453850 -260677 79058 -299419 -400627 88351
5962 88351 -239444 -530164 -324546 -840506 -654381 -368087 -321622 140114 294915 -58436
5952 -58436 314560 92239 -132513 -41545 -205663 -256446 -396846 -443852 -390485 -316600 -373920
5941 -373920 -62863 -60657 -345072 -164397 -39163 109727 242846 20447 -299775 103195
5931 103195 -32740 -415895 -375454 -303152 -2592 -124987 -131471 -71147 153571 123346 25745
5920 25745 -83395 -302437 -534201 -389560 -266862 -485207 -279830 -509835 -615700 -428670
5910 -428670 -250083 -177643 45024 -523593 -462469 -467224 -636608 -520220 -300460 -349868 -82648
5899 -82648 -232122 -425561 -255125 -324220 -162234 14955 -259563 -244560 -91701 -695850
5889 -695850 -621780 -375496 -586810 -483543 -434424 -481799 -249305 57911 576 -45538 -108089
5878 -108089 119675 -315223 -201811 -441529 -434183 -419370 -526189 -373842 -379590 -192161 -290046
5867 -290046 -4998 48655 216311 359396 302918 274200 268197 152517 -174845 -259394 -478465
5856 -478465 -314655 -51005 -365134 -215427 73796 295765 538521 482951 200573 -69264
5846 -69264 -232411 -429099 -454910 -490799 -451457 -168935 -261243 -241342 -173554 50105 -376634
5835 -376634 -272604 53708 -239445 -99383 -250992 -310627 -156108 -52758 -271007 -357045
5825 -357045 -413331 -388543 32427 -193350 113790 166738 -254062 -498861 -502008 -405062 -313462
5814 -313462 -463428 -429521 -301920 -387332 -397352 -32236 -40374 -39810 109232 -546955 -697646
5803 -697646 -638900 -342743 -551965 -298387 -80934 -181484 -73455 -276347 -5118 -17660
5793 -17660 -11448 -142376 138873 -194289 -503518 -644684 -665279 -565476 -383322 -415144 -84543
5782 -84543 241818 179489 -111683 -116496 -178570 -6346 106553 -47508 18921 -126588 -407276
5771 -407276 -546626 -379135 -302496 -530615 -388520 -334633 85136 -388623 -305757 -214116
5761 -214116 -270281 -623904 -486806 -244547 -168908 307897 97437 9620 -86343 29953
5751 29953 112517 -41892 -237499 81155 -15634 29122 145950 187411 -333885 -182255 -121942
5740 -121942 -251050 -107875 -375244 -110908 -103331 -291337 -410596 -343945 -312440 -661330
5730 -661330 -770135 -817070 -178243 -141536 -122013 -286082 -320631 -49967 72514 291909
5720 291909 221252 25943 -4788 -400402 -415521 -499460 -440158 -355008 -239225 -257974 -277698
5709 -277698 -65474 -295045 -65081 100463 50633 129684 284737 72785 -188364 -99270
5699 -99270 -417677 -411794 -479670 -398871 -117755 78346 -61372 -198224 -263889 -177109 -210133
5688 -210133 -298087 -296605 -216046 190162 88456 -47433 -181103 35288 248351 228765 -9218
5677 -9218 226686 260301 154255 -95352 -303412 -90611 64099 438899 84971 259164
5667 259164 198498 -80506 23568 -151646 69519 110902 -213854 -192187 -8685 92687
5657 92687 253484 344220 380599 360374 417993 82899 16223 38908 10148 -2808 -198187
5646 -198187 -264336 -224708 47557 -114011 221449 330813 643497 429145 221199 433693
5636 433693 314836 173697 69606 43700 -75492 -24516 -49948 -142085 -81956 135853 212127
5625 212127 -30619 125636 -82875 163125 78941 -96144 42688 157738 -136197 -40332
5615 -40332 69764 -39937 136262 86866 90662 395224 479702 81029 -3125 195670 476320
5604 476320 67884 108160 -5681 156638 84224 222706 216113 -183356 164858 276318
5594 276318 446156 422433 581566 451961 161290 250706 203148 92609 -33770 7477
5584 7477 -157248 -176682 91415 712577 761938 474616 323 363712 469595 440639 208877
5573 208877 60432 -23271 276591 350321 202809 231212 -38527 88768 410089 390973
5563 390973 413904 313573 306362 321978 260414 -202335 -273629 -305074 72024 327779 437292
5552 437292 701616 710232 555028 745945 670564 415633 55769 -188434 145194 251829
5542 251829 312122 266709 185752 242026 76113 339075 546983 474413 354151 527538 191642
5531 191642 373526 330286 281896 244722 359330 552785 612024 518700 451436 922887 656078
5520 656078 599654 389097 594895 340298 329825 282320 383359 570461 561815 392549 447068
5509 447068 561467 824441 703529 796119 924359 1177946 836328 698882 601468 192613
5499 192613 391312 493942 685238 943709 897426 869929 751895 819559 190611 291099
5489 291099 599287 570770 792366 701108 635853 850690 1048740 1166487 932873 732771
5479 732771 781763 616010 490120 583513 1080951 1054646 446894 528752 672749 874720
5469 874720 828705 877743 1140645 1164715 879410 536118 525613 428884 690752 645225 680939
5458 680939 995310 954612 865294 925854 1017827 1187425 1260825 1177142 627170 934188 1205932
5447 1205932 893651 1213406 1259121 1066047 1068529 1072226 898966 867544 1261747 1059862 1308909
5436 1308909 1460927 1508237 1418323 1089478 1227861 1059633 1451853 1501986 1390951 1253815
5426 1253815 1286902 1426977 1205089 1488813 1454375 1742843 1971226 1633075 1673295 1649237
5416 1649237 1594646 1418031 1519222 1223898 1343048 1098771 1264220 1703939 1625303 1691394
5406 1691394 1855986 1955990 1789305 1872737 1739875 1903945 1555842 1401472 1798845 1693942
5396 1693942 1746840 1694823 1942740 2030802 2115317 2186585 2325906 2290325 2194328 2390748 2226344
5385 2226344 2166744 2835636 2863087 3062020 3332734 3379457 3553957 3524841 2991250 2673144
5375 2673144 2787113 2729806 2660486 2727044 2667199 2704477 2854632 2940261 3157865 3486209 3445406
5364 3445406 3376544 3367334 3415556 3775341 3297512 3409692 3247783 2844682 2554688 2577339
5354 2577339 2305929 2472563 2201143 2163293 2224688 2019996 1743858 1750532 1835386 1982210
5344 1982210 1982777 2307134 2220849 2352773 2399062 2103385 2119237 2288491 2117184 1923120 1848181
5333 1848181 2010023 2211457 2313956 2583554 2735496 2380732 2581096 2550445 2246623 2107589
5323 2107589 2150531 2214884 2300707 2237314 2377932 2487422 2618218 2655968 2502360 2412931 2420269
5312 2420269 2355532 2595192 2677822 2374566 2359786 2377561 2593307 2630599 2797425 2976931
5302 2976931 3118153 3147176 3319552 3174227 3190231 3267652 3107721 3383700 3120549 3151813
5292 3151813 3715346 3732663 3813704 4024681 4202248 4363964 4422164 4399908 4617713 4245640
5282 4245640 4356634 4394651 4306515 4179315 4565389 4910523 5255120 5694275 6131954 6592278
5272 6592278 6824849 7091190 7504575 7739937 7972465 8292318 8908372 9197421 9810854 10114382
5262 10114382 10276025 9768897 9332404 8950027 8792106 8416493 8232171 7971165 7821104
5253 7821104 7656734 6963021 6848525 7081664 6850914 6766144 6985615 7051700 6900328 6913910
5243 6913910 6827064 6710755 6399540 6608538 6955052 6472410 6155356 6144962 5873274 5873729
5233 5873729 6143417 6092581 6107155 6160024 6528823 6738075 6635926 6515982 6245550 6180994
5223 6180994 6131857 6012370 6143324 6200317 6045304 6154883 6268206 6229513 6604692 6772146
5213 6772146 7319940 7552028 7629911 7737990 7523076 7136995 6746835 6577618 6430910 6202479
5203 6202479 6395655 6534796 6795380 6672914 6598014 6762912 6750165 6690511 7052613 6943246
5193 6943246 6544449 6590694 6467640 6791521 7366038 7679133 7901321 8104437 8794229 9160578
5183 9160578 9488779 9780057 9855424 9839401 9641986 9404215 8879170 8518679 8332930 7943412
5173 7943412 8151524 7781919 7572095 7560611 7570463 7590534 7240525 7451032 7163766 6836091
5163 6836091 7065819 7572976 7664502 7730324 7545588 7503985 7796757 8171871 8229292 8343001
5153 8343001 8189602 8331282 8413954 8319929 8105942 8232651 7976792 7413789 7469003 6909745
5143 6909745 7229854 7199486 7289384 7263178 7309039 7319482 6929477 6766556 6500754 6551426 6263752
5132 6263752 6065077 5873362 6153923 6521139 6536059 6500313 6868608 6933325 6821595 6909341
5122 6909341 6706949 6648169 6804876 6705313 6479263 6435557 6243020 6488865 6377217 6821507
5112 6821507 6836409 6755625 7051551 7170955 6811575 6707487 6533295 6205639 6108256 6034380
5102 6034380 5859837 6281684 6385296 6221932 6443453 6603531 6867751 6609230 6714641 7316730
5092 7316730 7022952 6957417 6818100 6584699 6517382 6537715 6349719 6436466 6674672 6647362
5082 6647362 6890039 6795384 7142984 7334901 7053947 7217797 7388454 7274965 7231849 7063345
5072 7063345 7003651 7415082 7670932 7884361 8161394 7998553 8279859 8180234 8148903 8472364
5062 8472364 8542843 8455885 8489453 8735202 8984563 9262943 9208308 9457428 9578879 9107554
5052 9107554 9432788 9582515 9636153 9732075 9666425 9492154 9756587 9808935 9787095 9977543
5042 9977543 9614707 9675139 9953415 9345748 9591689 9800451 9714976 9862000 9867954 9891135
5032 9891135 10173760 10155660 9898503 10017232 10180891 10245961 10481404 10622681 10913110 10899120
5022 10899120 10891961 11175679 11056646 11099136 11000787 11156720 11465733 11308712 11226810 11572285
5012 11572285 11556651 11810282 12442957 12307848 12868742 13290315 13747705 14362696 14872551 15062890
5002 15062890 15313084 15635644 15787659 16280646 16357966 15843929 15701987 15614475 15633951 15684852
4992 15684852 15533517 15655567 15920232 16065828 16163376 16269943 16071497 15696825 15387248 15269185
4982 15269185 15163953 14857402 15412807 15268007 15107928 15852083 16249537 16544231 16760548
4973 16760548 16896504 16833986 16970242 16914987 17093662 16887929 16947596 17184251 17138938 16730872
4963 16730872 16885537 17182925 17637952 17864756 18078588 18253779 18534625 18569115 18860236 19208758
4953 19208758 19050301 19477600 19625971 19839422 20497670 20821169 21236959 21682695 22233346
4944 22233346 22681902 23217012 23671175 24154048 24448177 24593119 24680156 24965060 25099662 25139645
4934 25139645 25321148 25201656 25270716 25176167 25484500 25545067 25584605 25385611 25437033 25359825
4924 25359825 25792069 26004853 25929050 25795319 25749948 25917430 25554098 25234917 24760955 24590263
4914 24590263 23817563 23155226 22456688 22094796 21769957 21304116 21258536 21058293 20829457 20656123
4904 20656123 20601935 20404394 20400838 20160287 20346409 20662464 20545954 20959525 21419714 21805235
4894 21805235 21847717 21974838 21781669 21973748 22196410 22064383 21860067 21966799 22032901 22220016
4884 22220016 22379509 22286008 22964457 23138154 23329863 23703288 23668987 24122978 24181996 24287977
4874 24287977 24398852 24756162 24795325 24769417 24685198 24910212 25432759 25781145 25884649 25969162
4864 25969162 26263132 26726611 27228495 27130512 27137640 27395493 28149148 28208237 28390554 28188785
4854 28188785 28457126 28794454 29143130 29687591 30238115 30936405 31279956 32074112 32284744
4845 32284744 33114698 33814534 34536127 35663187 36228599 36382282 36141964 36211173 36164792 36361894
4835 36361894 36099817 35968156 36069042 36229376 36383687 36732139 36836641 37081896 37518668
4826 37518668 38080229 38437262 39228632 40395628 41204217 42339672 43301645 44546621 45245008
4817 45245008 46114963 47045728 48106966 48787126 49250425 50482105 51096530 51951516 52593785
4808 52593785 53532045 54813711 56342180 57577952 58919636 60694980 61996969 63471488
4800 63471488 64518429 65378705 66546811 67694215 68566590 70217190 71621339 73115537
4792 73115537 75472291 78131289 80202510 83181399 85648212 88349891 91489708 93406470
4784 93406470 95418449 97323962 98353402 98807723 99277581 99033419 98652348 97504426 96040443
4775 96040443 94455455 92055168 89423582 86456968 83287723 80276753 77274194 74631047
4767 74631047 72131401 69978316 68071499 66562900 64862749 63420363 61997182 61020600
4759 61020600 60006645 59355586 58221994 57693041 56825827 56349877 55846802 54987779 54606558
4750 54606558 53649204 53053925 52325824 52007426 51471758 51040331 50436421 49870296 49710418
4741 49710418 49533948 49561269 49680150 49817435 49518041 49911962 50145618 50540593 50824934 51098269
4731 51098269 51746107 52203342 52886617 53087219 53188918 52976309 52754594 52221155 51798313
4722 51798313 51052027 50249078 49803218 48906346 47932926 47956247 47227773 46236726 45640710 44738143
4712 44738143 44182426 43368501 42770619 42617412 42219462 41889734 41542984 40848778 40516348
4703 40516348 40271247 39462591 39224998 38965890 38503839 38571999 38567264 38065925 37954469 37805110
4693 37805110 37702778 37331022 37239731 37362707 37084013 37241369 36979408 36862469 36742430 36610446
4683 36610446 36752266 36768651 36640252 36701397 36964810 36895540 36811419 36848132 37105899 36757923
4673 36757923 36800332 36876363 36859490 36817442 36864315 37013245 37085611 37316772 37251452 36977479 37163233
4662 37163233 37360082 37687239 37760445 38142381 38230933 38226239 38466853 38455257 38664401 38835635
4652 38835635 38784730 39083543 39480625 39410409 39583447 39972292 39627519 39790934 40023487 40209092
4642 40209092 40645815 40705858 41200890 41627858 41703155 41769773 42059086 42119617 42692128 43205623
4632 43205623 43467499 43431544 43624069 43981627 44173466 44233509 44485449 44995342 45574677 46132486
4622 46132486 46350127 46868163 47070286 47647232 48206350 48573337 48956584 49542089 50055016
4613 50055016 50467714 50805499 51018252 51616642 51996671 52301955 52686211 52882370 52891144 53277974
4603 53277974 53574248 54031716 54549900 55104899 55419212 55926601 56431735 56668945 57298494
4594 57298494 57623729 58319086 59320255 59691724 60338549 60898945 61400005 61981745 62477023
4585 62477023 62882804 63421345 63767159 63885730 63871291 63415496 63464046 63605476 63610424 63911771
4575 63911771 64566222 65045985 65427848 66098131 66372356 66953774 67168703 67337166 67706649
4566 67706649 68602308 68917992 68934070 69274989 69363931 69196300 69205105 69240688 69562571 69907517
4556 69907517 70045228 70032883 70320040 70441139 71034758 71559860 71725324 72377771 73006388 73521489
4546 73521489 74058648 74206165 74704897 75133801 75308046 75427083 75751212 75933510 76435525
4537 76435525 77167835 77607605 77895531 78430089 79171688 79770858 80676391 81244106 81724810
4528 81724810 82197807 82944155 83092660 83320228 83413609 83095601 82881547 82725748 82241903 81925732
4518 81925732 81368273 80413515 79725243 78529390 77652447 76885975 75940352 75137191 74546197
4509 74546197 73331269 72566922 72475873 71620238 71647043 71385034 71374150 71649054 71627379 71434772
4499 71434772 71326048 70663278 70440423 70120496 69632094 69386388 68708707 68591143 68080626
4490 68080626 67611140 67523507 67551734 67044792 66770202 66613381 66178150 66224606 66350672 66316845
4480 66316845 66246933 66438682 66640914 67043471 66836876 67218137 67626917 67694485 67926373 67955751
4470 67955751 68209366 68259557 68419442 69029356 69490314 69604792 69517632 70081822 70731179 71404102
4460 71404102 71878537 72259097 73288145 74636922 75605145 77401257 78785843 80366368 82637650
4451 82637650 85137675 87659853 90464928 92906743 95589621 98471172 100902270 103701147
4443 103701147 105686923 106931998 108112321 108600138 108767757 109060324 108960372 109163055 109226046
4434 109226046 109175724 109603961 109955808 109910799 110177092 110064891 109829546 109584689 108863982 108077045
4424 108077045 106971636 105808456 105038356 104168484 103282142 102707929 102154556 101463014 100992834
4415 100992834 100363413 100130168 99636543 98851510 98317124 96839402 95322466 93354437 91108884
4406 91108884 88808350 86426326 83939171 81564853 79348032 76768980 74812353 72822485
4398 72822485 70933983 69211518 67414202 65354163 64147348 62604446 61308135 60210818
4390 60210818 59121811 57861771 56735414 55632986 54821597 54204497 53260462 52641786 51651301
4381 51651301 50912937 50229367 49603970 48998962 48506981 47575558 47189118 47070716 46885438
4372 46885438 47059238 46892073 46606329 46698453 46728052 46824344 47613362 47239834 47618199 48449265
4362 48449265 49271534 50181850 51367019 52568112 53641295 54921683 56629037 58615507
4354 58615507 60818195 63571029 66750101 70127214 73947798 78623852 83766933 89113507
4346 89113507 93807528 97865815 100649562 100360181 97262459 91313358 85174024 79267909
4338 79267909 74364211 70591683 67549570 65274390 63904268 63049751 62082518 61792794 62119216
4329 62119216 62589277 63568800 64807810 65750094 67827035 69598788 71808675 74400823 76647181
4320 76647181 78887787 80855633 81393844 80214254 78427787 75102385 71358337 67208813
4312 67208813 62757761 58861696 55372394 52699578 50154066 48273975 46691532 45562051
4304 45562051 43986401 42858381 41737657 40726984 39526609 38359414 37847635 37636506
4296 37636506 37218972 36690937 36295230 36278190 36143215 36060187 35574321 35563008 35750291 36052661
4286 36052661 36383644 36657477 36792081 37406098 37773722 37948820 37805187 37758389 37597195 37350058
4276 37350058 36714661 36108041 35835073 35378963 35067030 34141527 33777399 32857618 32207779
4267 32207779 32158785 32030537 31205715 30593682 30372878 29641916 29232234 28657468 28246085 27695316
4257 27695316 27326337 27093827 27002019 26720913 26771060 26762497 26742859 26917727 26567651 26336347
4247 26336347 25946617 25941637 25732935 25470686 25015709 25182901 24903286 25336149 25080080 24394532
4237 24394532 24236901 23805576 23297272 22980410 22393428 21466041 20994153 20123286 19613355
4228 19613355 19184757 18528180 18125625 17605211 17544917 17252482 17079835 16810110 16474681 16075914
4218 16075914 15856631 15870156 15994881 15612671 15858880 15736443 15624236 15432971 15153401 15533576
4208 15533576 15429060 15713531 15651381 16090856 15623890 15452880 15359455 15515461 15777163 15442379
4198 15442379 15687563 15449011 15076297 14930869 14958125 14634085 14402013 14062072 14065204 13852934
4188 13852934 13565267 13526309 13225278 13241173 13381586 13326801 13324964 13303978 12735703 12769984 12849358
4177 12849358 13285394 13161936 12993891 13113482 13244797 13421601 13261423 13526353 13280357
4168 13280357 13759180 13681610 13740609 13766506 13173083 13167192 12828790 12299191 12208253 12072708
4158 12072708 11916443 12070511 11536458 11322584 11620009 11644441 11247836 11282860 11148559 11078137
4148 11078137 10847664 10785590 10582303 10561745 10586746 10731429 10760023 10508335 10618486 10957408
4138 10957408 11133050 11009420 11211507 11654490 11652229 11724708 11857915 11856818 11870179 12201808
4128 12201808 12620812 12489180 12854207 13477520 14011613 14248833 14533711 14660792 14588491 14286059
4118 14286059 14297493 14000553 13621376 13501333 13011053 12949607 13133436 13177640 13433234 13366331
4108 13366331 12627061 12683210 12483103 12413848 12140683 11769791 11391481 11195351 11102875 10916982
4098 10916982 10731621 10316404 10311061 10078624 10577217 10745266 10656638 10245359 10278642 10315216
4088 10315216 10299370 10186853 10034462 10232942 10263719 10413663 10427957 10537445 10346729 10267651
4078 10267651 10615570 10590990 10402442 10715298 10636708 10488130 10679118 10388877 10591312 10802768
4068 10802768 11003052 11020938 11009492 11209733 11073008 11197832 11389392 11435558 11482340 11597841
4058 11597841 11724251 12154481 12193789 12246078 12382099 12499989 13082956 13389275 13856725 14587570
4048 14587570 14895770 14910588 15577493 15889218 16189016 16475162 16483383 16928217 17438391 17620518
4038 17620518 17772712 17823154 17639604 17874081 17621725 17805478 17527761 17226155 16810159 16389711
4028 16389711 16624227 16286770 15621353 15358406 15315400 15259883 15624567 15522331 16048773 16412420
4018 16412420 16829685 16956382 17325384 17510743 17883756 18182726 18330143 18927140 18864090 18987870
4008 18987870 19176256 19429681 19333510 19476710 19410173 19844577 19888408 19707406 19306297 19000617
3998 19000617 18773483 18498561 18424927 17924347 17737246 17885504 17777947 17657159 17479372 16462418
3988 16462418 16287563 16213219 15746611 15765455 15209544 14939335 14868568 14829022 14554893 14569847
3978 14569847 14709994 14743459 14948136 14704347 14865318 14689963 14723240 14954015 15067010 14723619
3968 14723619 15112447 15319012 15199653 15415072 15761194 15593217 15257315 15177894 14716211 14403532
3958 14403532 14039498 13646446 13346635 13622248 13149199 13038955 12799766 12719672 12990695 12818306
3948 12818306 13068085 12997752 12974480 12934038 12754445 12373336 12185915 12366917 12394744 12427703
3938 12427703 12428294 12367193 12024564 12247897 12034182 12224038 12398806 12197231 12527155 12672075
3928 12672075 12134109 11984354 11939628 11677892 11451555 11251328 11325568 11363477 11514029 11340535
3918 11340535 11886007 12330788 12591167 12561532 12331589 12413140 12183138 12517352 12405831 12548368
3908 12548368 12713296 12618560 12307991 12119470 11979235 11868940 11752314 11503882 11709309 11588926
3898 11588926 11549367 12082287 11787651 11632041 11617625 11208907 11648776 11520503 11730446 12179758
3888 12179758 12627194 12493914 12560471 12818089 12668445 12931694 12988250 13171096 13320079 13490518
3878 13490518 13627211 13684579 13954278 14218289 14382937 13886926 14026662 14250848 14142357 14053749
3868 14053749 14162908 14433861 14530726 14614903 14611927 14831013 14796836 14680521 15195842 15307704
3858 15307704 15520707 15685713 15909439 16066611 15829764 16192322 16140761 16312469 16703504 16360701
3848 16360701 16794133 17164986 17035923 17277244 17545398 17423247 18051125 18624907 18942648
3839 18942648 19443366 19828935 20207365 20587376 20985099 21251331 21479059 21852475 22342015
3830 22342015 22803908 23374774 24126612 25102715 25891403 26919435 27821315 28649888 29594300
3821 29594300 30621017 31453220 32445910 32910451 32834999 32915101 33213569 34066166 35379192
3812 35379192 36544351 38126906 39952793 42092698 44151780 46703438 49473670 52345551
3804 52345551 56179038 60351978 65708935 71453212 78529694 87017587 96459729 105909919
3796 105909919 115236075 122080082 122282992 117658814 108003628 94880049 82084553 71468216
3788 71468216 63693376 58429976 54600235 51417250 48948259 47276982 45466276 44221565
3780 44221565 43026880 42062419 41654144 41079061 40420476 39648027 39421226 38799478 38531868
3771 38531868 37940583 37623608 37618632 37477977 37645494 37775485 37969269 38241167 38446273 38791931
3761 38791931 39296138 39381552 39676574 39826783 40532165 41018691 41280793 41803369 42258028 43080196
3751 43080196 43753294 44431741 45262167 46548701 47776728 49302818 50120505 51655861 53639680
3742 53639680 56213802 58620239 61598253 65011464 69019009 73643322 78479818 84728751
3734 84728751 91314443 99626019 108931718 117804864 126167634 133472816 134712056 131805521
3726 131805521 126691507 117399295 106361040 95585793 86824757 80083937 75225625 71532661
3718 71532661 68548455 66104966 63852552 62472053 61275848 59947297 59194545 58801723
3710 58801723 58225810 57831075 57478307 57226394 56505875 55969442 55615203 55643476 55415715 55221303
3700 55221303 54987283 54664424 54638584 54486601 54702499 54751980 55044913 55325487 55492695 55645247
3690 55645247 56094687 56164318 56038187 56772259 57315041 58542987 59328357 59956238 60655689
3681 60655689 60865878 61525302 62433004 62745121 63813515 64765914 65588018 66784628 67086059
3672 67086059 67331944 67569849 67097324 66820692 66637834 66521356 66711000 67159031 67432128
3663 67432128 68204949 68901038 69487427 70286436 71633218 72410727 73339429 74316985 74721199
3654 74721199 75513681 75382246 74698177 73869162 73325799 72647426 72831474 72722314 72976669
3645 72976669 74018647 74867264 75862465 77603497 78751429 80357776 82557371 84870480
3637 84870480 87275744 89903125 92872119 95977668 99377167 102975589 107156935 110897162
3629 110897162 115081893 119290307 123551422 127292058 130035858 132488998 133635021 133971552
3621 133971552 132854982 131055123 128878318 126042367 122460499 118626736 113602561 108844941
3613 108844941 104177818 99009462 94824987 91434431 88748145 86870554 85837094 85079457
3605 85079457 84264874 84254601 84766926 85323866 86034965 86704106 87866735 89412832 90126290
3596 90126290 90635297 90763160 90122697 89297951 88691751 88273812 88149367 88778101 89650440
3587 89650440 90938893 91838447 93584609 95697592 97337922 99601087 101975756 103908734
3579 103908734 106282064 108602442 110224388 111707131 112286287 112520719 112251508 111815436 110925042
3570 110925042 109766549 108529004 107194389 105432032 103670444 102025636 100359993 99005812
3562 99005812 97416315 96550452 95586498 95187999 95281045 95145599 95076570 94865563 94817968 94840278
3552 94840278 94960350 94753274 94550549 94555548 94448312 93979519 93398361 93006242 92724078 92116205
3542 92116205 91679684 91043472 90309988 89651626 88844247 88288385 87501704 86510208 86141275
3533 86141275 85295782 84132874 83382116 81999460 80668409 79337660 77597099 75925521
3525 75925521 74046122 71670149 69954934 68021110 66588494 65188150 63504630 62133726
3517 62133726 60806020 59544257 58681154 57747891 56517707 55912144 55237153 54687016 54510475
3508 54510475 54078606 54082178 53877163 54035078 54349700 54686154 55293906 55930849 56275125 56864273
3498 56864273 57570688 58027909 58574824 59029468 58934442 58434817 57449577 55795818 53833275
3489 53833275 52333094 51120123 50262440 49575226 48980672 48691957 48586083 48097621 48308657
3480 48308657 48571901 48899907 49315689 49665639 50410970 51039855 51726162 53113265 54290944
3471 54290944 55725729 57392165 58916579 60787540 62788515 64750211 67599637 69778785
3463 69778785 71546684 73643646 74683356 74561281 74027753 73187313 72213946 71404971 69915452
3454 69915452 68473860 66585690 64684713 63198256 62140924 61185439 60494609 59821407 59923689
3445 59923689 60066062 60376397 61037785 61831925 62444262 63004556 64075865 65224537 66057546
3436 66057546 66880723 67018106 66745133 66576366 66346400 66012176 65877698 65538693 65580992 65365016
3426 65365016 65385035 65151716 64986068 65102439 64967307 64997058 65190591 64985246 65073802 65577366
3416 65577366 65935896 66759631 67655862 68954372 70317630 72021507 73662841 75297197 76841335
3407 76841335 78668179 80791013 82334850 83637175 84537795 85158699 85551188 85704648 86064593
3398 86064593 86670573 86698696 86736718 86878895 87172573 87834702 88454816 89587288 91289474
3389 91289474 93872393 97302418 100851061 105714094 110934651 116757361 123225755 129319637
3381 129319637 134146874 137336960 137471846 133146872 126265865 118611116 111354459 104713144
3373 104713144 99279068 94883703 91364988 88511254 85853613 83898332 82324353 81170288
3365 81170288 79755496 78688574 77850191 77215736 77246131 76937864 76670205 76636418 76836721
3356 76836721 77303294 77653054 78032949 78643258 79118788 79981771 80674212 82014812 83831960
3347 83831960 85591177 87618381 89534044 91688117 94126503 96161107 98706275 101418712
3339 101418712 104297864 107780381 111148693 115233942 119880664 124474344 129227187 134754564
3331 134754564 140450892 147154433 154568804 161799602 170080477 179408535 189559899 200597894
3323 200597894 213021531 226588378 241573498 257778375 274325833 289890680 304001589
3316 304001589 314792019 320515923 321130328 316710367 308765288 299643329 290898566 283334113
3308 283334113 277659525 274081888 273159751 273739726 276085554 280003954 285318827 291496675
3300 291496675 299055817 307651884 317062958 328568754 340383237 352022458 362248276
3293 362248276 369008436 370819726 366608017 356171530 340567741 320844684 298465993
3286 298465993 275761729 254559993 235718541 220069255 207684309 197548196 189611596
3279 189611596 182482098 175966000 169230745 161907192 154530586 147254182 140266818 133384527
3271 133384527 127126967 121254283 116464436 111900838 107632830 103659723 100278162 96617257
3263 96617257 93729198 90877692 88245525 86100649 83701637 81523258 79517087 77571547
3255 77571547 75724362 73852592 72692466 70926086 69393369 68369985 67305518 66328658
3247 66328658 65554749 64602944 63709915 63014024 62608433 62139389 61927563 61611170 61432733
3238 61432733 61173545 60745860 60492556 60031303 60059966 60118688 60222459 60077149 59775124 59556875
3228 59556875 59276797 59039639 58845767 59028844 59438958 59696973 60021072 60845999 62006460
3219 62006460 62874968 64022791 65111923 66108579 67316263 68619593 69247374 69776581 69981375
3210 69981375 69793334 69590925 69078465 68442213 68049271 67398638 67031263 66366611 65493504
3201 65493504 64422915 62627198 60298694 58699719 56919201 55336586 53768646 52144096
3193 52144096 50843821 49973136 48971808 48185465 47315002 46387240 45918421 45282848 44568087
3184 44568087 44262270 43833050 43552290 43161045 42512925 41522096 41163774 40310848 39660652
3175 39660652 39112886 38312682 37803812 37102260 36717288 36264703 35760439 35211206 34816529
3166 34816529 34632334 34617232 34884524 34728648 34666656 34399228 33951176 33865002 33847382 33742863
3156 33742863 33619927 33648965 33609037 33488753 32972745 32647487 32502997 32067868 31799039 31283655
3146 31283655 30958707 30939575 30842982 30787568 30471899 30031067 30038526 29647474 29114346 28757647
3136 28757647 28170488 27684914 27434963 26944273 26716876 26195903 25299403 24998765 24780267
3127 24780267 24556675 24495174 24572403 24460029 24081576 23756067 23987142 24088432 23452453 23684231
3117 23684231 23759721 23314596 23237860 23089438 22618295 22501814 22301309 21861702 21933877 21770158
3107 21770158 21932171 22208207 22392858 22103820 22282143 22122065 22309919 22211199 22032089 22143280
3097 22143280 22078940 21657856 21675803 21478953 21255407 21277409 20969820 21159824 21480608 21495210
3087 21495210 21646497 21485110 21534805 20897012 21045121 20729937 20711773 20409856 20634373 21022682
3077 21022682 20760093 21043143 20844562 21201176 21510204 21499420 21761883 21784302 22250239 22752432
3067 22752432 22797344 22740245 22927562 22739917 22899895 23305849 24112281 24306119 24240066 24511247
3057 24511247 25283569 25605045 26118288 26525354 26886600 27379773 27552500 28261542 28666909
3048 28666909 29323412 29554905 30039921 30242305 30933973 31163776 31897766 32476049 32670450
3039 32670450 33453140 34197063 34739199 35432137 35962351 36078951 36333179 36930349 37427552
3030 37427552 38147294 38893527 39381590 39883967 40612136 41337680 42197346 43022365 44097896
3021 44097896 45104703 46317392 46802333 47365779 48008233 48340765 48793326 49166478 49577797
3012 49577797 50277651 51184933 52442209 53501894 54312915 55241701 56227074 56958208 57270020
3003 57270020 57393366 57550357 57916279 58095032 58268645 58740998 59346170 59973965 60490373
2994 60490373 61206519 62178440 63223659 63926966 64531471 64702515 64945729 64836719 64602564
2985 64602564 63945827 63558644 63995196 63940384 64024121 64538486 64805222 65521867 65739068 66085360
2975 66085360 66521010 66702822 66865924 66743172 66709099 66900221 67158012 67454043 68079270 68305627
2965 68305627 69015564 69976532 71142646 71978485 73249899 74376992 75319632 76105409 77138605
2956 77138605 78062689 79185280 80462670 82033905 83789241 85696306 87651736 89489809
2948 89489809 91139549 93019239 95750010 97902070 99997568 102325594 104692800 107159793
2940 107159793 109125349 111276437 113775318 116200677 118605839 121554628 124511861 127219516
2932 127219516 130165896 133104119 135528823 137700829 140108900 142226794 144489067 146405308
2924 146405308 147954523 149848250 151729038 152879760 154567357 155877963 157021117 158004733
2916 158004733 158979479 159496542 160126760 160479949 160297804 159675038 158337711 157693069 156656136
2907 156656136 155216902 154310390 152830685 151493389 150282998 148270850 145999879 143924050
2899 143924050 141695311 139199208 136941528 134299114 131316242 128306165 125072335 121911774
2891 121911774 118654413 115644632 112396051 109403037 106819374 103595368 100702629 97968266
2883 97968266 95282747 92064187 88827642 86511460 83676811 80528384 77662560 75107511
2875 75107511 72580992 69995290 67445586 65204726 63302513 61073097 59465940 57518481
2867 57518481 55276438 53472904 52115793 50254325 48939811 47526693 46141564 44256427
2859 44256427 42925053 41828496 40972039 40030779 39368875 38683713 38124913 37288247 36526395
2850 36526395 35694521 34890339 34536873 33923634 33401604 33657762 33383026 33081236 32859737
2841 32859737 32377433 32435945 32152726 31362580 31401740 31532875 31359654 31379428 31445642 31198367
2831 31198367 31157003 31251785 31251776 31410342 31683791 31557959 31269117 31309158 30943905 30785320 30919516
2820 30919516 30838779 30207704 30308776 30293394 30717654 30725589 30452576 29992765 30079822 29839401
2810 29839401 29593503 29228532 29193372 28809048 28463263 28144348 27692146 27404895 27356237 26802231
2800 26802231 26190473 26266989 26233244 25862885 25807117 25460525 25116881 24881430 24438292 23640986
2790 23640986 23295809 23251933 23153044 22967295 22645882 22371090 22146295 21987467 21719706 21451007
2780 21451007 21199472 21090551 20693463 20325435 19977496 19496439 19364965 19146048 18518057
2771 18518057 18496347 18628282 18556729 18680239 18325645 18410141 18401326 18075102 17711573 17412646
2761 17412646 17364793 17324430 16936423 16449175 16518162 16212652 16513804 16653480 16536490 16492443
2751 16492443 16422789 16123122 16343865 16505763 16201313 16197982 16073850 15678219 15602260 15636391
2741 15636391 15719473 15699638 15862477 15758219 15864011 15977271 15740009 15736858 15859004 15616182
2731 15616182 15667590 15485132 15475118 15290005 15013734 15288473 15424868 15619326 15983660 15745782
2721 15745782 15666953 15967259 15970991 16193053 16279319 16121283 16014642 15904035 16078053 16220759
2711 16220759 15911308 16314403 16211812 16513226 16673003 16545993 16758875 17371202 16985878
2702 16985878 17027066 17680546 17301291 17366582 17094682 17176468 17260393 17075673 17353113 17264454
2692 17264454 17384228 17932767 18368840 18338672 18352337 18665651 18833451 18914255 18594096 18512554
2682 18512554 18745631 18547894 18247689 18429706 18906940 19027028 19071387 19120786 18920266 19457678
2672 19457678 19837901 19938654 20324559 20458394 20387575 20978141 21055825 21045114 21568993 21754634
2662 21754634 21899911 22132932 22477418 22468505 22771462 23272072 23022226 23192396 23523826 23587378
2652 23587378 23757229 24083279 24714513 25195888 25445922 25964088 26468284 26252312 26915259
2643 26915259 27412998 27280905 27877570 28546100 28870368 29441941 29581585 29900401 30259105
2634 30259105 30738661 31266612 31874055 32599784 33144864 33606782 34043951 35015854 35358810
2625 35358810 36008202 36516949 37087000 38204246 39052062 39522923 40309269 41148714 42084395
2616 42084395 43014314 44119111 44996178 45815211 46790727 48278717 49455622 50604756 51972396
2607 51972396 53314087 54694464 56091784 57469331 58705068 60374324 61959143 63445628
2599 63445628 65309201 67026477 68363251 70221720 71772312 73597777 75441064 77328235
2591 77328235 79210056 81331860 83059669 84740797 86522517 88015104 89807409 91447866
2583 91447866 93217281 94861774 96385924 97788084 99190865 100966449 102621118 104025299
2575 104025299 105113541 106571717 107759149 108889917 110021363 110816147 111765039 112685498
2567 112685498 113729950 114677857 115692493 117066308 118093168 119393968 120585856 121956233
2559 121956233 123456740 124718295 126203013 128032194 129789815 131648645 133857674 136181287
2551 136181287 138451215 140812896 143402573 146144970 149512778 153086840 156583093 160592616
2543 160592616 165255212 169393148 173892303 178618209 183296568 188078703 193183873 198431480
2535 198431480 203369496 208415155 214025513 219145027 223975755 229143227 234029973 238654589
2527 238654589 243174407 247406019 251782182 256265595 259846175 263512626 267209143 270306298
2519 270306298 273320191 275885538 278327081 280915653 283058654 284712029 286344444 287730143
2511 287730143 289397784 290209799 290642112 291677371 292419285 293189496 294164568 294765644 295428402
2502 295428402 296478742 297025884 297582074 298150121 298606981 298948993 299234308 299003137 298710932
2493 298710932 298759551 298731186 298752828 298537585 298428135 298479346 298303339 297889429 297968787 297268355
2483 297268355 296659210 296140631 295126910 294171859 292937495 291269157 289662445 288165406
2475 288165406 286632071 285514963 284313756 283166637 282193906 281630852 281251847 281033462 281100177
2466 281100177 281413326 281904107 282885821 284409749 286164294 288404481 290798573 294023907
2458 294023907 297787211 301990952 306219108 311297026 316724331 322226914 328750832 334587728
2450 334587728 341154520 347273423 353308170 359273991 364928636 369711767 374394148 378211484
2442 378211484 381467297 384077008 385650462 386806642 387376883 386805845 385308481 383613787
2434 383613787 380520301 377251571 373267696 368024453 362757670 356884987 350180348 342998510
2426 342998510 335279861 326843791 318800106 310105878 301045015 291988193 282850254 273946999
2418 273946999 264749039 255840184 247584884 239326103 231209571 223842131 215970633 208646893
2410 208646893 201495103 194821542 188481609 182745785 176662168 171083880 165886270 160397352
2402 160397352 155476448 151190992 147405677 143176986 139613443 136577359 133415738 130762990
2394 130762990 128099533 125413534 123021435 121230067 118935338 116746982 114858337 113007753
2386 113007753 111322604 109467414 107610719 106204831 104917141 103263507 101643151 100020291
2378 100020291 98627745 96989061 95629475 93992085 92492593 90990295 89969492 88566531
2370 88566531 87001810 86012374 84538409 83475862 82131138 80622991 78850275 77688768
2362 77688768 76310960 75104475 74067093 72840750 71692648 71032379 70293647 69327129 68522944
2353 68522944 67654867 67082409 65853021 65294886 64814339 64776679 64405486 64306056 64359848 64423680
2343 64423680 64486966 64529229 65323153 65914150 66577127 67177778 68067278 69077279 70198466
2334 70198466 71419312 72932017 74356277 76124168 78322562 80275938 82370967 84615813
2326 84615813 87330806 89622240 92177470 94690007 96844210 98768382 100573769 102490470
2318 102490470 104049551 105616774 106422240 107089611 107251442 107045480 107141873 106758040 106442599
2309 106442599 106102279 105216882 104665225 103975060 102682318 101524615 100472796 98906253 96977031
2300 96977031 95418245 93306728 91118239 88536857 85993183 83432668 81019794 78426455
2292 78426455 75810916 73962117 71828851 69922539 68070614 66896951 65246852 63997304
2284 63997304 63140215 62406714 61584473 61211917 61296340 61455701 61530365 61871502 61888611 62294436
2274 62294436 62807912 63081261 63525568 64033117 64773726 65091421 65667008 66527349 66614312 67035427
2264 67035427 67655090 67830878 67974058 68112330 67991184 68106576 68577179 68703590 68821593
2255 68821593 69094864 69351116 69533513 69622602 69299699 69248088 68761221 68092366 67421123 66458272
2245 66458272 65680360 65242887 65163887 64492313 64407894 64223750 64057824 64182875 64437626 64471977
2235 64471977 64073677 64613524 64862712 65591684 66129425 67121319 67526557 68058372 68815756
2226 68815756 69818253 71090781 72566966 73636449 75468732 77654680 79842053 82143845
2218 82143845 84623202 86641844 88367323 90219239 91442405 92194322 93188277 94429095
2210 94429095 95611804 96728997 98671226 100801828 103427898 105836429 108853520 111946351
2202 111946351 115280216 119130588 123423568 127716252 132247397 137156981 142278928 148169363
2194 148169363 154215661 160855054 167507209 174407584 180748754 186955061 191792430 196280004
2186 196280004 199500975 201650888 203230855 204305147 204782878 205112138 206026053 206652889 208089344
2177 208089344 209726405 211447082 213305809 214686250 215691878 215377191 213934869 210998756
2169 210998756 207907929 202791656 196699389 190355121 183943156 177038764 170184644 163852402
2161 163852402 157957798 152364652 147093291 142340841 137722518 133226971 129304206 125193867
2153 125193867 121096755 117486006 113878570 110302480 107092820 104365231 101757354 99241542
2145 99241542 97544976 96072875 94749358 94370137 93976936 94109538 94672930 95133000 95839026
2136 95839026 97096026 98944269 100905838 102509503 104441034 106449423 108172438 110159910
2128 110159910 112077961 114067384 116677814 118658326 120849838 123384239 126004483 128400767
2120 128400767 130615132 132723941 134260329 135537393 136417811 136819400 136981129 136007824 134479402
2111 134479402 132612753 129594661 126072789 122926419 118989412 115236753 111802410 108356086
2103 108356086 105393571 102741197 100149344 97900122 95505725 93233730 91435973 89235463
2095 89235463 86995277 84958142 82341706 80074765 77577999 74959716 73353794 70971390
2087 70971390 68952466 67576934 66056128 64902408 63520814 62624208 61640927 61158742 61044626
2078 61044626 60757388 60717844 60463710 60839186 60794458 61261408 61560884 62464579 63104283 63402273
2068 63402273 64310182 65597211 66389443 67125727 67872019 68295578 68522461 68821861 69144030
2059 69144030 69036065 69318832 69487012 69374583 69317979 69078037 68986709 68904619 68434536 68487355
2049 68487355 68134375 68210010 68186603 66971869 67041103 66293670 65458061 64600445 63827360 63218260
2039 63218260 62693870 62092979 61786550 61653434 61026066 61160814 61023244 60868262 61058615
2030 61058615 61368968 61820980 62980158 64251843 65850361 67041657 68765991 70755302
2022 70755302 73029860 75050000 77023279 79190790 81198605 82953456 84149394 85218598
2014 85218598 85949665 86586589 86411095 86139207 85935216 84917118 84502477 83752269 83049212
2005 83049212 81949955 81303175 80610458 80313885 79879387 78847256 78251343 77246632 75872657
1996 75872657 74497002 72475561 70428252 68224244 65744978 63357855 61182839 59183393
1988 59183393 56809864 54860048 52931038 50920371 49321897 47716080 46259216 44911439
1980 44911439 43538709 42183215 41109445 39458272 38369398 36997599 35256553 34416328
1972 34416328 33119705 31752399 30416581 29223855 28335228 27039108 25694859 24943532
1964 24943532 24283616 23196523 22905849 22542669 22020885 21770405 20887688 20660257 20176275
1955 20176275 19744364 19286154 18797982 18343169 18378735 18280534 18162004 18225052 18332672 18393972
1945 18393972 18212392 18184371 18384318 18171496 18191516 18119472 17993950 17767734 17629677 17397584
1935 17397584 16918747 16887518 16883081 16588540 16276870 16184114 15942912 15489748 15298397 15006347
1925 15006347 14783610 14806071 14696414 14359998 14318486 14034947 13909996 13819042 13307127 12880651
1915 12880651 13112851 12822880 12635897 12622985 12616883 12418995 12238702 12203341 11756255 11713859
1905 11713859 11313817 11398994 11026900 10949731 11082876 10807988 10416723 10297227 10443347 10400864
1895 10400864 10509389 10451264 10910466 10812566 10520458 10547604 10540050 10620064 10488375 10230900
1885 10230900 10495877 10367723 10435734 10899960 10936711 11026336 11000476 11018347 11021452 10943251 10925054
1874 10925054 11239788 11244980 11344546 11995265 11830118 12112272 12389341 12041062 12202565 12429019
1864 12429019 12429098 12628961 12682724 12710643 13201786 13245582 13416286 13584481 13969576 14330520 15182509
1853 15182509 15050641 15270219 15572673 15322464 15752116 15955372 16136349 16617429 17100034
1844 17100034 17521873 18605725 18663761 19346834 19972283 20454043 20700506 20938957 21258981
1835 21258981 21320447 21674736 22196860 23082768 23411445 23972105 24575370 25235379 26025932 26735271
1825 26735271 27441388 28111427 28639627 29381379 29580945 29750649 30440338 30983501 31392292
1816 31392292 32218740 32924689 33482843 34245765 34400590 35096006 35948482 36441435 37516172
1807 37516172 38298804 39322999 40410658 41372317 42382359 43775759 45139960 46223614
1799 46223614 47790322 49214412 51056458 52974212 54638485 57173172 59369176 61849292
1791 61849292 64444794 67495332 70659997 73722474 77609644 82162671 86978719 92269916
1783 92269916 98040873 104539784 111665874 119642125 127998589 137188613 147161602 157121392
1775 157121392 167032481 176437095 187060020 198703351 212047136 226474059 241799222
1768 241799222 256433056 270653802 283019330 291605382 297518416 300354094 302461135 305753662
1760 305753662 311254643 320392926 333323857 348153607 362852100 374240020 378192474
1753 378192474 371510499 352415875 323197018 290373944 258899986 231405205 209109345
1746 209109345 191429250 176799854 164632055 153075582 142291123 131636202 121034765
1739 121034765 111678880 103608203 96266722 90273733 85201652 80487731 76591553 72799987
1731 72799987 69241411 66198975 63128839 60235897 58072907 55643897 53404475 51225294
1723 51225294 48956370 47352705 45988182 44733329 43276558 41792986 40541296 39313891
1715 39313891 38121715 36872413 35366326 34246865 33409743 32131755 31122025 30040957
1707 30040957 28891236 28446726 27697443 26630684 26139285 25289938 24417421 24034367 23245770
1698 23245770 22446134 22032824 20879310 20431081 19715891 19228937 19052125 18737066 18103285
1689 18103285 17933924 17810317 17198961 16891870 16476728 15773881 15270486 14847199 14515356
1680 14515356 14514173 14175835 13606693 13508840 13134217 13054693 13005965 12892490 12719836 12257584
1670 12257584 11901966 11871894 11661266 11465539 10819921 10486294 10366687 9965877 9974811 9919345
1660 9919345 9816103 9906974 9678646 9274665 9262121 8842919 8469133 8729813 8505321 8453104
1650 8453104 8691753 8233096 7874152 7731167 7347439 7103555 7119032 7280151 7342360 7334870
1640 7334870 7266753 6828955 6579185 6408290 6428421 6055687 5721826 5619284 5722238 5565033
1630 5565033 5531139 5368384 5267321 5507963 5326231 5748686 5602217 5225958 5077393 4830419
1620 4830419 5043118 4628919 4563237 4195666 4149865 4171085 4374376 4389932 4488572 4260327
1610 4260327 4108297 4187398 4065419 3886690 3921206 3952100 3761542 3890606 3530362 3763927
1600 3763927 3504356 3164441 3051367 3369702 3139992 2975841 3038161 2977491 3123259 2951990
1590 2951990 3228078 3044001 2941633 2785228 2686518 2758763 2681767 2626556 2340272 2277900
1580 2277900 2097633 2153039 2406357 2529451 2552495 2601480 2493500 2538882 2568187 2509305 2388256
1569 2388256 2317787 2378697 2002886 1891515 1784239 1932291 1845683 1979312 2223709 2261168
1559 2261168 2168090 1726963 1860258 2045325 2040860 1664358 1757464 2117031 1762993 1462506
1549 1462506 1438892 1259966 1163334 1308066 1246566 1251919 1363383 1674899 1167781 1112915 1176242
1538 1176242 1067331 1032947 1399913 1116300 1540390 1130185 927165 1326267 1144255 1196522
1528 1196522 1031684 788687 968258 1556793 1335458 1260149 838255 1094347 1396158 969679
1518 969679 1033591 1034859 1005512 1018885 1066235 1129340 1173197 1133986 1164713 865690 990012
1507 990012 776317 846625 803109 630867 973298 533265 639355 752799 1281872 1227256
1497 1227256 1311549 1102410 1075840 1112895 853068 773836 316517 435424 579954 694685
1487 694685 861530 1012821 934457 1220507 1179344 852978 944698 797707 1258262 1258035 1153606
1476 1153606 1311569 1554370 939669 1268720 1134991 1233979 1714341 1412451 1438371 1868188
1466 1868188 1907649 1957962 2088194 1763813 1869372 1578749 1710298 2341388 2183395 2195922
1456 2195922 2349503 2405408 2284482 2254406 2095200 2493981 2354435 1953052 2058499 2047274
1446 2047274 1597239 1584424 1500491 947470 972199 899945 792655 940620 1117758 1055972
1436 1055972 1063808 925341 1184252 1132274 652893 453735 322000 594882 464668 457361
1426 457361 437310 181855 45081 199773 96107 -56127 307882 623791 500400 267027
1416 267027 339729 211293 285481 255464 477062 304625 367426 280012 159931 45564 68888
1405 68888 -89122 -129213 -81886 -64167 317226 243665 197050 59736 244772 230915 67331
1394 67331 -209820 -175766 146832 -194719 -31446 -229008 153042 80378 162541 151373 282318
1383 282318 329477 285712 610733 374999 311458 217366 -224699 -191908 -225332 -119422 338563
1372 338563 134796 302080 -123883 -54393 23100 -127061 -34566 -375168 -149965 -165420
1362 -165420 -90543 -340736 -162032 -43080 64699 3138 180242 -148704 -280681 23425
1352 23425 -257508 386353 314542 36682 -2708 -224069 -63153 176777 293851 156189
1342 156189 507029 814408 172168 -352116 -564010 -210665 -16956 -247553 -125971 -92185
1332 -92185 -146595 122496 153134 -18397 -125825 120352 -142971 57772 -360491 -357983 -64044
1321 -64044 -165297 -248246 -291601 -115965 -267344 116914 -226773 -461717 -334437 -335001 -591701
1310 -591701 -267691 -351641 -264113 -177781 -266700 -154273 -142233 -209544 -97908 -224391 -609388
1299 -609388 -363753 -292533 -50753 -199259 -62795 71293 189690 143718 47343 341678
1289 341678 68984 -189320 117325 73011 -239122 -37897 -228953 -275627 -36219 79523
1279 79523 476834 209641 81255 91301 74405 -217977 -26624 -5670 -37638 22875 -152350
1268 -152350 -385482 -446357 -301870 -306627 -16802 -118926 126168 -105245 -327109 -207772
1258 -207772 284195 148160 226226 192122 -183611 235087 271036 154472 82487 162441 -50100
1247 -50100 88792 396042 449858 504209 454691 461817 465543 686661 564031 498070 346429
1236 346429 129421 -162385 -211110 -79061 -7480 367627 990 1039 -218637 -212385 -163130
1225 -163130 -29613 -6647 110121 -272742 159344 172360 -200690 72884 121224 -99317
1215 -99317 -229287 -206908 -347945 -85295 -51303 -90829 -74319 172856 75188 -209373 -116576
1204 -116576 -202091 -46351 51269 167612 -139141 -160183 -257831 32285 43769 -66288 -35163
1193 -35163 33342 -82974 -137446 -99965 -53641 -58149 -33696 245271 -378251 -291125 -215486
1182 -215486 -62321 -15070 -181502 -48198 3100 -43417 -29124 -147180 10299 -66862 -318758
1171 -318758 -381988 73353 -88614 -223392 -233822 -103046 -383602 -174662 -188253 -63293
1161 -63293 126082 70782 -97137 -115003 -206661 -226085 17813 220253 86964 45738 301651
1150 301651 166475 -3266 -1749 -109497 -82501 -75131 -158997 -292957 -214381 178806 108585
1139 108585 173094 171305 -107466 -46726 -113482 -14202 -78228 71669 214516 97615 158626
1128 158626 207625 69542 41716 70868 -172180 -177064 -357569 -640 119586 97470 129621
1117 129621 -269341 -278818 98231 250499 150469 172024 -50294 52147 26016 -169873
1107 -169873 -175981 -107410 113203 228888 423717 381571 378682 401246 408088 137883 284685
1096 284685 140546 82087 228963 420102 139972 472420 348055 95424 564795 741355
1086 741355 749921 723359 405370 541059 660039 296653 153454 198045 17254 -36022 197255
1075 197255 -18089 144329 377023 294160 440265 764726 745228 939432 534328 506321
1065 506321 931891 737952 794685 810143 712140 568798 790981 851978 852502 1042624 1050661
1054 1050661 1520083 1812518 1393086 1140826 891346 829491 1250100 1042366 1053964 855592
1044 855592 941486 1028378 1338431 1188022 1334896 1290816 1300036 1688533 2027176 2122594 1843748
1033 1843748 1543992 1357906 1567106 1478774 1516706 1376345 1676798 1482501 1672396 2044282
1023 2044282 2171057 2057896 2253660 1983156 2137360 2510152 2079219 2226371 2544690 2392620
1013 2392620 2500291 2562563 2165609 2334111 2665517 2510345 2858686 2985664 3242130 3534476
1003 3534476 3630553 3542942 3777978 3758193 3584092 4150531 4341897 4158397 4361043 4471889
993 4471889 4800291 5077040 5177438 5451662 5696773 6142297 6909032 7412404 7394577 7944266
983 7944266 8282772 8586810 9258223 9774625 10381966 11127405 12455739 13844905 14759724
974 14759724 15903988 17085833 18371447 19989964 21889331 23965309 26266952 29325888
966 29325888 33219478 37508214 42394727 48464480 55953136 64828624 73142025 78884002
958 78884002 84897690 81068328 69557928 57046387 44870617 36847442 31232804 27327156
950 27327156 23978698 21511725 19576890 17679094 16359297 15125667 13839394 13031758
942 13031758 12545456 11974030 11264023 10736967 9904542 9629277 9053057 8502775 7955294 7086724
932 7086724 6857328 6650125 6004498 5942437 5657403 5256623 5429198 4961883 4905013 5220714
922 5220714 4920074 4793057 4905312 4350496 4295868 3805590 3403559 3501904 2892270 2404074
912 2404074 2444201 2667213 2566063 2392096 2448897 2658412 2580904 2644877 2362326 2009656
902 2009656 1931736 1934536 1654884 1729867 1570691 1666535 1566953 1493682 1752209 1699794 1694797
891 1694797 1796291 1548635 1863620 1970170 1803340 1332200 1192127 1015031 1151405 1169794
881 1169794 1043444 1195924 1437687 1513048 1475843 1514292 1149575 1216862 966564 870122 833277
870 833277 957965 1152517 839722 519952 403584 506758 670881 569560 554249 599299
860 599299 903586 681864 689022 842146 694276 590592 713271 439904 446581 767072 188895
849 188895 256818 445706 439394 578503 430614 620844 464571 303688 387023 382424 423518
838 423518 450820 424710 523037 486165 390964 606464 1143222 543339 471596 323493 385765
827 385765 620894 412457 283028 472510 459363 411465 511152 250628 94027 47670 231979
816 231979 144447 -463526 -96854 462933 574162 529674 231374 235101 327170 205050 207415
805 207415 321455 94859 -2768 -86924 -361323 -99363 -170279 -300338 -196918 -286250 27049
794 27049 408744 305677 661447 743344 189109 252197 139883 -200485 -45776 101543
784 101543 -64717 52245 8723 13281 -380 76171 -12630 117923 449064 803797 538201
773 538201 -49222 -69055 -164235 -322317 249071 64701 222582 370696 -9863 -194990
763 -194990 93374 78500 416611 189935 158402 184837 205116 304061 31418 -247478 -186378
752 -186378 -312201 -275050 -137644 -434146 -9012 253207 372977 213430 232496 -154661
742 -154661 -189237 211902 113539 137217 -190955 -198880 -222861 -194998 -27989 172952 -157454
731 -157454 -116300 135987 46280 199211 89933 10191 24780 -99721 -256217 -148187 -344557
720 -344557 -145082 -181117 -205341 -73104 200323 83678 95534 -21137 -347334 27861
710 27861 -222617 -321893 -187841 -76483 -2875 -251924 -513802 -189287 -241917 -258228 281487
699 281487 91954 99857 221043 -70439 -41552 93795 -77041 55667 -51287 100051
689 100051 114971 -156674 -113171 254768 75532 279994 348803 -117101 46119 -76749
679 -76749 66096 567194 305085 124510 395864 51268 61150 273893 -18314 313739
669 313739 73147 -322979 -176919 -294900 103220 283501 54295 -59305 -183842 -296978
659 -296978 -254199 -260793 -167198 147339 -78396 -168249 17588 44121 173306 131144 138853
648 138853 -146121 -33892 -275407 -548287 -127811 -197556 49435 -209382 -82941 -24570
638 -24570 -157466 -86791 -82361 -380517 -120907 108272 4610 46252 -61892 -163555 53055
627 53055 -314950 -289822 -176089 -376909 -262163 -534063 -238171 -12184 -357275 -252427
617 -252427 -77556 -363693 -184902 151168 -339005 -395340 -154370 -267059 129032 -115937
607 -115937 -102382 -60246 -109589 87459 -59703 -98062 -63937 32363 -315342 -255071 -234261
596 -234261 -71779 -62023 -211149 -47567 -9837 89672 -97961 -27195 -11453 52278 -21711
585 -21711 -419635 -482951 -405259 -523321 -609130 -549756 -449994 -442228 -426344 -520057 -534855 -244032
573 -244032 -63531 -966 -230841 52497 97130 248583 211948 47847 406047 -295901
563 -295901 -398297 -237809 -226384 -42631 131530 -122649 -103785 -247286 -499152 -242578
553 -242578 -57859 -155064 -47432 -269979 -36654 -1349 -319063 -390540 -517487 -444283 -155158
542 -155158 -135742 -58656 532366 391958 -17568 -65711 -254289 -37619 -577801 -307255
532 -307255 -227226 -224814 -222308 -472129 -477396 -155228 -52632 -208708 -34699 98291 287369
521 287369 375694 84613 -507867 -746250 -937883 -741490 -715057 -374975 -123379 164799
511 164799 535448 359631 165571 129679 101118 -212973 -14055 73695 -24 93877 -213575
500 -213575 -312488 -416182 -527266 -715049 -229887 6790 188683 411365 177566 471236
490 471236 571591 120288 85937 139711 -258028 -291063 -303600 -440685 -132115 -329862 -85908
479 -85908 124374 -425987 -52479 245376 278511 382486 245422 -160222 -186655 -265627 -776148
468 -776148 -434844 -545840 -413127 -250416 -206588 508651 780749 403197 17271 -97033
458 -97033 -71087 -98981 -272484 -381310 -116897 -290808 -338752 -250250 -108288 -69383 97652
447 97652 65960 -155965 -481855 -504468 -393457 -116639 40758 -103447 -39461 156153 -31299
436 -31299 -127440 21395 -241557 -92965 -223827 -422989 -50689 -80460 8842 -3818 -63058
425 -63058 -251814 -53398 -308750 -252597 38433 -61917 8862 135649 -95457 -54098 64138
414 64138 -221930 42698 -70958 124971 379810 99417 -301615 -108865 -251104 7496
404 7496 -23973 -360558 -285481 -28378 209497 73865 141071 -185226 -199091 -762639 -835566
393 -835566 -644301 -473306 -496220 -521608 -176543 -113616 249038 303358 407647 63103 -186609
382 -186609 -388185 -433009 -482678 -364467 -358823 -307939 -183586 -323071 -289891 153100 98668
371 98668 -60388 -125020 -156610 -55551 -108787 -201841 -246791 -307062 87841 -200234 -516348
360 -516348 -307403 -184000 -126780 28178 -59202 41594 98236 -61136 -141139 -220958 -39631
349 -39631 -282280 -392499 -125179 5068 -130723 -226782 -293667 -208527 -226106 -313397 -119966
338 -119966 -226385 -214482 -110357 -84808 199025 -297109 -524016 -513770 -605313 -442986 -428784
327 -428784 -499728 -127999 307626 -48022 -444714 -479634 -443226 -366813 -214685 -131541 -92908
316 -92908 238014 103569 -202853 -98682 -204288 -157379 98583 -114393 -393064 -245232
306 -245232 -401772 -575612 -390959 -484549 -294618 -157969 -243838 -57278 60196 -206353
296 -206353 -107764 -167580 -355139 54094 -396511 -419689 -300223 -355037 -384446 -93975 288060
285 288060 91447 71139 138234 67450 -94903 -283475 -287595 -228181 -324259 -349643 -369468
274 -369468 -282579 -208525 -221416 -131561 -222639 -87354 -73287 -96139 -108589 75526 -297022
263 -297022 29458 -289608 -557898 -507042 -663677 -288455 -363394 -705950 -507470 -254619
253 -254619 -515117 -7433 -81544 -151674 -213348 -240761 -292232 -427263 -347361 -97617 -224970
242 -224970 -384042 -403366 -516173 -576808 -351226 -283884 -101069 52145 -233666 -228721 -46056
231 -46056 -71254 -74854 -141448 -224285 -418142 -462795 -607384 -583593 -312279 6809 160041
220 160041 41985 -309680 -90855 96159 -25962 -296070 -349276 -389454 -555462 -574597
210 -574597 -583659 -574182 -395451 -73142 -50187 -308971 -363225 -375290 -63217 -266504 51718
199 51718 187505 -363632 -348592 -202560 -449833 -169204 -190423 -388001 -53650 -300574
189 -300574 -68745 4299 -291666 20069 -166486 -334324 -462018 -778353 -691791 -475233
179 -475233 -525151 -320391 -205845 -147491 -215847 -444431 -244766 -472187 -560745 -430252 -570070
168 -570070 -772597 -485560 -320702 -106815 -21334 155741 -50746 -170834 -89127 -196337
158 -196337 27034 4624 -76599 21449 -197141 -45796 -193863 -156873 -120 -125716 -613033
147 -613033 -150930 -63802 -64934 58654 -238444 -136941 -33233 -407312 -282258 -364687 -812761
136 -812761 -442856 -253533 -243934 -255664 -385574 -413094 -62610 -194435 -166109 -252437 -472785
125 -472785 -186932 -361331 -657857 -691601 -503189 -352554 -466047 -612225 -365642 -492437
115 -492437 -599920 -394047 -250060 -309293 -288438 -372698 -540936 -419679 -496007 -321340 -268824
104 -268824 -299335 -285425 -299345 -444394 -336116 -312141 -546727 -426555 -260531 -263715 -266553
93 -266553 -385600 -292841 -178118 -537322 -373213 -233741 -348648 -252494 -268704 -357073 -180754
82 -180754 -341701 -367724 16606 -285328 -226109 -270904 -527843 -342606 -454237 -262076 -42084
71 -42084 -441743 -426893 -530112 -716653 -531946 -416247 -422795 -382180 -452653 -318807 -351481
60 -351481 -459397 -384505 -232395 -133728 -151346 -253284 -286470 -279490 -355221 54498 -21951
49 -21951 -105546 -85769 -21171 -210643 -467597 -451909 -458658 -391753 -413548 -378321 -258212 -395926
37 -395926 -245360 -55758 -139409 -205822 -184242 -284349 -411092 -359420 -532138 -543777 -490950
26 -490950 -499034 -512866 -608630 -482165 -183176 -232693 -252928 -215713 -188736 -184251 -301331 -449149
14 -449149 -283820 -271206 -397212 -457670 -486468 -373899 -559272 -681138 -742789 -517868 -148074
3 -148074 -183371 -256088 -272688
0 -272688
$$ Imaginary data points
##PAGE= N=2
##DATA TABLE= (X++(I..I)), XYDATA
16383 -10198334 -10141333 -10112864 -9859986 -9745155 -9558304 -9420512 -9509992 -9019911 -8757333 -8763988
16373 -8763988 -8647362 -8487880 -8368457 -8469609 -8296353 -8298407 -8371531 -8017447 -8151599 -7850627
16363 -7850627 -7729816 -7721101 -7331420 -7003577 -7154041 -7082763 -6906013 -6916268 -6610476 -6709516
16353 -6709516 -6740463 -6572091 -6796634 -6595597 -6194407 -6211004 -6008146 -6027804 -6227664 -5783745
16343 -5783745 -5547761 -5391107 -5112689 -5067054 -4979784 -5048780 -5265277 -5220481 -5286411 -5019510
16333 -5019510 -4639508 -4526904 -4394124 -4289723 -4151193 -4046379 -3694562 -3517409 -3458350 -3412471
16323 -3412471 -3633666 -3508190 -3732987 -3458836 -3391490 -3226256 -3368157 -3314181 -3146132 -2986107
16313 -2986107 -2737318 -2695188 -2363907 -2056935 -1956848 -1936745 -2254420 -2255027 -2046359 -1927427
16303 -1927427 -1724729 -1567790 -1580971 -1589072 -1507539 -1517509 -1289213 -1015408 -807664 -527585
16293 -527585 -927167 -617934 -441406 -494979 -367822 -644979 -671800 -550392 -523719 -530263
16283 -530263 5713 -56293 231054 368357 348946 599504 458497 639667 799115 665469
16273 665469 689628 1091881 1043029 982474 1178693 1207572 1508614 1548959 1444037 1797852
16263 1797852 1690328 1865927 2109396 1640711 1728145 1752639 1781450 1818950 2137672 2231548
16253 2231548 2196130 2274771 2350080 2498100 2701918 2495221 2366778 2382185 2221524 2363507
16243 2363507 2601521 2693014 3051230 2794149 2967901 2943623 3161373 3233921 3205367 3211139
16233 3211139 3454219 3498182 3491553 3349549 3621893 3639387 3419923 3655268 3825563 3465479
16223 3465479 3999209 3957154 3322609 3581023 3227591 3540454 3816996 3765777 4040795 4280482
16213 4280482 4531124 4651001 4467408 4270141 4719822 4759357 4686706 4694712 4335253 4215323
16203 4215323 4555810 4485389 4519248 4757017 4844468 5016358 5209070 5263924 5352182 5337585
16193 5337585 4924289 5234989 4879201 4991600 4762276 4717776 4597748 5108767 5343076 5489041
16183 5489041 5855303 5811666 5895467 5925720 5730774 5799563 5564864 5428297 5340843 5365132
16173 5365132 5306357 5253947 5161428 5377959 5702047 6059895 6246441 6196716 6627763 6570336
16163 6570336 6051441 6238528 6149754 5750080 5577135 5482715 5663032 5796145 5477536 5487856
16153 5487856 5754875 6005573 6465788 6373584 6659444 7196736 7054434 6725666 6334100 6001616
16143 6001616 5819188 5803152 5778511 5777052 6057857 5948936 6531194 6718721 6891411 6848704
16133 6848704 6804970 6848684 6602166 6428839 6370672 6200068 6158193 6443029 6212559 6031213
16123 6031213 6549872 6713924 6837033 6760766 7053559 7178031 6956510 6736770 6475658 6614800
16113 6614800 6414625 6297570 6319725 6562933 6843310 6729442 6964399 7085750 7008963 7326441
16103 7326441 7349297 6996288 7141208 6998001 6767887 7113864 7162240 6652936 6743826 6548526
16093 6548526 6689312 7043944 6838116 6775182 6739168 7074056 7285433 6996515 6803323 6925807
16083 6925807 6892145 6658876 6625022 6873810 6932829 7221206 7050216 7123636 7099977 7226720
16073 7226720 7105958 7234490 7253316 7034598 7031717 6871918 6566138 6729499 6871916 6913979
16063 6913979 6915597 6922756 6993783 7129097 7162113 7216558 7182070 7410890 7375760 7153399 7121432
16052 7121432 7110778 7435087 7369440 7143500 6960315 6677853 6680859 6950097 7003358 7027203
16042 7027203 7069867 7174280 7107681 7143483 7425243 7734406 7370973 6926763 6847439 6814140
16032 6814140 7027186 6937332 7133900 7208668 7205854 7207935 7206034 7502897 7025891 7447805 7769725
16021 7769725 7550864 7304299 7141993 7199972 7274457 7023627 6803770 7050151 6590890 6806821
16011 6806821 7384188 7383864 7824736 7593400 7261238 7446858 7348420 7110647 7211005 6960120
16001 6960120 7039899 7121670 6930910 6840651 7144111 6720776 7022977 7090731 7435253 7425042
15991 7425042 7530534 7443547 7164921 7343488 6891386 6904673 6611213 6679035 7005208 7472553
15981 7472553 7572237 7057895 7336948 7603219 7513595 7067786 7097687 7173269 7347859 7118998
15971 7118998 6850455 7021906 6938077 7301006 7348763 7547102 7552876 7445342 7319958 7707508
15961 7707508 7563902 7190604 6924776 7120952 6828750 7003008 6751237 6876026 7198925
15952 7198925 7098317 7277428 7281223 7133479 7345103 7481692 7057970 7318093 7370932 7044054
15942 7044054 7049561 7009487 7039203 6895528 6610510 6604041 7151584 7246851 7234518 7202401 7122969
15931 7122969 6859872 6989279 6900841 6843133 6813789 6843815 6855909 6910858 7198142 6985318
15921 6985318 7343434 7393357 7240969 7211331 7488391 7547713 7449283 7552226 7149375 7169117
15911 7169117 7043645 7185765 7313294 7264199 7324836 7649496 7634904 7682808 7689877 7304867
15901 7304867 7316138 7423260 7307557 7089134 7163882 7183565 7232594 7077343 7118987 7203821
15891 7203821 7227970 7159701 7420432 7381093 7292697 7299863 7268327 7266607 6946485 6979872 6940197
15880 6940197 6876888 7164395 7032827 7386443 7357671 7390942 7371134 7398833 7118712 7083856
15870 7083856 6901500 7053056 7198481 7274968 7252827 7198869 7119595 6989206 6942164 6876227
15860 6876227 7139767 7082462 7428521 7370533 7267265 7159420 7072364 7009685 7251297 7337815
15850 7337815 7464585 7617242 7699250 7649578 7251418 7045861 6832924 7168905 7306569 7162464
15840 7162464 7146159 7303537 7395751 7365284 7403696 7215537 7258236 7346840 7133519 7033808 6992455
15829 6992455 7288233 7296255 7136813 7060862 7029604 6773304 6676667 6690783 6925447 7075053
15819 7075053 7555964 7501724 7366271 7344881 7089676 7377317 7282069 7206182 7376255 7361078
15809 7361078 6968702 7126667 7243279 7350710 7395652 7173361 7123482 7361913 7206544 7525817
15799 7525817 7662999 7491531 7503313 7145823 7186104 7322213 7328929 7330358 7485989 7550051 7347125
15788 7347125 7370367 7251556 7328745 7715459 7790345 7671598 7489366 7448821 7423666 7319634
15778 7319634 7274687 7117108 6913207 6595812 6807230 7212573 7440706 7565461 7617925 7530243
15768 7530243 7276515 7244466 7340194 7044847 6883528 7163112 7126020 7174930 7423539 7176441
15758 7176441 7157109 6957134 7451891 7595958 7557598 7836018 7657479 7428287 7847995 7712353
15748 7712353 7055635 7046863 6844312 6960878 7260973 7239301 7445364 7835565 7564871 7577024
15738 7577024 7512336 7173279 7497377 7450086 7371186 7265378 7324457 7507135 7305006 7082590
15728 7082590 7033238 6862442 7023551 7437079 7542012 7523185 7440082 7539783 7393049 7171584
15718 7171584 7189211 6973380 6894279 6896440 6989968 7312871 7516117 7313292 7232514 7609250
15708 7609250 7890656 7611284 7493393 7513190 7094711 7314235 7615243 7344994 7085598 7049234
15698 7049234 6639266 7120534 7272404 7546907 7890669 8014744 8008366 7859081 7438826 7473926
15688 7473926 7472098 7237656 7444396 7393925 7260742 7512187 7022800 6977969 7476976 7635249
15678 7635249 7627829 7617849 7500774 7650128 7912227 7731054 7644802 7473869 7164804 7258506
15668 7258506 7259520 7094305 6974151 7143364 7566634 7756192 7826565 7421717 7445928 7397174
15658 7397174 7504708 7560126 7517376 7599473 7506494 7236936 7289784 7446493 7504115 7551143 7494700
15647 7494700 7536972 7754257 7716931 7821278 7584926 7262514 7456596 7336031 7148752 7279635
15637 7279635 7415318 7441739 7473998 7229712 7367515 7244334 6954028 7253250 7088382 7194430
15627 7194430 7430132 7256708 7033999 7437192 7343872 7328344 7305146 7251252 7491037 7538998
15617 7538998 7459176 7446166 7451330 7657775 7457425 7089429 7211341 7329298 7438102 7498191
15607 7498191 7363378 7376305 7379310 7521974 7555633 7518968 7256047 7050688 7516178 7417054
15597 7417054 7772448 7498707 7198806 7330706 7337389 7331958 7354553 7349527 7621459 7803497 7294985
15586 7294985 7338313 7478993 6983049 7182753 6928393 7001528 7551340 7388076 7323990 7674816
15576 7674816 7810160 7690227 7895965 7700325 7872433 7787544 7614246 7783323 7479979 7451325
15566 7451325 7382907 7322073 7347309 7489441 7746492 7543238 7444038 7161443 7380267 7442347
15556 7442347 7194238 7228287 7204915 7075794 7047806 7610424 7513228 7617163 7882744 7745960
15546 7745960 7986324 8026947 7610239 7289546 7282064 7359254 7032642 7190553 7305924 7396755
15536 7396755 7398875 7365429 7351795 7139115 7193673 7389996 7596785 7389806 7417507 7526174
15526 7526174 7445945 7557804 7577960 7575991 7568378 7467186 7363962 7528461 7354230 7304380 7886492
15515 7886492 7256836 7396118 7735925 7877401 7970428 7730809 7615642 7540618 7643595 7525819
15505 7525819 7353912 7687226 7631766 7877940 7917803 7884825 7752705 7788081 7758317 7881868
15495 7881868 7815758 7605008 7643515 7770989 7727457 7281294 7410327 7596002 7513330 7641324
15485 7641324 7641110 7511445 7431398 7566333 7769281 7748015 7914914 7556199 7637716 7712215 7820386
15474 7820386 7781459 7581275 7266144 7266041 7485208 7553938 7451898 7770734 7785234 7505534
15464 7505534 7203236 7767500 7868602 7863392 7735586 7683269 7987530 7735757 7539530 7376149
15454 7376149 7614753 7672462 7437095 7398714 7284304 7295207 7173035 7433931 7511026 7465594
15444 7465594 7802475 7513801 7455393 7410557 7283153 7354133 7287618 7629097 7710718 7703397 7734995
15433 7734995 7345781 7605798 7448315 7266882 7219954 7687864 7495964 7517714 7740244 7815532
15423 7815532 7963709 7691457 7439225 7500730 7443168 7409046 7693373 7778430 7802120 7710496
15413 7710496 7597691 7556317 7480751 7527179 7680486 7555514 7715949 7887784 7624525 7694946
15403 7694946 7816658 7377865 7396834 7515920 7430748 7471212 7544544 7325188 7384393 7337673
15393 7337673 7857825 7665182 7802682 7828611 7817016 7513128 7499080 7777668 7698403 7939922
15383 7939922 7543501 7520765 7335179 7369245 7248928 7505197 7520652 7662617 7683553 7649356
15373 7649356 7837408 7900491 7827971 7601413 7797948 7607832 7528896 7546241 7769705 7778739
15363 7778739 7945650 7890756 7401631 7487518 7670148 7911136 7774646 7515676 7034028 7204253
15353 7204253 7131079 7339907 7176684 6971780 7167187 7479061 7800640 7772740 7951160 7993736
15343 7993736 8161194 7803751 7632706 7508504 7075934 7198011 7106300 6916776 7064938 7431686
15333 7431686 7686248 8053195 8232259 8309672 8063872 8070815 7784472 7661241 7649630 7438260
15323 7438260 7369134 7379992 7603385 7665388 7778855 7489642 7873515 8021747 7855916 7416326
15313 7416326 7592746 7653197 7955726 8053646 7852529 7676433 7376329 7594206 7331156 7413168
15303 7413168 7362350 7476225 7673437 7665876 8060421 7828665 7491150 7564290 7472799 7328826
15293 7328826 7605290 7465019 7139718 7275476 7619872 7564945 7645684 7764944 7739093 7684090
15283 7684090 7670776 7756817 7521081 7516553 7314543 7152521 7041649 7431110 7568345 7213842
15273 7213842 7477564 7638138 7780729 7744849 7686919 7678231 7778684 7533580 7642779 7709457
15263 7709457 7548787 7833628 7668804 7720044 7863479 7733113 7408066 7675847 7773201 8176054
15253 8176054 8221615 7805500 7734663 7751902 7509027 7166209 7232940 7359957 7574684 7560042
15243 7560042 7883999 7756734 7644463 7834894 7948991 7599235 7586407 7686940 7532350 7940844
15233 7940844 8043578 7969822 7367107 7397627 7661270 7758621 7914703 7618787 7625091 7889039
15223 7889039 7769557 7592246 7604652 7489465 7392317 7546661 7550161 7477144 7977926 7879548
15213 7879548 7586917 7898915 7983951 8128353 8138913 8009014 7680189 7881868 7640581 7846851
15203 7846851 7774457 7542173 7650377 7519302 7609207 7759137 7861584 7879395 8068037 7879472
15193 7879472 8243716 8200345 7879053 7453815 7645140 7857481 7778666 7817983 7816982 7803463
15183 7803463 7614102 7533870 7440223 7483168 7768109 8190441 8169298 7898310 8060308 7949556
15173 7949556 7673584 7320791 7479707 7677184 7991077 7671553 7512316 7839817 7740560 7640971
15163 7640971 7873183 7787488 7919855 7898830 7763550 7827659 7873718 7613825 7486799 7851147
15153 7851147 7575137 7562764 7829792 7975701 7969637 7972342 7895709 7950805 8163221 7929304 7777683
15142 7777683 7798372 7867943 8032465 7827778 7852737 7734487 7837475 7577180 7883790 7578453
15132 7578453 7627230 7711156 7844339 8050791 7937901 7866159 8043066 7890981 7809730 7950428
15122 7950428 7803901 7904832 8005462 7815204 7492096 7882778 8079408 7955944 7706470
15113 7706470 7552266 7650018 7873079 7907626 7657110 7618923 8045857 8048867 7905274 7560693
15103 7560693 7427659 7060763 7374688 7870585 8170389 8003625 7724395 7775192 7842771 7846136
15093 7846136 7864751 7816091 7795463 8017737 8444607 8160835 8106146 7904692 7624190 7576575
15083 7576575 7314015 7362588 7760076 8150780 7875416 8032965 8046157 7855416 8012796 7922917
15073 7922917 8083599 8190946 7989072 8049414 8181915 7859338 7550559 7469092 7369585 7722289
15063 7722289 7880456 7946051 7756523 8010994 8031968 7855782 7792981 7861684 8067346 7809853
15053 7809853 7338690 7331275 7593869 7725727 7983529 7964794 8005596 8136369 8180652 8445320
15043 8445320 8544185 8264853 8229968 8402837 7685227 7490666 7393072 7419627 7456393 7480962
15033 7480962 7565749 7622712 7905675 8354294 8377554 8282435 8053757 7943103 8161900 7882303
15023 7882303 8097668 8181331 8014292 7715412 7561857 7496060 7704617 7746745 7784043 8090617
15013 8090617 8244960 8414085 8432077 8379195 8315831 7791478 7689190 7945668 7926204 7727389
15003 7727389 7679696 7759018 7757030 7901306 7950956 8127536 8029828 8206893 8044402 7941635
14993 7941635 8017401 7841369 7917797 8009426 7757662 7661161 7421838 7609960 7887578 7916577
14983 7916577 7920426 8035506 7987838 7901381 7651235 7611756 7810928 7617121 7752093 7874619
14973 7874619 7938571 8049899 7684667 7874814 7981656 7586688 7614982 7654407 7993695 8109412
14963 8109412 8016870 7855705 8149577 7658941 7814940 7905176 7893988 7969742 7954783 8180816
14953 8180816 8130014 7854028 7919933 8083794 8071517 8260095 8317970 8316701 8700707 8068299
14943 8068299 7928305 7845864 7424857 7532630 7224381 7387037 7493834 7752589 7889183 7960996
14933 7960996 8153191 8056811 8058584 7820490 7950073 7816037 7871855 7644006 7476990 7753589
14923 7753589 7816951 7867772 7876015 7962534 8273348 8207750 7854442 7980450 7958160 7874769 7838522
14912 7838522 7914297 8081440 7806614 7527697 7793377 7716729 7788883 7951909 7975444 7911284
14902 7911284 7919840 8141831 8205094 8158256 8140979 7769729 7804365 7756321 7471223 7566566 7799761
14891 7799761 7643891 7863383 7849624 7848552 8535709 8508625 8445646 8415343 8076076 8095249 7904320
14880 7904320 7699399 7709610 7922674 7966290 7877911 8010038 8315560 8174857 8144364 8364972
14870 8364972 8141633 8023939 7948660 7827240 8066168 7753115 7742220 7908495 7805779 7886150
14860 7886150 8009644 8074264 8203818 8353657 8271968 8200567 8339943 8339941 8199157 7711162 7554211
14849 7554211 7614762 7838747 7891090 7667378 7824928 7631528 7888175 7978106 7829015 8088754
14839 8088754 7879615 7512684 7441222 7304636 7539137 7661762 7663400 7622013 8053519 8356554
14829 8356554 8297337 8295306 8249286 8439884 8018027 7771910 7949716 7753453 7900188 7999919
14819 7999919 8221877 8274087 8044435 8117294 8015590 8059596 8185636 8303696 8320701 8280420
14809 8280420 8026719 7808111 7656834 7868507 7828166 7522836 7818993 7818655 7667641 7811914
14799 7811914 8021729 8019990 8274000 8282656 8163623 8248606 8403491 8184179 7653623 7656322 7679220
14788 7679220 7561151 7792166 7699868 8064529 8372333 7993805 8105450 8192482 8067454 8140160
14778 8140160 8077781 7877657 7704199 7549469 7542357 7605904 7614800 7938576 7995398 7970340 8520649
14767 8520649 8190839 8170060 8114414 8045619 8064256 7914550 7724174 7648875 7615988 7815339
14757 7815339 7993417 8055322 8110773 8181550 8198822 8062254 7966396 7754900 7844844 8270148
14747 8270148 8189424 7846971 8089974 8044024 8163306 8116352 7819588 8004458 8072766 8095764
14737 8095764 8012652 7969529 8079911 8225740 8062393 7936692 8045725 8134948 8019423 7877509
14727 7877509 7872474 8093769 8444012 8509034 8303852 7952476 8505529 8518892 8115109 8127832
14717 8127832 8102449 7870872 8154161 7942361 7894770 7994293 7890450 8126685 8299031 8447393
14707 8447393 8487596 8299288 8130565 8248978 8291031 8138236 8082605 7628582 7793519 7862480
14697 7862480 7804522 7943255 8190292 8077435 8073696 8247690 8288619 8210086 8375436 8423460
14687 8423460 8181492 7771905 7687271 8023344 8088121 8400093 8683401 8428074 8730558 8804932
14677 8804932 8330961 8195953 7960436 8125337 8290097 7893543 8046365 8341483 7944828
14668 7944828 8049454 8053630 8113636 7948954 7881085 8102366 8232489 8249326 8137629 7874102
14658 7874102 8011136 7961214 7729736 7757245 8069235 7983359 8118012 8258257 8394134 8571383
14648 8571383 8604190 8151578 8126077 8199137 8162922 8159218 8052568 8072548 8095173 7999722 8027571
14637 8027571 8074220 8025912 7942750 8185335 8288600 8570335 8445518 8304317 8358849 8354316
14627 8354316 8366222 7949390 7847372 7816822 7794907 7729366 8126214 8372657 8396657 8616369
14617 8616369 8658627 8629576 8525482 8004259 8007173 7828166 7906247 7908397 7965478 8151845 8232854
14606 8232854 8233672 8314143 8493839 8529382 8841352 8695625 8415463 8376745 8091791 7755302
14596 7755302 7860712 7797370 7780201 7886996 8266752 8336398 8553729 8335946 8458312 8385796
14586 8385796 8538400 8400376 8280173 8498613 8020282 7953656 7911144 7752522 8025634 8359390
14576 8359390 8437203 8553735 8281362 8145791 8262727 8674045 8475969 8258233 8143556 8166926
14566 8166926 8038986 7918488 8007003 8280087 8079052 8275910 8464292 8406622 8358715 8441544
14556 8441544 8552158 8620748 8569130 8423188 8236286 8196082 8019195 7783885 7685666 7652083
14546 7652083 8007606 8379460 8572939 8435051 8467874 8446454 8430482 8389340 8403675 8408496 7952914
14535 7952914 7859162 7889714 8025563 8418481 8168439 8080923 7670851 8015884 8548621 8831266
14525 8831266 8849811 8446748 8278545 8318842 8392095 8043823 7995090 7941317 8145909 8186413
14515 8186413 8101780 8160846 8002383 8180663 8179944 8061460 8080088 8405352 8297282 8581403
14505 8581403 8391815 7990101 8275922 8267056 8140311 8310058 8362963 8508249 8790538 8630214
14495 8630214 8399162 8580930 8467988 8661827 8705495 8554288 8437491 8170410 8328531 8373987
14485 8373987 8252835 8135461 8121786 7962992 7876971 7959042 7978166 8083378 8333940 8405922
14475 8405922 8214210 7977737 7863213 7941022 7879603 7545979 7863981 8113602 8384276 8368519
14465 8368519 8340385 8169267 8294338 8071653 8128564 8220921 8447368 8519177 8548508 8659797
14455 8659797 8554932 8133654 7943053 7810315 7767339 7878700 7899353 7860298 8112605 7921417
14445 7921417 7879034 8079029 8074882 8111651 8148539 8194628 8357863 8188299 8229041 8386079 8407684
14434 8407684 8249521 8172022 7933213 7987232 8531034 8508924 8422934 8730108 8342932 8154102
14424 8154102 8079001 8123045 8307812 8008423 8276989 8326271 8076429 8172485 8263050 8056854
14414 8056854 8456595 8528311 8296562 8393785 8657798 8302505 8328532 8360960 8373244 8322908
14404 8322908 8332922 8357811 8737797 8513589 8582990 8657610 8085471 8288784 8112469 7985325
14394 7985325 8229921 8098609 8335293 8298390 8269368 8544331 8630364 8721305 8835544 8420583
14384 8420583 8244706 8044084 8241279 8057897 8064566 8070984 8447901 8466251 8445301 8556541
14374 8556541 8502167 8619587 8749251 8733390 8832081 8405600 8014872 7492231 7765024 7903546
14364 7903546 7913046 7933402 8039668 8391316 8937292 8761113 8686464 8556229 8358758 8403615
14354 8403615 8035746 7864673 7829513 8041734 7918090 8112437 8023900 8365340 8422181 8195536
14344 8195536 8387011 8637423 8987721 9101408 8561798 8363060 8291932 8496741 8115790 7908148
14334 7908148 7903325 8184310 8394617 8828640 8796119 8588318 8537072 8590280 8419576 8439394
14324 8439394 8418125 8210138 7972754 8009304 8128901 8160468 8386212 8346817 8547695 8678201
14314 8678201 8678299 8841446 8971527 8943697 8522846 8276126 7901275 8216583 8440406 8427815
14304 8427815 8395919 8422531 8567960 8507392 8303247 8354911 8615515 8497690 8437075 8364983
14294 8364983 8250306 8154423 8117621 8168562 8360186 8401556 8395802 8138013 8584037 8618112 8462503
14283 8462503 8853319 8733877 8419323 8118203 7943818 7713110 8036106 7942423 8090109 8358144
14273 8358144 8639081 8969385 8918217 8697649 8692516 8574542 8263687 8303924 8251494 8248552 8494140
14262 8494140 8717007 8548738 8753503 8780769 8817986 8791791 8624719 8908290 8709283 8439601
14252 8439601 8498772 8645470 8207102 8242665 7948675 8348319 8695678 8751042 8869127 9084904
14242 9084904 8954565 8710264 8541292 8160739 8582739 8322629 8306450 8310550 8390543 8404567
14232 8404567 8253705 8144345 8243074 8406080 8161105 8052923 8282687 8493209 8239424 8320097
14222 8320097 8490528 8359781 8149445 8164211 8298288 8300931 8608490 8605093 8349472 8554044
14212 8554044 8467812 8359360 8416915 8178327 8573335 8293764 8202948 8310194 8280623 8235050
14202 8235050 8483257 8422737 8082624 8531887 8669146 8635267 8775534 8737851 8592882 8587935
14192 8587935 8597830 8090984 8152466 8179652 8520750 8582486 8356024 8439019 8832350 8782748 8484529
14181 8484529 8408492 8482174 8657862 8433229 8411271 8440085 8361519 8441821 8244226 8055119
14171 8055119 8439590 8488851 8760204 8767450 8742770 8808476 8949563 8720978 8467155 8650183
14161 8650183 8399455 8377225 8043855 8142034 8131489 8304110 8788136 8854124 8650602 8451146
14151 8451146 8325032 8310331 8250375 8162605 8163643 8557362 8261272 8520747 8584695 8742796
14141 8742796 8860928 8889817 8798952 8457706 8730415 8662920 8824264 8868064 8494955 8508206
14131 8508206 8497522 8449462 8497814 8404266 8552114 8871613 8604835 8313989 8792437 8504593
14121 8504593 8593115 8668931 8610002 8991615 8807015 8656039 9052489 8829260 8162476 8293760
14111 8293760 8400770 8213271 8402561 8150533 8600674 8825411 8739760 8693929 8594342 8810344
14101 8810344 8508522 8689738 8990225 8463222 8320375 8460343 8697258 8457144 8316747
14092 8316747 8158156 8359872 8526304 8609147 8914520 8426012 8605711 8852129 8817947 8855949
14082 8855949 8993556 8559788 8467023 8557968 8573968 9046322 8700629 8415290 8695646 8861757
14072 8861757 8625935 9060770 8644241 8724278 9013608 8981282 8821874 8804361 8283376 8090561
14062 8090561 8282368 7826151 8266015 8346372 8477363 8790969 8827324 8855052 8985101 8996849
14052 8996849 8977213 9010127 8425440 8485300 8473784 8466670 8383343 8306331 8128081 8304076 8829378
14041 8829378 9011599 9217923 9212630 9203623 9108213 9067532 8754953 8447775 8483328 8480409 8195451
14030 8195451 8667379 8984386 8799700 8907275 8929181 9087259 9084020 9283007 9308280 9079190
14020 9079190 8736081 8736963 8640705 8394514 8348387 8174183 7828133 8171589 8580707 8659698
14010 8659698 9031486 8730070 8805809 8826943 8760294 8946935 8992725 8818251 8564245 8377721
14000 8377721 8438460 8681242 8673736 8330641 8149395 8476105 8908596 8878941 8744797 8813640
13990 8813640 8844608 8801382 9201909 8977684 8638000 8488045 8312087 8235909 8351274 8412208
13980 8412208 8481817 8629770 8559530 8865417 9088370 9039234 8892552 8797385 8876133 8987884
13970 8987884 8757391 8566679 8607028 8451452 8672541 8597290 8763040 9078087 9243241 9149444
13960 9149444 9237216 9213667 9109995 8701509 8453197 8764526 8949208 8774757 8715023 8595220
13950 8595220 8464266 8798227 8848338 8873098 8723276 8482921 8488831 8578250 8618270 8789783
13940 8789783 8897807 8800942 8905479 8690823 8430160 8537711 8477673 8721497 8591189 8474892
13930 8474892 8622322 8382133 8703395 8806343 8609674 9219232 9502673 9164017 9168771 8832349
13920 8832349 8401219 8750824 8871825 8499133 8832725 8593732 8663721 8671906 8525028 8652195
13910 8652195 8813118 8667394 8832383 8990418 8773720 8839336 8651370 8824642 8787182 8645846
13900 8645846 8464761 8615900 8751140 9148970 9273198 8968879 8809081 8679211 8785685
13891 8785685 8865059 8864670 8799216 8986585 8943824 9088910 8956478 8990890 8615723 8696045 8668749
13880 8668749 8676880 8539035 8409969 8858855 8951732 9146822 8950158 8826934 8683364 8678719
$$ [...]
##END NTUPLES=NMR SPECTRUM
##END=
