##TITLE=1H_CA-8854-3-2
 CDCl3, 8 sc, 
 29.06.2021
##JCAMPDX= 6.0         $$ Bruker NMR JCAMP-DX V2.0
##DATA TYPE= NMR SPECTRUM
##DATA CLASS= NTUPLES
##ORIGIN= UXNMR, Bruker Analytische Messtechnik GmbH
##OWNER= root
$$ XWIN-NMR		Version 3.5
$$ Tue Jun 29 10:44:43 2021 Russian Standard Time (UT+4h)  she@DPX200
##.OBSERVE FREQUENCY= 200.131506
##.OBSERVE NUCLEUS= ^1H
##.ACQUISITION MODE= SIMULTANEOUS
##.ACQUISITION SCHEME= undefined
##.AVERAGES= 8
##.DIGITISER RES= 18
##SPECTROMETER/DATA SYSTEM= spect
##.PULSE SEQUENCE= zg30
##.SOLVENT NAME= CDCl3
##.SHIFT REFERENCE= (INTERNAL, CDCl3, 0, 17.5215)
##AUDIT TRAIL= $$ (NUMBER, WHEN, WHO, WHERE, WHAT)
$$ ##TITLE= Audit trail, XWIN-NMR		Version 3.5
$$ ##JCAMPDX= 5.01
$$ ##ORIGIN= Bruker BioSpin GmbH
$$ ##OWNER= she
$$ F:/spectra/data/she/nmr/H-F/1/pdata/1/auditp.txt
$$ ##AUDIT TRAIL=  $$ (NUMBER, WHEN, WHO, WHERE, WHAT)
(   1,<2021-06-29 10:43:23.48 +0400>,<she>,<DPX200>,
      <created by zg, POWCHK disabled, PULCHK disabled
       configuration hash MD5:
       00 E9 B6 7A A2 85 ED C7 34 08 36 98 17 FE 4E 26
       data hash MD5: 16K
       DE 87 5F D3 C7 4F AC 5A A1 BD B5 A4 9D 8F 0A DB>)
(   2,<2021-06-29 10:43:26.01 +0400>,<she>,<DPX200>,
      <Start of raw data processing
       efp BC_mod = 2 LB = 0.24 FT_mod = 6 PKNL = 1 PHC0 = -11925.48 PHC1 = 15.20101 SI = 16K 
       data hash MD5: 16K
       10 02 DB 62 B1 02 E9 79 DF C3 B0 C3 A8 76 E2 4B>)
(   3,<2021-06-29 10:43:52.62 +0400>,<she>,<DPX200>,
      <pk PHC0 = 3.40035 PHC1 = -0.6 
       data hash MD5: 16K
       9B BB F0 30 23 CF 2D C9 A9 45 E1 85 2D 94 82 57>)
(   4,<2021-06-29 10:43:55.53 +0400>,<she>,<DPX200>,
      <abs ABSG = 5 
       data hash MD5: 16K
       5E 4F EF C3 27 8E 92 B1 62 FF 8A 24 AB C4 A3 05>)
$$ ##END=
$$ 
$$ hash MD5
$$ FB 43 0D 18 15 5F A3 3A 45 56 D7 C0 FE 82 DA 54
##$RELAX= 
##$RELAX= 
##$RELAX= 
##$RELAX= 
##$RELAX= 
##$RELAX= 
$$ Bruker specific parameters
$$ --------------------------
##$DU= <F:/spectra>
##$EXPNO= 1
##$NAME= <H-F>
##$PROCNO= 1
##$TYPE= <nmr>
##$USER= <she>
##$AMP= (0..31)
100 100 100 100 100 100 100 100 100 100 100 100 100 100 100 100 100 100 
100 100 100 100 100 100 100 100 100 100 100 100 100 100 
##$AQSEQ= 0
##$AQ_mod= 1
##$AUNM= <au_zg>
##$AUTOPOS= <>
##$BF1= 200.13
##$BF2= 200.13
##$BF3= 200.13
##$BF4= 200.13
##$BF5= 200.13
##$BF6= 200.13
##$BF7= 200.13
##$BF8= 200.13
##$BYTORDA= 1
##$CFDGTYP= 0
##$CFRGTYP= 5
##$CHEMSTR= <none>
##$CNST= (0..31)
1 1 145 1 1 1 1 1 1 1 1 1 1 1 1 1 1 1 1 1 1 1 1 1 1 1 1 1 1 1 1 1 
##$CPDPRG= <>
##$CPDPRG1= <>
##$CPDPRG2= <>
##$CPDPRG3= <>
##$CPDPRG4= <mlev>
##$CPDPRG5= <mlev>
##$CPDPRG6= <mlev>
##$CPDPRG7= <mlev>
##$CPDPRG8= <mlev>
##$CPDPRGB= <>
##$CPDPRGT= <>
##$D= (0..31)
0 1.2 0 0 0 0 0 0 0 0.06 0 0.03 0 0 0 0 0.0002 0 0 0 0 0 0 0 0 0 0 0 0 
0 0 0 
##$DATE= 1624949002
##$DBL= (0..7)
120 120 120 120 120 120 120 120 
##$DBP= (0..7)
150 150 150 150 150 150 150 150 
##$DBP07= 0
##$DBPNAM0= <>
##$DBPNAM1= <>
##$DBPNAM2= <>
##$DBPNAM3= <>
##$DBPNAM4= <>
$$ [...]
##$SUBNAM3= <"">
##$SUBNAM4= <"">
##$SUBNAM5= <"">
##$SUBNAM6= <"">
##$SUBNAM7= <"">
##$SUBNAM8= <"">
##$SUBNAM9= <"">
##$SW= 20.0188882624521
##$SWIBOX= (0..15)
0 0 2 0 0 0 0 0 0 0 0 0 0 0 0 0 
##$SW_h= 4006.41025641026
##$TD= 16384
##$TD0= 1
##$TE= 0
##$TE2= 300
##$TE3= 300
##$TEG= 300
##$TL= (0..7)
0 120 120 120 120 120 120 120 
##$TP= (0..7)
150 150 150 150 150 150 150 150 
##$TP07= 0
##$TPNAME0= <>
##$TPNAME1= <>
##$TPNAME2= <>
##$TPNAME3= <>
##$TPNAME4= <>
##$TPNAME5= <>
##$TPNAME6= <>
##$TPNAME7= <>
##$TPOAL= (0..7)
0.5 0.5 0.5 0.5 0.5 0.5 0.5 0.5 
##$TPOFFS= (0..7)
0 0 0 0 0 0 0 0 
##$TUNHIN= 0
##$TUNHOUT= 0
##$TUNXOUT= 0
##$USERA1= <user>
##$USERA2= <user>
##$USERA3= <user>
##$USERA4= <user>
##$USERA5= <user>
##$V9= 5
##$VALIST= <valist>
##$VCLIST= <CCCCCCCCCCCCCCC>
##$VD= 0
##$VDLIST= <DDDDDDDDDDDDDDD>
##$VPLIST= <PPPPPPPPPPPPPPP>
##$VTLIST= <TTTTTTTTTTTTTTT>
##$WBST= 1024
##$WBSW= 4
##$XGAIN= (0..3)
0 0 0 0 
##$XL= 0
##$YL= 0
##$YMAX_a= 482168
##$YMIN_a= -532315
##$ZGOPTNS= <>
##$ZL1= 120
##$ZL2= 120
##$ZL3= 120
##$ZL4= 120
##$ABSF1= 17.52306
##$ABSF2= -2.495979
##$ABSG= 5
##$ABSL= 3
##$ALPHA= 0
##$AQORDER= 0
##$ASSFAC= 0
##$ASSFACI= 0
##$ASSFACX= 0
##$ASSWID= 0
##$AUNMP= <proc_1d>
##$AZFE= 0.1
##$AZFW= 0.1
##$BCFW= 0
##$BC_mod= 2
##$BYTORDP= 0
##$COROFFS= 0
##$CY= -3
##$DATMOD= 1
##$DC= 0
##$DFILT= <>
##$DTYPP= 0
##$F1P= 0
##$F2P= 0
##$FCOR= 1
##$FTSIZE= 16384
##$FT_mod= 6
##$GAMMA= 0
##$GB= 0
##$INTBC= 1
##$INTSCL= 1.334414e-10
##$ISEN= 128
##$LB= 0.24
##$LEV0= 0
##$LPBIN= 0
##$MAXI= 10000
##$MC2= 0
##$MEAN= 0
##$ME_mod= 0
##$MI= 1.114404
##$NCOEF= 0
##$NC_proc= -5
##$NLEV= 6
##$NOISF1= 3.799351
##$NOISF2= 2.8
##$NSP= 0
##$NTH_PI= 0
##$NZP= 0
##$OFFSET= 17.52155
##$PC= 1
##$PHC0= -11922.08
##$PHC1= 14.60101
##$PH_mod= 1
##$PKNL= yes
##$PPARMOD= 0
##$PSCAL= 0
##$PSIGN= 0
##$REVERSE= no
##$SF= 200.1300026177
##$SI= 16384
##$SIGF1= 3
##$SIGF2= 2
##$SINO= 5.538805
##$SIOLD= 16384
##$SREGLST= <1H.CDCl3>
##$SSB= 0
##$STSI= 16384
##$STSR= 0
##$SW_p= 4006.41025641026
##$SYMM= 0
##$S_DEV= 0
##$TDeff= 16384
##$TDoff= 0
##$TI= <>
##$TILT= no
##$TM1= 0
##$TM2= 0
##$TOPLEV= 0
##$USERP1= <user>
##$USERP2= <user>
##$USERP3= <user>
##$USERP4= <user>
##$USERP5= <user>
##$WDW= 1
##$XDIM= 16384
##$YMAX_p= 327389115
##$YMIN_p= -190457
$$ End of Bruker specific parameters
$$ ---------------------------------
##NTUPLES= NMR SPECTRUM
##VAR_NAME=  FREQUENCY,     SPECTRUM/REAL,   SPECTRUM/IMAG
##SYMBOL=    X,             R,               I
##VAR_TYPE=  INDEPENDENT,   DEPENDENT,       DEPENDENT
##VAR_FORM=  AFFN,          ASDF,            ASDF
##VAR_DIM=   16384,         16384,           16384
##UNITS=     HZ,            ARBITRARY UNITS, ARBITRARY UNITS
##FACTOR=    0.24454680195387, 1,            1
##FIRST=     3506.58769223609, 0,            0
##LAST=      -499.822564174166, 0,           0
##MIN=       -499.822564174166, -190457,     0
##MAX=       3506.58769223609, 327389115,    0
$$ Real data points
##PAGE= N=1
##DATA TABLE= (X++(R..R)), XYDATA
$$ [...]
5701D134146K0912j22940j83095j33745j85598k32590j12793r9293p1104o5927
5691B947973P2970O6471J23024R9963J57166K59355K95261K90565L02492L38165
5681D953405L61027L74033K43639R8198o9084k28629l64622l84764l42298l35928
5671D304977l13059k41933k33214j65260q0643p1854R853L9255K5703J04642Q0149
5660C458616J48596J89405J69210J90516J75613J14286J0752n3574j52093k73497
5650C977830l26327l08447l24705k75939k15925j40337j63531j29578j23057r0856
5640A879128j9244m4594l9118k5858k8192M633K5205K2756k4775l2183j4912k167
5628A700679m7991o8973j16243r5979j21831r4549m2868p9250p5608k7340k3808
$$ plain form
5701 4134146 4155058 4032118 3849023 3715278 3529680 3297090 3184297 3085004 3013900 2947973
5691 2947973 3020943 3087414 3210438 3310401 3467567 3726922 4022183 4312748 4615240 4953405
5681 4953405 5314432 5688465 5932104 6030302 5961218 5732589 5367967 4983203 4640905 4304977
5671 4304977 3991918 3749985 3516771 3351511 3270868 3199014 3208867 3248122 3273825 3378467 3458616
5660 3458616 3607212 3796617 3965827 4156343 4331956 4446242 4456994 4403420 4251327 3977830
5650 3977830 3651503 3343056 3018351 2742412 2526487 2386150 2222619 2093041 1969984 1879128
5640 1879128 1859884 1815290 1776172 1750314 1722122 1726755 1751960 1774716 1749941 1717758 1702846 1700679
5628 1700679 1652688 1583715 1467472 1371493 1249662 1155113 1112245 1032995 957387 930047 906239
5617I06239q0965m6906k845J1165l4284k7211o4586l1141j5120j574k3013k2837
5605E66922q519Q256p0045l5012M1421j8649n015l272O368j4928m9098m5159J2933
5592C86203L1767j5747m001j3356J0323j0186K8496n9578l2115K6781J3186j4694
5580C47079j450n218l8439K661o967M537M5515l7879K6276P744l6383J7782K711
5567C27969O267k508J2368r990l6593q998L50M174M7352j1080m8779l5825K5115
5554B69822k8505J4298N9704j9569M5507m7776k2823k0866j8394j419N1676K4789
5542C06444k1261k0454k1860k0669K5029N7942p41K643k2154N069L1464k8980
5530B92472j0917k4096J0830J4809J0605q995l9373J5464k749n2228j3465L8888
$$ plain form
5617 906239 825274 778368 775523 786688 752404 725193 660607 629466 614346 612772 589759 566922
5605 566922 558403 566659 496614 461602 503023 484374 479359 476087 482455 467527 418429 373270 386203
5592 386203 417970 402223 398222 384866 395189 385003 413499 353921 321806 348587 361773 347079
5580 347079 345629 340411 301972 304633 297666 302203 347718 309839 336115 343859 307476 325258 327969
5567 327969 334236 331728 344096 334106 297513 288515 288865 293039 340391 329311 280532 244707 269822
5554 269822 241317 255615 315319 295750 341257 293481 270658 249792 231398 229979 281655 306444
5542 306444 285183 264729 242869 222200 247229 305171 304430 307073 284919 289988 321452 292472
5530 292472 281555 257459 268289 283098 293703 284708 245335 260799 258050 205822 192357 231245
5518B31245j4748M7030l2122l5739M1533N9123l3283m1907O571P722L9711J9267
5506B94403j6796J5725J1946l707J2766j3878R481j3234o096k0589K7349l5377
5494B61993K4849J4254r454L646m3679K9080J5140K2709p844K894r676j2331N509
5481B97090m551M4006M5892l8402j0172J3895J1068n763j8072L3652L0565k3498
5469C75710J4988m1544P878j2184M8412m1001j7959K2044j1960r769K4299M3287
5457D02201K1584N621k8324j8787K2362K7780K9761K708m1185J3558K0052M3797
5445E01128q248k5446M465k6208O8610K6299j9908j0832M510N1690r609K1369
5433E77820k3240m404l925J8089m0886M9466M7223n5953L4375L4421M17j163K9814
$$ plain form
5518 231245 216497 263527 231405 195666 237199 296322 263039 221132 227703 235425 275136 294403
5506 294403 277607 293332 305278 301571 314337 300459 309940 296706 290610 270021 297370 261993
5494 261993 286842 301096 291642 295288 251609 280689 295829 318538 310694 313588 303912 291581 297090
5481 297090 292539 336545 382437 344035 333863 347758 358826 353063 334991 368643 399208 375710
5469 375710 390698 349154 357032 344848 393260 352259 334300 356344 344384 334615 358914 402201
5457 402201 423785 429406 401082 382295 404657 432437 462198 464906 423721 437279 457331 501128
5445 501128 492880 467434 471899 445691 514301 540600 520692 509860 514370 566060 556451 577820
5433 577820 554580 550176 546251 564340 523454 572920 620143 564190 598565 632986 633403 632240 662054
5420F62054J4673M0445m6241J2388J6953K8246N4001N3773M8215j1498J5254K2912
5408I11175l5950K824j1119n2531n928N4762M6733j4036k0393N2699Q559N2484
5396I89279N5887K6006Q8903J08944R9775J01755R7658R5299M8978L2918J9708
5385A765110K2117J4053p2961p4802j05467m6716o3840L0265k3046M8460K1873
5374A515046N3033O9583R1710J41619J21689J51572J25615J03393Q2540J843L0061
5363B487704N6556N5813J72993J96158J501r2542k37089j86866j45835j46661
5353B161732j38552p8682m3444M7705R1319K6814L9382O4509K3233j5443N713
5342B184286N2017J9276P3245Q8619J51201K40868K18902K37975Q3131q2290k71601
$$ plain form
5420 662054 676727 717172 670931 683319 700272 728518 782519 836292 884507 873009 888263 911175
5408 911175 875225 878049 866930 814399 808471 863233 909966 895930 875537 928236 936795 989279
5396 989279 1045166 1071172 1160075 1269019 1368794 1470549 1568207 1663506 1712484 1745402 1765110
5385 1765110 1787227 1801280 1728319 1653517 1548050 1501334 1437494 1467759 1444713 1493173 1515046
5374 1515046 1568079 1637662 1729372 1870991 1992680 2144252 2269867 2373260 2455800 2457643 2487704
5363 2487704 2544260 2600073 2773066 2969224 2970725 2878183 2641094 2454228 2308393 2161732
5353 2161732 2023180 1944498 1901054 1948759 2040078 2066892 2106274 2170783 2194016 2178573 2184286
5342 2184286 2236303 2255579 2328824 2417443 2568644 2809512 3028414 3266389 3349520 3267230 2995629
5331B995629k74271k78222k24406j96731r8232o1609m0747j7125J746q4726o2279
5320A659027n0090o0003Q3750N5272O3891O0679O9014J50581K02000J78078J48666
5309B560865J46568q9279k43730k38015j88170k21338j54723n5053r3275n6781
5299A367069l0058n1126j0510j4410m8214j950L9659M711O901J9353M1523M1326
5287A364274N1970R6510O1375K8853n1283n0473p5578j08144p1640q7101n0853
5276A107910r954N768K1291r189j1846m7776J5089k7046J0287K6451k3986K6438
5264A083437L4276N2199m509M3791J8005J3970Q018j1321n8118R083L7100k9031
5252A196900L1446k298l950m6727M9393l4893n0359N7528N6652K5673m045L485
$$ plain form
5331 2995629 2721358 2443136 2218730 2021999 1923767 1862158 1821411 1804286 1806032 1721306 1659027
5320 1659027 1608937 1548934 1632684 1687956 1751847 1812526 1881540 2032121 2234121 2412199 2560865
5309 2560865 2707433 2618154 2374424 2136409 1948239 1726901 1572178 1517125 1423850 1367069
5299 1367069 1337011 1285885 1275375 1260965 1212751 1210801 1250460 1255171 1262072 1281425 1322948 1364274
5287 1364274 1416244 1512754 1574129 1602982 1551699 1501226 1425648 1317504 1245864 1158763 1107910
5276 1107910 1097956 1103724 1125015 1115826 1103980 1056204 1071293 1044247 1054534 1080985 1056999 1083437
5264 1083437 1117713 1169912 1165403 1209194 1227199 1241169 1249187 1237866 1179748 1188831 1225931 1196900
5252 1196900 1228346 1226048 1222098 1175371 1224764 1189871 1139512 1197040 1253692 1279365 1275320 1278805
5240A278805N4295Q00j996M4127L3198O6939j836K4835L272J3270J7676O1483
5228A594868P395J7137m5646K1886J8185K0092J1415L6834M2045N1303R2937K4131
5216A892582O1007R9809N6823O3203K97Q2309M5066N2834O6826L2909N4550N7721
5204B565936O5755Q4391R2155Q5287J45552P1109J45528J37559Q7762J46507J12594
5193C740135R0377Q0686J63962J67371K05898J47520J38687K22463K41042K09969
5183E408110K84389L24530L53720L94735K74268K12292R1059N3261l3573m4493
5173G318298j5767J7389M9372J67480J63431K56845L44848L82130M11822N03269
5163I599117M92795M99264L55834L79916L60618L68247L30091K70697Q3451l3257
$$ plain form
5240 1278805 1333100 1333900 1331904 1376031 1409229 1476168 1474332 1499167 1502439 1515709 1533385 1594868
5228 1594868 1602263 1619400 1573754 1595640 1613825 1633917 1645332 1682166 1724211 1775514 1868451 1892582
5216 1892582 1953589 2053398 2110221 2173424 2173721 2256030 2301096 2353930 2420756 2453665 2508215 2565936
5204 2565936 2631691 2716082 2808237 2893524 3039076 3110185 3255713 3393272 3481034 3627541 3740135
5193 3740135 3830512 3911198 4075160 4242531 4448429 4595949 4734636 4957099 5198141 5408110
5183 5408110 5692499 6017029 6370749 6765484 7039752 7252044 7343103 7396364 7362791 7318298
5173 7318298 7302531 7319920 7369292 7536772 7700203 7957048 8301896 8684026 9095848 9599117
5163 9599117 10091912 10591176 10947010 11326926 11687544 12055791 12385882 12656579 12740030 12706773
5153A2706773j76724j87404j76651o0812O4137J77454K84405K26854K48626K48821
5143A3355479L60877M07175L81553L44245K45954L8067j23143j34977q3492k2584
5133A4769154k2038q8322p1260p4925q7391k8973O8869J36102J39215O5256m0026
5122A4765661j57406k81088l21697j81238k02705k44793l50919l57446l08651
5113A2359718k23310r8517l4375O5332J48617J04685P693r5521k10767l04583
5103A1718972k74761l02896l36037n11765n85688o17239n62640m38977l13950
5094G775019k14660j55851j12475o5298K3015J07093K01927K05669J56291O0197
5084G980927j09226l08253l01011k65887j78540j59079n7527N5322J32054K32333
$$ plain form
5153 12706773 12530049 12342645 12165994 12105182 12169319 12346773 12631178 12858032 13106658 13355479
5143 13355479 13716356 14123531 14505084 14849329 15095283 15133350 15010207 14875230 14791738 14769154
5133 14769154 14747116 14658794 14587534 14512609 14425218 14396245 14465114 14601216 14740431 14805687 14765661
5122 14765661 14608255 14327167 14005470 13824232 13621527 13376734 13025815 12668369 12359718
5113 12359718 12136408 12037891 12003516 12068848 12217465 12322150 12329843 12234322 12023555 11718972
5103 11718972 11444211 11141315 10805278 10293513 9707825 9090586 8527946 8088969 7775019
5094 7775019 7560359 7404508 7292033 7226735 7249750 7356843 7558770 7764439 7920730 7980927
5084 7980927 7871701 7563448 7262437 6996550 6818010 6658931 6601404 6656726 6788780 7021113
5074G021113L03954M43038N83384P17537N49518J49809m51510p15485p39960p31684
5064G129714n88159l84113k88467k38578q2518j10133n5880O5447N2691J15665
5054E615669J44507K42675L41269M41219M85084N24684L56685n7871l75662n71671
5044G146588o52148n88650m36833l18960l21230k57232j89497j51618j08019q3929
5034D038472p5932j29758n3173l3450k2718n1563j0110m160N8244N1548l1369
5023C736031K6950K7276K4054O2756O2638J9674k1417M2300O1653K0642K8880
5012D091437R5528P0171P4128J06345Q8857J04885J55536J35409J59100J93358
5002E274754K29535J69386K13431K30289J98572L00702K51719J26454n150o1626
$$ plain form
5074 7021113 7325067 7768105 8351489 9069026 9618544 9768353 9316843 8601358 7861398 7129714
5064 7129714 6541555 6157442 5868975 5630397 5547879 5437746 5381866 5447313 5500004 5615669
5054 5615669 5760176 6002851 6344120 6785339 7270423 7795107 8151792 8093921 7718259 7146588
5044 7146588 6494440 5905790 5468957 5149997 4828767 4571535 4382038 4230420 4122401 4038472
5034 4038472 3962540 3832782 3779609 3746159 3723441 3671878 3661768 3657608 3715852 3767400 3736031
5023 3736031 3762981 3790257 3814311 3877067 3939705 3959379 3937962 3980262 4041915 4062557 4091437
5012 4091437 4186965 4257136 4331264 4437609 4526466 4631351 4786887 4922296 5081396 5274754
5002 5274754 5504289 5673675 5887106 6117395 6315967 6616669 6868388 6994842 6989692 6928066
4992F928066n5633j9926j338M3800Q7973J50666J63889J54205K58986K54798K42629
4981H208115J96173J59156J86213K45341K58171L43791L32756L16829K57750J69780
4971A0674075K12582K67080L23905M28016N25606N80947O88025R13344J057992
4962A5671572J205751J300612J409252J690694J847404K173299K505161K769346
4954C0573091L108338L509127L881949L715443K884092J523457O11316M37446
4946E0244259k84255j419494k764768l324225l195409k777763k046454j305543
4938C3126348o28622r5053L98645Q66531J240151J560773J951883K410864K456050
4929D3287570J941025O83806o09671j111111r64812o01581j61764j82455r68606
$$ plain form
4992 6928066 6872433 6852507 6851169 6894969 6982942 7133608 7297497 7451702 7710688 7965486 8208115
4981 8208115 8404288 8563444 8749657 8994998 9253169 9596960 9929716 10246545 10504295 10674075
4971 10674075 10886657 11153737 11477642 11905658 12431264 13012211 13700236 14613580 15671572
4962 15671572 16877323 18177935 19587187 21277881 23125285 25298584 27803745 30573091
4954 30573091 33681429 37190556 41072505 44787948 47672040 49195497 49806813 50244259
4946 50244259 49960004 48540510 45775742 42451517 39256108 36478345 34431891 33126348
4938 33126348 32497726 32402673 32801318 33667849 34908000 36468773 38420656 40831520 43287570
4929 43287570 45228595 45912401 45302730 44191619 43226807 42625226 42463462 42281007 41312401
4920D1312401k058746k565772k511679k342136k014753j682578j350140j174427
4912B5612170r61318o80301m77946l64661k50421l15515m37758o03213o56885
4903B0864152p59263p21494n68045n37081n68566m19615l10833j98040K8737K21032
4893A7030984L79932M53355N27155L77618K87981J2854j69582k12439o9972R28
4883A8618814P518o9268l43258n99486q14148p95536q83672p97322p79104p14330
4873A2830208o13974n01874l74940k48088j49834r8022N379J16899J16726J16260
4863A1198740J38418O7763L377K8208Q2724J32781N1575n9922k61382n02118o62612
4852A0217552o61777o30676o00519n09051m34685m01084l23515k62109k40704
$$ plain form
4920 41312401 39253655 36687883 34176204 31834068 29819315 28136737 26786597 25612170
4912 25612170 24650852 23970551 23492605 23127944 22877523 22562008 22124250 21521037 20864152
4903 20864152 20104889 19383395 18815350 18278269 17709703 17290088 16979255 16781215 16809952 17030984
4893 17030984 17410916 17864271 18391426 18769044 19057025 19069879 18900297 18687858 18617886 18618814
4883 18618814 18626332 18557064 18213806 17614320 16800172 16004636 15120964 14323642 13544538 12830208
4873 12830208 12216234 11714360 11339420 11091332 10941498 10843476 10848855 10965754 11082480 11198740
4863 11198740 11337158 11404921 11408298 11436506 11519230 11652011 11703586 11643664 11382282 10880164 10217552
4852 10217552 9555775 8925099 8324580 7815529 7380844 6979760 6656245 6394136 6153432
4843F153432j93009j79709j33541j46093j90640j09533j21229q9344r1850p5978
4833D822506r8005p5580q6603r0955p182q6672l9931l0652m9197j1943q7914j2404
4821D145468O784m9936n3511l7484n8159m7187L1015k6876j2549m454p686K4107
4809C909532n4865j6976L6346l5322j8704j5849j2085l935k5857J814K593J4855
4797C781547K4187j0661j2297j030j6842j659N3537J8829J2045m1126P9453L0975
4785C916958O037j1581M6349O34J1214J4976R166M3022q149M1869J3785Q370L354
4772D096004K3149N8496J2305K9979L1907L0275N2861L266K4459L4063L6277P9125
4760D512166L5112L7531J1801K1552L3114P9524J1612Q9470P6974k0647N8271
$$ plain form
4843 6153432 5960423 5780714 5647173 5501080 5310440 5200907 5079678 4990334 4898484 4822506
4833 4822506 4724501 4648921 4562318 4471363 4464181 4377509 4337578 4306926 4257729 4245786 4157872 4145468
4821 4145468 4152252 4102316 4048805 4011321 3953162 3905975 3936990 3910114 3897565 3893111 3885425 3909532
4809 3909532 3854667 3837691 3874037 3838715 3820011 3804162 3792077 3788142 3762285 3764099 3766692 3781547
4797 3781547 3805734 3795073 3782776 3781746 3764904 3763245 3816782 3835611 3847656 3806530 3885983 3916958
4785 3916958 3922995 3911414 3957763 3958397 3969611 3984587 3993753 4036775 4028626 4070495 4084280 4092650 4096004
4772 4096004 4119153 4177649 4189954 4219933 4251840 4282115 4334976 4338242 4362701 4396764 4433041 4512166
4760 4512166 4547278 4584809 4596610 4618162 4651276 4730800 4742412 4831882 4908856 4888209 4946480
4749D946480N7588L2871O5688N6370M5505P4986K2785O7739O6928O2809J13544
4738E613293M7451P3985P2547N4608M5201M5142M2019Q9845Q7765N8489J02870
4727F333215Q1444K1339J10492Q3401O3770J15224O4608Q2807J15544M9074P151
4716G128069J44529J04931J02260J14557J10927J03263L7256P5639J25325Q8466
4706H135222J02683J00651J09732J40346O7949O8850J29521J19242J30371Q7760
4696I192327J65817J25255J11162J23722J66410J08859J35383J13496J29745R0356
4686A0462532J39502J53304J42958J61885J18777J50625J59599J33375J86688
4677A1809245J60919J36386J81027K09589J33620J71741J90018K14150J94803
$$ plain form
4749 4946480 5004068 5036939 5102627 5158997 5204502 5279488 5302273 5370012 5436940 5499749 5613293
4738 5613293 5660744 5734729 5807276 5861884 5907085 5952227 5994246 6084091 6171856 6230345 6333215
4727 6333215 6414659 6435998 6546490 6629891 6693661 6808885 6873493 6956300 7071844 7120918 7128069
4716 7128069 7272598 7377529 7479789 7594346 7705273 7808536 7845792 7921431 8046756 8135222
4706 8135222 8237905 8338556 8448288 8588634 8656583 8725433 8854954 8974196 9104567 9192327
4696 9192327 9358144 9483399 9594561 9718283 9884693 9993552 10128935 10242431 10372176 10462532
4686 10462532 10602034 10755338 10898296 11060181 11178958 11329583 11489182 11622557 11809245
4677 11809245 11970164 12106550 12287577 12497166 12630786 12802527 12992545 13206695 13401498
4668A3401498K10090K21838K52491K58097K41031K52389K86076L23919L61768
4659A5809197M11572M34873M91901N21467O17615O16699P37689P24858P24695
4650B1090566N93010L35923J61961m0781j38072p0871r6512r607J3732o5606o6368
4639B1707375n9782o7712J8930J26862J68592K31788M19314M58875O39638P29026
4629B4372906P40004P91458P14024M82399K08683R7060l5551j85782j90663j32648
4619B6861890k36441k11159k47446k60470l47274n59081o55980o43076n60532
4610B3140431n77905n67908m66159l58394l02062k45928j14496j71719j36845
4601B0199015l4796K9649L17j33672j03258m0432j6294q0184j08171k75685m40292
$$ plain form
4668 13401498 13611588 13833426 14085917 14344014 14585045 14837434 15123510 15447429 15809197
4659 15809197 16220769 16655642 17147543 17669010 18286625 18903324 19641013 20365871 21090566
4650 21090566 21683576 22019499 22181460 22140679 22002607 21931736 21835224 21825617 21839349 21773743 21707375
4639 21707375 21647593 21579881 21598811 21725673 21894265 22126053 22545367 23004242 23643880 24372906
4629 24372906 25112910 25904368 26618392 27100791 27309474 27406534 27370983 27185201 26994538 26861890
4619 26861890 26625449 26414290 26166844 25906374 25559100 25000019 24344039 23700963 23140431
4610 23140431 22562526 21994618 21528459 21170065 20868003 20622075 20507579 20335860 20199015
4601 20199015 20164219 20193868 20194185 20060513 19957255 19916823 19900529 19820345 19712174 19436489 18996197
4590A8996197n55649o38759p04308n87132m94471m86149m25844l27044l42663
4581A4434178l00718j99007j97324k03808k16827j96951j53519j35519p6478j28719
4571A2625308j21734m9485n180l2068l9319l4237n0844j06467j94015j33047k64481
4560A1594431l07400j88481j61956j93668p6808j15184r6488o6534m5433m0507
4550A0301972j34944j51588j32827j98166l03369k51728j91723k10284j93555
4541H533788j82745j74687j81234j50325j70167j31548j04759j06214r8740j47865
4531G085504o6840j41410r6390n6340j16191j14602n8253j26892n2132n3871r1048
4520F111535q8801j30548m9925m1260n8177j02076n7741l1891m0802p8901o3303
$$ plain form
4590 18996197 18440548 17801789 17097481 16510349 16015878 15529729 15103885 14776841 14434178
4581 14434178 14133460 13934453 13737129 13533321 13316494 13119543 12966024 12830505 12754027 12625308
4571 12625308 12503574 12454089 12448909 12416841 12377522 12343285 12292441 12185974 11991959 11858912 11594431
4560 11594431 11287031 11098550 10936594 10742926 10666118 10550934 10454446 10387912 10342479 10301972
4550 10301972 10167028 10015440 9882613 9684447 9381078 9129350 8937627 8727343 8533788
4541 8533788 8351043 8176356 7995122 7844797 7674630 7543082 7438323 7332109 7233369 7085504
4531 7085504 7018664 6877254 6780864 6724524 6608333 6493731 6435478 6308586 6256454 6202583 6111535
4520 6111535 6022734 5892186 5842261 5801001 5742824 5640748 5583007 5551116 5510314 5431413 5368110
4509E368110l2372p2492p4836n8368p5794l6668o3439j090n9613q5357J5833n8217
4497D765697p8687n2662k9154l4761k9852k7649p2461p3247o2863n0678O095m7881
4485D211897o3837o0500p1780N710k5260l9394l5831n4680r731L9845k6352m0117
4473C829970j5373r21l3280m8958o3471j3516j5657l6181L1586K353l1404k6069
4461C579079l6602l5835m966l9671k6692J1317p397q0860m736J5063N511J2648
4449C386859j7469q179k830l5589J5636n478l0447K770K3322M1160L3340P984
4437C411079J7524O9132N869J4367l0820Q745J8888k478l1712K3187R5504M3631
4425C642916L2021N2083Q0241J05362P2398R8863N7943J19716J60940O3251P0483
$$ plain form
4509 5368110 5335738 5263246 5188410 5130042 5054248 5017580 4954141 4953051 4893438 4808081 4823914 4765697
4497 4765697 4687010 4634348 4605194 4570433 4540581 4512932 4440471 4367224 4304361 4253683 4259778 4211897
4485 4211897 4148060 4087560 4015780 4021490 3996230 3956836 3921005 3866325 3856594 3896439 3870087 3829970
4473 3829970 3814597 3813676 3780396 3731438 3667967 3654451 3638794 3602613 3634199 3636552 3605148 3579079
4461 3579079 3542477 3506642 3501676 3462005 3435313 3446630 3439233 3358373 3353637 3368700 3374211 3386859
4449 3386859 3369390 3361211 3358381 3322792 3338428 3332950 3302503 3305273 3328595 3369755 3403095 3411079
4437 3411079 3428603 3497735 3503604 3517971 3487151 3495896 3514784 3512306 3480594 3503781 3599285 3642916
4425 3642916 3674937 3727020 3807261 3912623 3985021 4083884 4141827 4261543 4422483 4485734 4556217
4414D556217R5572J04761J01848M2014j5644K7958n2604K3747L858M8257Q3970
4403E019954L1187J23033J37797J34856J05328P1705R2920M2479m220L8119L2837
4392E825995J11487J65391K11856K32286L38488L78453M20385N65558O93288Q01807
4382I744994Q41769P60267M18080l9605m81876n99915n79410n17378l35298j63826
4372I047802j3577R4737K87198L55378M75323O21906P13978O73099L82956r3961
4362A2544839m80689o83751p11196o75987n05187l06681j88129j21727o5932l3065
4352H772495l7896j08786j09678l3503J2459N7258J17533J90816K45480L72410
4342I478588M81993M86962N46267N91164O15183P27253Q32428R60062J242983
$$ plain form
4414 4556217 4651789 4756550 4858398 4900412 4884768 4912726 4860122 4883869 4887727 4935984 5019954
4403 5019954 5051141 5174174 5311971 5446827 5552155 5623860 5716780 5759259 5755039 5793158 5825995
4392 5825995 5937482 6102873 6314729 6547015 6885503 7263956 7684341 8249899 8943187 9744994
4382 9744994 10586763 11347030 11765110 11725505 11243629 10643714 10064304 9546926 9211628 9047802
4372 9047802 9034225 9128962 9416160 9771538 10246861 10868767 11582745 12255844 12638800 12544839
4362 12544839 12064150 11380399 10669203 9993216 9488029 9181348 8993219 8871492 8805560 8772495
4352 8772495 8734599 8625813 8516135 8482632 8495091 8552349 8669882 8860698 9106178 9478588
4342 9478588 9960581 10447543 10993810 11584974 12200157 12927410 13759838 14719900 15962883
4333A5962883J336802J214332P84528j41799r03975j221631j241248j146746p24751
4324A3918395n12739k22696J4622J45258M13549O06277P43734Q49419Q85797M83530
4314A7325146k07173j006077j400833j523436j478523j245377j014949q41639
4306H607139o85405n37701m53354l50902l91170l04687l01988k11575k66323j90060
4296D913974j92269j47299j52299j52604j18961p6892q1950j03620o1163m6106
4286C780811k7073l9313p4378l7898m4459l2328j1428n7535m6939l0235k4243
4275C354982n2298p8003o7799M1612L2214j010M2966m9951M886L2962J3035N1003
4263C324599K2526J6057j4313k0266L3003k7935M6622L9779L3415O822N9643O8859
$$ plain form
4333 15962883 17299685 18514017 19298545 19156746 18252771 17031140 15789892 14643146 13918395
4324 13918395 13405656 13182960 13197582 13342840 13756389 14362666 15106400 15955819 16841616 17325146
4314 17325146 17117973 16111896 14711063 13187627 11709104 10463727 9448778 8607139
4306 8607139 7921734 7384033 6930679 6579777 6188607 5883920 5581932 5370357 5104034 4913974
4296 4913974 4721705 4574406 4422107 4269503 4150542 4073650 3991700 3888080 3826917 3780811
4286 3780811 3753738 3714425 3640047 3602149 3557690 3525362 3513934 3456399 3409460 3379225 3354982
4275 3354982 3302684 3224681 3156882 3198494 3230708 3229698 3272664 3222713 3227599 3260561 3273596 3324599
4263 3324599 3347125 3363182 3348869 3328603 3361606 3333671 3380293 3420072 3453487 3460309 3519952 3588811
4251C588811L7456R659L1695Q6298O4992N9028R1763J57833O4738J09214Q1472
4240D382959K07448J44546J84656K14320L11913K77160L83106M01626M99460N42023
4230G549217O40570P31899Q36712R56538J158706J335434J419552J168236N83024
4221A6379888k61012r82046j280694j386360j235253r72806p63686o28852n25189
4212H343990l92622l33629k94421j96163j31625q9900j2118O2409J30437J68450
4202G254808K55197K71111L81240N13864O00168O76350P97653Q95869J084472
4193A2730732J285438J369497J261526P60630n771p18579r74186j148405j074690
4184A3486192q98647p35417n33183l50788k02673q9951Q4864J78144L91354N26752
$$ plain form
4251 3588811 3626267 3635926 3667621 3753919 3818911 3877939 3969702 4127535 4192273 4301487 4382959
4240 4382959 4590407 4734953 4919609 5133929 5445842 5723002 6106108 6507734 7007194 7549217
4230 7549217 8189787 8921686 9758398 10714936 11873642 13209076 14628628 15796864 16379888
4221 16379888 16118876 15136830 13856136 12469776 11234523 10261717 9498031 8869179 8343990
4212 8343990 7951368 7617739 7323318 7127155 6995530 6905630 6893512 6955921 7086358 7254808
4202 7254808 7510005 7781116 8162356 8676220 9276388 9952738 10750391 11646260 12730732
4193 12730732 14016170 15385667 16647193 17407823 17402052 16683473 15709287 14560882 13486192
4184 13486192 12587545 11852128 11318945 10968157 10765484 10675533 10760397 10938541 11329895 11856647
4174A1856647N00407J70146l17176p79456r06898q88624q41394o34283m76983
4165G682386l62849l50634k72353k64911j64958j29643p5725o5540k7523N71N5594
4154F024415R2623K09904J85794K64904K66924L34277L05245L41212L90834L49860
4144H765992M47347N44668N61828L39373j05786o41228q35894q09921q09084o15739
4134F841556n05215l52518k59749j61197j36533j29823j40739k00883j89414k48845
4124D516640k24389k01259j65181j67327j68890j28919j11665q6518p6182J6468
4114C202778p6455p4299l4544K4284K0850J3693L1479K361P1156J20186M9631
4103C351120Q5724J46531N7147L8408O4520m3016n2840q6808n1084p5052j0000
$$ plain form
4174 11856647 12357054 12527200 12210024 11430568 10523670 9635046 8793652 8159369 7682386
4165 7682386 7319537 6968903 6696550 6431639 6266681 6137038 6061313 5995773 5968250 5968821 6024415
4154 6024415 6117038 6326942 6512736 6777640 7044564 7378841 7684086 8025298 8416132 8765992
4144 8765992 9213339 9758007 10319835 10659208 10553422 9912194 9076300 8266379 7457295 6841556
4134 6841556 6336341 5983823 5724074 5562877 5426344 5296521 5155782 4954899 4765485 4516640
4124 4516640 4292251 4090992 3925811 3758484 3589594 3460675 3349010 3262492 3186310 3202778
4114 3202778 3126323 3052024 3017480 3041764 3062614 3076307 3107786 3110147 3181303 3301489 3351120
4103 3351120 3436844 3583375 3640522 3678930 3743450 3700434 3647594 3560786 3509702 3434650 3424650
4092C424650J7865m8892o3650o5461l9158j01694j32896j42142r0879j08919n8247
4081B590577l3390n6535p0783j3567m7848j7089J0433k895K1990N1526J0323J948
4069B444690M6228R9169Q7605Q0649P3786Q4064K2008l6179j00510j34161j18688
4058B548661r3963r4108j04581k4006j5359k5108j1731L936P163j1170K4246L8548
4046B242528Q4057J0780O4520Q8239P2986O447k7947j3099l4219j61683j39837
4035B192772j22660p0287q5377p8586r2092p6770l7028j4377o2851j77n7558m3618
4023A451391k5562j1701j3716m155K4083m184J703m0170O0281L2046M0855P4477
4011A585348J5883M8456Q4495Q0243O1260Q1518N3566M5730k3045o4171n8870
$$ plain form
4092 3424650 3442515 3393623 3329973 3264512 3225354 3123660 2990764 2848622 2757743 2648824 2590577
4081 2590577 2557187 2500652 2429869 2416302 2368454 2351365 2361798 2358903 2380893 2432419 2442742 2444690
4069 2444690 2490918 2590087 2677692 2758341 2832127 2916191 2938199 2902020 2801510 2667349 2548661
4058 2548661 2454698 2360590 2256009 2232003 2216644 2191536 2179805 2183741 2190904 2179734 2203980 2242528
4046 2242528 2326585 2337365 2401885 2490124 2563110 2569557 2541610 2528511 2494292 2332609 2192772
4035 2192772 2070112 1999825 1914448 1835862 1743770 1667000 1629972 1615595 1552744 1552567 1495009 1451391
4023 1451391 1425829 1414128 1400412 1396257 1420340 1416156 1417859 1377689 1437970 1470016 1510871 1585348
4011 1585348 1601231 1649687 1734182 1814425 1875685 1957203 2010769 2056499 2033454 1969283 1910413
4000A910413j07149o9647p8539r1510j22284n0477j11958k6145m7682m1250j7100
3989A146672k0374q3779j2731n819k2013j5910L1377j6767l7396J048p0126J0982
3977I05164K6480m4106m641j1532M751m187l2738K0112l3339j120L2373j5215
3965H42002k1296o013j1751l0111R626j9218J8028j8006L28R896j9873K5131Q904
3952G87647O6281k8439j6929L1628K7087j9025j0339R578J267J4364J5793k8940
3940H49973l057L556o715l832M001J545j9617J9937j7705j3922J9666j627j5596
3927H16607m0475K2228M4789K211K1869j9550J3780Q429j058K0861n603J1126
3915H95214o349Q487J4312L7498K9484o1747m4817K2998L920P5436p771L893K7877
$$ plain form
4000 1910413 1803264 1733617 1655078 1563568 1441284 1390807 1278849 1252704 1205022 1163772 1146672
3989 1146672 1126298 1042519 1029788 1023969 1001956 986046 1017423 1000656 963260 964308 894182 905164
3977 905164 931644 887538 882897 871365 876116 871929 839191 859303 825964 824844 857217 842002
3965 842002 820706 814693 802942 772831 782457 763239 781267 763261 763589 773485 753612 778743 787647
3952 787647 853928 825489 808560 840188 867275 848250 837911 847489 848756 863120 878913 849973
3940 849973 846916 850472 843757 839925 843926 845471 825854 845791 828086 814164 833830 832203 816607
3927 816607 776132 798360 843149 845360 867229 847679 861459 869888 868830 889691 884088 895214
3915 895214 888865 897352 911664 949162 978646 916899 872082 895080 899000 974436 966665 970558 998435
3902I98435j7802O8815m744l7052J0210J9661L3452K4847m903j2319J0149j6789
3890A071960J790O2091j644J08926K442J0067K733L9553K4510R907J9980N9314
3878A411629K4476Q090o596R6315P1028J6093M1244O0975K4593L5860J05880N7284
3866A946871L1883M7616O2193O9502O5434K3785P9892Q2691P2311J17524J11666
3855B711368Q2035J14933R0598J04574R0258J78794J16035J39129J71697K02580
3845D002001J69318K22471K40609K04597K45495K72932K99837L31402L20397L57455
3835F666514L76668L93590M06018M33964M32722N23559M83578M25190N42532N64878
3825A1249213O39234O74640P28991P24495O81476O15952N69604N28750N13558
$$ plain form
3902 998435 980633 1049448 1044704 1007652 1017862 1037523 1070975 1095822 1090919 1078600 1088749 1071960
3890 1071960 1073750 1135841 1134197 1243123 1245565 1255632 1258365 1297918 1322428 1332335 1352315 1411629
3878 1411629 1436105 1444195 1437599 1533914 1604942 1621035 1662279 1723254 1747847 1783707 1889587 1946871
3866 1946871 1978754 2026370 2088563 2158065 2223499 2247284 2327176 2409867 2482178 2599702 2711368
3855 2711368 2793403 2908336 2998934 3103508 3193766 3372560 3488595 3627724 3799421 4002001
3845 4002001 4171319 4393790 4634399 4838996 5084491 5357423 5657260 5988662 6309059 6666514
3835 6666514 7043182 7436772 7842790 8276754 8709476 9233035 9716613 10141803 10684335 11249213
3825 11249213 11888447 12563087 13292078 14016573 14698049 15314001 15883605 16412355 16925913
3816A6925913N30121M72617N70485O60251P30534P43584P87652O65939O13953
3807B2701049M98434L67480J90106Q7290K145P661J41042K32347L41396M54895
3797B5023845M40803K89905J32040q8814l82247o06198o20694o56461o35079n56783
3787B2340317m37353k65085j30886j37528k34660l81077n20502p45149q71011
3778A8617066r24091r29628q34572p75604o90363n42955m72644l37463m54258
3769A2655488m21883n04456n57583n79717o01165n61157n86109m98940m60937
3760G883541m42031l51359l19697l55837k55299k37744k48944k52154k78237k20651
3750D921588k90803k62890j69686j91120j85669j70602j40227j27474j19403r5002
$$ plain form
3816 16925913 17456034 17928651 18499136 19159387 19889921 20633505 21421157 22087096 22701049
3807 22701049 23199483 23566963 23757069 23844359 23846504 23854165 23995207 24227554 24568950 25023845
3797 25023845 25464648 25754553 25886593 25797779 25415532 24809334 24188640 23532179 22897100 22340317
3787 22340317 21902964 21637879 21506993 21369465 21134805 20753728 20233226 19488077 18617066
3778 18617066 17692975 16763347 15928775 15153171 14462808 13919853 13447209 13109746 12655488
3769 12655488 12233605 11729149 11171566 10591849 9990684 9429527 8843418 8344478 7883541
3760 7883541 7441510 7090151 6770454 6414617 6159318 5921574 5672630 5420476 5142239 4921588
3750 4921588 4630785 4367895 4198209 4007089 3821420 3650818 3510591 3383117 3263714 3168712
3740C168712j16445j28128r5531j10845q8668o6975m6651o0897p2679o9172q1205
3729B231516r9970m0017o4487q4419l5237m2472q3947l3381k528j9319m3308l6680
3717A645751l9276j8349p1579p6228l9393j7681o6063l9435l4447p632k9667k1884
3705A184117n3550j8996J0319j6865J678p8350k5623k504l8995J1021N109k4693
3693I52668m7334m3845j3065j3112L5957j0529l5927k1731m7142L6442L1670m0916
3681G83136K6792o4311k7619j2584K7832j1967j6377n4356L2618j6174p9503K237
3669E89724K653N4755k5787k9638J6923l5899k1802L3926J2518n8486l4069r701
3657D95117J9619r198l3112J432J9809j657k1452n5545J3538M295l8418j584O9146
$$ plain form
3740 3168712 3052267 2924139 2828608 2717763 2629095 2562120 2515469 2454572 2381893 2312721 2231516
3729 2231516 2131546 2091529 2027042 1942623 1907386 1864914 1780967 1747586 1745058 1725739 1682431 1645751
3717 1645751 1606475 1588126 1516547 1440319 1400926 1383245 1317182 1277747 1243300 1235668 1206001 1184117
3705 1184117 1130567 1111571 1121890 1105025 1106703 1028353 1002730 1000226 961231 972252 977361 952668
3693 952668 905334 861489 848424 835312 871269 860740 824813 803082 755940 792382 824052 783136
3681 783136 809928 745617 717998 705414 733246 721279 704902 650546 683164 666990 587487 589724
3669 589724 592377 647132 621345 591707 608630 572731 550929 584855 597373 538887 504818 495117
3657 495117 514736 505538 472426 473858 493667 492010 470558 415013 428551 432846 394428 392844 461990
3644D61990J1303j452q918j2230k8098J0621J3036k8045K8850k0794l1585l5499
3632C59179M6735J3521k6313m4429L5682J8764q577J8423K974k2548P935P174
3620D08520j8802j7361J0164N7222l3j0431K0990j3611o5549P190p36l2262P0462
3607D15763l7865L3111k8359r361Q491k0698k9641J0611N2487l8565M5972k3402
3595C78544k6820L5049K0162R796J5078k5263o45K2062j9201n7532L5447K6128
3583D12805j2516P316L1860k8762l2623K0199J3913j2338J7713K3839K1021j4125
3571D48302j3844J672K2422j9330Q664N0222l6335l7408K4196M5438k9777l8438
3559D25784Q902L7444K89K8075m5889N634N7705K4905K2352l2292l2340K5339
$$ plain form
3644 461990 473293 471841 462923 450693 422595 433216 446252 418207 447057 426263 394678 359179
3632 359179 405914 419435 393122 348693 384375 403139 394562 412985 415959 393411 401346 408520
3620 408520 389718 372357 382521 439743 439710 429279 450269 436658 371109 378299 377563 345301 415763
3607 415763 377898 411009 382650 373289 381780 361082 331441 342052 394539 355974 401946 378544
3595 378544 351724 386773 406935 416731 431809 406546 405901 427963 408762 351230 386677 412805
3583 412805 400289 407605 439465 410703 378080 398279 412192 399854 417567 441406 462427 448302
3571 448302 434458 436130 458552 439222 447886 498108 461773 424365 448561 493999 464222 425784
3559 425784 434686 472130 472419 500494 454605 460239 517944 542849 565201 532909 500569 525908
3547E25908k0664K3193m1633K6462J9435K3460k317m721J9671J1417L3139L8240
3535F51590n1216m620M5622J3921L228n806o3289L5146O3915P811o041J7639j9136
3522F88764j8864M478l8140L9612k3135L1173k3852K5995N3857p4983L6679J3131
3510G14715O2631J3878j0250J8574J6110L391l9966O0989L1612p300o1282K8225
3498H31327R650R395r569J9707l1543O1585R376l0023P287k6722j6751J4571j1960
3485H36330l0579m2688J1777L1893K8257j4908k1170M1063p249o165J6326p855
3473H35032n9993L5157p118n5253j4433K8888Q363j8349n6881k310O4723J0287
3461G68113L959q056k6510l7689L8278j8611J248l0610L8030J6118J2658J442
$$ plain form
3547 525908 505244 528437 486804 513266 532701 556161 553844 549123 568794 580211 613350 651590
3535 651590 600374 595754 641376 655297 658525 652719 589430 624576 688491 696302 690261 707900 688764
3522 688764 669900 674378 636238 675850 652715 683888 660036 686031 739888 664905 701584 714715
3510 714715 777346 791224 780974 799548 815658 819049 779083 840072 871684 864384 803102 831327
3498 831327 840977 850372 840803 860510 828967 890552 899928 869905 877192 850470 833719 848290 836330
3485 836330 805751 763063 774840 806733 834990 820082 798912 839975 832726 826561 842887 835032
3473 835032 775039 810196 803078 747825 733392 762280 770643 752294 695413 693103 757826 768113
3461 768113 772072 764016 737506 699817 738095 719484 720732 690122 728152 744270 756928 758370
3449G58370m447O953k9931q386L5165r53R421J5420k840j3441L368O123L0600
3436H05422J7741K3445M629O015m895l7314K2896M3230O861J0093j4042l5414
3424H48667L7009O4161L3996j0375N3488n768l5125M5395K7775J3502l002j25
3412A069598P5704J810L9265l324J0593O0354K6875j1266L1859K0596M1014L1517
3400A394595O1719L1074K9204L0512L1950N1624N3932k6903O5106L4276L3710
3389A790799K2378P5682L0451K0463N8541O7910L7254K5396J4287J5822M8686
3378B207669K5001M9521J9054O3201K3428R4859M7589K1788K3118P0047M9279
3367B694554L9532M8596K8877O1698K7969Q3429J4098J01644M1532K3543P6616
$$ plain form
3449 758370 753923 760876 730945 722559 757724 756771 766192 781612 778772 765331 768699 774822 805422
3436 805422 823163 846608 851237 857252 852357 815043 837939 881169 888030 898123 884081 848667
3424 848667 885676 949837 983833 973458 1026946 1021178 986053 1031448 1059223 1072725 1069723 1069598
3412 1069598 1145302 1147112 1186377 1183053 1193646 1254000 1280875 1269609 1301468 1322064 1363078 1394595
3400 1394595 1456314 1487388 1516592 1547104 1579054 1630678 1684610 1657707 1722813 1757089 1790799
3389 1790799 1813177 1888859 1919310 1939773 1998314 2066224 2103478 2128874 2143161 2158983 2207669
3378 2207669 2232670 2282191 2301245 2364446 2387874 2482733 2530322 2552110 2575228 2645275 2694554
3367 2694554 2734086 2782682 2811559 2873257 2901226 2984655 2998753 3100397 3141929 3165472 3242088
3356C242088R914P4223R1238N9093Q1238P8666O3622P3754N3770P2463M2323N618
3344C948010j8080K0977N364J2179K1595J03382P7026M3288K368N6221k4776K8537
3332D276091O8641L7531k0079M7105j2495L7608J6744P3993M7557L1007K9886
3321D633589J0413L6603M7621Q0985J7274P8396M2742M1707P7848P0720Q5136
3310E223034J74335J43702J32623K20754K48458K27485K21515K52840K95273K89143
3300G429162L36206L09127K70120K56446K29067J61175J50842P7489P8754O7735
3290I366123J03953J18268J51094J22613R0800J02296J05230Q3476L9695j0191
3280A0273357M53M8257K1457m5707J08279P6320J6171N2643J67171Q0812J63700
$$ plain form
3356 3242088 3252002 3326225 3417463 3476556 3557794 3636460 3700082 3773836 3827606 3900069 3942392 3948010
3344 3948010 3929930 3950907 3956271 3968450 3990045 4093427 4170453 4213741 4216109 4272330 4247554 4276091
3332 4276091 4344732 4382263 4362184 4409289 4396794 4434402 4451146 4525139 4572696 4603703 4633589
3321 4633589 4644002 4680605 4728226 4809211 4826485 4904881 4947623 4989330 5067178 5137898 5223034
3310 5223034 5397369 5541071 5673694 5894448 6142906 6370391 6591906 6844746 7140019 7429162
3300 7429162 7765368 8074495 8344615 8601061 8830128 8991303 9142145 9219634 9298388 9366123
3290 9366123 9470076 9588344 9739438 9862051 9952851 10055147 10160377 10243853 10283548 10273357
3280 10273357 10273810 10322067 10343524 10297817 10406096 10482416 10498587 10551230 10718401 10799213 10962913
3269A0962913K16680K28249K29448L72573L77034M25604N44849N65984O38383
3260A4561717O56436P67976Q27211J015808J077788J272117J442984J614922J805747
3251B5042706J919432J989198J989947J955287J880378J855275J832409J680342
3243D0144974J587624J434504J237141J003567P10240M56958K15571o093j98975
3234D6585511l73397m21621m43095n00331n28592n50401p15103q97610j163208
3225D0992153j289977j491926j594463j607650j615678j526164j387803j287709
3217B9190783j172567j028286r76188p96407p52023o64328o36379n63371m18574
3208B2182660l78714k13034j55322k3775m8720m5892p3881P154j6288j7089L1221
$$ plain form
3269 10962913 11179593 11407842 11637290 12009863 12386897 12812501 13357350 13923334 14561717
3260 14561717 15218153 15986129 16813340 17829148 18906936 20179053 21622037 23236959 25042706
3251 25042706 26962138 28951336 30941283 32896570 34776948 36632223 38464632 40144974
3243 40144974 41732598 43167102 44404243 45407810 46118050 46575008 46790579 46784486 46585511
3234 46585511 46212114 45790493 45347398 44847067 44318475 43768074 43052971 42155361 40992153
3225 40992153 39702176 38210250 36615787 35008137 33392459 31866295 30478492 29190783
3217 29190783 28018216 26989930 26013742 25217335 24465312 23800984 23164605 22601234 22182660
3208 22182660 21803946 21590912 21435590 21411815 21363095 21317203 21243322 21250476 21234188 21217099 21248320
3197B1248320O5494J76652K27061L59702N25599O33595P60519P91879P90706P78424
3187B6357951P31032N69562M29967L67263J23028O6792j6673j10030l1446k6850
3177B8460596O1002J35192J45702J12755L5677j06043k81625m08073n18022o56053
3167B6981108p03474p44801p12102o18115n79593m37596m01295l32865k55163
3158B2196104j00231j58858n8213k592L3340P7312J04073J46713K22447K57256
3148B2717351L18968L48258L59111M32393M57081N12467N67597O25704O67777
3139B7006707P77796P87033Q82565R50288R95700J071854J193569J284930J330029
3130C6280471J383133J472841J571740J689402J767926J937640K108474K343381
$$ plain form
3197 21248320 21313814 21490466 21717527 22077229 22602828 23236423 23996942 24788821 25579527 26357951
3187 26357951 27088983 27658545 28088512 28455775 28578803 28645595 28628922 28518892 28487446 28460596
3177 28460596 28521598 28656790 28802492 28915247 28950924 28844881 28563256 28155183 27637161 26981108
3167 26981108 26277634 25532833 24820731 24202616 23623023 23185427 22784132 22451267 22196104
3158 22196104 22095873 21937015 21878802 21876210 21909550 21986862 22090935 22237648 22460095 22717351
3148 22717351 23036319 23384577 23743688 24176081 24633162 25145629 25713226 26338930 27006707
3139 27006707 27784503 28571536 29454101 30404389 31400089 32471943 33665512 34950442 36280471
3130 36280471 37663604 39136445 40708185 42397587 44165513 46103153 48211627 50555008
3122E0555008K549838K849284L168862L634126M122327M611534N258423N816449
3114H2565851O358530O697762O920894O897697O632564N947563N285751M450753
3106A31757365L712308L159190K918713L070576L333433L698693L966992L970143
3098A59587413L464960K606961J451356J3411j513064k919183l968000m555943
3090A54167911m708286m493153l938031l391986k875440k427875k217224k225062
3082A27890854k196197k256942k330863k312736k196147k025012j714045j316893
3074A11542019r71988n13037o212L59379O80439R72936J037621R16202O48009
3065A14665368K80428j73445p41476j308286j833334k338185k605134k894002
$$ plain form
3122 50555008 53104846 55954130 59122992 62757118 66879445 71490979 76749402 82565851
3114 82565851 88924381 95622143 102543037 109440734 116073298 122020861 127306612 131757365
3106 131757365 135469673 138628863 141547576 144618152 147951585 151650278 155617270 159587413
3098 159587413 163052373 165659334 167110690 167124101 165611037 162691854 158723854 154167911
3090 154167911 149459625 144966472 141028441 137636455 134761015 132333140 130115916 127890854
3082 127890854 125694657 123437715 121106852 118794116 116597969 114572957 112858912 111542019
3074 111542019 110570031 110056994 110050782 110410161 111090600 112063536 113101157 114017359 114665368
3065 114665368 114945796 114772351 114030875 112722589 110889255 108551070 105945936 103051934
3057A03051934k874227k686216k398071k093623j803017j619788j366885j043695
3049H7166412r68777p88528n98246j73182M42968P10537J37726k070019n008483
3040G8850408n369323n001692m738973l740721l047707k454690j953807j625419
3032E0918076j394223j231947r67632p74303m95861k32635M7848L33679O02579
3023D6805581J073699J491680K233874L137834L635118L290773J439887j468382
3015F1640064j867461j565094j405469n47482J15587N53396P99797J003899J106422
3006E9833659R18216P56857M95636J65825j14572n24390p85077j073251j294422
2997E8378481j405017j522976j606111j640427j650990j652812j704492j715499
$$ plain form
3057 103051934 100177707 97491491 95093420 92999797 91196780 89576992 88210107 87166412
3049 87166412 86197635 85409107 84810861 84637679 85080647 85791184 85928910 83858891 78850408
3040 78850408 73481085 68479393 63740420 59999699 56951992 54497302 52543495 50918076
3032 50918076 49523853 48291906 47324274 46549971 46054110 45821475 45869323 46203002 46805581
3023 46805581 47879280 49370960 51604834 54742668 58377786 61668559 63108446 61640064
3015 61640064 59772603 58207509 56802040 56254558 56370145 56923541 57723338 58727237 59833659
3006 59833659 60751875 61508732 62004368 62170193 62055621 61531231 60746154 59672903 58378481
2997 58378481 56973464 55450488 53844377 52203950 50552960 48900148 47195656 45480157
2989D5480157j655859j628257j622393j584078j494786j313169j141777r04263
2981C4135575p77447o46173m03218k60825p2916J15197L76229N65065Q24836J037478
2971C4893801J336816J658469J851196K202346K412693K511550K635700K642252
2963E2144823K553538K485725K451881K248711J936757J651737J410955J156881
2955F8041008Q97828P32740N65378L95157K05339l7147m30211q34145j368833
2946F8167114j755070k075426k336223k413165k490377k362424k305582k150089
2938E0278758k001969j907071j771483j773362j725715j819054j802514j856789
2930C5620801j887467j818628j816725j764419j648248j566633j440842j295154
$$ plain form
2989 45480157 43824298 42196041 40573648 38989570 37494784 36181615 35039838 34135575
2981 34135575 33358128 32711955 32308737 32047912 31974996 32090193 32466422 33031487 33856323 34893801
2971 34893801 36230617 37889086 39740282 41942628 44355321 46866871 49502571 52144823
2963 52144823 54698361 57184086 59635967 61884678 63821435 65473172 66884127 68041008
2955 68041008 68938836 69671576 70236954 70632111 70837450 70800303 70370092 69535947 68167114
2946 68167114 66412044 64336618 62000395 59587230 57096853 54734429 52428847 50278758
2938 50278758 48276789 46369718 44598235 42824873 41099158 39280104 37477590 35620801
2930 35620801 33733334 31914706 30097981 28333562 26685314 25118681 23677839 22382685
2922B2382685j185368j089655j012113q69462p28969o71375o25693n94077n05457
2913A5100516m60023l85644l23564k99978k34328k08349j46224j64967j51875
2904A2725564l110j8141k1158j8108K707n7591p0757j16689j26185j86293k39269
2893A1870970j64952k28729j45680k10644k00070r1132j77213k06230j71811j86185
2883A0088324j98289j93826k19734k42720k45663k34650k35582j80695j79395
2874H157770j90244j90285j74760j69520j72378j10518j05653j24838r0011r7629
2864F731934l8951q1822o9366o575j2758p2704p719q221k8835L6208k0171O722
2852F427742N1902J5271R379k231L5780k7425j0906o2401l797L6772m1383O5798
$$ plain form
2922 22382685 21197317 20107662 19095549 18226087 17497118 16825743 16200050 15605973 15100516
2913 15100516 14640493 14254849 13931285 13631307 13396979 13188630 13042406 12877439 12725564
2904 12725564 12722454 12704313 12683155 12665047 12667754 12610163 12539406 12422717 12296532 12110239 11870970
2893 11870970 11706018 11477289 11331609 11120965 10920895 10829763 10652550 10446320 10274509 10088324
2883 10088324 9890035 9696209 9476475 9233755 8988092 8753442 8517860 8337165 8157770
2874 8157770 7967526 7777241 7602481 7432961 7260583 7150065 7044412 6919574 6829563 6731934
2864 6731934 6692983 6611161 6541795 6535220 6522462 6449758 6442039 6433818 6404983 6441191 6421020 6427742
2852 6427742 6479644 6494915 6504294 6502063 6537843 6510418 6499512 6437111 6433314 6470086 6428703 6494501
2840F494501K6780j1683M59M571M4581M6984O9323M8695M9838N2040M6172P2735
2828F944996N9120O8555Q0580J12246M5406R3547Q1621J13544J31147J46441J16852
2817G994055P5137J65411J77820J38516K16439K38816K66193K77195K77502L17244
2807A0144328K68323K64330K94778K77556L08476K85471K87547K55340K63645
2798A2649794K61589K47667K39125K84861K69362L15041L52342K93674L24156
2789A5237611L93957M37322M44893M20742L97149M46147N14895N12156N64825
2780A9369697N95703N99486O68145P61735P77172Q15742R04398J033742J090657
2771B6616477J119110J207634J314766J443837J541828J624051J758822J870108
$$ plain form
2840 6494501 6521281 6509598 6510057 6514628 6559209 6606193 6675516 6724211 6774049 6826089 6872261 6944996
2828 6944996 7004116 7072671 7153251 7265497 7310903 7404450 7486071 7599615 7730762 7877203 7994055
2817 7994055 8069192 8234603 8412423 8550939 8767378 9006194 9272387 9549582 9827084 10144328
2807 10144328 10412651 10676981 10971759 11249315 11557791 11843262 12130809 12386149 12649794
2798 12649794 12911383 13159050 13398175 13683036 13952398 14267439 14619781 14913455 15237611
2789 15237611 15631568 16068890 16513783 16934525 17331674 17777821 18292716 18804872 19369697
2780 19369697 19965400 20564886 21233031 21994766 22771938 23587680 24492078 25525820 26616477
2771 26616477 27735587 28943221 30257987 31701824 33243652 34867703 36626525 38496633
2763C8496633K032811K177000K375325K595319K924750L166439L640130M134090
2755F1542497M735767N444017O221651P189683Q203713R367684J0731724J2447003
2747A25883739J4287644J6296441J8466829K0467552K1663377K1240745J8875961
2740B57182288J5673838J3651785J3885199J4147858J0949630J898517j1118959
2733C16270156k1443765k5614862k5892024k3943825k1482932j9897811j8451082
2726A59543855j6554676j4670221j2886600j1136304r579355q192939o993382
2719G9530378o085146n325001m770910m226737l713520l359890k914139k679214
2711D6455821k374615k135235j941192j775494j614935j466943j406736j291402
$$ plain form
2763 38496633 40529444 42706444 45081769 47677088 50601838 53768277 57408407 61542497
2755 61542497 66278264 71722281 77943932 85133615 93337328 102705012 113436736 125883739
2747 125883739 140171383 156467824 174934653 195402205 217065582 238306327 257182288
2740 257182288 272856126 286507911 300393110 314540968 325490598 327389115 316270156
2733 316270156 294826391 269211529 243319505 219375680 197892748 177994937 159543855
2726 159543855 142989179 128318958 115432358 104296054 94716699 86523760 79530378
2719 79530378 73445232 68120231 63349321 59122584 55409064 52049174 49135035 46455821
2711 46455821 44081206 41945971 40004779 38229285 36614350 35147407 33740671 32449269
2703C2449269j204627j130040j131859r74342r96251j006518r20789q58258q61608
2694B3364977q06571p63963p53052p52689o54486o29660o08878o35753n44368
2685A7215557n03723n55296m80105n05178m01750l86219m15954m03949l48080
2676A3215303l38229l38385l20728l06859k82563k84800k58833k60395k46443
2667A0578068k86252k11025k14541k20885k00059k68720k07068k52457k93657
2658H423404j52830k55576k26679j49062j60216k42393j75942k72098j71797j59307
2648F457504j74201j56951j40050r8396j52087q9980j30224q9413j27093m8869
2638E250240p6638j12437j46146q8839m7333r3724j28829r9044o8462j46310p2932
$$ plain form
2703 32449269 31244642 30114602 28982743 28008401 27012150 26005632 25084843 24226585 23364977
2694 23364977 22558406 21794443 21041391 20288702 19634216 19004556 18395678 17759925 17215557
2685 17215557 16711834 16156538 15676433 15171255 14769505 14383286 13967332 13563383 13215303
2676 13215303 12877074 12538689 12217961 11911102 11628539 11343739 11084906 10824511 10578068
2667 10578068 10291816 10080791 9866250 9645365 9445306 9176586 8969518 8717061 8423404
2658 8423404 8270574 8014998 7788319 7639257 7479041 7236648 7060706 6788608 6616811 6457504
2648 6457504 6283303 6126352 5986302 5887906 5735819 5645839 5515615 5426202 5299109 5250240
2638 5250240 5173602 5061165 4915019 4826180 4778847 4685123 4556294 4457250 4388788 4242478 4169546
2627D169546j17497j04527p1594j73324l7772q2652p0409l7268q5520n3006p7130
2616C258847o0564o5844m4530k7443m9501p1651k5334k1164p8975q998o5487m5915
2604B693441r2024l5065k8004n1607l6497P979l0167l3438o9917l5025k3170k2494
2592B244012n2985J033n9642l2139l6912l8074o4131j9447m6162m1950l3965o5792
2580A753846L1665p4098l3395l3916K6995k6419n53n32j3832j7120k9183K955
2568A586413l498L7944k9157k7803k4955m8870q557k9256m7363K1654k7451K970
2556A402071M3835l4804n7296j9455J6139J2035n2011m7289K9821M039l5143J1210
2544A273152m8398n1846M3424l995k1752L756N9900n3954N1590M6638j0319l1315
$$ plain form
2627 4169546 4052049 3947522 3875928 3702604 3664832 3582180 3511771 3474503 3388983 3335977 3258847
2616 3258847 3198283 3132439 3087909 3060466 3010965 2939314 2913980 2892816 2813841 2804843 2739356 2693441
2604 2693441 2601417 2566352 2538348 2486741 2450244 2458223 2428056 2394618 2324701 2289676 2266506 2244012
2592 2244012 2191027 2192060 2132418 2100279 2063367 2025293 1961162 1941715 1895553 1853603 1819638 1753846
2580 1753846 1785511 1711413 1678018 1644102 1671097 1644678 1644125 1643593 1629761 1612641 1583458 1586413
2568 1586413 1582915 1620859 1591702 1563899 1538944 1490074 1481517 1452261 1404898 1426552 1399101 1402071
2556 1402071 1445906 1411102 1353806 1334351 1350490 1362525 1310514 1263225 1293046 1297085 1261942 1273152
2544 1273152 1224754 1172908 1216332 1212337 1190585 1194341 1254241 1200287 1251877 1298515 1288196 1256881
2532A256881K2931P09j8662R506J9138j1889l5296J1588k0619J2835k588k2876
2520A221658j1601k8945n207j4263j9894k7513L5728K9710l6168k7386J4225J4605
2508A144949j9575J396N519J5874j4303p471M3055p8P119J5936L7956J3045M9422
2495A292844O3238M9306M4401O6784R7286M9265J07505O5914J53710N9925Q2812
2484B132990R1829O1626J8872Q1209M344o4301r1484j05751j45153j52464p0411
2473A761306j21010o1730j07008j21192m1863o0176n9327m9867o3836j3977n6388
2462A004932k7002l5542m2237m4424J0545j8854o0958j9448M1633j1364l1672
2451G65609j5958R630l0953j2662k6505k5678n8229M9644l533J8198m9693j8525
$$ plain form
2532 1256881 1279812 1280521 1261859 1271365 1290503 1278614 1243318 1254906 1234287 1247122 1244534 1221658
2520 1221658 1210057 1181112 1175905 1161642 1141748 1114235 1149963 1179673 1143505 1116119 1130344 1144949
2508 1144949 1125374 1126770 1132289 1148163 1133860 1126389 1169444 1169366 1176485 1192421 1230377 1243422 1292844
2495 1292844 1356082 1405388 1449789 1516573 1613859 1663124 1770629 1836543 1990253 2050178 2132990
2484 2132990 2224819 2286445 2305317 2386526 2390870 2326569 2235085 2129334 1984181 1831717 1761306
2473 1761306 1640296 1578566 1471558 1350366 1308503 1248327 1189000 1139133 1075297 1061320 1004932
2462 1004932 977930 942388 900151 855727 866272 847418 786460 767012 808645 797281 765609
2451 765609 749651 759281 728328 715666 689161 663483 605254 654898 651365 669563 619870 601345
2439F01345m0298J5895J0020l339l7464l1823K7363j3114R841k0186n591k8683
2427D83966p731M313L5729m6944J2226N093l2397L1113K2600k4830K701j4952
2415D70887K8306m5391L020j5841n857p274j3612K8835m5087k96J9459o286l2145
2402C78718M0965K2496o4601O598M950K9844k4423K2810K948j8610o8172J7185
2390C50708j3996k728J1419k041n240K5240k0178q934K8727P45l2113k8813O572
2377C09368J910l084K5615l6374l459M1730K422K4973m2224J7602R787l1481M537
2364C21322n692K3059j7140j0452K1672j7500K6140m3258J0340j4416m1584k8990
2352B23501J7809J0934j8034Q572K8146N664j1519j6027l7397K2317n2324J4819
$$ plain form
2439 601345 561047 576942 586962 583623 546159 514336 541699 528585 538426 518240 512649 483966
2427 483966 476235 480548 516277 469333 481559 486652 454255 485368 507968 483138 485839 470887
2415 470887 499193 453802 456822 440981 435124 427850 414238 443073 397986 397690 417149 410863 378718
2402 378718 419683 442179 377578 384176 389126 418970 394547 417357 420305 401695 333523 350708
2390 350708 336712 333984 345403 343362 338122 363362 343184 334250 362977 363722 331609 302796 309368
2377 309368 311278 308194 333809 297435 293976 335706 338128 363101 320877 338479 348266 316785 321322
2364 321322 315630 338689 321549 311097 332769 315269 341409 298151 308491 294075 252491 223501
2352 223501 241310 252244 234210 242782 270928 276592 265073 249046 211649 233966 181642 196461
2340A96461M8060o06L7153l6203j9823j6136J8804L8852l4938l7308O896j4308
2328A86904j873k0794N0431k0194J2295K0961m8190P376K8913J1761j7393l6783
2316A73414J3901K9787R72J2966k9980k7300m2544N688M3467l6753N4160O0862
2304B58640j8162k2059n2478j6551K8308o344p342k7721N749L5877J0724n897
2292A82744J9709L1140m9897J5049O8792j1094M4406j0072K762l0437m2160l4970
2280A85972l2654L5961N2993q127m9916k3040l0141J2518K1948J014k689k52k4298
2267A39289N625j2347K6558k4368J9216k015K7506n6623J1040M3284m971j0709
2255A61485J2139k3599l692m3130J2192J382n035q340K6710L151l0514K8750M662
$$ plain form
2340 196461 244521 243915 281068 244865 225042 208906 227710 266562 231624 194316 201212 186904
2328 186904 185031 164237 214668 194474 206769 227730 179540 186916 215829 227590 210197 173414
2316 173414 187315 217102 218074 231040 201060 173760 131216 136904 180371 143618 197778 258640
2304 258640 240478 218419 165941 149390 177698 171354 164012 136291 142040 177917 188641 182744
2292 182744 202453 233593 183696 198745 267537 256443 300849 290777 293539 263102 220942 185972
2280 185972 153318 189279 242272 234145 184229 161189 131048 143566 165514 166528 163839 163587 139289
2267 139289 144914 132567 159125 134757 153973 151958 179464 122841 133881 177165 172194 161485
2255 161485 173624 150025 146333 103203 115395 116777 111742 103402 130112 133263 102749 131499 136161
2242A36161J5499l3879J2465J0249J4667o717k9192Q61j1214K2925M0060R596
2230A81481M3183m3653l2547q863N774l7182k076J6090K3347K5904L255j2010
2218A62703k1865n8453Q971L3722l682K8098J5898l1869K836J1530p353j8827
2206A21709j1367j526L3077K7262J5012q204K8108K735k0463j1639L646N055J3659
2193A97064l0604o668j0881L3676K6643k9217j6162k2642N214K4759R222J664
2181A82068k1927L0316K4601l6998j4956N6643L1847k2558o1123j0686N4194m6627
2169A64794l4574K2913N0212J6490l8614M9201P791R509L5584j4928k5165j9570
2157B23643j84j6576J1439o6938J9003j7225K9860P781l7311N0623N214k1701
$$ plain form
2242 136161 151660 117781 130246 140495 155162 148445 119253 120114 108900 131825 171885 181481
2230 181481 224664 181011 148464 139601 145375 108193 106117 122207 145554 171458 174713 162703
2218 162703 140838 82385 91356 125078 121396 149494 165392 133523 136359 147889 140536 121709
2206 121709 110342 108816 141893 169155 184167 175963 204071 206806 186343 174704 178350 183405 197064
2193 197064 166460 159792 148911 182587 209230 180013 163851 141209 146423 171182 180404 182068
2181 182068 160141 190457 215058 178060 163104 219747 251594 229036 167913 157227 211421 164794
2169 164794 130220 153133 203345 219835 181221 230422 238213 247722 283306 268378 243213 223643
2157 223643 223459 206883 218322 151384 170387 153162 183022 190803 153492 204115 209329 187628
2145A87628l6727j9923M3669K1485k9176n3481j1664L9468K3417L0249p347L5082
2133B22680Q016j398P610j8649L3687m150K6361k3758j0747k7622K7184k7954
2121B11260N461K622L4411m923k331J1537M4175j1953l0991L5314J4853m3435
2109B66000J4538N2024j9475J9812K5725j9916r429M1230J5676K6177M288l83
2097D16267L5316O4315l7034L567k368N1985M1287o0780J6839L1082J1695N351
2085E77522N341j3253J1174M0579K1379o19M5643P2300L1653M881K8624R6666
2073I21890N0407M6551P2338M3015K8084M7180O8533O4280N1520J22276J52306
2062A668380P5903J05776J50366J73910K46430K53463K67628L07153L63431L42239
$$ plain form
2145 187628 150901 130978 174647 196132 166956 113475 101811 141279 164696 194945 187598 222680
2133 222680 230696 229298 236908 218259 251946 247796 274157 250399 239652 212030 239214 211260
2121 211260 216721 219343 253754 248831 246500 258037 302212 290259 259268 294582 309435 266000
2109 266000 280538 332562 313087 332899 358624 338708 329279 370509 386185 412362 416650 416267
2097 416267 451583 515898 478864 482431 480063 532048 573335 512555 529394 560476 572171 577522
2085 577522 582863 569610 580784 621363 642742 642123 687766 760066 791719 796600 825224 921890
2073 921890 972297 1018848 1091186 1134201 1162285 1209465 1277998 1342278 1393798 1516074 1668380
2062 1668380 1744283 1850059 2000425 2174335 2420765 2674228 2941856 3249009 3612440 3954679
2052C954679M89759N83579P50727Q38735J026052J316493J791155K078226J742336
2043A4571741L51207j760926j953417j745556j826674j275780r47353o93769n02306
2034D217167m24151l54672k03531k70183j81494j77307k33114j82880j47112k04410
2024A838313j54722q8319r2364o9945p1070o7428q1587o6715n6359o5189n2562
2013I72053P196j255j00280m8837J0518k4589k9n5701n2404J4017N182j9235j8901
2000F87735N012n9795n0700o0996J7524L8315k2703n3812m5380M5901k9143l1528
1988D40430j269j4180k0596k7000j8468j373K98K3820k2516n6158P692K8008l77
1975C38311k0629k4126N0124L3845l6444o6806L134n514l588q531j6551j9740
$$ plain form
2052 3954679 4444438 5028017 5778744 6617479 7643531 8960024 10751179 12829405 14571741
2043 14571741 14922948 13162022 11208605 9463049 7636375 6360595 5413242 4719473 4217167
2034 4217167 3793016 3438344 3234813 2964630 2783136 2605829 2372715 2189835 2042723 1838313
2024 1838313 1683591 1595272 1502908 1432963 1361893 1294465 1212878 1146163 1089804 1024615 972053
2013 972053 979249 977994 877714 828877 839395 814806 814777 759076 706672 720689 725871 706636 687735
2000 687735 692747 632952 582252 521256 538780 577095 554392 500580 455200 501101 471958 440430
1988 440430 439161 424981 404385 377385 358917 357544 357842 381662 359146 302988 310680 338688 338311
1975 338311 317682 293556 343680 377525 341081 274275 277409 271895 268307 259776 243225 223485
1963B23485K5473N603K862N192n2037j6910k1103J3266k452j4601P0787l817k3228
1950B12520J1098n8425l3753J3621J3484J9065J1533p947p8O268L3759k1086n9971
1937A40088k6168k1821K7571p435L6886J8659K3298k5650o8728r220J8702j4868
1925I1314M1196P251K2140J7989l2211L5715L222m2949M44N49j0549r611k9411
1912I5089j2145n4009K972R68N047L4952L4000J8861k8106j6917R114J0852L67
1899A01045J1273m776L9359l8215m3466J1470Q573J2505n712k4181L9376N3132
1887A60383n0138l9727J9616n0553K3236M3561j3170K6295j6064Q687k6567N381
1875I0940m354M1l3443J7696p453j801n846k164J1371J1352n4613m781L7039j0605
$$ plain form
1963 223485 248958 254561 257423 262615 210578 193668 172565 185831 183379 168778 239565 235748 212520
1950 212520 223618 165193 131440 145061 158545 177610 189143 181196 181118 187386 221145 200059 140088
1937 140088 113920 92099 119670 112235 149121 167780 191078 165428 96700 87480 106182 91314
1925 91314 132510 139761 161901 179890 147679 183394 186616 143667 144111 144660 134111 124500 95089
1912 95089 82944 28935 31907 32875 37922 72874 106874 125735 97629 80712 89826 100678 101045
1899 101045 112318 107542 146901 108686 65220 76690 85263 97768 92056 67875 107251 160383
1887 160383 110245 70518 90134 39581 62817 106378 93208 119503 103439 112126 85559 90940
1875 90940 86586 86627 53184 70880 63427 61626 55780 53616 64987 76339 21726 16945 53984 43379
1861D3379j5862k2110L7778j4780N986M979m314J1388M9534n422l9286N0362m3934
1848E7698J2152L2201l0989n5704N0797k489J1269J509j5270J1603k8337Q08k6416
1835A8832M4385J613l3624J2492K2127K3655N217m0685J1852L1634m3920J0685
1823F4263q532j8872k0690l3717J5394N4598J2326O381m152j3658R535j5025P710
1810E5561N969J3847J2537J8963m0919L7941K424q39K7488J3449k4591k9091j2863
1797G9876L3795l5827m7337J2409k496k3375N078K3602l996J3223J8484k0188
1785E3248J5636N1112k0100n5588q537L2957j3613J6241l1673p289M1900r407
1773F4887l0005k4030O932j5812K4143J844L8837k8215J4028K8219k5395j0447
$$ plain form
1861 43379 27517 5407 43185 28405 34391 39370 35056 46444 95978 90556 51270 101632 57698
1848 57698 69850 102051 71062 15358 66155 63666 74935 76444 61174 72777 44440 45248 18832
1835 18832 63217 64830 31206 43698 65825 89480 94697 54012 65864 97498 53578 64263
1823 64263 55731 36859 16169 -17548 -2154 52444 64770 71151 66999 53341 62876 47851 55561
1810 55561 61530 75377 87914 106877 65958 103899 106323 105484 132972 146421 121830 92739 79876
1797 79876 113671 77844 30507 42916 40420 17045 22123 45725 41729 54952 73436 53248
1785 53248 68884 119996 99896 44308 35771 68728 55115 71356 39683 32394 74294 64887
1773 64887 34882 10852 17784 1972 26115 27959 66796 38581 52609 80828 55433 44986
1761D4986m3828M1970m6974P609J9331J3887r916K158L2253M183l5639o700O398
1748B9718m5030j197Q615L503J1098K9633R29l1375P383L4291l8907j9011J0799
1735D49M0704k2872K8624J8553j5769J011L199j1698j4967K1766j9316j1846j960
1722A5878K0011J0472l4419k3606n126R245m782J2270N7851n4376k0816M2538
1710B5140P410l7401l9912Q3554L0101l2793l2369k7862K7550J2008k650k1531
1698h755J6039J152P294J2031l3724N845Q995k5863p598n404N1620k5384k365
1685f117K2423m252R006K5486m1281r221J7532M4132k8774r872N9890l4892j8836
1672B5224r163K0210K0734k5079O317L434J045n548m2295m537o084K4502j0545
$$ plain form
1761 44986 1158 43128 -3846 3763 23094 36981 27065 29223 61476 65659 30020 23320 29718
1748 29718 -15312 -16509 -7894 -4391 6707 36340 37269 5894 13277 47568 8661 -10350 449
1735 449 41153 18281 46905 65458 49689 50700 53899 42201 27234 49000 29684 17838 15878
1722 15878 35889 46361 11942 -11664 -16790 -7545 -12327 -57 57794 3418 -17398 25140
1710 25140 32550 -4851 -44763 38791 68892 36099 3730 -24132 3418 15426 12776 -8755
1698 -8755 7284 8436 15730 27761 -5963 -118 8877 -16986 -24584 -29988 21632 -3752 -6117
1685 -6117 16306 12054 21060 46546 5265 -3956 13576 57708 28934 19062 78952 44060 25224
1672 25224 16061 36271 57005 31926 38243 41677 42722 37174 -5121 -9658 -15742 8760 -1785
1659a785m1848j1818K8061L1384J1031l7391M8701j0504J1377P62j6449Q556N162
1646B5239k2006l3204J3045K5460K7024P763j5575K86J0323K4554j5579k3797
1634B3533j1009M0872L2967j1998k4898n9614j2673n858o755P8125K108j4782
1622C0018j6054k2957O2523o041k4229O678P05M3789n9537l1638p760j1694O5340
1609B9143j6992J2310j547K1893n744Q887n2491J3372m475j0398k548N444q47
1596c993P680J7277J7526k1459p733K9245J9540n701k7823j9874k2478J6993N5631
1583E4831q202n7168J897O424J6908K8588l3502l1746N70j3793J4810M8396j462
1570B6551K4747J4730l9064P207J700L230m4194r282J8332j1591l9278K6744J0723
$$ plain form
1659 -1785 -43633 -55451 -27390 3994 15025 -22366 26335 15831 27208 27970 11521 20077 25239
1646 25239 3233 -29971 -16926 8534 35558 43321 27746 28032 38355 62909 47330 23533
1634 23533 12524 53396 86363 74365 49467 -10147 -22820 -28678 -35433 42692 44800 30018
1622 30018 13964 -8993 53530 47489 23260 29938 30643 74432 14895 -16743 -24503 -36197 29143
1609 29143 12151 24461 22914 44807 39063 47950 -4541 8831 4356 -6042 -8590 -3146 -3993
1596 -3993 3687 20964 38490 17031 9298 38543 58083 52382 24559 4685 -17793 -800 54831
1583 54831 46629 -10539 -8642 -2218 14690 43278 9776 -21970 -21400 -35193 -20383 28013 26551
1570 26551 51298 66028 26964 34171 35871 39101 -5093 -14375 3957 -7634 -46912 -20168 -9445
1557i445j4680l1017M2182k281J5879J7391n3014N3557n5399Q817K7337m562m961
1544a0196k5375L2425J0836j2573r080L0727Q493j0683n5680j8344K3739M3944
1532H233j3722J921k1936o423M9688J5092N410l0598j1018Q313j7893L9712j6792
1519I987J1267j1072K097l2860J7940r675O699M3819l5478K6449N146K0714m4775
1506A0258J101J7161k0550J0395J7073k0839R726k03k3073j9542j6534J2732J7559
1493d736p793r687j935j9957K8665N9860l3413j3958o880k6959K755M6623L2497
1480D5082m4910o3346L4579K0293M8360J6800k243L7180l8424k0627j3171m1106
1468b1533K9670M0224m3051J0572p853k5733k0500M3139j0017l1606k1839K9580
$$ plain form
1557 -9445 -24125 -55142 -12960 -15241 638 18029 -34985 18572 -36827 -28010 -673 -5235 -10196
1544 -10196 -35571 -3146 7690 -4883 -13963 16764 25257 14574 -41106 -59450 -35711 8233
1532 8233 -5489 -3568 -25504 -31927 17761 32853 38263 7665 -3353 4960 -12933 26779 9987
1519 9987 21254 10182 12279 -20581 -2641 -12316 -5617 38202 2724 29173 34319 55033 10258
1506 10258 11359 28520 7970 18365 35438 14599 24325 24122 1049 -18493 -35027 -22295 -4736
1493 -4736 -12529 -22216 -24151 -44108 -15443 44417 11004 -2954 -9834 -36793 -34038 12585 45082
1480 45082 172 -63174 -28595 -8302 40058 56858 54615 91795 53371 32744 19573 -21533
1468 -21533 8137 48361 5310 15882 8029 -17704 -38204 4935 -5082 -36688 -58527 -28947
1456b8947L5282k0450N584Q562J1321k5282O8057l6044k1164N2046j5139R776
1444D3602j5057k1999m699n9074L5327K28M3839j8632L3057M9607l0885q323j4846
1431C2145J605o237k133l2186k8112K6392J6759P286k7838K199L1594l2341J6373
1418E506K2044j5111l9971K4764L8619j9865o2621L5310N3980J0354k1447K6410
1406E7972n2723m2954P5144m946k7920k5882J8680K0172j2n979l943P712O623
1393B1944Q476k8375Q378J7757J0681k2517m4985L6176L773l5223M2280j8836
1381d71N1864K2429n5356j7980J1657p584P082k4658q76N7817P245m5746J5270
1368B0693J7335m3894o329P687j4591N7668o970k0336P976m950j1426n059M4239
$$ plain form
1456 -28947 6335 -14115 -8531 31 11352 -13930 54127 18083 -3081 48965 33826 43602
1444 43602 28545 6546 1847 -57227 -21900 -21672 22167 3535 36592 86199 55314 46991 32145
1431 32145 33750 27513 25380 -6806 -34918 -8526 8233 15519 -12319 -10120 21474 -10867 5506
1418 5506 27550 12439 -27532 -2768 35851 15986 -46635 -11325 42655 53009 31562 57972
1406 57972 5249 -37705 37439 32493 4573 -21309 -2629 17543 17531 11552 7609 15321 21944
1393 21944 30420 2045 10423 28180 38861 16344 -28641 7535 11308 -23915 18365 -471
1381 -471 51393 73822 18466 486 12143 4559 11641 -13017 -13893 43924 51169 5423 20693
1368 20693 38028 -5866 -12195 -4508 -19099 38569 31599 11263 19239 14289 2863 -2196 42043
1355D2043J0273k8745r790R93n0134j9023J8185N3531l9375o406J4611L4454j0970
1342I647R944L2528l3166l3525J0856k360K8010J367l0570j4498J5729O948K860
1329C770J9670k6526k812l1605N7699M3495n9432l0771J1804j949M34N885J1495
1316A157j5591J6386J4059l4947l637L4630n244j0512O791J7581o669j6416P268
1303D856R736J3779j5196l3241r534K2066q168N658K1353k516o2952M0804J3479
1290A24m4329M4498m419k471k571R585Q908k7100L34O1499k0762n0182L9674n989
1276F799J5605L3676j0129m1347n7475L5148j7571j2099O7549r294O021n381J737
1263A3239q900k8650j076Q716J9841J931k3670k9710L7822J0198l2775k9771L0646
$$ plain form
1355 42043 52316 23571 13781 14774 -35360 -54383 -36198 17333 -22042 -28448 -13837 20617 9647
1342 9647 19591 52119 18953 -14572 -3716 -6076 21934 23301 -7269 -21767 -6038 910 3770
1329 3770 23440 -3086 -5898 -37503 20196 63691 4259 -26512 -14708 -16657 -16223 -10338 1157
1316 1157 -14434 1952 16011 -18936 -22573 12057 6813 -3699 3092 20673 14004 -2412 4856
1303 4856 14592 28371 13175 -20066 -29600 -7534 -15702 -10044 11309 8793 -54159 -13355 124
1290 124 -44205 293 -4126 -6597 -9168 417 9325 -17775 -17441 44058 23296 -26886 12788 6799
1276 6799 22404 56080 45951 4604 -52871 -17723 -35294 -47393 20156 10862 16883 11502 13239
1263 13239 4339 -24311 -25387 -16671 3170 5101 -18569 -48279 -10457 -259 -33034 -62805 -32159
1250c2159K5458j1298O465L491j3676l2549L3158J9914k8469L465L9897m8928
1238c5231L567N5359k8027N433j2767J0807J5978k6990l5177j4989K8612Q26j1016
1225d3615N1544R814l8926M644l7229J539M4152l849P415p688L827L4162n3540
1212b7750N205K3374J0013J7110J4357L7099j2814o5919L77l6659n546M8031j397
1199E481k942K2985j2942J7746K514O584j3655k0949k7847J8582N1647j3272m1324
1186g392m5065L0954l1912p40L6521M9266k4280m0877N8638o620m421j1839J0355
1173A2588P834o897K5926k7130r649j4096J3994j5265k2147K8375P138j4144K0666
1160G193J6337J3266m3844j9277N6324L633l8324p804j3046O3638n396m866m3303
$$ plain form
1250 -32159 -6701 -17999 -11534 -8043 -21719 -54268 -21110 -1196 -29665 -26200 13697 -35231
1238 -35231 -31664 23695 -4332 1101 -11666 -859 15119 -11871 -47048 -62037 -33425 -32599 -43615
1225 -43615 7929 17743 -21183 -16539 -53768 -52229 -8077 -11926 -4511 -12199 -8372 25790 -27750
1212 -27750 -22545 829 10842 27952 42309 79408 66594 675 1052 -35607 -41153 6878 5481
1199 5481 2539 25524 12582 30328 32842 39426 25771 4822 -23025 -4443 47204 33932 -7392
1186 -7392 -52457 -21503 -53415 -54155 -17634 31632 7352 -33525 25113 18493 14072 2233 12588
1173 12588 20422 13525 39451 12321 2672 -11424 2570 -12695 -34842 -6467 671 -13473 7193
1160 7193 23530 36796 -7048 -26325 29999 33632 -4692 -12496 -25542 38096 32700 27834 -15469
1147a5469l6558L3563L1849j0847Q040j6513L0819l0626m1125M5790o910j6248
1135b4235L3953J2433j6797J9341m8767M4571J1911l4915R980ol0138o720J1122
1122a8267L8913j2085n0142J3661N0771m3649L8235K5428K5324k0386m2901j4584
1110i682j2358O0556m164O722j5468j7360m3476J0415M7476j7887K8807N2583
1098H6164n8452K3883J3061q340j7947n3506j4755N4294R343k4759l5877J1782
1086a5109K0755J2914k4529L9241L3667p3820J0692n2571P702M1747J2332R165
1074B2186J4106m0897j0345J9835k2868k0956J9457J8366N379O523L150l1226
1062a7290l6379M3038Q638j7768l044L479M1525J3002K0263j5853o2473L0972
$$ plain form
1147 -15469 -52027 -18464 13385 2538 10578 -5935 24884 -5742 -46867 -1077 -7987 -24235
1135 -24235 9718 22151 5354 24695 -24072 20499 32410 -2505 7475 7469 -22669 -29389 -18267
1122 -18267 20646 8561 -41581 -27920 22851 -20798 17437 42865 68189 47803 4902 -9682
1110 -9682 -22040 38516 34352 41074 25606 8246 -35230 -24815 22661 4774 33581 86164
1098 86164 27712 51595 64656 56316 38369 -15137 -29892 24402 33745 8986 -26891 -15109
1086 -15109 5646 18560 -5969 33272 66939 -6881 3811 -48760 -41058 689 13021 22186
1074 22186 36292 -4605 -14950 4885 -17983 -38939 -19482 -1116 4263 10786 13936 -17290
1062 -17290 -53669 -10631 -1993 -19761 -22805 -19326 22199 35201 55464 39611 -22862 8110
1050H110P608K242l183P783O397k4012Q264l0498J0096R147K6608l3508K6688
1037B1742K2503j7235Q05r96j8553l0425L4236p602j8745K9887j3969J4364k6312
1024a0300k0714k031L1631j9039j2994r859L6526J4553j4229J7259l5944J2788
1012a2353p163r656K1566K386m579L79q762K2652Q905K4209J3031j7403l905l5595
998f288M8J4155J3313Q990J0326m5162o880j3099L8486n24n0842N3719P17j035
984A5924J8822m7872o102J3283j7173N358k3327L5823j1796J4578j5623Q281L5129
971B5305j7318r651J0983N0160L12l9201L4810m8033N5852k1748m7623K49K8683
958B2780k9179L7222p507l5145m1443J4476M0027o174L4513l1395k1448K1669
$$ plain form
1050 8110 15718 17960 14777 22560 28957 4945 13209 -17289 -7193 1954 28562 -4946 21742
1037 21742 44245 27010 27815 26819 8266 -22159 12077 4475 -14270 15617 1648 16012 -10300
1024 -10300 -31014 -33045 -1414 -20453 -33447 -43306 -6780 7773 -6456 10803 -25141 -12353
1012 -12353 -19516 -29172 -7606 -5220 -9799 -9420 -18182 4470 13375 37584 50615 33212 29307 -6288
998 -6288 -6240 7915 21228 30218 40544 -4618 -11498 -24597 13889 13365 -37477 16242 16959 15924
984 15924 34746 -13126 -19228 -5945 -23118 -17760 -41087 -5264 -17060 -2482 -18105 -9824 25305
971 25305 7987 -1664 9319 59479 59791 20590 55400 7367 63219 41471 -6152 -5903 22780
958 22780 -6399 30823 23316 -11829 -53272 -38796 1231 -4943 29570 -1825 -23273 -1604
946a604J0071J6298m7565K0226K4848P050N3942n0716J4415m7703k618j6054J41
933a9269j4582K5993L7370k4240j6070J2502l6921L1111M5388r35J334k4954m313
920A2414j8493J5730q354j64l4020j7235L660J4150k0338M7955L4476m2092j567
907a3878j4548k30j62L6748L7074l6582l6540J1680M4416l7555j2456m943j6977
894d3953N605l6017J5787M8870K7993k9260j9033L2086L4588n7756J3685j5190
882b2595K7396M773j9034N892r146k0868J9417P646j7052K4781M1315q100j7286
869A7139j0173Q458L258O228P084m494m8042p208J3145J4595L4082l2198k4054
856b2180J3887M3071m473j1799j0374n092L1179j9862k9047R60k4579J2207l7224
$$ plain form
946 -1604 8467 24765 -22800 -2574 22274 29324 83266 32550 46965 -738 -3356 -19410 -19269
933 -19269 -33851 -7858 29512 5272 -10798 1704 -35217 -4106 41282 40347 41681 16727 12414
920 12414 -6079 9651 1297 1133 -32887 -50122 -46462 -32312 -52650 -4695 29781 -12311 -13878
907 -13878 -28426 -28656 -28818 7930 45004 8422 -28118 -16438 27978 -9577 -22033 -26976 -43953
894 -43953 -38348 -74365 -58578 -9708 18285 -10975 -30008 2078 36666 -21090 -7405 -22595
882 -22595 4801 9574 -9460 -3568 -12714 -33582 -14165 -6519 -23571 1210 42525 34425 17139
869 17139 6966 15424 18682 24910 31994 27500 -20542 -27750 -14605 -10 34072 1874 -22180
856 -22180 -8293 34778 30305 18506 8132 3040 34219 14357 -14690 -13730 -38309 -26102 -63326
843f3326j9603N4742N816n8685O3941N3499l4352j3481j4446J941N0556m5890
831a9288j9867J7367q177j3980J5314J2893Q164K9731p416p642N699j5708p830
818a0740M965L954J1318r916m865K2478Q923J2484O338j8879l0146k1264K2258
805c092k3665K7408K4471j3681k7665j6461M2898k5727J3781M0767l9100j7530
793a7596j5076J3660P5502l1177q0179j063l283K5365N3732k0029m938n1365p145
780f3592M5148R120o085P559N9229j9390k9778l9749m971M6720J5259p484n310
767F676k9435K0816j0470K4918l0505o693k1501M5237K2368m045J790K0000k3916
754A5240m7747L490K0489J9906n15j2016j7790L6087r143k3402m4029L0358L5151
$$ plain form
843 -63326 -82929 -28187 -22371 -81056 -17115 36384 2032 -11449 -25895 -23954 26602 -19288
831 -19288 -39155 -21788 -29965 -43945 -28631 -15738 -7574 22157 14741 7099 12798 -2910 -10740
818 -10740 -5775 -1821 9497 -419 -5284 17194 26117 38601 44939 26060 -4086 -25350 -3092
805 -3092 -26757 651 25122 11441 -16224 -32685 10213 -15514 -1733 39034 -66 -17596
793 -17596 -32672 -19012 56490 25313 -54866 -55929 -59212 -33847 19885 -144 -5082 -56447 -63592
780 -63592 -18444 -9324 -15409 -7850 51379 31989 2211 -37538 -42509 4211 19470 11986 6676
767 6676 -22759 -1943 -12413 12505 -18000 -24693 -46194 -957 21411 17366 19156 39156 15240
754 15240 -32507 -29017 -8528 11378 10863 -1153 -18943 17144 8001 -15401 -59430 -29072 6079
741F079M1103m1538n269Q466l9958l332j5614K9108N9070K6344j8322l9495k1061
728a4419P159M8416k1896k5422l9903J589K0566j2045K3700Q833l0498J0060J4363
715i497k7112L387J9266M7018L038l4194j3953j2493j4045K1371Q1567j2521k574
702D9258n4470K5732M509J4848q576q742l1295j052J4203L0664K105j7011L6955
689E7128j0540l4112m8547K4322j2147K1654J8131o82K3261J849j0722k8689K976
676C882J183r286m83k0688N1144k7275J0561K6056l0747k6723n416K3707K7694
663B3609k6226l1923L1764K878m410J9876K9094j3990p1295k426N685K3324J0242
650c798J8674J1735j2349j1988O466n975k7060J3018j5037O708j8398O4174R754
$$ plain form
741 6079 47182 5644 375 8841 -31117 -34449 -50063 -20955 38115 64459 46137 6642 -14419
728 -14419 -7260 41156 19260 -6162 -46065 -44476 -23910 -35955 -12255 -3422 -33920 -23860 -9497
715 -9497 -36609 -33222 -13956 33062 36100 1906 -12047 -24540 -38585 -17214 64353 51832 49258
702 49258 -5212 20520 25029 39877 31301 22559 -8736 -9788 4415 35079 37184 20173 57128
689 57128 46588 12476 -36071 -11749 -23896 -2242 15889 15207 38468 40317 29595 906 3882
676 3882 5065 -4221 -4704 -25392 25752 -1523 9038 35094 4347 -22376 -27792 -4085 23609
663 23609 -2617 -34540 -2776 102 -4308 15568 44662 30672 -40623 -43049 -37364 -14040 -3798
650 -3798 14876 26611 14262 2274 8740 2765 -24295 -11277 -26314 -19606 -38004 26170 35924
637C5924n0121M0400m4604R401J3712K8666j0390L2783k7540l3274J5867j0610
625B14J8454k8362L885L871j1629p021l0488l617J1180K9803L2179l1530J4466
612A405K6305n8432l1523Q90N7813K0477O759J592m2855n9427J9198M2676M471
599a0651l596Q171K145j1386J5852k858J9210k7966J2583L8502l1983P668O364
586B2055n481L362J9039J8815k7053l9414l6118K8504J3270K803r557n0904N529
573e5150J9924J3479L8448l2093j0365n661K2415L9224l2750m2551M9571m235
561B56N962K7362j7713j6609j8878K9059Q586l6553J1916p852M097k3539L9443
548E537L5208l4201K586n151l0613K201J595j0383L5222p060j2122K7137K0053
$$ plain form
637 35924 -14197 26203 -18401 -9000 4712 33378 22988 55771 28231 -5043 10824 214
625 214 18668 -9694 -5809 -1938 -13567 -20588 -51076 -54693 -43513 -13710 18469 -13061 1405
612 1405 27710 -30722 -62245 -61355 -3542 16935 23694 25286 -17569 -76996 -57798 -15122 -10651
599 -10651 -14247 -6076 -3931 -15317 535 -2323 16887 -11079 1504 40006 8023 15691 22055
586 22055 16574 19936 38975 57790 30737 -8677 -44795 -16291 -3021 -218 -9775 -60679 -55150
573 -55150 -35226 -21747 16701 -15392 -25757 -31418 -9003 30221 -2529 -45080 4491 256
561 256 6218 33580 15867 -742 -19620 9439 18025 -18528 -6612 -14464 -10367 -33906 5537
548 5537 40745 6544 9130 3979 -26634 -24433 -22838 -33221 2001 -5059 -17181 9956 30009
535C0009J1154K0944m2965k144l8511J0597J2096k1240K581j1437K4419N1433
523D6936j3920l8114k2922L4661j7773J5456J5179J5226l3569l746J9071q241
511H244o4191M453J5904k3590N0072L1769j5774n8734L4041j7263K1933L4568
499B1432j2476j8379K5833k1493P6065m1316j9328k1206L1659J955R30K4628J0144
486E8448m9597j5220K796j4289L2561r010l2197J3109O374k2960K3847M938j2515
473a3715k644o161P032K1260l3464q296j6344m655L4409K3656l4871K4594l5735
460d4934L1568K0751L322l4721Q724k3253L7884K6413j4360K914l3993J0769k4282
447c3198j8372M7199N302k5153O682n356Q630L9577K3489j26K147l2223J2892
$$ plain form
535 30009 41163 62107 19142 16998 -21513 -10916 1180 -20060 -17479 -28916 -4497 46936
523 46936 33016 -5098 -28020 6641 -11132 4324 19503 34729 1160 -2586 16485 8244
511 8244 -55947 -51494 -35590 -59180 -9108 22661 6887 -51847 -17806 -35069 -13136 21432
499 21432 8956 -9423 16410 -5083 70982 29666 10338 -10868 20791 22746 23676 48304 58448
486 58448 8851 -6369 -3573 -17862 14699 5689 -26508 -13399 -7025 -29985 -6138 -1200 -13715
473 -13715 -16359 -22520 -15488 5772 -27692 -35988 -52332 -56987 -22578 1078 -33793 -9199 -44934
460 -44934 -13366 7385 10707 -24014 -15290 -38543 -659 25754 11394 14308 -19685 -8916 -33198
447 -33198 -51570 -4371 931 -24222 -17540 -22896 -14266 25311 48800 48674 50821 18598 31490
434C1490J661k9019K4392o69p941r997l2506j0291N617K998j7885K113J5745j4025
420c8317K4125J0815J4115J5022m0592M7378l2596O76k0393j3754J8191p289M8825
407B6206r224j0442l1982K0372K8745k2843j8408K7761j4123k3391j6747J4656
395b9420N4041j5054l3838J473o788j1458L8671K553K322N878k2451l1918Q5898
382C9909J1482o8282K864O397J3074J0019j2073J0699j0335j3332J4011P115R187
369B0735J8025K8011l4241n4800j8886O303J1209J8379p086J9524J669j152L1429
356C9119j9950l5669L302Q676M6008M807n1835o299L7258j5450K1320J4787k7735
343A8339k3250j8908k979Q375m126L7169O451j2132k0045n1791L5586L4490l0901
$$ plain form
434 31490 33151 4132 28524 27855 19914 9917 -22589 -32880 -27263 -24265 -42150 -40037 -24292 -38317
420 -38317 -14192 -3377 10738 25760 -14832 32546 -50 626 -19767 -33521 -15330 -22619 26206
407 26206 16982 6540 -25442 -5070 23675 832 -17576 10185 -3938 -27329 -44076 -29420
395 -29420 24621 9567 -24271 -22798 -29586 -41044 -2373 180 2502 8380 -14071 -45989 39909
382 39909 51391 -16891 -14027 -7630 5444 15463 3390 14089 3754 -9578 4433 11548 20735
369 20735 38760 66771 32530 -22270 -41156 -34853 -23644 -5265 -12351 7173 8842 7690 39119
356 39119 19169 -16500 -13198 -4522 41486 46293 -5542 -11841 25417 9967 31287 46074 18339
343 18339 -4911 -23819 -26798 -18423 -22549 14620 21071 8939 -11106 -62897 -27311 7179 -23722
330b3722o199j9041J0530J8920j5519n232J9714J8988j5387J8994J8721k3498
318b731P15p72k4012m882k9952P457N5687J0567p5797J0643k6546N3876K9811
305D064j5308j8701J8143J4164M547N5592m0478L2585q296l1325k4887K8740j5567
292C273m864Q242O43J8122J1838k1259J7992J457l6277K1388j1945o079m3183
279d0652j2080J9545n570O460q099m018P647L6247j4014J8212K2027m8262m01
266b2958q911K414M7918P906m6782k638N763J3484J1271P5k7879J3358J6642K5670
252C5333Q716j8023l332Q80p398k9712K1443K7751j9562j9893k1564M2383P144
239B4166M6091p0152K5807j1325n0190K9891K1058l0893j565M207K8919m2422
$$ plain form
330 -23722 -29921 -48962 -38432 -19512 -35031 -40263 -20549 -1561 -16948 2046 20767 -2731
318 -2731 -2016 -2788 -26800 -31682 -61634 -54177 1510 12077 -63720 -53077 -79623 -25747 4064
305 4064 -11244 -29945 -11802 2362 6909 62501 22023 54608 46312 14987 -9900 18840 3273
292 3273 -1591 6651 7294 25416 37254 15995 33987 35444 -833 20555 8610 2531 -40652
279 -40652 -52732 -33187 -38757 -32297 -40396 -44414 -36767 -520 -14534 3678 25705 -22557 -22958
266 -22958 -31869 -29455 18463 26369 -20413 -23051 -17288 -3804 7467 7542 -20337 -6979 9663 35333
252 35333 44049 26026 22694 23574 16176 -13536 7907 35658 16096 -3797 -25361 17022 24166
239 24166 70257 105 25912 14587 -35603 -5712 15346 -15547 -17112 -12905 16014 -26408
227b6408k6735L7107l728L0793r800J424k0619m275J4440J4679p877j1976R842
214c133o702j5109J7481r906J6993j8306j9895K218j8075J4353J6587J4049L6886
201B7441k3569k8144l427q19p715K9271M742J0699j5163K9854n853J2649n608
188B4358P020J4960l5841j4746J8267k7823J5720l341m9989K3769K0368K2547
176A5269j4058k9546N4924J6086M9302j2688l5591o5608j2293N433K0469m858
164a3159P939J2240N363l1164j5368L3054r087J088K0811p410j0418q633K8233
151A3489K2178j7490M205J737n94q274K189k6881J5469K0389j0872k8967r054
138b2476M725j7767l3124L8339k777K6451j3963R986R550k5579p436J554r719
$$ plain form
227 -26408 -53143 -16036 -19764 11029 1229 2653 -17966 -22241 -7801 6878 -999 -12975 -3133
214 -3133 -9835 -24944 -7463 -17369 -376 -18682 -38577 -36359 -54434 -40081 -23494 -9445 27441
201 27441 3872 -24272 -27699 -28518 -36233 -6962 -2220 8479 -6684 23170 17317 29966 24358
188 24358 31378 46338 10497 -4249 14018 -13805 1915 -1426 -51415 -27646 -7278 15269
176 15269 1211 -28335 26589 42675 91977 79289 43698 -21910 -34203 -28770 -8301 -13159
164 -13159 -5220 7020 12383 -18781 -34149 -1095 -10182 -9094 11717 4307 -6111 -14744 13489
151 13489 35667 18177 22382 24119 23525 15251 17440 -9441 6028 26417 15545 -13422 -22476
138 -22476 -17751 -35518 -68642 -30303 -33080 -6629 -20592 -10606 -1056 -26635 -34071 -32517 -42236
125d2236P593K7655o311l8769M3378Q222l0876j4020K5875P773P99j381k2871
112c5169K8722m192j3140J7062k6036K6022j1621j5913K7869j906p039k836J4186
99c991p70K1558q406J8300o645k2404J0576l3729J017L6186m2246l821K8961j6263
85b1677L4823q023j6090K0221r987r815N387j9434K3778L0077k3202k3615j3461
72c1018j2499M5682Q324k3373j7591N886J8883j5499J7328J9715P04K5110m0294
59A358R140J3365O870J8547l7918Q760k6007r176J0875j3007K2657O912j6442
46d066M4772j2671m9250K2465K2155l9488j5887J9838J293j0750k3361n109N0681
33F22m496J1895p354k4964j8806K4825K3618j5773Q682k7963K5857O458J6736
$$ plain form
125 -42236 -34643 -6988 -13299 -52068 -8690 -468 -31344 -45364 -19489 -11716 -10917 -12298 -35169
112 -35169 -6447 -10639 -23779 -6717 -32753 -6731 -18352 -34265 -6396 -8302 -15341 -18177 -3991
99 -3991 -4761 16797 8391 26691 20046 -2358 8218 -25511 -24494 11692 -30554 -34375 -5414 -21677
85 -21677 13146 5123 -10967 9254 -733 -10548 -5161 -24595 -817 29260 6058 -17557 -31018
72 -31018 -43517 2165 10489 -12884 -30475 -24589 -5706 -21205 -3877 15838 16542 41652 1358
59 1358 10498 23863 30733 49280 11362 20122 -5885 -15061 -4186 -17193 5464 12376 -4066
46 -4066 40706 28035 -21215 1250 23405 -16083 -31970 -12132 -10839 -21589 -44950 -50059 622
33 622 -3874 8021 667 -24297 -43103 -18278 5340 -10433 -1751 -29714 -3857 2601 19337
20A9337K5080m327m8968j1709j5581O946J5759R11N502Q297k733J064K1458l2690
6a1654l7204L6620K6281k2364j5951j8593
0d2865
$$ plain form
20 19337 44417 40090 -8878 -20587 -36168 -29222 -13463 -12552 -7050 1247 -1486 -422 21036 -11654
6 -11654 -48858 -12238 14043 -8321 -24272 -42865
0 -42865
$$ Imaginary data points
##PAGE= N=2
##DATA TABLE= (X++(I..I)), XYDATA
16383a497048M713P7934k0967o040J5170K1045K3707J6214L5065j193L0020J476
16371a299904K6998L9665K0883K93N043M7938K5058k9890K9768M5186J0187P604
16359a071171L841M9023K5869K7561l0367J1830M5522K515J5647J460K7938J5621
16347h74711K5349J5579j0551Q228K3471L3104K2872l133K813N6889K3069J6812
16335f60209l1486R408M0176K919K0926J4825n539L3448M3869K2049J1360l645
16323e01899K5928J2899P484K2531j877L6976J55N4875J7363l1875J3535O761
16311c37144M2392M5131k2147J7454m209n173M7625M1600J7953l6091J6354K4662
16299a51593J4278K3185K6801K6527J0440o241q163K8341j996O459r592N025K3237
$$ plain form
16383 -1497048 -1492335 -1414401 -1435368 -1441408 -1426238 -1405193 -1381486 -1365272 -1330207 -1331400 -1301380 -1299904
16371 -1299904 -1272906 -1233241 -1212358 -1212065 -1207022 -1159084 -1134026 -1163916 -1134148 -1088962 -1078775 -1071171
16359 -1071171 -1067330 -1018307 -992438 -964877 -995244 -983414 -937892 -935377 -919730 -918270 -890332 -874711
16347 -874711 -849362 -833783 -844334 -836106 -812635 -779531 -756659 -759792 -756979 -700090 -677021 -660209
16335 -660209 -691695 -682287 -642111 -639192 -618266 -603441 -608980 -575532 -531663 -509614 -498254 -501899
16323 -501899 -475971 -463072 -455588 -433057 -434934 -397958 -397803 -342928 -325565 -357440 -343905 -337144
16311 -337144 -294752 -249621 -271768 -254314 -258523 -263696 -216071 -174471 -156518 -192609 -176255 -151593
16299 -151593 -137315 -114130 -87329 -60802 -50362 -56603 -64766 -36425 -38421 -31962 -41554 -36529 -13292
16286a3292K9386J750K1003L4900P614J6076M2554k2261O541K0135K9638K5893
16274A99937j977M7340j2341j0307K7552L0144j7118L3854j2537K48J0443M1033
16262C36271m421M642k7727J6580P4998J1324j4853R313K2741L3427K3097m2938
16250D42454L8791p47o673j1038k1117M7563J8133k0657L3429J303M6805N170
16238E73416J3014K479Q810J668q314L5799L2583j4826Q987K167k6244k4405M8134
16225F53268L5463j2758N5439k0227M0189J327k1599l4482K5809L6837l9874j0242
16213G09150O7071P129k6716R721J3957L7732Q510j1098m049j8792l0009Q5253
16201H47859N0551m2931n826O777J0825j1083k727j1804K9212K0872r199K3675
$$ plain form
16286 -13292 16094 17844 38847 73747 81361 97437 139991 117730 124271 144406 174044 199937
16274 199937 197960 245300 232959 222652 250204 280348 263230 297084 284547 284795 295238 336271
16262 336271 331850 336492 308765 325345 400343 411667 396814 406127 428868 462295 485392 442454
16250 442454 481245 480498 473825 462787 441670 489233 507366 486709 520138 521441 568246 573416
16238 573416 586430 588909 597719 599387 591073 626872 659455 644629 653616 655783 629539 605134 653268
16225 653268 688731 675973 731412 711185 751374 752701 731102 696620 722429 759266 719392 709150
16213 709150 776221 783350 756634 766355 780312 818044 826554 815456 811407 792615 762606 847859
16201 847859 898410 855479 849653 856430 867255 856172 853445 841641 870853 891725 882526 906201
16189I06201L5821j1597l7571j8827M5032K2360k4078M6954K1191k2720J57J2699
16177I75622J7392m8250O295N1186J6925N042J1842Q052k6398k0775N0139O410
16165A053482k6113k0602L9754q768k0223k209J829J5949K5402M7617n4918P298
16153A058498J5893l4955j5536K115J8075r945K6751J0393J4328K5612m470k621
16141A104138J4673K3257m8292R479J211Q200j2208j1985J2540j8564j902P0829
16129A151376j7287R60o24l774R470j4605L951K8603J3082K1472k4429j3999L700
16116A157896K5741L3456k2709l4901m264N929l9104J8983j595j1848M6857L4726
16104A209167k1359n2438n5460N6891J4183o238L5959J1150J366L9343m3966j1468
$$ plain form
16189 906201 942022 930425 892854 874027 919059 941419 917341 964295 985486 962766 962923 975622
16177 975622 993014 944764 951059 1002245 1019170 1024212 1036054 1044106 1017708 996933 1047072 1053482
16165 1053482 1027369 1006767 1046521 1037753 1017530 1015321 1017150 1033099 1058501 1106118 1051200 1058498
16153 1058498 1074391 1039436 1023900 1026015 1044090 1034145 1060896 1071289 1085617 1111229 1106759 1104138
16141 1104138 1118811 1142068 1093776 1103255 1104466 1112666 1100458 1088473 1101013 1082449 1080547 1151376
16129 1151376 1134089 1135049 1134425 1130651 1140121 1125516 1129467 1158070 1171152 1192624 1168195 1154196 1157896
16116 1157896 1183637 1217093 1194384 1159483 1155219 1161148 1122044 1141027 1139432 1127584 1174441 1209167
16104 1209167 1187808 1135370 1079910 1136801 1150984 1144746 1180705 1191855 1193221 1232564 1188598 1177130
16092A177130K984N731k4702J3049O333l2882O3890J1836m4823k3845M2748Q739
16080A206188k2034K653M43L0389m6451o369L6149l2414L0077N497J6067k7846
16068A192349K2227k3809j8313J8408k1200J9290p406j810l3216k1103M1321J0695
16056A177433r111K4391j885o924k54j6880L4200j362R974J3338J5219k8240J175
16043A211074K6702l0647m9194L595L411K1133K338M340M0356k130k3462k0846
16031A186670K0365m221K9174j9158k3452J9585J7707l325J4709j8826p916k8375
16019A182937k8013M1961M5405j8373j0496L8890k525m5155M4882Q541m0581N9434
16007A276907j6237j9471j1864l4321K7616M4287j1542N940l9136l130J8584K9759
$$ plain form
16092 1177130 1180114 1185845 1161143 1174192 1180525 1147643 1211533 1223369 1178546 1154701 1197449 1206188
16080 1206188 1184154 1186807 1187250 1217639 1171188 1164819 1200968 1168554 1198631 1204128 1220195 1192349
16068 1192349 1214576 1190767 1172454 1190862 1169662 1188952 1181546 1179736 1146520 1125417 1166738 1177433
16056 1177433 1168322 1192713 1190828 1183904 1183650 1166770 1200970 1199608 1209582 1222920 1238139 1209899 1211074
16043 1211074 1237776 1207129 1157935 1161530 1164941 1186074 1188412 1192752 1233108 1230978 1207516 1186670
16031 1186670 1207035 1202814 1231988 1212830 1189378 1208963 1226670 1223345 1238054 1219228 1211312 1182937
16019 1182937 1154924 1196885 1242290 1223917 1213421 1252311 1249786 1204631 1249513 1258054 1217473 1276907
16007 1276907 1260670 1241199 1229335 1195014 1222630 1266917 1255375 1261315 1222179 1219049 1237633 1267392
15995A267392m2276m4793M9681l2816Q976o881N8848J8238j5776p8546k8779M7595
15983A200863J0663J8580k5512K0909L04J26M034j2072l19k6622K6425L5880l649
15970A249610J2774l898K4631n6257J2366J7292o5706R239O1140o475r739j370
15958A243607m7976L9645R343j57M539L2274o109q130k8299n8033K6238J2339
15946A219281r525P176j4101J5821n652K0838j5k615k24m6640O711K1687j731
15933A211011j2587j5846p177O4449J7172m7818l2069L9395K0047j077J3844m4791
15921A204553M3648K2420j2273q315k7728k5806k5888N1613k103J0637J7476j222
15909A247012j0183m6534K8410j7618K9876K3179k4790J6048j5192L3319j4415
$$ plain form
15995 1267392 1225116 1180323 1230004 1197188 1206164 1199283 1258131 1276369 1260593 1182047 1153268 1200863
15983 1200863 1211526 1230106 1204594 1225503 1225807 1225933 1229967 1217895 1217576 1190954 1217379 1253259 1249610
15970 1249610 1262384 1258486 1283117 1226860 1239226 1256518 1190812 1200051 1261191 1254716 1244977 1243607
15958 1243607 1195631 1235276 1244619 1244462 1249001 1281275 1275166 1267036 1238737 1180704 1206942 1219281
15946 1219281 1209756 1216932 1202831 1218652 1213000 1233838 1233823 1231208 1230984 1184344 1191055 1212742 1211011
15933 1211011 1198424 1182578 1175401 1239850 1257022 1209204 1177135 1216530 1236577 1235500 1249344 1204553
15921 1204553 1248201 1270621 1258348 1250033 1222305 1196499 1170611 1222224 1220121 1230758 1248234 1247012
15909 1247012 1236829 1190295 1218705 1201087 1230963 1254142 1229352 1245400 1230208 1263527 1249112
15898A249112k3931N111l3198K7183M2867m0319J6080q812R351j7132J4517j1416
15886A229413l1618n011K7988J7765l2317p28J0981K1244K8540R254l0106N721
15874A251126l608j0315j5700K2204l5957K1393J8321R306L1488j4847j4809n143
15862A253459K7159k0744m8706L0085L8828j9765m2299k4681k1337r67N2510l2634
15850A190908k0579L0221J3179J1792o786P936M9161J6942j4259P106J4464j1451
15838A288634k0158m509j7625m292k0246J0211R394L2005Q454k5422m396j1576
15826A240474J1256k1389k7990J3680K9399j6395K5642o238l2510M1233P609j2334
15814A252437J3278j0994j8839K5531j4341n595J3304J6849l0011N436K8992n645
$$ plain form
15898 1249112 1225181 1230292 1197094 1224277 1267144 1226825 1242905 1234093 1243444 1226312 1240829 1229413
15886 1229413 1197795 1192784 1220772 1238537 1206220 1205492 1216473 1237717 1266257 1275511 1245405 1251126
15874 1251126 1247518 1237203 1221503 1243707 1207750 1229143 1247464 1256770 1288258 1273411 1258602 1253459
15862 1253459 1280618 1259874 1211168 1241253 1280081 1260316 1218017 1193336 1171999 1171032 1223542 1190908
15850 1190908 1170329 1200550 1213729 1225521 1218735 1226671 1275832 1292774 1278515 1285621 1300085 1288634
15838 1288634 1268476 1263967 1246342 1242050 1221804 1232015 1241409 1273414 1281868 1256446 1252050 1240474
15826 1240474 1251730 1230341 1202351 1216031 1245430 1229035 1254677 1248439 1215929 1257162 1264771 1252437
15814 1252437 1265715 1254721 1235882 1261413 1247072 1241477 1254781 1271630 1241619 1247055 1276047 1270402
15802A270402p586L2919n594o3277p805p94M1386k0451j5582R6k0081j0454K8608
15789A221787K0116L8983J7280n4957M0703L2970n0001J499j4747L2451l3340
15778A252744r876M2672J5652L0610n3259l4991J5332r464j0974r857L228j0775
15766A221042N9357L583k7664k3804o050O406O583J3214k1028K869j7542L2129
15754A249095J1104P223K929K6822n643m5602j5335M5341k5518K2025m1806j7625
15742A213010M6205R025J2710k6791K2879K6728k258l4412P8O1414l9431K0966
15730A310123l3362n6027l850J7829J1657J8078o423K1168J4285k4953L5822l5947
15718A268400p47n885l21P752K666k7410l0409M3456j8989k7265J0226m249O4235
$$ plain form
15802 1270402 1262816 1295735 1290141 1226864 1219059 1218265 1259651 1239200 1223618 1223714 1203633 1193179 1221787
15789 1221787 1241903 1280886 1298166 1243209 1283912 1316882 1266881 1268380 1253633 1286084 1252744
15778 1252744 1242868 1285540 1301192 1331802 1278543 1243552 1258884 1249420 1238446 1228589 1231817 1221042
15766 1221042 1280399 1283982 1256318 1232514 1226464 1232870 1239453 1252667 1231639 1234508 1216966 1249095
15754 1249095 1260199 1267422 1270351 1297173 1291530 1245928 1230593 1275934 1250416 1272441 1230635 1213010
15742 1213010 1259215 1268240 1280950 1254159 1277038 1303766 1301508 1267096 1267174 1328588 1289157 1310123
15730 1310123 1276761 1220734 1216884 1234713 1246370 1264448 1258025 1279193 1293478 1268525 1304347 1268400
15718 1268400 1267653 1261768 1261447 1269199 1271865 1244455 1214046 1257502 1238513 1211248 1221474 1217225 1281460
15705A281460k6494r782Q284l702J3430J9138j9563L0450k6534R453r186k0950
15693A246004K1046l1411j0165L9500K6945J9609q285k527p974m9077N9402K762
15681A305829p2004j3640L1950j514M2583l4356j6003j3789k4596K061M3809k0875
15669A229455J75L1297J05J5138k8318J5746R166n3835k0466M3280K09L7444M829
$$ plain form
15705 1281460 1254966 1245184 1253468 1249766 1263196 1282334 1262771 1293221 1266687 1276140 1266954 1246004
15693 1246004 1267050 1235639 1225474 1264974 1291919 1311528 1303243 1300716 1292742 1243665 1303067 1305829
15681 1305829 1233825 1220185 1252135 1250621 1293204 1258848 1242845 1229056 1204460 1206521 1250330 1229455
15669 1229455 1229630 1260927 1261032 1276170 1247852 1263598 1272764 1218929 1198463 1241743 1241952 1279396 1284225
$$ [...]
##END NTUPLES=NMR SPECTRUM
##END=
