##TITLE=1H_CA-8854-3-1
 DMSO, 8 sc, 
 29.06.2021
##JCAMPDX= 6.0         $$ Bruker NMR JCAMP-DX V2.0
##DATA TYPE= NMR SPECTRUM
##DATA CLASS= NTUPLES
##ORIGIN= UXNMR, Bruker Analytische Messtechnik GmbH
##OWNER= root
$$ XWIN-NMR		Version 3.5
$$ Tue Jun 29 09:33:02 2021 Russian Standard Time (UT+4h)  she@DPX200
##.OBSERVE FREQUENCY= 200.131506
##.OBSERVE NUCLEUS= ^1H
##.ACQUISITION MODE= SIMULTANEOUS
##.ACQUISITION SCHEME= undefined
##.AVERAGES= 8
##.DIGITISER RES= 18
##SPECTROMETER/DATA SYSTEM= spect
##.PULSE SEQUENCE= zg30
##.SOLVENT NAME= CDCl3
##.SHIFT REFERENCE= (INTERNAL, CDCl3, 0, 17.524)
##AUDIT TRAIL= $$ (NUMBER, WHEN, WHO, WHERE, WHAT)
$$ ##TITLE= Audit trail, XWIN-NMR		Version 3.5
$$ ##JCAMPDX= 5.01
$$ ##ORIGIN= Bruker BioSpin GmbH
$$ ##OWNER= she
$$ F:/spectra/data/she/nmr/H-F/1/pdata/1/auditp.txt
$$ ##AUDIT TRAIL=  $$ (NUMBER, WHEN, WHO, WHERE, WHAT)
(   1,<2021-06-29 09:31:09.17 +0400>,<she>,<DPX200>,
      <created by zg, POWCHK disabled, PULCHK disabled
       configuration hash MD5:
       00 E9 B6 7A A2 85 ED C7 34 08 36 98 17 FE 4E 26
       data hash MD5: 16K
       7C 30 E5 D7 FC DA FB 4F FD ED 1E 05 2B D6 E5 C7>)
(   2,<2021-06-29 09:31:39.75 +0400>,<she>,<DPX200>,
      <Start of raw data processing
       efp BC_mod = 2 LB = 0.24 FT_mod = 6 PKNL = 1 PHC0 = -11706.78 PHC1 = -17.79899 SI = 16K 
       data hash MD5: 16K
       4B 9E AB EA B5 0F 71 E7 12 93 4F 69 36 16 58 BB>)
(   3,<2021-06-29 09:32:01.00 +0400>,<she>,<DPX200>,
      <pk PHC0 = -11.62696 PHC1 = 14.2 
       data hash MD5: 16K
       28 A7 9D CA A9 F7 F7 DA 90 1C AD A5 D4 0E 7F C6>)
$$ ##END=
$$ 
$$ hash MD5
$$ 62 E7 5A C1 B5 10 98 B6 4C E5 01 A5 D1 14 EE 65
##$RELAX= 
##$RELAX= 
##$RELAX= 
##$RELAX= 
##$RELAX= 
##$RELAX= 
$$ Bruker specific parameters
$$ --------------------------
##$DU= <F:/spectra>
##$EXPNO= 1
##$NAME= <H-F>
##$PROCNO= 1
##$TYPE= <nmr>
##$USER= <she>
##$AMP= (0..31)
100 100 100 100 100 100 100 100 100 100 100 100 100 100 100 100 100 100 
100 100 100 100 100 100 100 100 100 100 100 100 100 100 
##$AQSEQ= 0
##$AQ_mod= 1
##$AUNM= <au_zg>
##$AUTOPOS= <>
##$BF1= 200.13
##$BF2= 200.13
##$BF3= 200.13
##$BF4= 200.13
##$BF5= 200.13
##$BF6= 200.13
##$BF7= 200.13
##$BF8= 200.13
##$BYTORDA= 1
##$CFDGTYP= 0
##$CFRGTYP= 5
##$CHEMSTR= <none>
##$CNST= (0..31)
1 1 145 1 1 1 1 1 1 1 1 1 1 1 1 1 1 1 1 1 1 1 1 1 1 1 1 1 1 1 1 1 
##$CPDPRG= <>
##$CPDPRG1= <>
##$CPDPRG2= <>
##$CPDPRG3= <>
##$CPDPRG4= <mlev>
##$CPDPRG5= <mlev>
##$CPDPRG6= <mlev>
##$CPDPRG7= <mlev>
##$CPDPRG8= <mlev>
##$CPDPRGB= <>
##$CPDPRGT= <>
##$D= (0..31)
0 1.2 0 0 0 0 0 0 0 0.06 0 0.03 0 0 0 0 0.0002 0 0 0 0 0 0 0 0 0 0 0 0 
0 0 0 
##$DATE= 1624944668
##$DBL= (0..7)
120 120 120 120 120 120 120 120 
##$DBP= (0..7)
150 150 150 150 150 150 150 150 
##$DBP07= 0
##$DBPNAM0= <>
##$DBPNAM1= <>
##$DBPNAM2= <>
##$DBPNAM3= <>
##$DBPNAM4= <>
##$DBPNAM5= <>
##$DBPNAM6= <>
##$DBPNAM7= <>
##$DBPOAL= (0..7)
0.5 0.5 0.5 0.5 0.5 0.5 0.5 0.5 
##$DBPOFFS= (0..7)
0 0 0 0 0 0 0 0 
##$DE= 6
##$DECBNUC= <off>
$$ [...]
##$SUBNAM2= <"">
##$SUBNAM3= <"">
##$SUBNAM4= <"">
##$SUBNAM5= <"">
##$SUBNAM6= <"">
##$SUBNAM7= <"">
##$SUBNAM8= <"">
##$SUBNAM9= <"">
##$SW= 20.0188882624521
##$SWIBOX= (0..15)
0 0 2 0 0 0 0 0 0 0 0 0 0 0 0 0 
##$SW_h= 4006.41025641026
##$TD= 16384
##$TD0= 1
##$TE= 0
##$TE2= 300
##$TE3= 300
##$TEG= 300
##$TL= (0..7)
0 120 120 120 120 120 120 120 
##$TP= (0..7)
150 150 150 150 150 150 150 150 
##$TP07= 0
##$TPNAME0= <>
##$TPNAME1= <>
##$TPNAME2= <>
##$TPNAME3= <>
##$TPNAME4= <>
##$TPNAME5= <>
##$TPNAME6= <>
##$TPNAME7= <>
##$TPOAL= (0..7)
0.5 0.5 0.5 0.5 0.5 0.5 0.5 0.5 
##$TPOFFS= (0..7)
0 0 0 0 0 0 0 0 
##$TUNHIN= 0
##$TUNHOUT= 0
##$TUNXOUT= 0
##$USERA1= <user>
##$USERA2= <user>
##$USERA3= <user>
##$USERA4= <user>
##$USERA5= <user>
##$V9= 5
##$VALIST= <valist>
##$VCLIST= <CCCCCCCCCCCCCCC>
##$VD= 0
##$VDLIST= <DDDDDDDDDDDDDDD>
##$VPLIST= <PPPPPPPPPPPPPPP>
##$VTLIST= <TTTTTTTTTTTTTTT>
##$WBST= 1024
##$WBSW= 4
##$XGAIN= (0..3)
0 0 0 0 
##$XL= 0
##$YL= 0
##$YMAX_a= 148584
##$YMIN_a= -88874
##$ZGOPTNS= <>
##$ZL1= 120
##$ZL2= 120
##$ZL3= 120
##$ZL4= 120
##$ABSF1= 0
##$ABSF2= 0
##$ABSG= 0
##$ABSL= 0
##$ALPHA= 0
##$AQORDER= 0
##$ASSFAC= 0
##$ASSFACI= 0
##$ASSFACX= 0
##$ASSWID= 0
##$AUNMP= <proc_1d>
##$AZFE= 0.1
##$AZFW= 0.1
##$BCFW= 0
##$BC_mod= 2
##$BYTORDP= 0
##$COROFFS= 0
##$CY= -3
##$DATMOD= 1
##$DC= 0
##$DFILT= <>
##$DTYPP= 0
##$F1P= 0
##$F2P= 0
##$FCOR= 1
##$FTSIZE= 16384
##$FT_mod= 6
##$GAMMA= 0
##$GB= 0
##$INTBC= 1
##$INTSCL= 1.334414e-10
##$ISEN= 128
##$LB= 0.24
##$LEV0= 0
##$LPBIN= 0
##$MAXI= 10000
##$MC2= 0
##$MEAN= 0
##$ME_mod= 0
##$MI= 1.114404
##$NCOEF= 0
##$NC_proc= -8
##$NLEV= 6
##$NOISF1= 3.799351
##$NOISF2= 2.8
##$NSP= 0
##$NTH_PI= 0
##$NZP= 0
##$OFFSET= 17.52399
##$PC= 1
##$PHC0= -11718.41
##$PHC1= -3.59899
##$PH_mod= 1
##$PKNL= yes
##$PPARMOD= 0
##$PSCAL= 0
##$PSIGN= 0
##$REVERSE= no
##$SF= 200.130002129256
##$SI= 16384
##$SIGF1= 3
##$SIGF2= 2
##$SINO= 5.538805
##$SIOLD= 16384
##$SREGLST= <1H.CDCl3>
##$SSB= 0
##$STSI= 16384
##$STSR= 0
##$SW_p= 4006.41025641026
##$SYMM= 0
##$S_DEV= 0
##$TDeff= 16384
##$TDoff= 0
##$TI= <>
##$TILT= no
##$TM1= 0
##$TM2= 0
##$TOPLEV= 0
##$USERP1= <user>
##$USERP2= <user>
##$USERP3= <user>
##$USERP4= <user>
##$USERP5= <user>
##$WDW= 1
##$XDIM= 16384
##$YMAX_p= 497326708
##$YMIN_p= -906138
$$ End of Bruker specific parameters
$$ ---------------------------------
##NTUPLES= NMR SPECTRUM
##VAR_NAME=  FREQUENCY,     SPECTRUM/REAL,   SPECTRUM/IMAG
##SYMBOL=    X,             R,               I
##VAR_TYPE=  INDEPENDENT,   DEPENDENT,       DEPENDENT
##VAR_FORM=  AFFN,          ASDF,            ASDF
##VAR_DIM=   16384,         16384,           16384
##UNITS=     HZ,            ARBITRARY UNITS, ARBITRARY UNITS
##FACTOR=    0.24454680195387, 1,            1
##FIRST=     3507.07628231581, 0,            0
##LAST=      -499.333974094451, 0,           0
##MIN=       -499.333974094451, -906138,     0
##MAX=       3507.07628231581, 497326708,    0
$$ Real data points
##PAGE= N=1
##DATA TABLE= (X++(R..R)), XYDATA
$$ [...]
5454G155029N8378j706R2492P3430L9227Q2726q8346O5178J73764J29883P1175
$$ 7155029 7213407 7211701 7304193 7377623 7416850 7499576 7411230 7476408 7650172 7780055 7851230
5443G851230P1202N5324J15291J59478Q6279K75190J10804m437J64040K45939
$$ 7851230 7922432 7977756 8093047 8252525 8338804 8613994 8724798 8720361 8884401 9130340
5433I130340R1217J56077J72936L24744L50377J51266L47829K98802M28785K27791
$$ 9130340 9221557 9377634 9550570 9875314 10225691 10376957 10724786 11023588 11452373 11680164
5423A1680164K83586L14903M59184O09459N81834L03768M09540N01311M89411
$$ 11680164 11963750 12278653 12737837 13347296 13929130 14232898 14642438 15143749 15633160
5414A5633160M13772L93460K68013M55724L49119K93087M21020N04862O59117
$$ 15633160 16046932 16440392 16708405 17164129 17513248 17806335 18227355 18732217 19391334
5405A9391334P65051N22336N84626P24654P04953O87909P92234O34965O19798
$$ 19391334 20156385 20678721 21263347 21988001 22692954 23380863 24173097 24808062 25427860
5396B5427860O05093N05931N02566M19862L83914K55948L21316M12872M59783
$$ 25427860 26032953 26538884 27041450 27461312 27845226 28101174 28422490 28835362 29295145
5387B9295145M04922O98290P91416O38748Q03246O36622L72078K38139J75573
$$ 29295145 29700067 30398357 31189773 31828521 32631767 33268389 33640467 33878606 34054179
5378C4054179M9364k55162k49775k85049j61240j12327K4278J56584O9151O7514
$$ 34054179 34103543 33848381 33598606 33313557 33152317 33039990 33064268 33220852 33290003 33357517
5368C3357517K62595K96711K57603M39016M25376M90664L87794J83070o191k44791
$$ 33357517 33620112 33916823 34174426 34613442 35038818 35529482 35917276 36100346 36094155 35849364
5358C5849364m83661o72266o90230q88498q30726n89850m37721l86866l08178
$$ 35849364 35365703 34693437 34003207 33114709 32283983 31694133 31256412 30869546 30561368
5349C0561368k58756j59522k89121l44973l01359n34107n51925n51082m74904
$$ 30561368 30302612 30143090 29853969 29508996 29207637 28673530 28121605 27570523 27095619
5340B7095619n51400o89902p29329o37329q75479o82732o32164o74274l87545
$$ 27095619 26544219 25854317 25124988 24487659 23612180 22929448 22297284 21623010 21235465
5331B1235465n98035m44967l91588m61673l88037l00768m63633n75482o30576
$$ 21235465 20637430 20192463 19800875 19339202 18951165 18650397 18186764 17611282 16980706
5322A6980706l88723n65154o15586n76907o19886n56525l86072m88411l66610
$$ 16980706 16591983 16026829 15411243 14834336 14214450 13657925 13271853 12783442 12416832
5313A2416832k89859l57203l90476j67441l06416j95754k14697j86570k26553
$$ 12416832 12126973 11769770 11379294 11211853 10905437 10709683 10494986 10308416 10081863
5304A0081863k45595j61637o9555k00943k47042N210n2957j27012k06743q1568
$$ 10081863 9836268 9674631 9605076 9404133 9157091 9162301 9109344 8982332 8775589 8694021
5294H694021k03754j34035p704m9448q3308L2900j52241j43009l2873m4836N5373
$$ 8694021 8490267 8356232 8348528 8299080 8215772 8248672 8096431 7953422 7920549 7875713 7931086
5283G931086n1945m6395J4460j89824K1213j19135n3895l5782l444J08250j92441
$$ 7931086 7879141 7832746 7847206 7657382 7678595 7559460 7505565 7469783 7466339 7574589 7382148
5272G382148q5602K9171k5126j56244o8285J2806M3484n9023Q7585n6931q1077
$$ 7382148 7296546 7325717 7300591 7144347 7076062 7088868 7132352 7073329 7160914 7103983 7022906
5261G022906R1985M709q6023j52825k8205J06466j4162J3114N2274q7296j7883
$$ 7022906 7114891 7119600 7033577 6880752 6852547 6959013 6944851 6957965 7010239 6922943 6905060
5250F905060q767j08665n6184J52622M5507P95L2578J5395l6876l88o4494O7754
$$ 6905060 6896293 6787628 6731444 6884066 6929573 6930368 6962946 6978341 6941465 6941077 6876583 6944337
5238F944337J33221m0529n2044O7877K3489j01702K4536R4634J28691m6158j25213
$$ 6944337 7077558 7037029 6984985 7052862 7076351 6974649 6999185 7093819 7222510 7176352 7051139
5227G051139K05389K24585k153n1544P623K44898R7076Q2719O7420k0589J17998
$$ 7051139 7256528 7481113 7478960 7427416 7435039 7679937 7777013 7859732 7927152 7906563 8024561
5216H024561Q889R692j3287J40668m5719M2100l4229j00741j36998K6082R8818
$$ 8024561 8033450 8043142 8029855 8170523 8124804 8166904 8132675 8031934 7894936 7921018 8019836
5205H019836O0238l6846P4373M2736N7772M3644k3179J318N0682K61864J3357
$$ 8019836 8080074 8043228 8117601 8160337 8218109 8261753 8238574 8239892 8290574 8552438 8565795
5194H565795j3973K81009K3728P1605J55585Q8835M7619K31505J22513P8945J57127
$$ 8565795 8551822 8832831 8856559 8928164 9083749 9172584 9220203 9451708 9574221 9653166 9810293
5183I810293J31162J28178m0318M3589m214R5553m628L225m6429p2551J9700J10750
$$ 9810293 9941455 10069633 10029315 10072904 10068690 10164243 10159615 10162840 10116411 10043860 10063560 10174310
5171A0174310l1686j86790o628m6512J28245L3149j05330K30183Q9623l6480J40076
$$ 10174310 10142624 9955834 9949206 9902694 10030939 10064088 9958758 10188941 10278564 10242084 10382160
5160A0382160K97242K37502K10280P8783p574N6752O0025m9087r1531J7476L2212
$$ 10382160 10679402 10916904 11127184 11205967 11198393 11255145 11315170 11266083 11174552 11192028 11224240
5149A1224240j01733Q0832o7341j3783J1270J44492J45261N6230J53271p880J24962
$$ 11224240 11122507 11203339 11135998 11122215 11133485 11277977 11423238 11479468 11632739 11624859 11749821
5138A1749821J48176J33505K61567K91682K94497J53348J96640Q0347K00112R3073
$$ 11749821 11897997 12031502 12293069 12584751 12879248 13032596 13229236 13309583 13509695 13602768
5128A3602768Q560K05517J08690K03557M83207M02461N00866O75323O59087Q31821
$$ 13602768 13611328 13816845 13925535 14129092 14612299 15014760 15515626 16190949 16850036 17681857
5118A7681857P24919M82256K04258Q0891j59458l78500M5929l9032k29070K29931
$$ 17681857 18406776 18889032 19093290 19174181 19014723 18636223 18682152 18643120 18414050 18643981
5108A8643981J92448L02888K92554J38141K94826L93278L47391O12578O91263
$$ 18643981 18836429 19139317 19431871 19570012 19864838 20258116 20605507 21218085 21909348
5099B1909348O09469O34688N83356L83368J53695P9270p0076J71100L45788L74207
$$ 21909348 22518817 23153505 23736861 24120229 24273924 24353194 24283118 24454218 24800006 25174213
5089B5174213M97124M94006P68096J046963J144058J206557J527484J769703J804418
$$ 25174213 25671337 26165343 26933439 27980402 29124460 30331017 31858501 33628204 35432622
5080C5432622K115340K371461K664863L075346L505107L718228M100267M202558
$$ 35432622 37547962 39919423 42584286 45659632 49164739 52882967 56983234 61185792
5072F1185792L781637K799295J484469K80142n78909q04379q52797l31115L69891
$$ 61185792 64967429 67766724 69251193 69531335 68952426 68148047 67295250 66964135 67334026
5063F7334026R93230J972097K730620L416612L846057M015102L616802K874905
$$ 67334026 68327256 70299353 73029973 76446585 80292642 84307744 87924546 90799451
5055I0799451J864593Q58673j86739j275210k154251l097089l957293m302812
$$ 90799451 92664044 93522717 93335978 92060768 89906517 86809428 82852135 78549323
5047G8549323m195208l789349l013498k450828j722128j086949o11475q4552M98955
$$ 78549323 74354115 70564766 67551268 65100440 63378312 62291363 61679888 61595336 62094291
5038F2094291J016812J122819J071390N92601j61117j390381k547264l350623
$$ 62094291 63111103 64233922 65305312 65897913 65736796 64346415 61799151 58448528
5030E8448528l573383l504881l525025k895375k626163k149026j704355j439870
$$ 58448528 54875145 51370264 47845239 44949864 42323701 40174675 38470320 37030450
5022C7030450j379421j083653r59726q42029o17326m99019m69418n32562k72648
$$ 37030450 35651029 34567376 33607650 32765621 32148295 31649276 31179858 30647296 30374648
5013C0374648r8433j60599j56467l34260p30718j108405j119265j090732r79619
$$ 30374648 30276215 30115616 29959149 29624889 28894171 27785766 26666501 25575769 24596150
5004B4596150j132807r75172p05547p06925m00095m19672m03257k74219j40894
$$ 24596150 23463343 22488171 21782624 21075699 20675604 20255932 19852675 19578456 19437562
4995A9437562j16013o0310j1978O9794R0324L40962M2133p9479m62729p29171
$$ 19437562 19321549 19261239 19249261 19319055 19409379 19750341 19792474 19712995 19250266 18521095
4985A8521095o28772p66142p84971o55064m94668n03942m32015n97398m94063
$$ 18521095 17892323 17126181 16341210 15686146 15191478 14687536 14255521 13658123 13164060
4976A3164060k91261l71021m54392k36989l41982l67520j06185j57242k64241
$$ 13164060 12872799 12501778 12047386 11810397 11468415 11100895 10994710 10837468 10573227
4967A0573227k75347k10902j96513k19680j32983j39771j22805k55936m5356R1860
$$ 10573227 10297880 10086978 9890465 9670785 9537802 9398031 9275226 9019290 8973934 9065794
4957I065794j19625p7157j27660j08193o9327j58413j30952n2408j53795r0271
$$ 9065794 8946169 8869012 8741352 8633159 8563832 8405419 8274467 8222059 8068264 7977993
4947G977993j31894j03012o8787j21480k9285n4559n4576j1958n2313N2244m5537
$$ 7977993 7846099 7743087 7674300 7552820 7523535 7468976 7414400 7402442 7350129 7402373 7356836
4936G356836q7733O4111j70176m4591m871o308K8023j51630j24219l1792M6487
$$ 7356836 7269103 7333214 7163038 7118447 7113576 7107268 7135291 6983661 6859442 6827650 6874137
4925F874137j77865J3563O2508k29723r4616j32320J56860J1369j41820L429j28178
$$ 6874137 6696272 6709835 6772343 6542620 6448004 6315684 6472544 6483913 6342093 6345522 6217344
4914F217344r6124l2615N3298j90804m6482J30136N7001j22742j01005N6994l5512
$$ 6217344 6121220 6088605 6141903 5951099 5904617 6034753 6091754 5969012 5868007 5925001 5889489
4903E889489J02191j72970j65479J73884p5739k70386j5113N9463m5522m7963
$$ 5889489 5991680 5818710 5653231 5827115 5751376 5480990 5465877 5525340 5479818 5431855
4893E431855K9402j32367r648l6187k1765l7575l3223L3607o2740J29080j61988
$$ 5431855 5461257 5328890 5319242 5283055 5261290 5223715 5190492 5224099 5161359 5290439 5128451
4882E128451m828J40973m2178j04350n4521r4881j67910J01918r672m879j1051
$$ 5128451 5123623 5264596 5222418 5118068 5063547 4968666 4800756 4902674 4893002 4888123 4877072
4871D877072j38307Q17o4731m5372o9287k0752J35859p9504R4148N9200q9935
$$ 4877072 4738765 4739582 4674851 4629479 4560192 4539440 4675299 4595795 4689943 4749143 4659208
4860D659208j13991q4111N1604j88639m4075K4286n5293n4768L8534r1823j0677
$$ 4659208 4545217 4461106 4512710 4324071 4279996 4304282 4248989 4194221 4232755 4140932 4130255
4849D130255M2187o9754J28555k9484Q107O8277j08136j02754l997m2279n890
$$ 4130255 4172442 4102688 4231243 4201759 4209866 4278143 4170007 4067253 4063256 4020977 4015087
4838D015087M8638p902L0446m2664n0549m3196N1601p8741J01274j91238J10048
$$ 4015087 4063725 4055823 4086269 4043605 3993056 3949860 4001461 3922720 4023994 3832756 3942804
4827C942804p0727r7500Q6239l8851M9853O3455q0680J2071M5719j27768J780
$$ 3942804 3872077 3774577 3860816 3821965 3871818 3935273 3854593 3866664 3912383 3784615 3786395
4816C786395M7435N2078j23087m2285p7663J7550Q426M6094N1528J33628r8461
$$ 3786395 3833830 3885908 3762821 3720536 3642873 3660423 3668849 3714943 3766471 3900099 3801638
4805C801638m4495O1734l8398r8092j3480J17887k2417o4081r697r6739L6000
$$ 3801638 3757143 3818877 3780479 3682387 3668907 3786794 3764377 3700296 3690599 3593860 3629860
4794C629860n6003r1921J59533n0949l7618J01510r9777O484N6103n2854J7770
$$ 3629860 3573857 3481936 3641469 3590520 3552902 3654412 3554635 3561119 3617222 3564368 3582138
4783C582138j5611k638l6364O9984r2619j0494P9151R8340q5487j02048j6914
$$ 3582138 3566527 3563889 3527525 3597509 3504890 3494396 3573547 3671887 3586400 3484352 3467438
4772C467438Q2957L7442k5808K7523l7434J23198j63557l3325m2094J44795N8946
$$ 3467438 3550395 3587837 3562029 3589552 3552118 3675316 3511759 3478434 3436340 3581135 3640081
4761C640081K290J12764j16859m5493L1168M1380k7825o9386O4226q4456p1773
$$ 3640081 3642371 3755135 3638276 3592783 3623951 3665331 3637506 3568120 3632346 3547890 3476117
4750C476117Q0566K4497K9863K2756J3307P1026j53367J30889n5415J4280p6977
$$ 3476117 3556683 3581180 3611043 3633799 3647106 3718132 3564765 3695654 3640239 3654519 3577542
4739C577542K4693L8850n0087O2247N5692o9811K5045L7153j22607J719j57777
$$ 3577542 3602235 3641085 3590998 3653245 3708937 3639126 3664171 3701324 3578717 3580436 3422659
4728C422659n0950J17687J31832k0333p6840n6091R3676O9106l7620q5010m4069
$$ 3422659 3371709 3489396 3621228 3600895 3524055 3467964 3561640 3630746 3593126 3508116 3464047
4717C464047k7026j10535J36479K9817j07790P7513l7599j10945J1584Q5803r4574
$$ 3464047 3437021 3326486 3462965 3492782 3384992 3462505 3424906 3313961 3325545 3411348 3316774
4706C316774O106j39752J11541J34318P0131j2058j04448O8788J7305M8552k8700
$$ 3316774 3322880 3183128 3294669 3428987 3499118 3487060 3382612 3451400 3468705 3517257 3488557
4695C488557n1593o6770q3288Q9402k4806p8528k0678K09520j51392n168m9558
$$ 3488557 3436964 3370194 3286906 3376308 3351502 3272974 3252296 3461816 3310424 3305256 3255698
4684C255698L9212O4669k531J35500p8147n9437O2201n1137r6720J8303J7112
$$ 3255698 3294910 3359579 3357048 3492548 3414401 3354964 3417165 3366028 3269308 3287611 3304723
4673C304723Q1000p3802j37563K56904o6019j37806R900r6353J59584o1818O9491
$$ 3304723 3385723 3311921 3174358 3431262 3365243 3227437 3237337 3140984 3300568 3238750 3308241
4662C308241J21008Q1461K5158p2553l7223K7473k5853J778k139O3762L3882m2225
$$ 3308241 3429249 3510710 3535868 3463315 3426092 3453565 3427712 3429490 3427351 3491113 3524995 3482770
4650C482770k6410k5894J45265k4277r2166N136r374N4692L1620Q5404m5927M9765
$$ 3482770 3456360 3430466 3575731 3551454 3459288 3464424 3455050 3509742 3541362 3626766 3580839 3630604
4638C630604l9291M0278O1309K8165M8160j8474k7918J5730L4608J2654K0479
$$ 3630604 3591313 3631591 3692900 3721065 3769225 3750751 3722833 3738563 3773171 3785825 3806304
4627C806304J7657J503l7634J70746P0789N4832K2263k03588J22752K5831l8700
$$ 3806304 3823961 3825464 3787830 3958576 4029365 4084197 4106460 3902872 4025624 4051455 4012755
4616D012755m7685J63183M7901M2577P5450J59628M3087j45464J63001K2503M3780
$$ 4012755 3965070 4128253 4176154 4218731 4294181 4453809 4496896 4351432 4514433 4536936 4580716
4605D580716L8118Q6985M9976k7579L6640J47848l4389J75591J76644J02336N0605
$$ 4580716 4618834 4705819 4755795 4728216 4764856 4912704 4878315 5053906 5230550 5332886 5383491
4594E383491J468p989R6940M9275J17632J91694K25335J90791L8261O6814M4016
$$ 5383491 5384959 5376970 5473910 5523185 5640817 5832511 6057846 6248637 6286898 6353712 6397728
4583F397728J48212K77991K6969J11401K44596K18758M9696L33500L98379J79877
$$ 6397728 6545940 6823931 6850900 6962301 7206897 7425655 7475351 7808851 8207230 8387107
4573H387107J98140L32278L38082K94244L12494L25085N48028M55974N69202P26424
$$ 8387107 8585247 8917525 9255607 9549851 9862345 10187430 10735458 11191432 11760634 12487058
4563A2487058N99030P42325Q43114J060648J088262J021595J299961J097811J059065
$$ 12487058 13086088 13828413 14671527 15732175 16820437 17842032 19141993 20239804 21298869
4554B1298869J172007R50082N38380K09937N2076M4082q187o8617O2742K62765
$$ 21298869 22470876 23420958 23959338 24169275 24221351 24265433 24257246 24188629 24251371 24514136
4544B4514136J56836K61422L00437M28132L04801j26427n26430o72898o72581
$$ 24514136 24670972 24932394 25232831 25660963 25965764 25839337 25312907 24640009 23967428
4535B3967428r43058r72354r56189q52703o95146o00721n19758m17027m30296
$$ 23967428 23024370 22052016 21095827 20243124 19547978 18947257 18427499 18010472 17580176
4526A7580176o4675m5178k19035Q4234J39489J43920O7527L82108L36018M66234
$$ 17580176 17515501 17470323 17251288 17335522 17475011 17618931 17686458 18068566 18404584 18870818
4516A8870818O12351P18704R00761R57220Q97112J253958J461380J415154J742091
$$ 18870818 19483169 20201873 21102634 22059854 22956966 24210924 25672304 27087458 28829549
4507B8829549J646939J554153J764980J422785J167444P48729L70035J6326k90368
$$ 28829549 30476488 32030641 33795621 35218406 36385850 37134579 37504614 37520940 37230572
4498C7230572m81596m53976k84032l14699j68091j36539J06629k1590k75880l80516
$$ 37230572 36748976 36295000 36010968 35696269 35528178 35391639 35498268 35476678 35200798 34820282
4488C4820282j059572j209285j612776j895644j831715j753655j562175j543972
$$ 34820282 33760710 32551425 30938649 29043005 27211290 25457635 23895460 22351488
4480B2351488j330255j122072j279513j102707q10440o98182p47408p80769o24536
$$ 22351488 21021233 19899161 18619648 17516941 16706501 16008319 15260911 14480142 13855606
4471A3855606o94765n91411l92874l15253m39530l88565m11197l90232l51503
$$ 13855606 13160841 12569430 12176556 11861303 11421773 11033208 10622011 10231779 9880276
4462I880276j59424j96148k63979k97850j57330j45666j40109k00623j83258j46635
$$ 9880276 9720852 9524704 9260725 8962875 8805545 8659879 8519770 8319147 8135889 7989254
4452G989254q6250k7870k22551j80248l8991j69769j18897o1866n5917j2248r6600
$$ 7989254 7903004 7875134 7652583 7472335 7433344 7263575 7144678 7082812 7026895 7014647 6918047
4441F918047j06171M9335j89908j3148n5218p5178J21362K3955J3740j53114j11877
$$ 6918047 6811876 6861211 6671303 6658155 6602937 6527759 6649121 6673076 6686816 6533702 6421825
4430F421825J70293J517n1288j52o6945J7635J29493L0788j6920m1138J73491
$$ 6421825 6592118 6593635 6542347 6542195 6475250 6492885 6622378 6653166 6636246 6595108 6768599
4419F768599r5826j025L0979J79448j9647j54953J35630R0463L2036k7802K14923
$$ 6768599 6672773 6671748 6702727 6882175 6862528 6707575 6843205 6933668 6965704 6937902 7152825
4408G152825J63910J18677J21575r3757j13366J82596J38513K4543J78442M12974
$$ 7152825 7316735 7435412 7556987 7463230 7349864 7532460 7670973 7695516 7873958 8286932
4398H286932J69749J42066J97804J99917K17062L26472L04767K55198M38714N68929
$$ 8286932 8456681 8598747 8796551 8996468 9213530 9540002 9844769 10099967 10538681 11107610
4388A1107610K05678N11446O20580O54413O30378N33244P73913Q55398J021588
$$ 11107610 11313288 11824734 12445314 13099727 13730105 14263349 15037262 15892660 16914248
4379A6914248J127841J075822J137684J153641J772460J584003J406959J355412
$$ 16914248 18042089 19117911 20255595 21409236 23181696 24765699 26172658 27528070
4371B7528070J224462Q82625L35918j05673p13923q60375j200380j214763r98038
$$ 27528070 28752532 29635157 29971075 29865402 29151479 28291104 27090724 25875961 24877923
4362B4877923j034337j123497q68937q13021o61943p08457m80025l07341j10506
$$ 24877923 23843586 22720089 21851152 21038131 20376188 19667731 19187706 18880365 18769859
4353A8769859p7239l6577l8877J69462J23945J70781M39646O35689P22410O23412
$$ 18769859 18692620 18656043 18617166 18786628 18910573 19081354 19521000 20156689 20879099 21502511
4343B1502511P54009R83264J123379J196140J233121J291588J279763J228874
$$ 21502511 22256520 23239784 24363163 25559303 26792424 28084012 29363775 30592649
4335C0592649R84036M80615Q4989k47175l54704p72123p76064r24477o06384m02815
$$ 30592649 31576685 32057300 32142289 31895114 31540410 30768287 29992223 29067746 28461362 28058547
4325B8058547l25544k35081J5121J36522P7094n2202m34965o03157j061947j071545
$$ 28058547 27733003 27497922 27513043 27649565 27726659 27674457 27239492 26636335 25574388 24502843
4315B4502843j233289j247205j064057j113447j074220p88945q05221p33622l67486
$$ 24502843 23269554 22022349 20958292 19844845 18770625 17981680 17176459 16442837 16075351
4306A6075351o94608l48717k52336l63991r8638j42854k19617R506N1300r6546
$$ 16075351 15380743 15032026 14779690 14415699 14317061 14174207 13954590 13964096 14015396 13918850
4296A3918850R3464J78465K12669M96292N46866M52220M81153O09665N99981O56088
$$ 13918850 14012314 14190779 14403448 14899740 15446606 15898826 16379979 16989644 17589625 18245713
4286A8245713N96364L86201J04404j80673n23564p31440q49617j066865r54316
$$ 18245713 18842077 19228278 19332682 19152009 18628445 17897005 17047388 15980523 15026207
4277A5026207j155361q84183q30219p22179m78014n53211n91865l91705k71639
$$ 15026207 13870846 12986663 12156444 11434265 10956251 10403040 9811175 9419470 9147831
4268I147831m45434k98063k36961l89021k79226n7942k64868j07294j32305k48809
$$ 9147831 8702397 8404334 8167373 7778352 7499126 7441184 7176316 7069022 6936717 6687908
4258F687908k77176j61885q1024j23157o5529j79085j74274l7069n4110l1181
$$ 6687908 6410732 6248847 6167823 6044666 5979137 5800052 5625778 5588709 5534599 5503418
4248E503418r2470j84337j44475j67648J7861j1620K968j67952o8753j03357j33065
$$ 5503418 5410948 5226611 5082136 4914488 4932349 4920729 4923697 4755745 4686992 4583635 4450570
4237D450570L7107N2652j67682j02463O6555P2561J3192j45155r3553o17J03918
$$ 4450570 4487677 4540329 4372647 4270184 4336739 4409300 4422492 4277337 4183784 4183167 4287085
4226D287085k02500j32245M405O215j4906n0532j8111k1560P4958N6282j29632
$$ 4287085 4084585 3952340 3956745 3962960 3948054 3897522 3879411 3857851 3932809 3989091 3859459
4215C859459q2526j16130R5730J51181j44308l0743j07778N5149L0235O1920K1538
$$ 3859459 3776933 3660803 3756533 3907714 3763406 3732663 3624885 3680034 3710269 3772189 3793727
4204C793727j5675j25493L4616q0461P921J746K4579R564j69968j403O5681J1723
$$ 3793727 3778052 3652559 3687175 3606714 3614635 3616381 3640960 3650524 3480556 3479153 3544834 3556557
4192C556557m1923k364l2241j23473J42461N4957l5787P4530R3k3475K3162j07539
$$ 3556557 3514634 3512270 3480029 3356556 3499017 3553974 3518187 3592717 3592810 3569335 3592497 3484958
4180C484958M4664J69765j27176k988j00940N4195j19510J44970J38192L8190
$$ 3484958 3529622 3699387 3572211 3569223 3468283 3522478 3402968 3547938 3686130 3724320
4170C724320R4465j1661J00128l3680j03507L9949P9438l5164p5251J13497L0055
$$ 3724320 3818785 3807124 3907252 3873572 3770065 3810014 3889452 3854288 3779037 3892534 3922589
4159C922589O3979J6921O6365L1476L0348J19470M8787k0088J23639L3816J69632
$$ 3922589 3986568 4003489 4069854 4101330 4131678 4251148 4299935 4279847 4403486 4437302 4606934
4148D606934O2462M5958J80093m904R9898M245M723J08145J44005J37908J45675
$$ 4606934 4669396 4715354 4895447 4890543 4990441 4994686 4999409 5107554 5251559 5389467 5535142
4137E535142O4760K29325J90348J37758J36503J27144K77039K98526L17655K84843
$$ 5535142 5599902 5829227 6019575 6157333 6293836 6420980 6698019 6996545 7314200 7599043
4127G599043K90533K23760L92261M29609L60549M68517P81336Q91226P37020R56369
$$ 7599043 7889576 8113336 8505597 8935206 9295755 9764272 10545608 11436834 12173854 13130223
4117A3130223J091972J155746J115101J320115J147255J007175R44710J261659
$$ 13130223 14222195 15377941 16493042 17813157 18960412 19967587 20912297 22173956
4109B2173956J354437J390447J483875J165305Q03037N55952O93740O86476P38253
$$ 22173956 23528393 24918840 26402715 27568020 28371057 28927009 29620749 30307225 31045478
4100C1045478R13140M78024J36001m56331q38611j032450q19801n88832o03326
$$ 31045478 31958618 32436642 32572643 32116312 31277701 30245251 29425450 28836618 28233292
4091B8233292o47205j082708j361800j392714j493987j446285j071405j101821
$$ 28233292 27586087 26503379 25141579 23748865 22254878 20808593 19737188 18635367
4083A8635367j044749j229644j103369j214757j191418r53406q45061n91061o57234
$$ 18635367 17590618 16360974 15257605 14042848 12851430 11898024 11052963 10461902 9804668
4074I804668o06761m08422l67826n36989k90012k68022k43142j75396k60677j87990
$$ 9804668 9197907 8789485 8421659 7884670 7594658 7326636 7083494 6908098 6647421 6459431
4064F459431l47654k69717j85502j93714j10262j06597o0227j10465j46571l4283
$$ 6459431 6111777 5842060 5656558 5462844 5352582 5245985 5185758 5075293 4928722 4894439
4054D894439j59410k5965j17677j14813k6069n8976j58864r8905p4001k4168q3626
$$ 4894439 4735029 4709064 4591387 4476574 4450505 4391529 4232665 4133760 4059759 4035591 3951965
4043C951965J04653j62690m8480j03398q8096O5716Q9490j52583K7966j01005
$$ 3951965 4056618 3893928 3845448 3742050 3653954 3719670 3809160 3656577 3684543 3583538
4033C583538j96616J62576m4416K2793k5890n3352j16321J2137p4603o6036p0228
$$ 3583538 3386922 3549498 3505082 3527875 3501985 3448633 3332312 3344449 3269846 3203810 3133582
4022C133582m9041j0309J2983j80783M3438L1164j50784j28413J96626J7038r0028
$$ 3133582 3084541 3074232 3087215 2906432 2949870 2981034 2830250 2701837 2898463 2915501 2825473
4011B825473n2068j23830l5521k2436J2104M5512l8760J25714j10580j28499R5854
$$ 2825473 2773405 2649575 2614054 2591618 2603722 2649234 2610474 2736188 2625608 2497109 2592963
4000B592963l7167j20959k709P4756m5343R0149M5487j84112m6493J36355o4908
$$ 2592963 2555796 2434837 2432128 2506884 2461541 2551690 2597177 2413065 2366572 2502927 2438019
3989B438019L9816p5723j1577n8479Q9219J02057M8355r3197J858K1173l1380
$$ 2438019 2477835 2402112 2390535 2332056 2421275 2523332 2571687 2478490 2480348 2501521 2470141
3978B470141O5823j48334j21234J0645k9255m2638J47045j7869q8262O2293P8453
$$ 2470141 2535964 2387630 2266396 2277041 2247786 2205148 2352193 2334324 2246062 2308355 2386808
3967B386808r9893J04748K3680J1968j22744O3888R9126k9937j09167k3204j56347
$$ 2386808 2286915 2391663 2415343 2427311 2304567 2368455 2467581 2437644 2328477 2305273 2148926
3956B148926J27435m602j15352J11456N5475M9935Q1965N6170m1008L999k7845
$$ 2148926 2276361 2271759 2156407 2267863 2323338 2373273 2455238 2511408 2470400 2474399 2446554
3945B446554K2267J353N0514J19625j74777L6835N2833k3949L9036K4409J93825
$$ 2446554 2468821 2470174 2520688 2640313 2465536 2502371 2555204 2531255 2570291 2594700 2788525
3934B788525k2983l6697Q9592o4221n7617Q6838n2246J60985j20320Q580J01514
$$ 2788525 2765542 2728845 2818437 2754216 2696599 2783437 2731191 2892176 2771856 2780436 2881950
3923B881950J9689j79436J75832J39083K9588q2264M5162R7566O3334R8970p7565
$$ 2881950 2901639 2722203 2898035 3037118 3066706 2984442 3029604 3127170 3190504 3289474 3211909
3912C211909k7777J17622P0289j31060R640J28689j45207N9244N4415j8633P9
$$ 3211909 3184132 3301754 3372043 3240983 3250623 3379312 3234105 3293349 3347764 3329131 3329210
3901C329210q7742K78314N1684k8455N8290L1882N0046J67114o2602R8588l9854
$$ 3329210 3241468 3519782 3571466 3543011 3601301 3633183 3683229 3850343 3787741 3886329 3846475
3890C846475Q0093J06219J24678N3624R3885K219p2921L9592Q1324K89725J5621
$$ 3846475 3926568 4032787 4157465 4211089 4304974 4307193 4234272 4273864 4355188 4644913 4660534
3879D660534J33337J5479K26855K48634J33555J01544M1599J89888K33499k9468
$$ 4660534 4793871 4809350 5036205 5284839 5418394 5519938 5561537 5751425 5984924 5955456
3869E955456J63876K13694J04490K06824J68909K56653L20834L52064K41011L08727
$$ 5955456 6119332 6333026 6437516 6644340 6813249 7069902 7390736 7742800 7983811 8292538
3859H292538L97849L82999L07233K65934M19527M86850L81775N17248N20395O49681
$$ 8292538 8690387 9073386 9380619 9646553 10066080 10552930 10934705 11451953 11972348 12622029
3849A2622029O81948O72912O72046Q21712P28038P04856Q91223Q41346R31603
$$ 12622029 13303977 13976889 14648935 15470647 16198685 16903541 17794764 18636110 19567713
3840A9567713R65151J221266J134647Q89126J067314J037940J172010J161516
$$ 19567713 20532864 21754130 22888777 23777903 24845217 25883157 27055167 28216683
3832B8216683J088873J227985J148370J333718J270149J269923J155478J031247
$$ 28216683 29305556 30533541 31681911 33015629 34285778 35555701 36711179 37742426
3824C7742426J010220R38761Q79249P54779P61031N70276N88001P95914N94257
$$ 37742426 38752646 39691407 40570656 41325435 42086466 42656742 43244743 44040657 44634914
3815D4634914P33162N45375J45247N5007n8554j80010l48475m94359m55662o64068
$$ 44634914 45368076 45913451 46058698 46113705 46055151 45875141 45526666 45032307 44576645 43912577
3805D3912577n89286n23938o60205p24000p03023p53791p85259r27160j222038
$$ 43912577 43323291 42799353 42139148 41415148 40712125 39958334 39173075 38245915 37023877
3796C7023877j162223j135520j246488j372540j297140j050760j167784j002535
$$ 37023877 35861654 34726134 33479646 32107106 30809966 29759206 28591422 27588887
3788B7588887j055596j093005q53214r07803r51891j130176r89354r60704p51566
$$ 27588887 26533291 25440286 24587072 23679269 22727378 21597202 20607848 19647144 18895578
3779A8895578p37331q96946q02454o29639p38294o39504n14028l48492n65290
$$ 18895578 18158247 17261301 16458847 15829208 15090914 14451410 13937382 13588890 13023600
3770A3023600m80393m78390n52460l17821l09430k14183k41789l33989l85937
$$ 13023600 12543207 12064817 11512357 11194536 10885106 10670923 10429134 10095145 9709208
3761I709208k56896n7768l17430k75312k40207k54218j23559k79181j72751j37737
$$ 9709208 9452312 9394544 9077114 8801802 8561595 8307377 8183818 7904637 7731886 7594149
3751G594149k81503j36796q3039o0773l5402k08185k47747j55376j37054Q1576
$$ 7594149 7312646 7175850 7092811 7032038 6996636 6788451 6540704 6385328 6248274 6329850
3741F329850j04170l01125j92417j36662K8518j55087j32168N692o8098j60401
$$ 6329850 6225680 5924555 5732138 5595476 5623994 5468907 5336739 5342431 5274333 5113932
3731E113932j10575r3528j43740j65740P5300p5814j34111r807j37198R44l4747
$$ 5113932 5003357 4909829 4766089 4600349 4675649 4599835 4465724 4455917 4318719 4319663 4284916
3720D284916m7364j15940K1476q0950j78702j00200J4351Q8598K1632k15338O3067
$$ 4284916 4237552 4121612 4143088 4062138 3883436 3783236 3797587 3886185 3907817 3692479 3755546
3709C755546R4501j18791r7912R194J2652J1167j03021j70678J36280j16735p2268
$$ 3755546 3850047 3731256 3633344 3642538 3655190 3666357 3563336 3392658 3528938 3412203 3339935
3698C339935l2656J273m3660r4462j0733o0705M8078m3358j28946K6366l6062
$$ 3339935 3307279 3308552 3264892 3170430 3159697 3098992 3147070 3103712 2974766 3001132 2965070
3687B965070O100J0252p2085M9611j3044k0206R5093r4815q5098N8298m0306K2178
$$ 2965070 2971170 2981422 2909337 2958948 2945904 2925698 3020791 2925976 2840878 2899176 2858870 2881048
3675B881048R859j07924J0570l3956K8812j9047q0008q6512R8469l4214L7007
$$ 2881048 2890907 2782983 2793553 2759597 2788409 2769362 2689354 2602842 2701311 2667097 2704104
3664B704104N6376n8581j27960J15173R9489j15692O0402J25312j02115O4522
$$ 2704104 2760480 2701899 2573939 2689112 2788601 2672909 2733311 2858623 2756508 2821030
3654B821030j0236q3046R5313p4495p7082n1054J2139L2086L3931r0509Q8040
$$ 2821030 2810794 2727748 2823061 2748566 2671484 2620430 2632569 2664655 2698586 2608077 2696117
3643B696117Q7507j51044K7450p995P9425O975K120o6096J12818p9985j09704
$$ 2696117 2783624 2632580 2660030 2652035 2731460 2738435 2740555 2674459 2787277 2707292 2597588
3632B597588O5768P5602M4904j40936J12844p3672j407M0351N5378L6592O9603
$$ 2597588 2663356 2738958 2783862 2642926 2755770 2682098 2680691 2721042 2776420 2813012 2882615
3621B882615N178N0485j17639k128j64696J29236n255n9765K27871O6772j00485
$$ 2882615 2887793 2938278 2820639 2818511 2653815 2783051 2777796 2718031 2945902 3012674 2912189
3610B912189M4388Q5933q7907L192J13260J4461k02584O2724J4460J49167O3725
$$ 2912189 2956577 3042510 2954603 2957795 3071055 3085516 2882932 2945656 2960116 3109283 3173008
3599C173008R6408j18113k9848J20780J18713P7285L5314L168j603L8247J59094
$$ 3173008 3269416 3151303 3121455 3242235 3360948 3438233 3473547 3476715 3475112 3513359 3672453
3588C672453r590M0572J57585N9733L4660j3520j38868J17384J52948O5778J60100
$$ 3672453 3662863 3703435 3861020 3920753 3955413 3941893 3803025 3920409 4073357 4139135 4299235
3577D299235R3504K10487q6126R6288J66315J21232o0629l6082L2823J64564J37490
$$ 4299235 4392739 4603226 4517100 4613388 4779703 4900935 4840306 4804224 4837047 5001611 5139101
3566E139101J1934P9992m935O0757J12577N9922J03628J5172J07831n4304Q6872
$$ 5139101 5151035 5231027 5226092 5286849 5399426 5459348 5562976 5578148 5685979 5631675 5718547
3555E718547p5571M84J45887K1652L5712P8988o3442R1821K90209m6497J1641
$$ 5718547 5642976 5643460 5789347 5810999 5846711 5925699 5862257 5954078 6244287 6197790 6209431
3544F209431K41944N3305p4864R3287J7419J54375L9783K10941J14644K1307l6321
$$ 6209431 6451375 6504680 6429816 6523103 6540522 6694897 6734680 6945621 7060265 7081572 7045251
3533G045251L3219J15402R8612J22107m937K35544J31566J39927J39287K33996
$$ 7045251 7078470 7193872 7292484 7414591 7409654 7645198 7776764 7916691 8055978 8289974
3523H289974J92160k8519K03940J12290R6953K37664J26604J87019L54981K01992
$$ 8289974 8482134 8453615 8657555 8769845 8866798 9104462 9231066 9418085 9773066 9975058
3513I975058L66879M08623L18360K22042M18899M51509L40316M35935J64942M12625
$$ 9975058 10341937 10750560 11068920 11290962 11709861 12161370 12501686 12937621 13102563 13515188
3503A3515188L96008L16715K75998M02547J95216L59066M29161K03937K49843
$$ 13515188 13911196 14227911 14503909 14906456 15101672 15460738 15889899 16093836 16343679
3494A6343679M18242K06365K01353L52748L42093M53632K43441K23823K88466
$$ 16343679 16761921 16968286 17169639 17522387 17864480 18318112 18561553 18785376 19073842
3485A9073842K76380M46316L03526J86023N90343N79999N27671O60668O05609
$$ 19073842 19350222 19796538 20100064 20286087 20876430 21456429 21984100 22644768 23250377
3476B3250377P35598Q06587P92759R97397J178666J173178J228002J497553J529037
$$ 23250377 23985975 24792562 25585321 26582718 27761384 28934562 30162564 31660117 33189154
3467C3189154J666025J990139K004259K068569K401115K558626K741531K689348
$$ 33189154 34855179 36845318 38849577 40918146 43319261 45877887 48619418 51308766
3459E1308766L045201K708804K747780K807087K821356K668834K705059K582233
$$ 51308766 54353967 57062771 59810551 62617638 65438994 68107828 70812887 73395120
3451G3395120K473292K453463K109841K000268J931543J520461J202929R91641
$$ 73395120 75868412 78321875 80431716 82431984 84363527 85883988 87086917 88078558
3443H8078558P49812K55909j46574o47979r53331j183386j273558j507427j841121
$$ 88078558 88828370 89084279 88937705 88289726 87336395 86153009 84879451 83372024 81530903
3434H1530903j791448j947037j993864k040031k055333k296990k311095k539142
$$ 81530903 79739455 77792418 75798554 73758523 71703190 69406200 67095105 64555963
3426F4555963k664483k711997k654989k726647k651760k459477k524210j913881
$$ 64555963 61891480 59179483 56524494 53797847 51146087 48686610 46162400 44248519
3418D4248519j641989k034012j454701j274808j261457r65503j051223p00460
$$ 44248519 42606530 40572518 39117817 37843009 36581552 35616049 34564826 33864366
3410C3864366o44336n87490m73136m59707l34568l19979j07674k32972l30713
$$ 33864366 33220030 32632540 32159404 31699697 31365129 31045150 30937476 30704504 30373791
3401C0373791j60519k74804k12817l2794j47386j03709j09112j45107j72097l27370
$$ 30373791 30213272 29938468 29725651 29692857 29545471 29441762 29332650 29187543 29015446 28688076
3391B8688076l28080k07787n05000m37439k31232l25745l79699m22573k91039
$$ 28688076 28359996 28152209 27647209 27209770 26978538 26652793 26273094 25850521 25559482
3382B5559482k41973l45258l65403l08088k75589l87371k46412k22075j74560
$$ 25559482 25317509 24972251 24606848 24298760 24023171 23635800 23389388 23167313 22992753
3373B2992753k63790j25141n8501j10794p2837L9827j0149O161o0047M36426L51349
$$ 22992753 22728963 22603822 22545321 22434527 22361690 22401517 22391368 22397529 22337482 22773908 23125257
3362B3125257K55318J71768L06805L21273M07126M23259L39923N91352O72665
$$ 23125257 23380575 23552343 23859148 24180421 24587547 25010806 25350729 25942081 26614746
3353B6614746P66202O87399R28730R12937Q52776P91105P84006P64762Q03429
$$ 26614746 27380948 28068347 28997077 29910014 30762790 31553895 32337901 33102663 33906092
3344C3906092N42648N04345K15895N1724Q4549J27287M930l5700Q4375j27589
$$ 33906092 34448740 34953085 35168980 35220704 35305253 35432540 35437470 35401770 35486145 35358556
3334C5358556K0010J49694L00034L29852K97075L56832L95629M22171M59301O59810
$$ 35358556 35378566 35528260 35828294 36158146 36455221 36812053 37207682 37629853 38089154 38748964
3324C8748964O27738O71367O34809P92981R81317J027153R78547J078775J157213
$$ 38748964 39376702 40048069 40682878 41475859 42457176 43484329 44462876 45541651 46698864
3315D6698864J313572J496693J526026J736502J853165J887435K152730K339247
$$ 46698864 48012436 49509129 51035155 52771657 54624822 56512257 58664987 61004234
3307F1004234K492440K944429L223768L215559L463510L579367L821473L890058
$$ 61004234 63496674 66441103 69664871 72880430 76343940 79923307 83744780 87634838
3299H7634838L753978L792927L670654L391763L385279L115564L036311K922993
$$ 87634838 91388816 95181743 98852397 102244160 105629439 108745003 111781314 114704307
3291A14704307K703248K769024L127516L122103L459900L973036M203551M520458
$$ 114704307 117407555 120176579 123304095 126426198 129886098 133859134 138062685 142583143
3283A42583143M690440M652813M583793M284408L645605K600311J655729N02049
$$ 142583143 147273583 151926396 156510189 160794597 164440202 167040513 168696242 169198291
3275A69198291q49282k026059k840375l682864m198962m442898m582669m724299
$$ 169198291 168349009 166322950 163482575 159799711 155600749 151157851 146575182 141850883
3267A41850883m280329m430810m088620l857335l993707l856967m035343l864612
$$ 141850883 137570554 133139744 129051124 125193789 121200082 117343115 113307772 109443160
3259A09443160m221364m072999l985090l783498l901846l522392l409506l141980
$$ 109443160 105221796 101148797 97163707 93380209 89478363 85955971 82546465 79404485
3251G9404485l019854k724478k530987k340345k070688j973985j721742j714537
$$ 79404485 76384631 73660153 71129166 68788821 66718133 64744148 63022406 61307869
3243F1307869j571275j424352j469293j257871j456240j148229j043912j020870
$$ 61307869 59736594 58312242 56842949 55585078 54128838 52980609 51936697 50915827
3235E0915827r74639q25932q54246p02507p51559p25548m64698o59874n51878
$$ 50915827 49941188 49115256 48261010 47558503 46806944 46081396 45616698 44956824 44404946
3226D4404946m64901m23378k69071l86055l71991k42113k91546j86274l39319
$$ 44404946 43940045 43516667 43247596 42861541 42489550 42247437 41955891 41769617 41430298
3217D1430298k39762m04656m67375n23116n72495p14586p94936r22431q56878
$$ 41430298 41190536 40785880 40318505 39795389 39222894 38508308 37713372 36790941 35934063
3208C5934063q73764j034781j095099q35891q54420q95893p08695p33707o41869
$$ 35934063 35060299 34025518 32930419 32094528 31240108 30344215 29635520 28901813 28259944
3199B8259944n86802l51292l88961m90665l20056j94830l13582k87405j26695
$$ 28259944 27673142 27321850 26932889 26442224 26122168 25927338 25613756 25326351 25199656
3190B5199656n7678k4138Q5573M6072l3238R3802J57669M4849J91300K00149K33858
$$ 25199656 25141978 25117840 25203413 25249485 25216247 25310049 25467718 25512567 25703867 25904016 26137874
3179B6137874L19854L23064L79315K84739M07679M02112N31570M35578M91611
$$ 26137874 26457728 26780792 27160107 27444846 27852525 28254637 28786207 29221785 29713396
3170B9713396M90193M26170M48956M39317M88562M70420L42742K92764L36864
$$ 29713396 30203589 30629759 31078715 31518032 32006594 32477014 32819756 33112520 33449384
3161C3449384M14377N19084N49564L93643L16500L22099N17896M38948M87888
$$ 33449384 33863761 34382845 34932409 35326052 35642552 35964651 36482547 36921495 37409383
3152C7409383L20580L34413N54106M79438K55389M07375N40415M91606N74180
$$ 37409383 37729963 38064376 38618482 39097920 39353309 39760684 40301099 40792705 41366885
3143D1366885O91221Q52831O58101Q00861R77838R28245J113885J346345J485080
$$ 41366885 42058106 42910937 43569038 44369899 45347737 46275982 47389867 48736212 50221292
3134E0221292J704361J552130J719138J923757K229746K528114K544527K778426
$$ 50221292 51925653 53477783 55196921 57120678 59350424 61878538 64423065 67201491
3126F7201491L194483L489518L590431M066608M500002M956230N374579N740220
$$ 67201491 70395974 73885492 77475923 81542531 86042533 90998763 96373342 102113562
3118A02113562O421873O868440P563364Q027620Q676955R151897R298924R505055
$$ 102113562 108535435 115403875 122967239 130994859 139671814 148823711 158122635 167627690
3110A67627690R315345R001134Q434233P472179O511807N250410L927939K750927
$$ 167627690 176943035 185944169 194378402 201850581 208362388 213612798 217540737 220291664
3102B20291664J783405R97547K65300j61080q49564j366662j821614k892050l943367
$$ 220291664 222075069 223072616 223337916 223176836 222327272 220960610 219138996 216246946 212303579
3093B12303579m789067n872768p251259p922019q664788r009616r145358r156535
$$ 212303579 207514512 201641744 194390485 186468466 177803678 168794062 159648704 150492169
3085A50492169q932952q521312p768074p481662o982904o259959n788688n370837
$$ 150492169 141559217 133037905 125269831 117788169 110805265 104545306 98756618 93385781
3077I3385781m627412m525226l996890l517042l170788l205885k783678k637727
$$ 93385781 88758369 84233143 80236253 76719211 73548423 70342538 67558860 64921133
3069F4921133k453026k151088j958902j778382j689502j493549j434746j330904
$$ 64921133 62468107 60317019 58358117 56579735 54890233 53396684 51961938 50631034
3061E0631034j339048j324342j312254q82327r19127r46670r16393r66745q56588
$$ 50631034 49291986 47967644 46655390 45773063 44853936 43907266 42990873 42024128 41167540
3052D1167540q44811p70035q19991p45612n80589q00985o86719n61246n24792
$$ 41167540 40322729 39552694 38732703 37987091 37406502 36605517 35918798 35357552 34832760
3043C4832760o44285n64478o38520n20178n08775m40438l34916l99789l42552
$$ 34832760 34188475 33623997 32985477 32465299 31956524 31516086 31181170 30781381 30438829
3034C0438829k07875l09881j61592r5745k09065o2113j6888L6769K20991J96639
$$ 30438829 30230954 29921073 29759481 29663736 29454671 29392558 29375670 29412439 29633430 29830069
3024B9830069K32828L57372J50285Q4211J62563J37629N6074j29750k25311j95766
$$ 29830069 30062897 30420269 30570554 30654765 30817328 30954957 31011031 30881281 30655970 30460204
3014C0460204j27530j31150j95259j60066j67769j78257m8163M5402J88257K08847
$$ 30460204 30332674 30201524 30006265 29846199 29678430 29500173 29452010 29497412 29685669 29894516
3004B9894516K06685K31788K20464L76080N29332N46864N07436O67975P08720
$$ 29894516 30101201 30332989 30553453 30929533 31458865 32005729 32513165 33181140 33889860
2995C3889860Q46911O90442R11299R10086J013477J183956J198202J152074J441067
$$ 33889860 34736771 35427213 36338512 37248598 38262075 39446031 40644233 41796307 43237374
2986D3237374J633965J770599J956797K126875K512268K641472L076533L500562
$$ 43237374 44871339 46641938 48598735 50725610 53237878 55879350 58955883 62456445
2978F2456445L317854L818712M303827M357638M435075M586893M630256M524837
$$ 62456445 65774299 69593011 73896838 78254476 82689551 87276444 91906700 96431537
2970I6431537M351550L693899L377304K786146K034813J582118J072315L76628
$$ 96431537 100783087 104476986 107854290 110640436 112675249 114257367 115329682 115706310
2962A15706310n0447n41213j102273j686462k251887k735081l313095l856129
$$ 115706310 115655863 115114650 114012377 112325915 110074028 107338947 104025852 100169723
2954A00169723m313433m567481m630581m696169m543562m549307m174074l942583
$$ 100169723 95856290 91288809 86658228 81962059 77418497 72869190 68695116 64752533
2946F4752533l580058l303357l032074k849071k597218k494781k226300j987068
$$ 64752533 61172475 57869118 54837044 51987973 49390755 46895974 44669674 42682606
2938D2682606j845290j451216j576610j568574j180329j057521j010039r02860
$$ 42682606 40837316 39386100 37809490 36240916 35060587 34003066 32993027 32090167
2930C2090167p80189o30980o94416n39395l28439l10052k11566l15597l00775
$$ 32090167 31309978 30678998 29984582 29445187 29116748 28806696 28595130 28279533 27978758
2921B7978758K38217J82945J66088K85918N18864O68824R36333Q94223J111886
$$ 27978758 28216975 28399920 28566008 28851926 29370790 30039614 30975947 31870170 32982056
2912C2982056J273310J629305K067906K305890K897514L259044K673525J547565
$$ 32982056 34255366 35884671 37952577 40258467 43155981 46415025 49088550 50636115
2904E0636115j164004l196925l440706l395713l277638k549576j844209j538924
$$ 50636115 49472111 46275186 42834480 39438767 36161129 33611553 31767344 30228420
2896C0228420j065583p87766p02276n83100l63164k47040J48035K24332K94328
$$ 30228420 29162837 28375071 27672795 27089695 26726531 26479491 26627526 26851858 27146186
2887B7146186N44790J080827J385710J775242K349016K759838K468274J401952
$$ 27146186 27690976 28771803 30157513 31932755 34281771 37041609 39509883 40911835
2879D0911835j347529l348704l167752l124860l062660k361489j589620j300597
$$ 40911835 39564306 36215602 33047850 29922990 26860330 24498841 22909221 21608624
2871B1608624j029321q18938o15570o19334n23596o07019m80882k86994m10739
$$ 21608624 20579303 19760365 19144795 18525461 18001865 17394846 16913964 16626970 16216231
2862A6216231l45878j28192j75329j89651j64568j77905L2553p448l6069r5461
$$ 16216231 15870353 15742161 15566832 15377181 15212613 15034708 15067261 15059813 15023744 14928283
2852A4928283R799j2162j6207P1461q0426K1780N9084K1406j6669R1447N6207
$$ 14928283 14938082 14925920 14909713 14981174 14900748 14922528 14981612 15003018 14986349 15077796 15134003
2841A5134003J27691k442O6204O5374k9698J20070J0739K13399m3583J3924K14349
$$ 15134003 15261694 15259252 15325456 15390830 15361132 15481202 15491941 15705340 15661757 15675681 15890030
2830A5890030J48941J53445J46657m796J80020J17885J43214M4913K15144K75604
$$ 15890030 16038971 16192416 16339073 16334277 16514297 16632182 16775396 16820309 17035453 17311057
2820A7311057J58699k2543K59549J69220K57197J80749L66865K37991K96144M02815
$$ 17311057 17469756 17447213 17706762 17875982 18133179 18313928 18680793 18918784 19214928 19617743
2810A9617743L86364M14820K15739M16976N13066O23490N31792N09735N31496
$$ 19617743 20004107 20418927 20634666 21051642 21564708 22188198 22719990 23229725 23761221
2801B3761221P64065P42554O02462O80516R45251P25842R13746R30488J011189
$$ 23761221 24525286 25267840 25870302 26550818 27496069 28221911 29135657 30066145 31077334
2792C1077334J036402J120198J169721J152978J099010J337518J483701J417807
$$ 31077334 32113736 33233934 34403655 35556633 36655643 37993161 39476862 40894669
2784D0894669J312236J452848J548391J552739J587322J912657K083740J972855
$$ 40894669 42206905 43659753 45208144 46760883 48348205 50260862 52344602 54317457
2776E4317457K138247K265078K376796K554196K799468L036916L211569L437992
$$ 54317457 56455704 58720782 61097578 63651774 66451242 69488158 72699727 76137719
2768G6137719L652748L949124M376814M557076N146590N566664N992594O485939
$$ 76137719 79790467 83739591 88116405 92673481 97820071 103386735 109379329 115865268
2760A15865268P092810P916386Q741883R706748J0857538J2253502J3590757J5344793
$$ 115865268 122958078 130874464 139616347 149323095 160180633 172434135 186024892 201369685
2752B01369685J7311843J9357402K1479986K3632351K5689236K7585066K9266957
$$ 201369685 218681528 238038930 259518916 283151267 308840503 336425569 365692526
2745C65692526L0320480L0423827K8749951K3754414J5042894L342616r038163
$$ 365692526 396013006 426436833 455186784 478941198 493984092 497326708 488288545
2738D88288545k0151978k7882045l2011021l3088200l2049678k9984623k7357206
$$ 488288545 468136567 440254522 408243501 375155301 343105623 313121000 285763794
2731B85763794k4519855k1952830j9450144j7310707j5361755j3630423j2174002
$$ 285763794 261243939 239291109 219840965 202530258 187168503 173538080 161364078
2724A61364078j1057233r736002q758779p718084o935654o204348n590293m778383
$$ 161364078 150306845 140570843 131812064 124093980 117158326 110953978 105363685 100585302
2716A00585302m250206l987017l648887l384790l120322l173826l041649l106916
$$ 100585302 96335096 92348079 88699192 85314402 82194080 79020254 75978605 72871689
2708G2871689l007463l092125l040394k837069k708936k552793k317785k405162
$$ 72871689 69864226 66772101 63731707 60894638 58185702 55632909 53315124 50909962
2700E0909962j968873k038012j950834j810947j596139j575770j551458j280959
$$ 50909962 48941089 46903077 44952243 43141296 41545157 39969387 38417929 37136970
2692C7136970j284973j209740j177495r85556j003252j114669p85416r04585p53385
$$ 37136970 35851997 34642257 33464762 32479206 31475954 30361285 29575869 28671284 27917899
2683B7917899p63677p69413o02165n32440o80149n80789p36415o86011m98610
$$ 27917899 27154222 26384809 25782644 25250204 24570055 23989266 23252851 22566840 22068230
2674B2068230n44532n20520l97753l06215n03857n04826l96116m10515m33328
$$ 22068230 21523698 21003178 20605425 20299210 19795353 19290527 18894411 18483896 18050568
2665A8050568k80857m62387m50725m01292n54853l10944m32113n39334m08522
$$ 18050568 17769711 17307324 16856599 16455307 15900454 15589510 15157397 14618063 14209541
2656A4209541m19021l27403k89186m16986k55161l26073k79347m05435l29709
$$ 14209541 13790520 13463117 13173931 12756945 12501784 12175711 11896364 11490929 11161220
2647A1161220k48832k59810k76191k32114j41949k75524j03417l87361j70766
$$ 11161220 10912388 10652578 10376387 10144273 10002324 9726800 9623383 9236022 9065256
2638I065256k46069p0835j46868k16686j39969j75162j31101n5368j87890k22700
$$ 9065256 8819187 8748352 8601484 8384798 8244829 8069667 7938566 7883198 7695308 7472608
2628G472608O497k60367k22668j36709j22754q9438m0692j57949j42481J9866
$$ 7472608 7479105 7218738 6996070 6859361 6736607 6647169 6606477 6448528 6306047 6325913
2618F325913j50661j37079K427m5462m1606l09289j44097l6820r4737j00640j54689
$$ 6325913 6175252 6038173 6040600 5995138 5953532 5644243 5500146 5463326 5368589 5267949 5113260
2607E113260j3481J7604j11936k96169N7666q8325j71658M635K146p2865j1016
$$ 5113260 5099779 5117383 5005447 4709278 4766944 4678619 4506961 4511596 4513742 4440877 4429861
2596D429861j01962j08009J1205m9360K6895p6229k02593j28000n6418j3706j60868
$$ 4429861 4327899 4219890 4231095 4181735 4208630 4132401 3929808 3801808 3745390 3731684 3570816
2585C570816o8982r4077m3277q7368j53726o8924n6339m1966L4154j05248p4510
$$ 3570816 3501834 3407757 3364480 3277112 3123386 3054462 2998123 2956157 2990311 2885063 2810553
2574B810553n373o6349q8049p3269P6604J03044n628l5329j39661k4881N5292
$$ 2810553 2805180 2738831 2650782 2577513 2654117 2757161 2751533 2716204 2576543 2551662 2606954
2563B606954K1450K0560m7904r3635o4838j42463k14900J3358k776q6440M5540
$$ 2606954 2628404 2648964 2601060 2507425 2442587 2300124 2085224 2098582 2095806 2009366 2054906
2552B054906j05302m0010j07784n2972J3474q983Q7580j55497n2426q690k1822
$$ 2054906 1949604 1909594 1801810 1748838 1762312 1753329 1840909 1685412 1632986 1624296 1602474
2541A602474j849p1875j09125P4468p3058o3657o4254R9878J97511j1183J0243
$$ 1602474 1600625 1528750 1419625 1494093 1421035 1357378 1293124 1393002 1590513 1579330 1589573
2530A589573n65j85552p0196l691r620n6401M2085p8363J21799k3085l6161M1812
$$ 1589573 1589008 1403456 1333260 1329569 1319949 1263548 1305633 1227270 1349069 1325984 1289823 1331635
2518A331635k0310N6713j60561J2960m4845R7327Q1091j5123M7897j49975Q3810
$$ 1331635 1311325 1368038 1207477 1220437 1175592 1272919 1354010 1338887 1386784 1236809 1320619
2507A320619K01041M333r9486R906m2055O0156M3823J5309q6733J37644K32754
$$ 1320619 1521660 1525993 1426507 1436413 1394358 1454514 1498337 1513646 1426913 1564557 1797311
2496A797311k6988J18316J63056L941R0417J13728R8690Q6291Q2994O7629k3448
$$ 1797311 1770323 1888639 2051695 2055636 2146053 2259781 2358471 2444762 2527756 2595385 2571937
2485B571937J10177q9927P8811l6642J11036k29782j62754k00593m1223k03004
$$ 2571937 2682114 2592187 2670998 2634356 2745392 2515610 2352856 2152263 2111040 1908036
2475A908036k25734p0961j42799k2931n3594j60305q3406m3337j77650R9165j25168
$$ 1908036 1682302 1611341 1468542 1445611 1392017 1231712 1148306 1104969 927319 1026484 901316
2464I01316j42787L7836J51357j78829K44j03351K3618q9881Q8522n9603P0856
$$ 901316 758529 796365 947722 768893 769137 665786 689404 599523 688045 628442 699298
2453F99298j2949k68876j1425j61170J18852J44216j54316j57936K2845j7887
$$ 699298 686349 417473 406048 244878 363730 507946 353630 195694 218539 200652
2443B00652l6859P2764R106j8443K7334j7163n9275j20993O814J54025q4139p0554
$$ 200652 163793 236557 245663 227220 254554 237391 178116 57123 63937 217962 133823 63269
2431F3269R1603q7287J02131L301K6504l5259L6297j10578K7188n2541K9619j07080
$$ 63269 154872 67585 169716 173017 199521 164262 200559 89981 117169 64628 94247 -12833
2419a2833k7467L1444Q5676J40248l01307r7655J79249n9328K2565J79888Q918
$$ -12833 -40300 -8856 76820 217068 -84239 -181894 -2645 -61973 -39408 140480 149398
2408A49398L676J8896J21240j29484j62608n6515j0753J59117M0002o8822O9782
$$ 149398 153074 171970 293210 163726 1118 -55397 -66150 92967 132969 64147 133929
2397A33929l6420M661l3332L4786N1721R2498m4838k40856l1542J0107R4159R5016
$$ 133929 97509 102170 68838 103624 155345 247843 203005 -37851 -69393 -59286 34873 129889
2385A29889N685m2115P792q7508m8475J5478m4784k10156p3370K40440J78367
$$ 129889 135574 93459 101251 13743 -34732 -19254 -64038 -274194 -347564 -107124 71243
2374G1243o8054j95968J13613P179m8511m3651l1069j7304P1309r1179l7079J93466
$$ 71243 3189 -192779 -79166 -71987 -120498 -164149 -195218 -212522 -141213 -232392 -269471 -76005
2362g6005l7275k2749J0284j89373M7017j01424J16352j15489j705Q1239J8954
$$ -76005 -113280 -136029 -125745 -315118 -268101 -369525 -253173 -368662 -370367 -289128 -270174
2351b70174K6158j58145Q4815q5935N2856m9075q4933J57030J6068K2132J03862
$$ -270174 -244016 -402161 -317346 -403281 -350425 -399500 -484433 -327403 -311335 -289203 -185341
2340a85341K6915r186K0728K0274l6212o1083q1762K9278J6278n2741o5159J6843
$$ -185341 -158426 -167612 -146884 -126610 -162822 -223905 -305667 -276389 -260111 -312852 -378011 -361168
2328c61168J6174L0857M4782o0719p5455Q8730q2519p9968M6569P8656k4211J01666
$$ -361168 -344994 -314137 -269355 -330074 -405529 -316799 -399318 -479286 -432717 -354061 -378272 -276606
2316b76606k7842P6798l3324k1066M214k992p6757O1362M5023m2416N5012j39202
$$ -276606 -304448 -227650 -260974 -282040 -277826 -280818 -357575 -296213 -251190 -293606 -238594 -377796
2304c77796K5405j3681J02937k2403k1310n7588M9900J34890j79064n5677J7088
$$ -377796 -352391 -366072 -263135 -285538 -306848 -364436 -314536 -179646 -358710 -414387 -397299
2293c97299j5109O389k1995j60433J99473J02089o8270Q5843j8386J161J3174
$$ -397299 -412408 -406019 -428014 -588447 -388974 -286885 -355155 -269312 -287698 -286537 -273363
2282b73363l3306K6703N3005k8148n1726O2039j57112o467K8472K8115O479n8349
$$ -273363 -306669 -279966 -226961 -255109 -306835 -244796 -401908 -408375 -379903 -351788 -345309 -403658
2270d03658l0546q6021J46144o46k12450O3212R9869q301J57848K3606m563j6308
$$ -403658 -434204 -520225 -374081 -374727 -587177 -523965 -424096 -432397 -274549 -250943 -255506 -271814
2258b71814K4119l5831M3729L2638R5644q5831j02169k0461J07334j36359N345
$$ -271814 -247695 -283526 -239797 -207159 -111515 -197346 -299515 -319976 -212642 -349001 -343656
2247c43656J4480N6884o4507n8559j02677r2498j0093M045j0938J01898L045o0548
$$ -343656 -329176 -272292 -336799 -395358 -498035 -590533 -600626 -596581 -607519 -505621 -502576 -563124
2235e63124J72973n5j0424L5529J32984l6468l7091O3846k0495j04137J5124k6155
$$ -563124 -390151 -390206 -400630 -365101 -232117 -268585 -305676 -241830 -262325 -366462 -351338 -377493
2223c77493Q7652l9120j38936M2559J22614K3925K4823j1787M5228O8691j42806
$$ -377493 -289841 -328961 -467897 -425338 -302724 -278799 -253976 -265763 -220535 -151844 -294650
2212b94650r7913K64N2900o481k7638P4684K8640J00412p2778o9614O2005n0203
$$ -294650 -392563 -392299 -339399 -345880 -373518 -298834 -270194 -169782 -242560 -312174 -250169 -300372
2200c00372L365j07802O540Q7733J73022r0285r4952M7799J3857J9838k867o5977
$$ -300372 -297007 -404809 -398269 -310536 -137514 -227799 -322751 -274952 -261095 -241257 -244124 -310101
2188c10101L4338j3029l5708M8356j24722K5375N431J19638q6558r0235K28802
$$ -310101 -275763 -288792 -324500 -276144 -400866 -375491 -370060 -250422 -336980 -427215 -198413
2177a98413L2986j80322N2590o3069j6189P8098r021k50764J15961J0912J38689
$$ -198413 -165427 -345749 -293159 -356228 -372417 -294319 -303340 -554104 -438143 -427231 -288542
2166b88542L5052m4147p6864O303J35112K3661L4143J1515J42833q3075j11520
$$ -288542 -253490 -297637 -374501 -368198 -233086 -209425 -175282 -163767 -20934 -104009 -215529
2155b15529q460Q2478m3586j0621j3692Q2495r6890O4684K0729j23041R382O4401
$$ -215529 -223989 -141511 -185097 -195718 -209410 -126915 -223805 -159121 -138392 -261433 -252051 -187650
2143a87650k626M8506p0465n7436J3259R495J48942o0136l154J0614m851Q4695
$$ -187650 -190276 -141770 -212235 -269671 -256412 -246917 -97975 -158111 -161265 -150651 -155502 -70807
2131g0807N365j0678m3390J39220r4015r9648O9785L1295n0448L9831K2141j11184
$$ -70807 -65442 -76120 -119510 19710 -74305 -173953 -104168 -72873 -123321 -83490 -61349 -172533
2119a72533J2906L9920m8609N500J77166q6789M6855l7244j21702J47916O6387
$$ -172533 -159627 -119707 -168316 -162816 14350 -72439 -25584 -62828 -184530 -36614 29773
2108B9773J18757j27772j03631J35882M117J27732k339Q796N6228N721L790j4339
$$ 29773 148530 20758 -82873 53009 57126 184858 182519 191315 247543 253264 257054 242715
2096B42715Q2932J85126n419j00055P603J05744O8607L5833N6926m8565J33637
$$ 242715 325647 510773 505354 405299 412902 518646 587253 623086 680012 631447 765084
2085G65084N0124J9906P2422k4575J41783J17497L2293N1265J53810o5544O1569
$$ 765084 815208 835114 907536 882961 1024744 1142241 1174534 1225799 1379609 1314065 1375634
2074A375634L7168J22247J43818O1069J69760J60121J0005J29178M73980K12561
$$ 1375634 1412802 1535049 1678867 1739936 1909696 2069817 2079822 2209000 2682980 2895541
2064B895541K38644J59916J51472J85395L35119L10407M06766L56231N56074M41491
$$ 2895541 3134185 3294101 3445573 3630968 3966087 4276494 4683260 5039491 5595565 6037056
2054F037056M33686O24813O01803R91816J056503J267829J715406J977319K484822
$$ 6037056 6470742 7095555 7697358 8689174 9745677 11013506 12728912 14706231 17191053
2045A7191053L088321L406618K747850J687837j522548l536885l228932l159872
$$ 17191053 20279374 23685992 26433842 28121679 26599131 23062246 19833314 16673442
2037A6673442l064730k271718j571288j320122r28283p61391m89245n00525l06229
$$ 16673442 13608712 11336994 9765706 8445584 7517301 6755910 6266665 5766140 5459911
2028E459911l56139m68731n26691l89154l99919l42363j58503p1144l29919j99330
$$ 5459911 5103772 4635041 4108350 3719196 3319277 2976914 2818411 2747267 2417348 2218018
2018B218018k8358j75875j85532o4278Q8088o7209j33088j28650k38541j31716
$$ 2218018 2189660 2013785 1828253 1763975 1852063 1784854 1651766 1523116 1284575 1152859
2008A152859k01781o936Q2210j1522p318j88442j52857k4907j00064q8976L3695
$$ 1152859 951078 944142 1026352 1014830 1007512 819070 666213 641306 541242 452266 485961
1997D85961L0085n6872l9937l7869o7373j0704N5535j18254q9499K7884J47173
$$ 485961 516046 459174 419237 381368 313995 303291 358826 240572 151073 178957 326130
1986C26130j13792m1135R3586j29047m2886n3035N0533K48p8961k9885P4320L6560
$$ 326130 212338 171203 264789 135742 92856 39821 90354 90602 11641 -18244 56076 92636
1974I2636J450J3804j85100n3570k9784O8677p7258m4580n5880L0357J10907J3774
$$ 92636 94086 107890 -77210 -130780 -160564 -91887 -169145 -213725 -269605 -239248 -128341 -114567
1962a14567k738q3383K1508N1708j05583o0019j2083j4044m285k0995N4830J6779
$$ -114567 -117305 -200688 -179180 -127472 -233055 -293074 -305157 -319201 -323486 -344481 -289651 -272872
1950b72872l002j24646j1684p352j1495M9229l9685k2520J4035K6141J92606j30952
$$ -272872 -275874 -400520 -412204 -419556 -431051 -381822 -421507 -444027 -429992 -403851 -211245 -342197
1938c42197p8456O9478m411L3744r8745O3207k897K6122L1177J2303j35733Q2207
$$ -342197 -420653 -351175 -355586 -321842 -420587 -357380 -360277 -334155 -302978 -290675 -426408 -344201
1926c44201O8644l8795k0334j21703Q6321N2230j0631o7199p6280m6256Q7010
$$ -344201 -275557 -314352 -334686 -456389 -370068 -317838 -328469 -395668 -471948 -518204 -431194
1915d31194J20734j09428j80830O7696K04062p5781m0955M8315k0296J8677o2970
$$ -431194 -310460 -419888 -600718 -533022 -328960 -404741 -445696 -397381 -417677 -399000 -461970
1904d61970o3072j34512J21998n5869R0452J32522O1489j71938O2253O7635j791
$$ -461970 -525042 -659554 -537556 -593425 -502973 -370451 -308962 -480900 -418647 -351012 -352803
1893c52803m2270K7069J17629j97462O353O4580j61478J11305k8271m6805n6139
$$ -352803 -395073 -368004 -250375 -447837 -441484 -376904 -538382 -427077 -455348 -502153 -558292
1882e58292R2955J63022j16428P3532R066r2752p5888o196j22203N4068P5765
$$ -558292 -465337 -302315 -418743 -345211 -336145 -428897 -504785 -510981 -633184 -579116 -503351
1871e03351q2687l9368M1120k4999L8179K6222q6497J12837j4027O6757j51515
$$ -503351 -586038 -625406 -584286 -609285 -571106 -544884 -631381 -518544 -532571 -465814 -617329
1860f17329K130J56486p8051k9817o680K0724k5310J41650j06005j18992J14680
$$ -617329 -615199 -458713 -536764 -566581 -573261 -552537 -577847 -436197 -542202 -661194 -546514
1849e46514o615j11063L4402J03024J58998o5731q0382R7329q9005j08847J51300
$$ -546514 -553129 -664192 -629790 -526766 -367768 -433499 -513881 -416552 -505557 -614404 -463104
1838d63104m8837r0666L2920n5538m5887N0354l2419J45875l383R0172l964j09223
$$ -463104 -511941 -602607 -569687 -625225 -671112 -620758 -653177 -507302 -510685 -420513 -424477 -533700
1826e33700j6197O1640P439m5852J8179M8808l1883N6299j07643L087l1346Q4091
$$ -533700 -549897 -488257 -480818 -526670 -508491 -459683 -491566 -435267 -542910 -539823 -571169 -487078
1814d87078K5569j73504L6851N6246R5947q4809o9436r082J57366J5880J4739
$$ -487078 -461509 -635013 -598162 -541916 -445969 -530778 -600214 -609296 -451930 -436050 -421311
1803d21311K2449Q493r103j9176K1302R9344j61703r6213J17859M8989o9025P581
$$ -421311 -398862 -390369 -399472 -418648 -397346 -298002 -459705 -555918 -438059 -389070 -458095 -450514
1791d50514j8430K2254k0813j24936k3192J36841k9833K0188Q1528j39418m587
$$ -450514 -468944 -446690 -467503 -592439 -615631 -478790 -508623 -488435 -406907 -546325 -550912
1780e50912Q3190J31184j10571q251N9394m3711j63965l687O0221L6001m2745
$$ -550912 -467722 -336538 -447109 -455360 -395966 -439677 -603642 -607329 -547108 -511107 -553852
1769e53852j4689n720M5324k6263j69736k0792J55119J37537j00815R02l3724
$$ -553852 -568541 -574261 -528937 -555200 -724936 -745728 -590609 -453072 -553887 -552985 -586709
1758e86709O9819K4281l0058n9665Q4865P8946j3260o5024J1182J4476N5426R220
$$ -586709 -516890 -492609 -522667 -582332 -497467 -418521 -431781 -496805 -485623 -471147 -415721 -406501
1746d06501q4335l288k2983J0217j9295k2104m2683J12461P6166L566q8172l9950
$$ -406501 -490836 -494124 -517107 -506890 -526185 -548289 -590972 -478511 -402345 -398779 -486951 -526901
1734e26901l3861l4818J13228M6053N7620L3497o7973q18L2118o4426M2787k7712
$$ -526901 -560762 -595580 -482352 -436299 -378679 -345182 -413155 -413973 -381855 -446281 -403494 -431206
1722d31206J78541m5967j47742m1664L1566j40571J02276J24105k16874J31242
$$ -431206 -252665 -298632 -446374 -488038 -456472 -597043 -494767 -370662 -587536 -456294
1712d56294l8019L9247m4653l8768o6038L9264r229M9529j5961K5822q1823O3519
$$ -456294 -494313 -455066 -499719 -538487 -604525 -565261 -574490 -524961 -540922 -515100 -596923 -533404
1700e33404n6434M2158R3003J1372M8241Q1476r8582j96054m8298O4495K20535
$$ -533404 -589838 -547680 -454677 -443305 -395064 -313588 -412170 -608224 -656522 -592027 -371492
1689c71492r3865j16768q0608O5563J8708P7752r3776L9941J07187p6952r2030
$$ -371492 -465357 -582125 -662733 -597170 -578462 -500710 -594486 -554545 -447358 -524310 -616340
1678f16340M7633L9197o4560n7949J50977j51792r3532J33225J05515q8944N7720
$$ -616340 -568707 -529510 -594070 -652019 -501042 -652834 -746366 -613141 -507626 -596570 -538850
1667e38850k1024r1579k329O1534l6462K6973L446P5557K9474M4983j4322q2942
$$ -538850 -559874 -651453 -653782 -592248 -628710 -601737 -598291 -522734 -493260 -448277 -462599 -545541
1655e45541p6487j37k2560M4898k0443J90510J36652j31866M0661q3924N025j08833
$$ -545541 -622028 -622165 -644725 -599827 -620270 -429760 -293108 -424974 -384313 -468237 -463212 -572045
1643e72045q4923R8339J30014j4311q1601N0226J46026l1193j20468j7702m9193
$$ -572045 -656968 -558629 -428615 -442926 -524527 -474301 -328275 -359468 -479936 -497638 -546831
1632e46831l5956R4126R8677r2q9857L5114L0539j58275k38332J41520k2821M7662
$$ -546831 -582787 -488661 -389984 -390076 -479933 -444819 -414280 -572555 -810887 -669367 -692188 -644526
1620f44526q923M860O0811l8673L9363J00468q2413m9815L3607n2531o125N8522
$$ -644526 -653449 -648589 -587778 -626451 -587088 -486620 -569033 -618848 -585241 -637772 -643897 -585375
1608e85375l3164K4814K268L2959m9947Q9571N0355m7466J7805O5676j08051K2314
$$ -585375 -618539 -593725 -591457 -558498 -608445 -518874 -468519 -515985 -498180 -432504 -540555 -518241
1596e18241j29596m8681J38444J0678k0237J33621j7120q6906m4302N4910q9163
$$ -518241 -647837 -696518 -558074 -547396 -567633 -434012 -451132 -538038 -582340 -527430 -616593
1585f16593n3427L3495j8376r5563J72177K4249J2202l9518m6693L0733o7426
$$ -616593 -670020 -636525 -654901 -750464 -578287 -554038 -541836 -581354 -628047 -597314 -664740
1574f64740J46462j21104r13R2958n3818j645O6086k70712N7467J56623J33245
$$ -664740 -518278 -639382 -640295 -547337 -601155 -602800 -536714 -807426 -749959 -593336 -460091
1563d60091j01428J4336J8908M6332m3597n4063r9740J3672Q7851M8682l8225
$$ -460091 -561519 -547183 -528275 -481943 -525540 -579603 -679343 -665671 -577820 -529138 -567363
1552e67363j48515M9225J88378n2809J4268o7238j04233J45636M8178n6661P0128
$$ -567363 -715878 -666653 -478275 -531084 -516816 -584054 -688287 -542651 -494473 -551134 -481006
1541d81006R6615p5300n6403l8503J9827n9189m0963k4228q0407J12327P6078
$$ -481006 -384391 -459691 -516094 -554597 -534770 -593959 -634922 -659150 -739557 -627230 -551152
1530e51152P6029n3168O7804M094j06069K25755J1542r3238L0370q83m4375j62215
$$ -551152 -475123 -528291 -460487 -456393 -562462 -336707 -325165 -418403 -388033 -388916 -433291 -595506
1518e95506J14636k5010O4339J1334j37362J08416M8859O3038j36888j48024P125
$$ -595506 -480870 -505880 -441541 -430207 -567569 -459153 -410294 -347256 -484144 -632168 -625043
1507f25043J25636n8588M4989M6472m1575m735m2380o3908l1695P0088m2214J06525
$$ -625043 -499407 -557995 -513006 -466534 -508109 -512844 -555224 -619132 -650827 -580739 -622953 -516428
1495e16428O3614J27720j26228r0031j477l7494p4501M5074j7940n0408J81510
$$ -516428 -452814 -325094 -451322 -541353 -542830 -580324 -654825 -609751 -627691 -678099 -496589
1484d96589j41544J5710O7256L9466j5111J9012p1022J4755Q5807n9387K1907
$$ -496589 -638133 -622423 -555167 -515701 -530812 -511800 -582822 -568067 -482260 -541647 -519740
1473e19740j45371n463J43596K1922J21860l6880p7911j77144n4012J09238J00840
$$ -519740 -665111 -670574 -526978 -505056 -383196 -420076 -497987 -675131 -729143 -619905 -519065
1462e19065j3122l3260L3085J16766O338j83532L6079O4905L1579J5051q8695
$$ -519065 -532187 -565447 -532362 -415596 -409258 -592790 -556711 -491806 -460227 -445176 -533871
1451e33871j07051Q963l0377L6109R8145P0265j56018n5251K0036O7843N4948
$$ -533871 -640922 -631959 -662336 -626227 -528082 -457817 -613835 -669086 -649050 -581207 -526259
1440e26259n6550p4460J28456n4371j02240J94358o8968j25149J09183N1114P785
$$ -526259 -582809 -657269 -528813 -583184 -685424 -491066 -560034 -685183 -576000 -524886 -517101
1429e17101J0112N4984k3766j04557L8020j4168M7714r4050k3935o1706R8790
$$ -517101 -506989 -452005 -475771 -580328 -542308 -556476 -508762 -602812 -626747 -688453 -589663
1418e89663j709J66185J28320l50307o652J24319j809J86945j03069n5621q7580
$$ -589663 -591372 -425187 -296867 -647174 -653826 -529507 -531316 -344371 -447440 -503061 -590641
1407e90641j5767j4876O2411n0240O1476j13218k5899J20535N4933l9537n1494
$$ -590641 -606408 -621284 -558873 -609113 -547637 -660855 -686754 -566219 -511286 -550823 -602317
1396f02317J04739K5916m1798L973J10182j26558k8100K9462n2774R452Q1289
$$ -602317 -497578 -471662 -513460 -509487 -399305 -525863 -553963 -524501 -577275 -567823 -486534
1385d86534l2254K8292m9306J5679k9583j33670P4223l0496O6708O1604l3547
$$ -486534 -518788 -490496 -539802 -524123 -553706 -687376 -613153 -643649 -576941 -515337 -548884
1374e48884O4598m6737q2009J31331l879m0541o5979o7162J43570j77119Q3421
$$ -548884 -484286 -531023 -613032 -481701 -485580 -526121 -592100 -659262 -515692 -692811 -609390
1363f09390Q0378j02460P3780J09959j46511K3819O4420j11555j6742K01584j28171
$$ -609390 -529012 -631472 -557692 -447733 -594244 -570425 -506005 -617560 -634302 -432718 -560889
1352e60889r0603J11792J13705p2916Q39m3740q8616N5839P678l8780J00780k6424
$$ -560889 -651492 -539700 -425995 -498911 -498072 -541812 -630428 -574589 -566911 -605691 -504911 -531335
1340e31335j64931R8279m7437J22864r2183j02708P4118n0649J41021Q3402K6977
$$ -531335 -696266 -597987 -645424 -522560 -614743 -717451 -643333 -693982 -552961 -469559 -442582
1329d42582o9371n9638j00213J2587J2360n7468J19662K874q9032j7062l8477
$$ -442582 -511953 -571591 -671804 -659217 -646857 -704325 -584663 -581789 -670821 -687883 -726360
1318g26360L5797J17122k3731L8519J3234o9639K020K4256J01505M3463o1958
$$ -726360 -690563 -573441 -597172 -558653 -545419 -615058 -613038 -588782 -487277 -443814 -505772
1307e05772n4371R7476p8930M883J71443O487j92001k2640Q8600L7185Q344m3608
$$ -505772 -560143 -462667 -541597 -536714 -365271 -358784 -550785 -573425 -484825 -447640 -439296 -482904
1295d82904j84120n2387J06477j64104Q0477K14122p6669m5335q2296J69175J21357
$$ -482904 -667024 -719411 -612934 -777038 -696561 -482439 -559108 -604443 -686739 -517564 -396207
1284c96207k61896o6465K9784J78707j7020o3703n9216P7865N5201N8514j45085
$$ -396207 -658103 -724568 -694784 -516077 -533097 -596800 -656016 -578151 -522950 -464436 -609521
1273f09521j50414L3807l426J12686Q3016j16889o3309J56075n5038n9422J83189
$$ -609521 -759935 -726128 -729554 -616868 -533852 -650741 -714050 -557975 -613013 -672435 -489246
1262d89246O8236m3919j8137r8276n7861r4252L6186L5667o2841J7429J10266
$$ -489246 -421010 -464929 -483066 -581342 -639203 -733455 -697269 -661602 -724443 -707014 -596748
1251e96748M9664K2698q9106j41837k4117J98599K7367k7532m5981j39092J12318
$$ -596748 -547084 -524386 -613492 -755329 -779446 -580847 -553480 -581012 -626993 -766085 -653767
1240f53767l988J49151q309J9482Q8964k13291R747O4399j15246J23136K728o3909
$$ -653767 -657755 -508604 -516913 -497431 -408467 -621758 -612011 -547612 -662858 -539722 -536994 -600903
1228f00903p1872Q8395P0743J32515J3608p3877j52897m5743R9620M912k9618
$$ -600903 -672775 -584380 -513637 -381122 -367514 -441391 -594288 -640031 -540411 -535499 -565117
1217e65117K2607p1660P0573l5058m9746O5350M048o2899p8117J42622n9334n0837
$$ -565117 -542510 -614170 -543597 -578655 -628401 -563051 -559003 -621902 -700019 -557397 -616731 -667568
1205f67568L5300L5515m2538K09421o6918o6552N2187L1650l7493j12061l1220
$$ -667568 -632268 -596753 -639291 -429870 -496788 -563340 -511153 -479503 -516996 -629057 -660277
1194f60277P6930j5069p313J83907M1253o5210K5429q6941q7062R3788p6757j2847
$$ -660277 -583347 -598416 -605729 -421822 -380569 -445779 -420350 -507291 -594353 -500565 -577322 -590169
1182e90169M874J11516n2871j6618R5228l9860o5472j28558k4997J18738m7587
$$ -590169 -585295 -473779 -526650 -543268 -448040 -487900 -553372 -681930 -706927 -588189 -635776
1171f35776m4291L7506J06763k573l8264J15848j93305J28272m805j35357k079
$$ -635776 -680067 -642561 -535798 -538371 -576635 -460787 -654092 -525820 -530625 -665982 -668061
1160f68061P7281J7698n9063J00277q3547j0029J58478K819o5919j11658M4712
$$ -668061 -590780 -573082 -632145 -531868 -615415 -625444 -466966 -464147 -530066 -641724 -597012
1149e97012J54718r7954Q5814K2664j54975n1669l8717K2941J19050j9556j31605
$$ -597012 -442294 -540248 -454434 -431770 -586745 -638414 -677131 -654190 -535140 -554696 -686301
1138f86301J36669M363p8573R8389N1276k19972K2909j20490J33132J94805j29119
$$ -686301 -549632 -545269 -623842 -525453 -474177 -694149 -671240 -791730 -658598 -463793 -592912
1127e92912J0141p641O4026Q0728j30569n3355J7180j3801n8637k3796R9616R0555
$$ -592912 -582771 -590412 -526386 -445658 -576227 -629582 -612402 -626203 -684840 -708636 -609020 -518465
1115e18465j7453j33721O1617l468r2410k1761K38855q4215R5964j17698L7759
$$ -518465 -535918 -669639 -608022 -611490 -703900 -725661 -486806 -571021 -475057 -592755 -554996
1104e54996J04352k32593M6404R3771J22439J00648k8126r5788o6165k8116J0595
$$ -554996 -450644 -683237 -636833 -543062 -420623 -319975 -348101 -443889 -510054 -538170 -527575
1093e27575n8389N5973K2867L7481J07841m8765j18597J3180R875j2753O092l4856
$$ -527575 -585964 -529991 -507124 -469643 -361802 -410567 -529164 -515984 -506109 -518862 -512770 -547626
1081e47626P679j0183p7259N7678O9934N4843j6827q4061p3045J1517j05573L7261
$$ -547626 -539947 -550130 -627389 -569711 -499777 -444934 -461761 -545822 -618867 -607350 -712923 -675662
1069f75662P8002J8611N4273L2242L0823l9886q8849o6516j05909N5335j1371
$$ -675662 -597660 -579049 -524776 -492534 -461711 -501597 -590446 -656962 -762871 -707536 -718907
1058g18907J44264l2185N9647J1517o35J52578j25366J644M3259k566r7274J5936
$$ -718907 -574643 -606828 -547181 -535664 -536299 -383721 -509087 -507443 -464184 -466750 -564024 -548088
1046e48088l4756P7565J10506l8823j94533Q5684O9604r9972p7695P5201L7488
$$ -548088 -582844 -505279 -394773 -433596 -628129 -542445 -472841 -572813 -650508 -575307 -537819
1035e37819p1843r2891o4378M3167J04736k9084Q3276M8383m7074n4582K2616
$$ -537819 -609662 -702553 -766931 -723764 -619028 -648112 -564836 -516453 -563527 -618109 -595493
1024e95493N3315M7791J0229q4600p7591k0038J92971J26615r3980j14918J4473
$$ -595493 -542178 -494387 -484158 -568758 -646349 -666387 -473416 -346801 -440781 -555699 -541226
1013e41226J87900l0912j2765j23452o8895k5132J4530J40467M2756j04502R013
$$ -541226 -353326 -384238 -397003 -520455 -589350 -614482 -599952 -459485 -416729 -521231 -512218
1002e12218j4049o0720k6184O0881j68053M6366m5057q6280J92149P2935m761
$$ -512218 -526267 -586987 -613171 -552290 -720343 -673977 -719034 -805314 -613165 -540230 -544991
991e44991j31621R7074n0962J9559l8961O5573m6401J68221o6820J9368n8897
$$ -544991 -676612 -579538 -630500 -610941 -649902 -584329 -630730 -462509 -529329 -509961 -568858
980e68858J255l3245J3866j5498R525J19011j43658J16692P0359o0883j08088
$$ -568858 -567603 -600848 -586982 -602480 -592955 -473944 -617602 -500910 -430551 -491434 -599522
969e99522N3478L4351j11947Q3211j8671r2581J18581J26215p9939n8955J4484
$$ -599522 -546044 -511693 -623640 -540429 -559100 -651681 -533100 -406885 -486824 -545779 -531295
958e31295M7728J8542m0456p2219M0669j28413Q584R8295R8144J31029k07540
$$ -531295 -483567 -465025 -505481 -577700 -537031 -665444 -656860 -558565 -460421 -329392 -536932
947e36932k2944M5967Q4991j32046o2858K5024M904K523J5870l6779J5162M5324
$$ -536932 -559876 -513909 -428918 -560964 -623822 -598798 -593894 -591371 -575501 -612280 -597118 -551794
935e51794P0431J0523K533M2831j22314k8513O3540n0422J490n3918p452N8421
$$ -551794 -481363 -470840 -468307 -425476 -547790 -576303 -512763 -563185 -561695 -615613 -623065 -564644
923e64644o8907L9709O0721J04432K3981p9522p746m1012K6557n9093M1550O7427
$$ -564644 -633551 -593842 -533121 -428689 -404708 -484230 -491976 -532988 -506431 -565524 -523974 -456547
911d56547l5121k7253l1790j22248J6161K32989J02840L6355r5338l04681J7407
$$ -456547 -491668 -518921 -550711 -672959 -656798 -423809 -320969 -284614 -379952 -684633 -667226
900f67226Q3774K6778J29585M4306k03736j27131J26566O8008K5998l2832j19549
$$ -667226 -583452 -556674 -427089 -382783 -586519 -713650 -587084 -519076 -493078 -525910 -645459
889f45459J5536K280J32874L4533j40064N9949O9613o9180l2012n0133J0129P1313
$$ -645459 -629923 -627643 -494769 -460236 -600300 -540351 -470738 -539918 -571930 -622063 -611934 -540621
877e40621m9564K4621m3732J35442p4259l2858K0139N254j18669M6043R5827j4667
$$ -540621 -590185 -565564 -609296 -473854 -548113 -580971 -560832 -555578 -674247 -628204 -532377 -547044
865e47044q776n3105Q1551m4925j9992J354O9442N9094j22810Q6958O9178p3616
$$ -547044 -555820 -608925 -527374 -572299 -592291 -590937 -521495 -462401 -585211 -498253 -429075 -502691
853e02691m1285N4299k0236l0056L1245L4533m7215L3732l9124P308j87120M8887
$$ -502691 -543976 -489677 -509913 -539969 -508724 -474191 -521406 -487674 -526798 -519490 -706610 -657723
841f57723P6636R0618O0946n6572K0164L585j06044N318J65728q0300l5522r5495
$$ -657723 -581087 -490469 -429523 -486095 -465931 -462346 -568390 -563072 -397344 -477644 -513166 -608661
829f08661N2342L6259j39513j5358J56799q7006j2274k7342J5599K6712j06804
$$ -608661 -556319 -520060 -659573 -674931 -518132 -605138 -617412 -644754 -629155 -602443 -709247
818g09247o0021J27183J60813r309p9883l8748j27508n9898K81770L8280j8468
$$ -709247 -769268 -642085 -481272 -490581 -570464 -609212 -736720 -796618 -514848 -476568 -495036
807d95036Q475n4172J47794m7619j21931m8025p633j0703M2660M6855P7645M5404
$$ -495036 -486561 -540733 -392939 -440558 -562489 -610514 -618147 -628850 -586190 -539335 -461690 -416286
795d16286K6451r9245O0756l2048O6439p5746r364N309l9478q6352R8584N73k3782
$$ -416286 -389835 -489080 -428324 -460372 -393933 -469679 -479043 -473734 -513212 -599564 -500980 -500407 -524189
782e24189O0343q9424q2277J34723P1363j30865L901p3782Q2328p9166m1684Q5111
$$ -524189 -463846 -553270 -635547 -500824 -429461 -560326 -556425 -630207 -547879 -627045 -668729 -583618
770e83618k5331j1827L6200Q2905j46922p4725K03592k053p7848L9619m9395l7887
$$ -583618 -608949 -620776 -584576 -501671 -648593 -723318 -519726 -521779 -599627 -560008 -609403 -647290
758f47290P8425J45899j00737k14932R1924Q6777R05Q5228j3875j15499M2730
$$ -647290 -568865 -422966 -523703 -738635 -646711 -559934 -559029 -473801 -487676 -603175 -560445
747e60445J3566j15994j98598J36754M4624J25792j6335L5295j75766O1459P7257
$$ -560445 -546879 -662873 -861471 -724717 -680093 -554301 -570636 -535341 -711107 -649648 -572391
736e72391l1083J02614n5492J19708q6728k9008o7764l0600J6905K0054K0530
$$ -572391 -603474 -500860 -556352 -436644 -523372 -552380 -620144 -650744 -633839 -613785 -593255
725e93255J4458P8200L9318j1303m9292l0935l6273j4733n6925J43484N1884j03072
$$ -593255 -578797 -500597 -461279 -472582 -521874 -552809 -589082 -603815 -660740 -517256 -465372 -568444
713e68444j25607L5850J7406J31218l3244n5987K2448j85589P1809r361J23616
$$ -568444 -694051 -658201 -640795 -509577 -542821 -598808 -576360 -761949 -690140 -699501 -575885
702e75885M6039m9910J6553J05052p8229l8895P0949J2997P0385q5957n6853j07589
$$ -575885 -529846 -579756 -563203 -458151 -536380 -575275 -504326 -491329 -420944 -506901 -563754 -671343
690f71343K4680J22028n7667m7859J13365J0429K6827n2206O8192R819l6985r0212
$$ -671343 -646663 -524635 -582302 -630161 -516796 -506367 -479540 -531746 -463554 -453735 -490720 -580932
678e80932n6905N2690J39697K3515j71785M4355m0043J2953L4149N6297m271J8803
$$ -580932 -637837 -585147 -445450 -421935 -593720 -549365 -589408 -576455 -542306 -486009 -490280 -471477
666d71477o4361j08714L4694M7695j816J07217j54292l9975J11839j5181j17257
$$ -471477 -535838 -644552 -609858 -562163 -563979 -456762 -611054 -651029 -539190 -554371 -671628
655f71628R381J12363K4798n7753M1288N8271J1634q5899r940K1673j12051J70155
$$ -671628 -662247 -549884 -525086 -582839 -541551 -483280 -471646 -557545 -567485 -545812 -657863 -487708
643d87708J00160j26112j47031K1809R2522N8169j21279N0979L8505J9152n2893
$$ -487708 -387548 -513660 -660691 -638882 -546360 -488191 -609470 -558491 -519986 -500834 -553727
632e53727J147J02695p1795L4456R2916m8329o8792r0338l9448N3531r2657M3206
$$ -553727 -552580 -449885 -521680 -487224 -394308 -442637 -511429 -601767 -641215 -587684 -680341 -637135
620f37135L5427K9525P739L4082q7545l0172r1721J43501l119M9067L6909r6414
$$ -637135 -601708 -572183 -564444 -530362 -617907 -648079 -739800 -596299 -599418 -550351 -513442 -609856
608f09856K0295p9180L6549J05311L4541j32754j04574R8771J44887j22488p8368
$$ -609856 -589561 -668741 -632192 -526881 -492340 -625094 -729668 -630897 -486010 -608498 -686866
597f86866j2116j016k9451J29145J41732q5018l1062L8314o6094J4864n0563Q2461
$$ -686866 -698982 -699998 -729449 -600304 -458572 -543590 -574652 -536338 -602432 -587568 -638131 -555670
585e55670j07946J39123j19113k7032J63549j6996M8005j33093j57550Q1701J52349
$$ -555670 -663616 -524493 -643606 -670638 -507089 -524085 -476080 -609173 -766723 -685022 -532673
574e32673p1122Q6871k7820N3277k4917M3124j16957j3437m867J7527Q883j617
$$ -532673 -603795 -516924 -544744 -491467 -516384 -473260 -590217 -603654 -608521 -590994 -582111 -583728
562e83728J29382j25366N3067J5873J5038M8500R5868j12626n9215j41729j1957
$$ -583728 -454346 -579712 -526645 -510772 -495734 -447234 -351366 -463992 -523207 -664936 -676893
551f76893L1021n3061p8540J23313K17562j69523R0030p5063j44456R3808m0581
$$ -676893 -645872 -698933 -777473 -654160 -436598 -606121 -516091 -591154 -735610 -641802 -682383
540f82383M0148J06811o5946m8216N6826O5648J38918j49418j74774N3027N9168
$$ -682383 -642235 -535424 -601370 -649586 -592760 -527112 -388194 -537612 -712386 -659359 -600191
529f00191N0096j42130L7850j1758m2762J2364J0452n9276R0838J3305J50773
$$ -600191 -550095 -692225 -654375 -666133 -708895 -696531 -686079 -745355 -654517 -641212 -490439
518d90439L0213j84513K2845n558j41044J76263N3816l0076M8513L38J03997j25116
$$ -490439 -460226 -644739 -621894 -627452 -768496 -592233 -538417 -568493 -519980 -519642 -415645 -540761
506e40761r8658N4571n1356R9751P9257j15308M5991p9860N7206J14314n0993
$$ -540761 -639419 -584848 -636204 -536453 -457196 -572504 -526513 -606373 -549167 -434853 -485846
495d85846o3600o4301M550N3373J48498l9811j18113p8151l1881K98062j1145
$$ -485846 -549446 -613747 -609197 -555824 -407326 -447137 -565250 -643401 -675282 -377220 -388365
484c88365K7716L6717j84029k4055r0Q9839k7213O7o946j85141O8987m4036P7695
$$ -388365 -360649 -323932 -507961 -532016 -532106 -442267 -469480 -469413 -476359 -661500 -592513 -636549 -558854
471e58854L4370m505l0358N0221R3455L1335j03531p9577L5678l164o4545K1226
$$ -558854 -524484 -528989 -559347 -509126 -415671 -384336 -487867 -567444 -531766 -534930 -599475 -578249
459e78249K0426j9886R9251k9264o54k1127j02694k519N3855M9659J86196R153
$$ -578249 -557823 -577709 -478458 -507722 -508376 -529503 -632197 -634716 -580861 -531202 -345006 -335853
447c35853j71780N6602K3803o253L873j981m1057n5385J10924j05555L7975k4546
$$ -335853 -507633 -451031 -427228 -433481 -429608 -431589 -472646 -528031 -417107 -522662 -484687 -509233
435e09233J62598k0383j7347k1427j15244M4651k9219p1619k8155M3022K5078
$$ -509233 -346635 -367018 -384365 -405792 -521036 -476385 -505604 -577223 -605378 -562356 -537278
424e37278N3734r4156J29449O7745m3778p5646M3007N0849J24338p2665m2000
$$ -537278 -483544 -577700 -448251 -380506 -424284 -499930 -456923 -406074 -281736 -354401 -396401
413c96401q1336j10357k662r268P5485j4061N5085j19507J7926o7526j4899J56046
$$ -396401 -477737 -588094 -590756 -600024 -524539 -538600 -483515 -603022 -585096 -652622 -667521 -511475
401e11475O3708p7210J3936M1427m7826m6693J48080M0977k50355J16788P3896
$$ -511475 -447767 -524977 -511041 -469614 -517440 -564133 -416053 -375076 -625431 -508643 -434747
390d34747q4907k4367J27598q1280L9040j80748l5927J28836L6203K5602r1634
$$ -434747 -519654 -544021 -416423 -497703 -458663 -639411 -675338 -546502 -510299 -484697 -576331
379e76331J09989J9815K9252q3472k8475L7131j03552j22473M3846k7247J33338
$$ -576331 -466342 -446527 -417275 -500747 -529222 -492091 -595643 -718116 -674270 -701517 -568179
368e68179l896q4568J8679J21686m9244j02281l2976m4127P6380J37082j00741
$$ -568179 -572075 -656643 -637964 -516278 -565522 -667803 -700779 -744906 -668526 -531444 -632185
357f32185l3998O0549J25665k9787R0497n5427j34552j4608K4686l5347l5060
$$ -632185 -666183 -605634 -479969 -509756 -419259 -474686 -609238 -623846 -599160 -634507 -669567
346f69567M4936J83182M2052k14792O573j2587J60780k6464j38467k6668P7526
$$ -669567 -624631 -441449 -399397 -614189 -607616 -620203 -459423 -485887 -624354 -651022 -573496
335e73496O1560o0259q5512N0681M3456N5988J06679l6818j39611J02488k7326
$$ -573496 -511936 -572195 -657707 -607026 -563570 -507582 -400903 -437721 -577332 -474844 -502170
324e02170j904p4544K777o7999j4395J19710R2779n5758J8648N6416J3049j3968
$$ -502170 -504074 -578618 -575841 -643840 -658235 -538525 -445746 -501504 -482856 -426440 -413391 -427359
312d27359J7415j30521l8257K1624l2858k6308J08161M5451j6638M3085k05010
$$ -427359 -409944 -540465 -578722 -557098 -589956 -616264 -508103 -462652 -479290 -436205 -641215
301f41215p8807q062J24400L6362l8334M20Q6416M2704k1639J1770O6606L9276
$$ -641215 -720022 -728084 -603684 -567322 -605656 -605236 -518820 -476116 -497755 -485985 -419379 -380103
289c80103j4677j58798K0097M4381M3654m2574p8788j8665j4994j11496j5019
$$ -380103 -394780 -553578 -533481 -489100 -445446 -488020 -566808 -585473 -600467 -711963 -726982
278g26982J16573J0419N6351q9305m9787R521p7900J31038Q5060J4021l8859j15722
$$ -726982 -610409 -599990 -543639 -632944 -682731 -673210 -751110 -620072 -535012 -520991 -559850 -675572
266f75572k222R901q1744R7708M3799n9511p3744K5470K1973J18705j796m0811
$$ -675572 -677794 -667893 -749637 -651929 -608130 -667641 -741385 -715915 -693942 -575237 -577033 -617844
254f17844R3398r1825n2394J0543j24302J2806K84516O649l0931j56317j30004
$$ -617844 -524446 -616271 -668665 -658122 -782424 -769618 -485102 -478453 -509384 -665701 -795705
243g95705J43031N7543p8108r3517J04459J21911O9671r515o4670P0484p5323
$$ -795705 -652674 -595131 -673239 -766756 -662297 -540386 -470715 -480230 -544900 -474416 -549739
232e49739m9284J7383o8090k2749m7440P7129L2681r1256K9874j8763J02287k2668
$$ -549739 -599023 -581640 -649730 -672479 -719919 -642790 -610109 -701365 -671491 -690254 -587967 -610635
220f10635J6096M1202q7543J30459j62387J6667J01180L0777J4402j39024K0047
$$ -610635 -594539 -553337 -640880 -510421 -672808 -656141 -554961 -524184 -509782 -648806 -628759
209f28759J56890J3100j09185j01928k7283K08863m6392o8805J5575L4800r2664
$$ -628759 -471869 -458769 -567954 -669882 -697165 -488302 -534694 -603499 -587924 -553124 -645788
198f45788Q5797R6210P7535n9980K8447r9807o4598L1539M471L5014r7055j18100
$$ -645788 -559991 -463781 -386246 -446226 -417779 -517586 -582184 -550645 -546174 -511160 -608215 -726315
186g26315O1438P3285J47876m8205k9683k7016K1575k0846n8142R3177J8338J70794
$$ -726315 -664877 -591592 -443716 -491921 -521604 -548620 -527045 -547891 -606033 -512856 -494518 -323724
174c23724n0254j20991J3528J380p8734o7596J7831R6417j1112o8311o5646N6294
$$ -323724 -373978 -494969 -481441 -480061 -558795 -626391 -608560 -512143 -523255 -591566 -657212 -600918
162f00918J9684m5546O7088J18074j1214m4117r2571Q5113m216J1028L2488k5633
$$ -600918 -581234 -626780 -559692 -441618 -452832 -496949 -589520 -504407 -508623 -497595 -465107 -490740
150d90740j13699n4219L3652J80023j11749l8788M9121O3829m9039j03435O7236
$$ -490740 -604439 -658658 -625006 -444983 -556732 -595520 -546399 -482570 -531609 -635044 -567808
139e67808P3243l0248p794O5042j45189o587o014m5299J3773Q1171Q3118K1638
$$ -567808 -494565 -524813 -532607 -467565 -612754 -619341 -625355 -670654 -656881 -575710 -492592 -470954
127d70954o4102J43156q3769j38547J13825K3943k7158n3203K2515o7319O0050
$$ -470954 -535056 -391900 -475669 -614216 -500391 -476448 -503606 -556809 -534294 -601613 -541563
116e41563R0277j9044r5594l5327o455N7505k8156N2149m032l3156r999r027m5793
$$ -541563 -451286 -470330 -565924 -601251 -607706 -550201 -578357 -526208 -530240 -563396 -573395 -582422 -628215
103f28215j0342K533k9147J11991N7957j248j01003r3291J57564M9292o1249l7061
$$ -628215 -638557 -636024 -665171 -553180 -495223 -496471 -597474 -690765 -533201 -483909 -545158 -582219
91e82219j8352N3382j60514L755J02664j23455N4663R2356L4331j1283j3884J9521
$$ -582219 -600571 -547189 -707703 -703948 -601284 -724739 -670076 -577720 -543389 -554672 -568556 -549035
79e49035O992M4231j06799j5952N1060J3875N3117m112r200J08J280m6863q0338
$$ -549035 -542043 -497812 -604611 -620563 -569503 -555628 -502511 -506623 -515823 -515715 -514435 -561298 -641636
66f41636O3588L8443j6851m1759K7309r5171j4713N4100J31033j8135n1195L283
$$ -641636 -578048 -539605 -556456 -598215 -570906 -666077 -680790 -626690 -495657 -513792 -564987 -561704
54e61704M982r9722M0151M5766O0388n4847p5529M2204Q016P4837l4648k2941
$$ -561704 -556722 -656444 -616293 -570527 -510139 -564986 -640515 -598311 -590295 -515458 -550106 -573047
42e73047k7002j02827n10P7261J07942l3415o327l3610N1935M5525l4127l7465
$$ -573047 -600049 -702876 -703386 -626125 -518183 -551598 -557925 -591535 -539600 -494075 -528202 -565667
30e65667l7611P410r4303O7658J61551k9480J3993k5435l6563l6975j4948l4996
$$ -565667 -603278 -595868 -690171 -622513 -460962 -490442 -476449 -501884 -538447 -575422 -590370 -625366
18f25366o628k750K1623m573r5078O5701J05702r4973k1692J0718o831P5377j07446
$$ -625366 -631994 -634744 -613121 -617694 -712772 -647071 -541369 -636342 -658034 -647316 -654147 -578770 -686216
5f86216k3816l5876j1749O3720P4493
$$ -686216 -710032 -745908 -757657 -693937 -619444
0f19444
$$ -619444
$$ Imaginary data points
##PAGE= N=2
##DATA TABLE= (X++(I..I)), XYDATA
16383b886811L2278L1282j7045p930K2417J16178N3283m7058O2715M5536j8114
$$ -2886811 -2854533 -2823251 -2840296 -2848226 -2825809 -2709631 -2656348 -2703406 -2640691 -2595155 -2613269
16372b613269J34201O2206P980m4351j5213R8749R3837J46792l6847r1099J710
$$ -2613269 -2479068 -2416862 -2408882 -2453233 -2468446 -2369697 -2275860 -2129068 -2165915 -2257014 -2255304
16361b255304R4271J9057R6972J42479N2998k3311l1757N4231j5781q820j8475
$$ -2255304 -2161033 -2141976 -2045004 -1902525 -1849527 -1872838 -1904595 -1850364 -1866145 -1874965 -1893440
16350a893440J19505R2779m498J11815l7411k0762N6783l5696j2465P5627j8486
$$ -1893440 -1773935 -1681156 -1685654 -1573839 -1611250 -1632012 -1575229 -1610925 -1623390 -1547763 -1566249
16339a566249k6130M4895N2112M0390K15239R3047l2804R196K4575M2231J67J40921
$$ -1566249 -1592379 -1547484 -1495372 -1454982 -1239743 -1146696 -1179500 -1170304 -1145729 -1103498 -1103331 -962410
16327i62410k1632L238L985L7897J27939J1593o2301N6204o5313P8667J08542
$$ -962410 -984042 -980804 -976819 -938922 -810983 -799390 -861691 -805487 -870800 -792133 -683591
16316f83591n9979O1189j2868N3217J94403l3642l1859N214L1972M7908p6096
$$ -683591 -743570 -682381 -695249 -642032 -447629 -481271 -513130 -507916 -475944 -428036 -504132
16305e04132M8870K0594J29612J7273J60994Q2558J4762J4539n4754j8453J35097
$$ -504132 -455262 -434668 -305056 -287783 -126789 -44231 -29469 -14930 -69684 -88137 46960
16294D6960k3116j7396J24310q9078k1598m0454j3465J10717R516N9977J1486
$$ 46960 23844 6448 130758 41680 20082 -20372 -33837 76880 86396 146373 157859
16283A57859O1281M492J942K5479R2725J02003J7719L948J5681M083J7378J7020
$$ 157859 219140 223632 225574 251053 343778 445781 463500 467448 483129 487212 504590 521610
16271E21610K4807J4266J79574K1464o8870M601k4976o942N8505L6298p0945O2283
$$ 521610 546417 560683 740257 761721 692851 697452 672476 665534 724039 760337 689392 751675
16259G51675j6003K7144J16818L9347n0037O236J07610Q7108M9659l6645q242
$$ 751675 735672 762816 879634 918981 868944 875180 982790 1069898 1119557 1082912 1074670
16248A074670m584N3213n1043j1097J13179q7210r0363J90700J13029J4101o4295
$$ 1074670 1070086 1123299 1072256 1061159 1174338 1087128 996765 1187465 1300494 1314595 1250300
16237A250300n2045j86j04217J23208N7752j5109Q9263L5066k0201O2297m2189
$$ 1250300 1198255 1198069 1093852 1217060 1274812 1259703 1348966 1384032 1363831 1426128 1383939
16226A383939J45602K00857j96415o1444J2265M9384N988n1269J34218N3162m5663
$$ 1383939 1529541 1730398 1533983 1472539 1484804 1534188 1540176 1488907 1623125 1676287 1630624
16215A630624q156n0851O0493N3838Q5523r136K117M935r6194k5722n2505J42798
$$ 1630624 1622468 1571617 1632110 1685948 1771471 1762335 1764452 1769387 1673193 1647471 1594966 1737764
16203A737764q796P6796L3304P403p8949J83807q8171O7028P1750r5868j40465
$$ 1737764 1728968 1805764 1839068 1846471 1767522 1951329 1863158 1930186 2001936 1906068 1765603
16192A765603K55226K7356j09494Q5496L0907k0130j32465Q7299j5228Q1559J0426
$$ 1765603 2020829 2048185 1938691 2024187 2055094 2034964 1902499 1989798 1974570 2056129 2066555
16181B066555o1905l6767Q4738r1342L4587R7703K5137K0531R920M2347M8981
$$ 2066555 2004650 1967883 2052621 1961279 1995866 2093569 2118706 2139237 2149157 2191504 2240485
16170B240485j24413M836M3106j4392K8217o3528R6092m9416o4461J08360N9120
$$ 2240485 2116072 2120908 2164014 2149622 2177839 2114311 2210403 2160987 2096526 2204886 2264006
16159B264006q8538l813P6316O2419J5374q8016k3821J57862k6781M991o7501
$$ 2264006 2175468 2171655 2247971 2310390 2325764 2237748 2213927 2371789 2345008 2349999 2282498
16148B282498J0448Q8697m3605n0055k7195K5816j248J06729o4017p524M9333
$$ 2282498 2292946 2381643 2338038 2287983 2260788 2286604 2285356 2392085 2328068 2320544 2369877
16137B369877O584J15153N8693q3743l2306j27671M3083J3006O0799O7635N6621
$$ 2369877 2376461 2491614 2550307 2466564 2434258 2306587 2349670 2362676 2423475 2491110 2547731
16126B547731j38416k4088m953L5155J21867o24n9776l6657J35351J5159j15337
$$ 2547731 2409315 2385227 2380274 2415429 2537296 2536672 2476896 2440239 2575590 2590749 2475412
16115B475412P7618m361l3218l4122J0424J20913j31950m7836N4815n8318J20661
$$ 2475412 2553030 2548669 2515451 2481329 2491753 2612666 2480716 2432880 2487695 2429377 2550038
16104B550038q1792J3181Q40o9643J0471R3094J6633m9789k814l8234P8616j6035
$$ 2550038 2468246 2481427 2482267 2412624 2423095 2516189 2532822 2483033 2480219 2441985 2520601 2504566
16092B504566J285r7411l0385R2411J26026j38646L5443L3963r383J38180L8949
$$ 2504566 2505851 2408440 2378055 2470466 2596492 2457846 2493289 2527252 2517869 2656049 2694998
16081B694998j23128q1705m2561P0378j3002p2545J07003P3398q7133M0008J5447
$$ 2694998 2571870 2490165 2447604 2517982 2504980 2432435 2539438 2612836 2525703 2565711 2581158
16070B581158n2724J8382M3861j24941P3836K25629p0604j00368n3001n0864L3195
$$ 2581158 2528434 2546816 2590677 2465736 2539572 2765201 2694597 2594229 2541228 2490364 2523559
16059B523559N117l0430J61868j03500j4381o7209j14238j2186P1248J45017j9344
$$ 2523559 2528676 2498246 2660114 2556614 2542233 2475024 2360786 2348600 2419848 2564865 2545521
16048B545521q900J31117j8132r671L0706j8985n4711n0188l7182j29457o5047
$$ 2545521 2536621 2667738 2649606 2639935 2670641 2651656 2596945 2546757 2509575 2380118 2315071
16037B315071J41644J10860J27989l6372L131k1176p1268p7459q2543N6818J0088
$$ 2315071 2456715 2567575 2695564 2659192 2662323 2641147 2569879 2492420 2409877 2466695 2476783
16026B476783J25220m0585J41466j2457q1632j30553P2052K6499q2567r8261J17444
$$ 2476783 2602003 2561418 2702884 2690427 2608795 2478242 2550294 2576793 2494226 2395965 2513409
$$ [...]
##END NTUPLES=NMR SPECTRUM
##END=
