##TITLE=1H_CA-8853-2
 CDCl3, 8 sc, 
 13.05.2021
##JCAMPDX= 6.0         $$ Bruker NMR JCAMP-DX V2.0
##DATA TYPE= NMR SPECTRUM
##DATA CLASS= NTUPLES
##ORIGIN= UXNMR, Bruker Analytische Messtechnik GmbH
##OWNER= root
$$ XWIN-NMR		Version 3.5
$$ Thu May 13 10:34:48 2021 Russian Standard Time (UT+4h)  she@DPX200
##.OBSERVE FREQUENCY= 200.131506
##.OBSERVE NUCLEUS= ^1H
##.ACQUISITION MODE= SIMULTANEOUS
##.ACQUISITION SCHEME= undefined
##.AVERAGES= 8
##.DIGITISER RES= 18
##SPECTROMETER/DATA SYSTEM= spect
##.PULSE SEQUENCE= zg30
##.SOLVENT NAME= CDCl3
##.SHIFT REFERENCE= (INTERNAL, CDCl3, 0, 15.945)
##AUDIT TRAIL= $$ (NUMBER, WHEN, WHO, WHERE, WHAT)
$$ ##TITLE= Audit trail, XWIN-NMR		Version 3.5
$$ ##JCAMPDX= 5.01
$$ ##ORIGIN= Bruker BioSpin GmbH
$$ ##OWNER= she
$$ F:/spectra/data/she/nmr/H-F/1/pdata/1/auditp.txt
$$ ##AUDIT TRAIL=  $$ (NUMBER, WHEN, WHO, WHERE, WHAT)
(   1,<2021-05-13 10:32:00.96 +0400>,<she>,<DPX200>,
      <created by zg, POWCHK disabled, PULCHK disabled
       configuration hash MD5:
       00 E9 B6 7A A2 85 ED C7 34 08 36 98 17 FE 4E 26
       data hash MD5: 16K
       63 AE 55 AB 99 82 9D E0 EE 45 79 27 DF 5E 89 41>)
(   2,<2021-05-13 10:32:03.43 +0400>,<she>,<DPX200>,
      <Start of raw data processing
       efp BC_mod = 2 LB = 0.24 FT_mod = 6 PKNL = 1 PHC0 = -11123.19 PHC1 = 15.001 SI = 16K 
       data hash MD5: 16K
       24 37 70 CE 2A 5C DB 90 D2 B5 3B 24 32 41 EB 0E>)
(   3,<2021-05-13 10:32:31.00 +0400>,<she>,<DPX200>,
      <pk PHC0 = 3.705704 PHC1 = -4 
       data hash MD5: 16K
       F0 A2 80 6E 5E B9 13 C0 A3 BF 68 8B 24 54 FA E4>)
(   4,<2021-05-13 10:32:34.09 +0400>,<she>,<DPX200>,
      <abs ABSG = 5 
       data hash MD5: 16K
       8C 06 7C 6C A0 60 6F 85 00 F9 C8 3E AB 2E 98 4F>)
$$ ##END=
$$ 
$$ hash MD5
$$ E1 D1 5F E5 04 6F 52 88 E6 1A EB 6E 04 B8 F7 9D
##$RELAX= 
##$RELAX= 
##$RELAX= 
##$RELAX= 
##$RELAX= 
##$RELAX= 
$$ Bruker specific parameters
$$ --------------------------
##$DU= <F:/spectra>
##$EXPNO= 1
##$NAME= <H-F>
##$PROCNO= 1
##$TYPE= <nmr>
##$USER= <she>
##$AMP= (0..31)
100 100 100 100 100 100 100 100 100 100 100 100 100 100 100 100 100 100 
100 100 100 100 100 100 100 100 100 100 100 100 100 100 
##$AQSEQ= 0
##$AQ_mod= 1
##$AUNM= <au_zg>
##$AUTOPOS= <>
##$BF1= 200.13
##$BF2= 200.13
##$BF3= 200.13
##$BF4= 200.13
##$BF5= 200.13
##$BF6= 200.13
##$BF7= 200.13
##$BF8= 200.13
##$BYTORDA= 1
##$CFDGTYP= 0
##$CFRGTYP= 5
##$CHEMSTR= <none>
##$CNST= (0..31)
1 1 145 1 1 1 1 1 1 1 1 1 1 1 1 1 1 1 1 1 1 1 1 1 1 1 1 1 1 1 1 1 
##$CPDPRG= <>
##$CPDPRG1= <>
##$CPDPRG2= <>
##$CPDPRG3= <>
##$CPDPRG4= <mlev>
##$CPDPRG5= <mlev>
##$CPDPRG6= <mlev>
##$CPDPRG7= <mlev>
##$CPDPRG8= <mlev>
##$CPDPRGB= <>
##$CPDPRGT= <>
##$D= (0..31)
0 1.2 0 0 0 0 0 0 0 0.06 0 0.03 0 0 0 0 0.0002 0 0 0 0 0 0 0 0 0 0 0 0 
0 0 0 
##$DATE= 1620887520
##$DBL= (0..7)
120 120 120 120 120 120 120 120 
##$DBP= (0..7)
150 150 150 150 150 150 150 150 
##$DBP07= 0
##$DBPNAM0= <>
##$DBPNAM1= <>
##$DBPNAM2= <>
##$DBPNAM3= <>
##$DBPNAM4= <>
##$DBPNAM5= <>
$$ [...]
##$SUBNAM3= <"">
##$SUBNAM4= <"">
##$SUBNAM5= <"">
##$SUBNAM6= <"">
##$SUBNAM7= <"">
##$SUBNAM8= <"">
##$SUBNAM9= <"">
##$SW= 16.9725357007746
##$SWIBOX= (0..15)
0 0 2 0 0 0 0 0 0 0 0 0 0 0 0 0 
##$SW_h= 3396.73913043478
##$TD= 16384
##$TD0= 1
##$TE= 0
##$TE2= 300
##$TE3= 300
##$TEG= 300
##$TL= (0..7)
0 120 120 120 120 120 120 120 
##$TP= (0..7)
150 150 150 150 150 150 150 150 
##$TP07= 0
##$TPNAME0= <>
##$TPNAME1= <>
##$TPNAME2= <>
##$TPNAME3= <>
##$TPNAME4= <>
##$TPNAME5= <>
##$TPNAME6= <>
##$TPNAME7= <>
##$TPOAL= (0..7)
0.5 0.5 0.5 0.5 0.5 0.5 0.5 0.5 
##$TPOFFS= (0..7)
0 0 0 0 0 0 0 0 
##$TUNHIN= 0
##$TUNHOUT= 0
##$TUNXOUT= 0
##$USERA1= <user>
##$USERA2= <user>
##$USERA3= <user>
##$USERA4= <user>
##$USERA5= <user>
##$V9= 5
##$VALIST= <valist>
##$VCLIST= <CCCCCCCCCCCCCCC>
##$VD= 0
##$VDLIST= <DDDDDDDDDDDDDDD>
##$VPLIST= <PPPPPPPPPPPPPPP>
##$VTLIST= <TTTTTTTTTTTTTTT>
##$WBST= 1024
##$WBSW= 4
##$XGAIN= (0..3)
0 0 0 0 
##$XL= 0
##$YL= 0
##$YMAX_a= 551909
##$YMIN_a= -453479
##$ZGOPTNS= <>
##$ZL1= 120
##$ZL2= 120
##$ZL3= 120
##$ZL4= 120
##$ABSF1= 15.98749
##$ABSF2= -0.9851742
##$ABSG= 5
##$ABSL= 3
##$ALPHA= 0
##$AQORDER= 0
##$ASSFAC= 0
##$ASSFACI= 0
##$ASSFACX= 0
##$ASSWID= 0
##$AUNMP= <proc_1d>
##$AZFE= 0.1
##$AZFW= 0.1
##$BCFW= 0
##$BC_mod= 2
##$BYTORDP= 0
##$COROFFS= 0
##$CY= -3
##$DATMOD= 1
##$DC= 0
##$DFILT= <>
##$DTYPP= 0
##$F1P= 0
##$F2P= 0
##$FCOR= 1
##$FTSIZE= 16384
##$FT_mod= 6
##$GAMMA= 0
##$GB= 0
##$INTBC= 1
##$INTSCL= 1.334414e-10
##$ISEN= 128
##$LB= 0.24
##$LEV0= 0
##$LPBIN= 0
##$MAXI= 10000
##$MC2= 0
##$MEAN= 0
##$ME_mod= 0
##$MI= 1.114404
##$NCOEF= 0
##$NC_proc= -6
##$NLEV= 6
##$NOISF1= 3.799351
##$NOISF2= 2.8
##$NSP= 0
##$NTH_PI= 0
##$NZP= 0
##$OFFSET= 15.94502
##$PC= 1
##$PHC0= -11119.48
##$PHC1= 11.001
##$PH_mod= 1
##$PKNL= yes
##$PPARMOD= 0
##$PSCAL= 0
##$PSIGN= 0
##$REVERSE= no
##$SF= 200.130013292192
##$SI= 16384
##$SIGF1= 3
##$SIGF2= 2
##$SINO= 5.538805
##$SIOLD= 16384
##$SREGLST= <1H.CDCl3>
##$SSB= 0
##$STSI= 16384
##$STSR= 0
##$SW_p= 3396.73913043479
##$SYMM= 0
##$S_DEV= 0
##$TDeff= 16384
##$TDoff= 0
##$TI= <>
##$TILT= no
##$TM1= 0
##$TM2= 0
##$TOPLEV= 0
##$USERP1= <user>
##$USERP2= <user>
##$USERP3= <user>
##$USERP4= <user>
##$USERP5= <user>
##$WDW= 1
##$XDIM= 16384
##$YMAX_p= 312646815
##$YMIN_p= -342447
$$ End of Bruker specific parameters
$$ ---------------------------------
##NTUPLES= NMR SPECTRUM
##VAR_NAME=  FREQUENCY,     SPECTRUM/REAL,   SPECTRUM/IMAG
##SYMBOL=    X,             R,               I
##VAR_TYPE=  INDEPENDENT,   DEPENDENT,       DEPENDENT
##VAR_FORM=  AFFN,          ASDF,            ASDF
##VAR_DIM=   16384,         16384,           16384
##UNITS=     HZ,            ARBITRARY UNITS, ARBITRARY UNITS
##FACTOR=    0.207333158178282, 1,           1
##FIRST=     3191.07700890509, 0,            0
##LAST=      -205.662121529695, 0,           0
##MIN=       -205.662121529695, -342447,     0
##MAX=       3191.07700890509, 312646815,    0
$$ Real data points
##PAGE= N=1
##DATA TABLE= (X++(R..R)), XYDATA
$$ [...]
6298A01776n7189j927J4634q9770L2549K5211p306L9081k7684K0978J8349N6046
6286A24748j624q8881j1468K2232P495n145k1388l582j10852l8638M0720Q4732
6274a651M8371M492M4876L6770q8388l6588M5170q9790O6441K9872o7937l981
6262a2343J52620j31687k3583J0558k3768L7115k7361K8173O4879m7727j2067
6251A4809n8867k5995k0646L0468Q2098q5972M2982J03065j6682m4635N7229k947
6239G4907J1714k5121K8161o7966M5229k2480p1351K5095Q1180K038M5813l4596
6227I2623j32679M8866L5560J2838L5904K8450k891o2463j4078k9963l0194L848
6215a4179N8165o0832k8877J0705J57457Q0145j32000o7790N3220k4462J8200
$$ y = [101776, 44587, 42660, 57294, -32476, 73, 25284, 17978, 57059, 29375, 50353, 68702, 124748, 123124, 34243, 22775, 45007, 52502, 47357, 25969, 22387, -88465, -127103, -86383, -1651, 46720, 51212, 96088, 132858, 44470, 7882, 53052, -36738, 29703, 59575, -8362, -12343, 140277, 8590, -14993, -4435, -28203, 8912, -18449, 9724, 74603, 26876, 14809, -44058, -70053, -90699, -60231, 21867, -64105, -21123, 81942, 65260, 20625, 77854, 74907, 86621, 61500, 89661, 21695, 66924, 44444, -26907, -1812, 79368, 81406, 127219, 92623, -40056, 8810, 44370, 57208, 93112, 121562, 118671, 56208, 42130, 12167, -18027, -14179, 43986, -16846, -45723, -35018, 122439, 202584, 70584, 2794, 56014, 31552, 49752]
6204D9752P396l5952R2722L1435k3770k9997L0672m6551N0046L6151l7998K1764
6192A45670J9698m7916k5406l2496l5654l4493J4339K7181O9363j135n3244N2749
6180I8656l2530L1280O8141J4351q7939J7775N8847n3701K7479m9159L5742l9389
6168H9553L0703K6798l0367Q7315R9334P967j04749k8173P0070L081p9173o0831
6156A11528o4295o047N8006J15787l3865N24n3122J0166R5735P9219n122n5572
6144B52942N7644k7321N057R166p3727J9746P4793l8547o8678j4029Q4566L8310
6132C19922L4940n9517J4096L4197j3572n6802j1850R3967P073p3080M0313p0688
6120B58999J2340J129j5067K7636K5517l574l4865M8624J00179P409o6431m1642
$$ y = [49752, 57148, 21196, 113918, 145353, 121583, 91586, 122258, 75707, 125753, 161904, 123906, 145670, 165368, 117452, 92046, 59550, 23896, -10597, 3742, 30923, 100286, 99151, 45907, 98656, 66126, 97406, 165547, 179898, 91959, 109734, 168581, 114880, 142359, 93200, 128942, 89553, 120256, 147054, 116687, 204002, 303336, 311303, 206554, 178381, 248451, 251532, 172359, 111528, 47233, 41186, 99192, 214979, 181114, 181638, 128516, 138682, 234417, 313636, 308514, 252942, 310586, 283265, 288322, 297488, 223761, 243507, 318300, 279753, 211075, 197046, 281612, 319922, 354862, 295345, 309441, 343638, 330066, 273264, 261414, 355381, 362454, 289374, 329687, 258999, 271339, 272468, 257401, 285037, 310554, 306980, 272115, 320739, 420918, 428327, 361896, 320254]
6108C20254K9616l4712l4125J47998R3626L022P2250o2708M933O7502j15701o5877
6096D26078N7873O3300p0208n0171m3367J08952J01818L9421q8639r505K1092
6085E56644l0048L6846P5048N2830M7993Q492p6427j0859J11668P0225L3290L2607
6073I08309M1062n050J04792J24978J56344l5825J31051J05902o8206J00388J19316
6062A683061J95419L7210J07609R1600N1135P6499k3708N236j463j12082r0391
6051B020125o1690j44046r5680n0014q6619o2015l5067p2147j14807R767R730
6040A317537J949o9890j13375j7443j01498j4165L8753r889O3198j16182j58823
6029H20172r8128l224J08780O6492O1176R1570O4356K2360r6770j40160j12300
$$ y = [320254, 349870, 315158, 281033, 429031, 522657, 525679, 597929, 535221, 540154, 607656, 491955, 426078, 483951, 547251, 477043, 426872, 383505, 492457, 594275, 633696, 545057, 535552, 556644, 526596, 563442, 638490, 691320, 739313, 747805, 671378, 660519, 772187, 842412, 875702, 908309, 949371, 944321, 1049113, 1174091, 1330435, 1294610, 1425661, 1531563, 1463357, 1563745, 1683061, 1878480, 1915690, 2023299, 2114899, 2166034, 2242533, 2218825, 2224061, 2222598, 2110516, 2020125, 1958435, 1814389, 1718709, 1668695, 1582076, 1520061, 1484994, 1412847, 1298040, 1307807, 1317537, 1319486, 1249596, 1136221, 1118778, 1017280, 1003115, 1041868, 1031979, 1095177, 978995, 820172, 722044, 718820, 827600, 894092, 955268, 1046838, 1111194, 1133554, 1036784, 896624, 784324]
6018G84324k3630Q9897Q070l2794n5804n738M8353J583k9224M6375K7979N4567
6006I13958N2321L9376k6902P328j07638N4771O282L5409M0748k4218P8457L5286
5994A105178J03560l9012J01022Q4729k3559m0234N6852j08317n3787O9144P8890
5983A334466J1354m3998J8334p1545n4409J261Q6994J2877m0183r9945j8866l879
5971A132461q9256k9744N5105o3182K5889o3802k6505O0167l5709P417l3731r161
5959I29949L2873o0445n9351L285M584M2719r0357l6701k9928J75j4859J0501
5947G32445n986Q916k2624j6659m9223l2779M9257K1511n4573J5928l4292k2498
5935E89423M1953L1861k5197j8489N7539N179l1716O0140J13070k9027m0212j8947
$$ y = [784324, 760694, 850591, 858661, 825867, 770063, 764325, 812678, 814261, 785037, 831412, 859391, 913958, 966279, 1005655, 978753, 986081, 878443, 933214, 939496, 974905, 1015653, 991435, 1069892, 1105178, 1208738, 1169726, 1270748, 1355477, 1331918, 1291684, 1348536, 1240219, 1186432, 1255576, 1334466, 1345820, 1301822, 1320156, 1248611, 1194202, 1195463, 1282457, 1295334, 1255151, 1155206, 1136340, 1132461, 1043205, 1013461, 1068566, 1005384, 1031273, 967471, 940966, 1001133, 965424, 972841, 939110, 929949, 962822, 902377, 843026, 846311, 850895, 893614, 803257, 766556, 736628, 736803, 721944, 732445, 726459, 735375, 712751, 696092, 646869, 614090, 663347, 684858, 630285, 646213, 611921, 589423, 631376, 663237, 638040, 619551, 677090, 682269, 650553, 710693, 823763, 794736, 754524, 735577]
5923G35577j37347j8902O8593j9020j4248R3100k660j12811M9289j7238p8171
5912E46162K6351k1688q6227l4164J7798L5880K7758M5474j8180o5740N5825m8672
5900D80577j20601j2261k3880N0802n5448j9001J15221P1313k3875q2539j2620
5889C67688J4793l2824k4399M4346K1156k6681n2262P6295o1846m0829L519j5838
5877B73118k0774P5037l4528m2786K7875Q6547M2333m4609M6010j2636j111m2399
5865C52077j3908j25899l2926K010M163N5663r141K2280k1144p258Q6247J5054
5853C27218m0728n8437k7752l0296K9198N0325N8194j34615j15087M0027J38200
5842B36247M9925j360k4820o0325j1707O0383k2824O2719Q047n8527o357K231
$$ y = [735577, 598230, 579328, 647921, 628901, 614653, 707753, 705093, 592282, 641571, 624333, 546162, 572513, 550825, 464598, 430434, 448232, 484112, 511870, 557344, 539164, 473424, 529249, 480577, 359976, 347715, 323835, 374637, 319189, 300188, 415409, 486722, 462847, 380308, 367688, 382481, 349657, 325258, 369604, 390760, 364079, 311817, 388112, 326266, 285437, 288956, 273118, 252344, 327381, 292853, 250067, 277942, 364489, 406822, 362213, 408223, 395587, 394476, 352077, 338169, 212270, 179344, 181354, 185517, 241180, 232039, 254319, 233175, 225917, 312164, 327218, 286490, 228053, 200301, 170005, 199203, 249528, 307722, 173107, 58020, 98047, 236247, 286172, 284812, 259992, 199667, 187960, 248343, 225519, 288238, 296285, 237758, 231401, 233632]
5830B33632K3818q2937N5198L9143p1221r479k9844J3840j12848M7574J10613
5819B17489N9826l5935R731L770N9803j30639l126j06742j8950J24721K7586N3444
5807B60978J8449o4100q6951J08543J2932p739q7380n4692J3403N4493l7510M9946
5795A80372l1514k907J9995K9731L0430K5991o5958j07130o6332J09417K4330
5784A46425j7635p5116k8574N8524P187P1518K1376j35488l7601R8033M2670n3512
5772I7807K6728J21860K839J2194j01385j8819Q6657k2040o256j23388P101J9541
5760A02839N276P2490k3043q848J26368K9420q1661j3629N708r0464k7696j36683
5748c9923M7366L4091j01634L2995M2503J07866J48776n3694k0273j15184P098
$$ y = [233632, 257450, 174513, 229711, 268854, 197633, 188154, 158310, 172150, 59302, 106876, 217489, 277315, 241380, 251111, 254881, 314684, 184045, 180919, 74177, 55227, 179948, 207534, 260978, 279427, 215327, 128376, 236919, 249851, 242112, 154732, 100040, 113443, 167936, 130426, 180372, 148858, 145951, 165946, 195677, 226107, 252098, 186140, 79010, 12678, 122095, 146425, 128790, 53674, 25100, 83624, 90811, 162329, 183705, 48217, 10616, 108649, 151319, 97807, 124535, 246395, 249234, 261428, 160043, 141224, 227881, 205841, 199585, 76197, 83298, 102839, 108115, 180605, 157562, 148714, 275082, 304502, 222841, 209212, 214920, 124456, 96760, -39923, 7443, 41534, -60100, -27105, 15398, 123264, 272040, 218346, 198073, 82889, 89987]
5737H9987K0904J06965M875m4477m5406m5487N4501K9362O6680q967o7025K9419
5725A91331L8824m2160k9776j9537q328O490L787k8593J6214j6847L3459O9268
5713B14132q1950Q400P4055m2640L0144p1057P9358L8135n141J6309k1797j11926
5701A26022M1257L5270N133l6225M3581J7635K8816J454J053o2741k027l3541
5689A65687m1518K268l1783J2952p1035L6187P4487J8754J614M111K0190L5564
5677B27478j3875m265r775j60843K4569O5019L6210M2067L2574j4307L2005l6276
5665B20581k3189J0780P9266q1864p9548M9816k838J12106P6646m001p1768r2721
5653A93266J1479P9610J21565p9098q3275r0365M292j9534L6310J27849k298k0015
$$ y = [89987, 110891, 217856, 222731, 178254, 132848, 87361, 141862, 171224, 237904, 228937, 161912, 191331, 230155, 187995, 158219, 138682, 130354, 136844, 140631, 112038, 128252, 111405, 144864, 214132, 132182, 140582, 214637, 171997, 202141, 131084, 210442, 248577, 243436, 259745, 237948, 126022, 167279, 202549, 207682, 171457, 215038, 232673, 261489, 262943, 263996, 201255, 199228, 165687, 124169, 126437, 94654, 107606, 36571, 72758, 147245, 165999, 167613, 171724, 191914, 227478, 213603, 209338, 199563, 38720, 63289, 128308, 164518, 206585, 239159, 224852, 256857, 220581, 197392, 208172, 287438, 205574, 126026, 175842, 173004, 285110, 361756, 357755, 285987, 193266, 204745, 284355, 405920, 326822, 243547, 153182, 157474, 137940, 174250, 302099, 299801, 279786]
5641B79786j2581O6477l3582j441m8031k6451K1487K7316j1798k8362M1017j05716
5629A68121M6787M9273k7990K6675l1416Q6103K0762l6853j37044P6457O2134
5618C03009N667j0081N9144M836j9710R258J8953o6040M1694J7546q852n4038
5606C01386J05292K2148k14772J8654P4702j25723L6484j3781k0705J18138n831
5595B95992N8263k331l8805l8106L5042J4926K385J307M7783o7960q6252J09516
5583C31760l4914Q1443J03279q3637l4192m1607n8875M7987N2756n3651q187N9537
5571C61699N7486j28253O4350J20522q329n5567p6635R9778k8843n232m1499o9787
5559B89690K772M4344N5418r6261R4468K9432M4796N5764k7814k8245L7986o534
$$ y = [279786, 267205, 333682, 300100, 298659, 250628, 224177, 245664, 272980, 261182, 232820, 273837, 168121, 214908, 264181, 236191, 262866, 231450, 317553, 338315, 301462, 164418, 240875, 303009, 308676, 298595, 357739, 362575, 342865, 352123, 371076, 305036, 346730, 364276, 355424, 301386, 406678, 428826, 214054, 232708, 307410, 181687, 218171, 204390, 183685, 301823, 295992, 354255, 351924, 313119, 275013, 310055, 324981, 327366, 328673, 376456, 308496, 222244, 331760, 296846, 378289, 481568, 397931, 363739, 322132, 263257, 311244, 364000, 310349, 302162, 361699, 419185, 290932, 355282, 475804, 467475, 411908, 335273, 435051, 406208, 400976, 359477, 289690, 292462, 336806, 392224, 295963, 390431, 419863, 464659, 520423, 492609, 464364, 502350, 495816]
5547D95816m9087J3166K1180o547r2377P7973o0315L8950P5577M4136N3459K3504
5535F35435j37599q5530O6882M2294n6665o188O6276j25415M0126J18744l9814
5524E18546m3125r366L7093l1280M8432m376L5263M2171j8026Q6947j00879l3149
5512E28251n4600L9923J5629J9430k516L4946j6399K1481Q5664J0441k6024m805
5500F51421l5098p6660n1960O3954L7812k8658J0641M7113K8541q9594P1412O0504
5488F89428N505J6143P1779p5808l313M2245r1583Q331J7909k606n5530L1931
5476F54431J9471M8178Q7827L8398O7218K9368p7488j13120O6299L7486p8362
5465G79706N1587M4m7368J2915J72145N6714M2983N7818K62P2235j03959k3879
$$ y = [495816, 446729, 459895, 481075, 474528, 382151, 460124, 399809, 438759, 514336, 558472, 611931, 635435, 497836, 412306, 479188, 521482, 464817, 458629, 524905, 399490, 439616, 558360, 518546, 475421, 466055, 503148, 471868, 520300, 515924, 551187, 593358, 575332, 662279, 561400, 528251, 473651, 513574, 529203, 548633, 546117, 581063, 564664, 586145, 671809, 682250, 656226, 651421, 616323, 539663, 487703, 551657, 589469, 560811, 571452, 618565, 647106, 557512, 628924, 689428, 694933, 711076, 782855, 707047, 703734, 745979, 654396, 662727, 680636, 678030, 622500, 654431, 673902, 722080, 809907, 848305, 915523, 944891, 867403, 754283, 820582, 858068, 779706, 831293, 831337, 783969, 796884, 969029, 1025743, 1068726, 1126544, 1126806, 1199041, 1095082, 1071203]
5453A071203j7137k5398r25J9469n0577k9138J2780N8486P8965P7924J03588M8900
5441A348140r473n6902M6632k7926k3579M8629J02665K8231m3543J8248m5586
5430A385536q0618q142r6132P2948k5785j34412l3631k5787r9667j18092k6093
5419H10125O2456l5683Q8149o06m225J6642j7869N5934J0827j08756J153J4189
5407H92336P72P8745q2542o3767N6461O166p09j6456l3327Q9775J5756J03447
5395A046657q7885j44960j28196J4099N0743O7884j8620J53632q813l8851J630
5384I07320L1789K5005M5988m4082q6097q6114r3806N1181J1235n6121o4589M1668
5372F83377k2386P7279l8600n1673J23014K7734r9150j11355L6985P4297M3097
$$ y = [1071203, 1054066, 1028668, 1027743, 1047212, 996635, 967497, 980277, 1038763, 1117728, 1195652, 1299240, 1348140, 1338667, 1281765, 1328397, 1300471, 1276892, 1325521, 1428186, 1456417, 1412874, 1431122, 1385536, 1304918, 1296776, 1200644, 1273592, 1247807, 1113395, 1079764, 1053977, 954310, 836218, 810125, 872581, 836898, 925047, 924441, 920216, 936858, 918989, 974923, 985750, 876994, 878147, 892336, 893108, 971853, 889311, 825544, 882005, 888171, 887462, 871006, 837679, 927454, 943210, 1046657, 958772, 813812, 685616, 699715, 750458, 818342, 799722, 953354, 944541, 905690, 907320, 939109, 964114, 1010102, 966020, 879923, 793809, 700003, 751184, 762419, 706298, 641709, 683377, 660991, 738270, 699670, 647997, 771011, 798745, 699595, 588240, 625225, 699522, 742619]
5361G42619l0155n9337k0479N4063Q7129J5382j7865R2363J25367q2776o177K4432
5349I24566j21538K2413m1586m1332P7271L0991R433L0496J8787l4968K432P5223
5337I52188K4752j22051r8493K8163R9290o0223L5745Q777n9025j06756k831K5880
5325G25416M7292l5115M8195J282p0076P260k895l2185K1366k3355J3276K8863
5313G29324k0845K9315q468J2708J7030k5120K2982R506o0962N6673l924R4998
5301H53217j21948m5725r17M2601J42583l6252L8289N1126J9258R6378P0804L4983
5289A144397j03777M0518K2726m9869K8647M2277o4171n5171K4565M1220q9401
5278I81961o4558l5087j08563m1560K8577J4711m8363J45928r7466q1218M3224
$$ y = [742619, 712464, 653127, 632648, 686711, 773840, 789222, 771357, 863720, 989087, 906311, 900134, 924566, 803028, 825441, 783855, 742523, 819794, 850785, 860218, 890714, 909501, 874533, 876965, 952188, 976940, 854889, 756396, 784559, 883849, 823626, 859371, 868148, 809123, 702367, 699536, 725416, 772708, 737593, 785788, 787070, 716994, 724254, 721359, 689174, 710540, 687185, 700461, 729324, 708479, 737794, 729326, 742034, 759064, 733944, 756926, 766432, 705470, 762143, 758219, 853217, 731269, 685544, 684627, 727228, 869811, 833559, 871848, 922974, 942232, 1038610, 1109414, 1144397, 1040620, 1081138, 1103864, 1053995, 1082642, 1124919, 1060748, 1005577, 1030142, 1071362, 981961, 917403, 882316, 773753, 732193, 760770, 775481, 727118, 873046, 775580, 694362, 737586]
5267G37586K7326o6063m6342L0253m6317L7635N0594P946M231k6l056j1501K7430
5254G49696M8389q3543o3626M1372m7446L3178Q5449O0240j01836J4198o1553
5243F74518k563N2920K0697J3272o3868n5469L8892n787M461K3922m3914K9924
5231F87005M100L7053m5686j07416N769M1335j5640l3456m3781j5928R5013O0743
5219F69111r0679l8690J08180R394n7262K7914L6024N1584j03083l1312j8233
5208E62948M1192R8638O2162k0969p0001j41113q911P5445J5655N5926q1819n7602
5196E31551J01938M8030o283O4348n386L6803p5804K3426k2812k2471L1160j5736
5184F88764N5824k2477k3791K974K8819k4162K0650P7420K7050o0982k0457K5106
$$ y = [737586, 764912, 698849, 652507, 682760, 636443, 674078, 724672, 732618, 736849, 736823, 733767, 722266, 749696, 798085, 714542, 650916, 692288, 644842, 678020, 763469, 823709, 721873, 736071, 674518, 671955, 724875, 745572, 758844, 694976, 639507, 678399, 672612, 677073, 700995, 657081, 687005, 691105, 728158, 682472, 575056, 580825, 622160, 606520, 573064, 529283, 513355, 608368, 669111, 578432, 539742, 647922, 657316, 600054, 627968, 663992, 715576, 612493, 581181, 562948, 604140, 702778, 764940, 743971, 673970, 532857, 523946, 599391, 615046, 670972, 589153, 531551, 633489, 681519, 675236, 739584, 734198, 771001, 695197, 718623, 695811, 673340, 704500, 688764, 744588, 722111, 698320, 701294, 730113, 705951, 726601, 804021, 831071, 770089, 749632, 774738]
5172G74738J6302J6588L5659o5436k6344K3587o1053l0639N6639k2225Q3551m563
5160G96804k5813J40981j4702o0505P9521k1879o6241K166J7828k7730k701J14100
5148I31829K1698j07451O6653M6281r606j9911j0337M8095q5602p6067J1551N7493
5136H74626M0442k7194J868M7156R3280n5360m059p143M5341L2399p9832K10O1836
5123A023570l3086l9946P1187M6711J105M0674l6757O384p6433l2911O6595Q8136
5111A125229M0482q1182j6563P7260O8074p234k1405j14379J8480P8381J23472
5100A290615j3177L0239k9225m0186m8664j5616P6666O1228N8837N8009j43047
5089A285679j3783p2473q5992M9289Q2969L1752J291m0183n7374j9458L9572j2781
$$ y = [774738, 791040, 807628, 843287, 777851, 751507, 775094, 714041, 683402, 740041, 717816, 801367, 796804, 770991, 911972, 897270, 836765, 916286, 894407, 828166, 830332, 848160, 820430, 817729, 931829, 953527, 846076, 912729, 959010, 949404, 929493, 919156, 967251, 881649, 805582, 817133, 874626, 915068, 887874, 889742, 936898, 1030178, 974818, 970759, 963616, 1008957, 1041356, 961524, 961734, 1023570, 990484, 950538, 1021725, 1068436, 1069541, 1110215, 1073458, 1079842, 1003409, 970498, 1037093, 1125229, 1165711, 1084529, 1067966, 1145226, 1213300, 1206066, 1184661, 1070282, 1088762, 1167143, 1290615, 1277438, 1307677, 1278452, 1238266, 1189602, 1173986, 1250652, 1311880, 1370717, 1428726, 1285679, 1271896, 1199423, 1113431, 1162720, 1245689, 1277441, 1278732, 1238549, 1181175, 1161717, 1201289, 1188508]
5077A188508L4007N3452l9959q7021J2664L6201K2706M7461l849k8166P83M760
5065A241547q1744l5685K4757P022K7538j00333n6985K9944N7805M1452m4515
5054A110803O554K021M9829L5846n7455N3264L0118j3594o4934k8988L3842J5823
5042A173129M3860l1764L436k9814k045O8150j9214p1405k5955K4390L6844M649
5030A174261n6793j2400N3183m215N6245j16570L7708J209Q0781N0651J9946m7884
5018A236122J4468m3732M5126m3088K5134M9315p6867J3695j2994l6308Q4248
5007A255119J7440j9007K1792o1947Q3536l2927j0511l7795K4071J13380J6745
4996A369896r3424k4916j708Q2945j1412j05190M9281K59p5136Q6187J58966q4577
$$ y = [1188508, 1222515, 1275967, 1236008, 1148987, 1161651, 1197852, 1220558, 1268019, 1264170, 1236004, 1236787, 1241547, 1159803, 1124118, 1148875, 1155897, 1183435, 1083102, 1026117, 1056061, 1113866, 1155318, 1110803, 1117357, 1119378, 1169207, 1205053, 1147598, 1200862, 1230980, 1217386, 1152452, 1123464, 1157306, 1173129, 1216989, 1185225, 1188661, 1158847, 1156802, 1224952, 1205738, 1134333, 1108378, 1132768, 1169612, 1174261, 1117468, 1105068, 1158251, 1154036, 1210281, 1093711, 1131419, 1132628, 1213409, 1264060, 1284006, 1236122, 1250590, 1206858, 1251984, 1208896, 1234030, 1283345, 1206478, 1220173, 1207179, 1170871, 1255119, 1272559, 1253552, 1275344, 1213397, 1296933, 1264006, 1253495, 1215700, 1239771, 1353151, 1369896, 1276472, 1251556, 1249848, 1332793, 1321381, 1216191, 1265472, 1265731, 1190595, 1276782, 1435748, 1351171]
4984A351171l5219l4148m6280Q213J26719O6345k3580q5527q2170P3354P0067
4973A388945L1448j5365m4133J26869m3828r8244L1090P1451p468j018J11709
4962A551456j9468n1621p4234K0275R0082O0222r0095M4854p7448J0971N8198
4951A523192J11001j30444M8949R4410j4836k8117m9769O5950J32325k355r6277
4940A654029R2112O3176m8676n451P9491Q9675O7950q4057j5148J25889J6613
4929B035603N8154J3639l2002l26p6967l7797P1959K2972O3628P5000r8009O664
4917B102518Q6259J26834R3058O1711J128J8287N140Q1313P6750K8024p5950j5654
4905B589418M6441n0789p2589j8721m3058L6884l9529j11736j06724o346n7598
$$ y = [1351171, 1315952, 1281804, 1235524, 1243737, 1370456, 1436801, 1413221, 1327694, 1245524, 1318878, 1388945, 1420393, 1405028, 1360895, 1487764, 1443936, 1345692, 1376782, 1448233, 1440765, 1439747, 1551456, 1531988, 1480367, 1406133, 1426408, 1516490, 1576712, 1486617, 1531471, 1454023, 1464994, 1523192, 1634193, 1503749, 1552698, 1647108, 1632272, 1604155, 1554386, 1620336, 1752661, 1750306, 1654029, 1746141, 1809317, 1760641, 1755190, 1834681, 1924356, 1992306, 1908249, 1893101, 2018990, 2035603, 2093757, 2107396, 2075394, 2075068, 1998101, 1960304, 2032263, 2055235, 2118863, 2193863, 2095854, 2102518, 2188777, 2315611, 2408669, 2470380, 2471508, 2489795, 2494935, 2576248, 2652998, 2681022, 2605072, 2589418, 2635859, 2585070, 2512481, 2493760, 2450702, 2487586, 2448057, 2336321, 2229597, 2223251, 2165653]
4894B165653r0767M7766M9338J9433k3971Q3449j9854K7479K4157r343L8075o7236
4882B244179o9856L8973j045J4854K3235m0161l1173m8189K7837Q4137O9874P6530
4870B389195q4334m3002j0387K907L5035m1922L6472J00558o359n0867k7475K729
4858B302550J8272J07829j0748j4265j0103k8835Q6753j856J0345o0756q5944
4847B313242J11760J095o5051J17671M1760n6857m8105L2084K1991Q4459j4805
4836B539244N7659o965k0287j19O4887M937O8183J32457K726O0079K5863K6963
4824B955627R5981J18340J07094J56096j2312J7934P3625J09050J62639J19608
4814C903682O3544K4751O1132N3471R4678k3561J10644K8541o0494r1282r1069
$$ y = [2165653, 2074886, 2122652, 2171990, 2191423, 2167452, 2250901, 2231047, 2258526, 2282683, 2273340, 2311415, 2244179, 2174323, 2213296, 2212251, 2227105, 2250340, 2210179, 2179006, 2130817, 2158654, 2242791, 2312665, 2389195, 2304861, 2261859, 2251472, 2254379, 2289414, 2247492, 2283964, 2384522, 2378163, 2327296, 2299821, 2302550, 2320822, 2428651, 2417903, 2403638, 2393535, 2364700, 2451453, 2449597, 2459942, 2399186, 2313242, 2425002, 2426097, 2361046, 2478717, 2520477, 2463620, 2415515, 2447599, 2469590, 2554049, 2539244, 2596903, 2589938, 2569651, 2569532, 2634419, 2639356, 2707539, 2839996, 2842722, 2902801, 2928664, 2955627, 3051608, 3169948, 3277042, 3433138, 3420826, 3438760, 3512385, 3621435, 3784074, 3903682, 3967226, 3991977, 4053109, 4106580, 4201258, 4177697, 4288341, 4316882, 4256388, 4165106, 4074037]
4803D074037K8465k3656q6249K1463n6249m9208j07984j40699m2530N8853J06606
4792C782849M3463q7870q5845L6321M8505L2543J86016O4952k5110P9278q920
4781D066182N0985J31287P2433p5440l5028Q2492l2338j29838q293j35716l2527
4770C954199O910k6195l8081K31K3336J44740O8208K5066n3614K5825j3570k6232
4758D090823M3937Q699K2222n3588K4343o2336k4053L6404o9034K183j17417j50155
4746C752028n8350Q2746o4327Q390k7090l7993m0725r6643k9761j9007m8221O269
4734C427316N2319R1768n9296Q5922J5469l0106M236Q556N44K3599J11942j8893
4722C713376j6726k1680M5601n5530L8915K9387N2218q175n938p519p1778O5271
$$ y = [4074037, 4102502, 4078846, 3992597, 4014060, 3957811, 3908603, 3800619, 3659920, 3617390, 3676243, 3782849, 3826312, 3738442, 3652597, 3688918, 3737423, 3769966, 3955982, 4020934, 3995824, 4075102, 4066182, 4117167, 4248454, 4320887, 4245447, 4210419, 4292911, 4260573, 4130735, 4122442, 3986726, 3954199, 3961109, 3934914, 3896833, 3897064, 3920400, 4065140, 4133348, 4158414, 4104800, 4130625, 4117055, 4090823, 4134760, 4143459, 4165681, 4112093, 4136436, 4074100, 4050047, 4086451, 4017417, 4019600, 3902183, 3752028, 3693678, 3776424, 3712097, 3720487, 3693397, 3655404, 3614679, 3518036, 3488275, 3469268, 3421047, 3427316, 3479635, 3571403, 3512107, 3598029, 3613498, 3583392, 3587628, 3596184, 3596728, 3620327, 3732269, 3713376, 3696650, 3674970, 3720571, 3665041, 3703956, 3733343, 3785561, 3777386, 3771448, 3763929, 3692151, 3757422]
4710C757422N6107k415J36059m3039j2004R0147L7259Q3228l4055j5000M7568
4699D101277L4582J31944R4147J12660k3022N7974k2199N525r577n3291P4592
4688D504612J9744r561M8191P4596L9801o9768k0682j14170l5225k9863r0379
4677D317296q1664j27881O657q5605L8103j0127o3840m4930j18222m363J1746
4666C837170N1269m3324m2039L4562r1281p6579o2363n682P6414m6376j3434p9721
4654C538616J2971J00526Q2798P4612L22j40080l0944M4782J08005N7610q7031
4643C762187J7735K9144P1591p8012K476J46947M228J23485J06212Q655J1732
4632D206380P327L1232j04064L1530M4798M3649p533O2507O3889L7351K9967L5303
$$ y = [3757422, 3813529, 3811114, 3947173, 3904134, 3892130, 3982277, 4019536, 4102764, 4068709, 4053709, 4101277, 4135859, 4267803, 4361950, 4474610, 4451588, 4509562, 4487363, 4492888, 4483311, 4430020, 4504612, 4524356, 4514795, 4562986, 4637582, 4677383, 4607615, 4586933, 4472763, 4437538, 4407675, 4317296, 4235632, 4107751, 4114408, 4028803, 4066906, 4056779, 3992939, 3948009, 3829787, 3825424, 3837170, 3888439, 3845115, 3803076, 3837638, 3746357, 3669778, 3607415, 3601733, 3678147, 3631771, 3618337, 3538616, 3551587, 3652113, 3734911, 3809523, 3809845, 3669765, 3638821, 3683603, 3791608, 3849218, 3762187, 3779922, 3809066, 3880657, 3802645, 3805121, 3952068, 3956296, 4079781, 4185993, 4194648, 4206380, 4213707, 4244939, 4140875, 4172405, 4217203, 4260852, 4253319, 4315826, 4379715, 4417066, 4447033, 4482336]
4620D482336k3361K1777J09982M5907M9561j7215k518j2328k4405J15770J5044
4609D760550J22448J41782K5908k7555O3372J00084M9814P1463M3780J43834J43231
4598E638711K6973J41017J47441J25914Q6940K0042J98783P9838J67541J46464
4588F779664O2242J38892M9629J64764K09720P0963J59825J08866J16599J07524
4578G968688K24344J61474J52297J54951J50593J38976Q7137K34304J89540J98739
4568I661043J79595J52242K28363K32580J60921J12261K57746K02260K07522K60617
4558A1655150J82624L16213K05546K55642K70157K84971K86259L06208K45943
4549A4008713K61464M62629L69502L92418M80534L77060M48985N76252M52951
$$ y = [4482336, 4458975, 4480752, 4590734, 4636641, 4686202, 4668987, 4666469, 4654141, 4629736, 4745506, 4760550, 4882998, 5024780, 5050688, 5023133, 5086505, 5186589, 5236403, 5307866, 5351646, 5495480, 5638711, 5665684, 5806701, 5954142, 6080056, 6166996, 6187038, 6385821, 6465659, 6633200, 6779664, 6841906, 6980798, 7030427, 7195191, 7404911, 7475874, 7635699, 7744565, 7861164, 7968688, 8193032, 8354506, 8506803, 8661754, 8812347, 8951323, 9038460, 9272764, 9462304, 9661043, 9840638, 9992880, 10221243, 10453823, 10614744, 10727005, 10984751, 11187011, 11394533, 11655150, 11837774, 12153987, 12359533, 12615175, 12885332, 13170303, 13456562, 13762770, 14008713, 14270177, 14732806, 15102308, 15494726, 15975260, 16352320, 16801305, 17377557, 17830508]
4540A7830508L87677N06385N74405O93950M68630O78372O48258O41875P69296
4531B3199356O91087P37985P78099P75619Q00930Q33497R80063R87523R98246
4522C0782405J196711J236195J386608J481637J580296J747159J960634K028183
4514D3399828K236762K524022K956211L092328L345666L805674M327777M653200
4506G0341468N131823N557009O103387O395748O457717O451648O318777O134065
4498A18891642N711572N484781N022937M258297L268005J625996m43250k629493
4490A41190487m779099n975830o719215o953299p092893p241565p224090p266658
4482H7937838p027375o611383o118631n547254m917652m297109l774765l375794
$$ y = [17830508, 18218185, 18724570, 19298975, 19992925, 20461555, 21139927, 21788185, 22430060, 23199356, 23890443, 24628428, 25406527, 26182146, 26983076, 27816573, 28796636, 29784159, 30782405, 31979116, 33215311, 34601919, 36083556, 37663852, 39411011, 41371645, 43399828, 45636590, 48160612, 51116823, 54209151, 57554817, 61360491, 65688268, 70341468, 75473291, 81030300, 87133687, 93529435, 99987152, 106438800, 112757577, 118891642, 124603214, 130087995, 135110932, 139369229, 142637234, 144263230, 143819980, 141190487, 136411388, 130435558, 123716343, 116763044, 109670151, 102428586, 95204496, 87937838, 80910463, 74299080, 68180449, 62633195, 57715543, 53418434, 49643669, 46267875]
4474D6267875k894320k679010k343408k062196j967096j678567j505717j423263
4466B9714298j320070j226093j052256j099130r50235p08145q31330p99643o79138
4457B1048258n69035o98075o13522n62694n11335m60453m89443l99392l59765
4448A6384544m99694l22347k01867l34989l31051l08000j95166k51438k03512
4439A3736480k11827k27393k08814j77125k89341l01373k17871r1953j41474j86827
4429A1682482l6564j24339j50668j12109j14486n7742P56j8910J452K1170N0960
4418A1142002O6378K853r710k4187J24164J18573q6258o1636m1646j71554j38826
4407A0920153j52605k04601j04778o6946j02250r1836j91001m2660N5365M6923
$$ y = [46267875, 43373555, 40694545, 38351137, 36288941, 34321845, 32643278, 31137561, 29714298, 28394228, 27168135, 26115879, 25016749, 24066514, 23358369, 22527039, 21727396, 21048258, 20479223, 19781148, 19167626, 18604932, 18093597, 17633144, 17143701, 16744309, 16384544, 15884850, 15562503, 15360636, 15025647, 14694596, 14386596, 14191430, 13939992, 13736480, 13524653, 13297260, 13088446, 12911321, 12621980, 12320607, 12102736, 12010783, 11869309, 11682482, 11645918, 11521579, 11370911, 11258802, 11144316, 11086574, 11087330, 11068420, 11069872, 11091042, 11142002, 11208380, 11211233, 11201523, 11177336, 11301500, 11420073, 11333815, 11272179, 11230533, 11058979, 10920153, 10767548, 10562947, 10458169, 10391223, 10288973, 10197137, 10006136, 9963476, 10018841, 10065764]
4397A0065764o5987O5076L012J51080L3499l2151K21396J67083J60782O8921J48226
4386A0986701J44587P7214M812J77448j56995j59052l03981l41538k91119l00238
4376I837839k99230k43358o5834k25815k50675j68851K7434k3276J6574L4874
4366H639682j58365k1596P26K9175m255L4643K727M6511L8133N3429J3921j12301
4354H562430J0563r2740j02534j44594k36818k29402j92330k36969k43071j60179
4344F934356j75769j93275j82617r6330k12756p4623q7556l2553l0833o8274j8166
4333E761604n6821m3307j90184j75408p6594m620Q0306N7925j19856l6621r5977
4322E100447M7069K9194k0158n4815M3753N6266n4626k2255n6229k475R3126J44144
$$ y = [10065764, 9999777, 10064853, 10067865, 10218945, 10252444, 10220293, 10441689, 10608772, 10769554, 10838475, 10986701, 11131288, 11208502, 11213314, 11390762, 11233767, 11074715, 10770734, 10429196, 10138077, 9837839, 9538609, 9295251, 9229417, 9003602, 8752927, 8584076, 8611510, 8588234, 8604808, 8639682, 8481317, 8459721, 8460447, 8489622, 8485367, 8520010, 8522737, 8569248, 8607381, 8660810, 8674731, 8562430, 8572993, 8480253, 8377719, 8233125, 7996307, 7766905, 7574575, 7337606, 7094535, 6934356, 6758587, 6565312, 6382695, 6286365, 6073609, 5998986, 5911430, 5878877, 5848044, 5779770, 5761604, 5704783, 5661476, 5471292, 5295884, 5219290, 5214670, 5294976, 5352901, 5233045, 5196424, 5100447, 5147516, 5176710, 5156552, 5101737, 5145490, 5201756, 5147130, 5124875, 5068646, 5066171, 5159297, 5303441]
4310E303441k0497k2262Q4026Q4159N5066O2715L3283k8854m5516m7245K186j02558
4298E357944p3894l8869J03230j05238q3030l7285j03110p3628l8963r5759q0857
4287D730541n2758k9469l0374j08517q4564r8953L3700j4209K1869k0426Q944
4276D355784Q4081j00950n1830m053m7069l5023L8967R9915p7537J2436O0598
4265D335319K2752l3659J4476j6036m7190O8712j7462n7559Q2233J6645r70M3552
4253D410813j468n0751J35217R8296P161j2344k0510l944J00376M4730Q2652J23611
4241D913839J20743J78525K00376K19493Q8953J23219K36474K32856K11124K98609
4231F824211L03128K32213R912j96084l16648l05937k54214k18038k56794j98658
$$ y = [5303441, 5282944, 5260682, 5344708, 5428867, 5483933, 5546648, 5579931, 5551077, 5505561, 5458316, 5460502, 5357944, 5284050, 5245181, 5348411, 5243173, 5160143, 5122858, 5019748, 4946120, 4907157, 4811398, 4730541, 4677783, 4648314, 4617940, 4509423, 4424859, 4325906, 4359606, 4345397, 4367266, 4346840, 4355784, 4439865, 4338915, 4287085, 4283032, 4235963, 4200940, 4239907, 4339822, 4262285, 4274721, 4335319, 4358071, 4324412, 4338888, 4322852, 4275662, 4344374, 4326912, 4269353, 4351586, 4368231, 4367261, 4410813, 4409345, 4358594, 4493811, 4592107, 4599268, 4586924, 4566414, 4562470, 4662846, 4707576, 4790228, 4913839, 5034582, 5213107, 5413483, 5632976, 5721929, 5845148, 6081622, 6314478, 6525602, 6824211, 7127339, 7359552, 7369464, 7173380, 6856732, 6550795, 6296581, 6078543, 5821749, 5623091]
4221E623091j1721l8374m7856O3747J6399m6628O4899J19428J19434M4297M5348
4210E952064Q2575R3621J93090J98000J11201J80085L75755L11309M06915N09861
4200H414476M69535N87311N08400L34572P6596m77849p75569q07069n99746l75700
4190G354957k94823l55798k49203k46761j45921j04043r5259o6456L5006k1211
4180E810488m2450j848k7706L8391O9585R5828J13988R6250J09041K21647M6663
4169F529877R9507K37975L39796K65559K02949J71075M4932l18249m30295m31718
4159F711408l42649l56962k55095j91773o4328j29871j95672j72692j35074K9697
4149D896989j49517p8649m4572o3204k4797j35855o1469j06304j28645K717m0407
$$ y = [5623091, 5611370, 5572996, 5525140, 5588887, 5605286, 5558658, 5623557, 5742985, 5862419, 5906716, 5952064, 6034639, 6128260, 6321350, 6519350, 6630551, 6810636, 7186391, 7497700, 7904615, 8414476, 8884011, 9471322, 9979722, 10314294, 10390890, 9913041, 9137472, 8330403, 7730657, 7354957, 7060134, 6704336, 6455133, 6208372, 6062451, 5958408, 5863149, 5796693, 5831699, 5810488, 5768038, 5766190, 5738484, 5776875, 5846460, 5942288, 6056276, 6152526, 6261567, 6483214, 6529877, 6629384, 6867359, 7207155, 7472714, 7675663, 7846738, 7891670, 7573421, 7143126, 6711408, 6368759, 6011797, 5756702, 5564929, 5500601, 5370730, 5175058, 5002366, 4867292, 4896989, 4747472, 4668823, 4624251, 4561047, 4536250, 4400395, 4338926, 4232622, 4103977, 4106694, 4066287]
4138D066287m7236q2480p412J843M0389K438j00067j241J1145L9565L3771l0520
4126C926482j06388K4287J09787o2778M0199k8378j6658l7247o0553M0446n3552
4115C775647R904k6131q9226j5727j2555j7003n6007o7790O6382L7441j717m4163
4103C559055l5183L7245k175o2412m4991L7091J4871Q1200n1054k3964k143J1754
4091C519294K8791j6995O69M5154r3826J39487Q5660O4348k8536J01299L8600
4080C883945n3649M1629M898l2740k5793J18299p8656O4907l5634n6927K3784
4069C854063R514l5304K3427Q8511M6249J6177p8750J10733R9925L2272n3411
4058D113406O2919L8392l9011K3375J02861J08908l6588l6358M5935K9506n2746
$$ y = [4066287, 4019051, 3936571, 3929159, 3931002, 3971391, 3973829, 3873762, 3872521, 3883666, 3923231, 3957002, 3926482, 3820094, 3844381, 3954168, 3891390, 3931589, 3903211, 3886553, 3849306, 3788753, 3829199, 3775647, 3785551, 3759420, 3670194, 3654467, 3641912, 3624909, 3568902, 3501112, 3567494, 3604935, 3603218, 3559055, 3523872, 3561117, 3558942, 3496530, 3451539, 3488630, 3503501, 3584701, 3533647, 3509683, 3507540, 3519294, 3548085, 3531090, 3531759, 3576913, 3483087, 3622574, 3708234, 3772582, 3744046, 3845345, 3883945, 3830296, 3871925, 3876823, 3844083, 3818290, 3936589, 3857933, 3922840, 3887206, 3830279, 3854063, 3863577, 3828273, 3851700, 3940211, 3986460, 4002637, 3923887, 4034620, 4134545, 4166817, 4113406, 4176325, 4214717, 4175706, 4199081, 4301942, 4410850, 4374262, 4337904, 4383839, 4413345, 4360599]
4047D360599P6105m7450m231K2452k4096J3057L438O6830Q8799j9903M957K7851
4035D568408j8043n736O6330j8252k61n708J51720J8861M6499m558O8778M8881
4023D916919R7037J03968r3797k9623K9131j1533Q7572J08128M5764L5479O0201
4012E349246J0996R0991M9640Q4731J21810M3721J28802J74637J51969K30339
4002F436882J71519K04039o997r9110J5830J60010R3100R1875J83986K47130K19978
3991G718242K02427L07646K42726K59446K09437J47354R4129J87841J53215N1604
3981I574067j7857r7264j79135o0781L648J25184K65504L54283L70705L48194
3971A0686548K51645K27951J39579M0122k31170j33115j49115k7999R302n6948
$$ y = [4360599, 4436704, 4389254, 4385023, 4407475, 4383379, 4396436, 4399874, 4466704, 4555503, 4535600, 4540557, 4568408, 4550365, 4544629, 4610959, 4592707, 4592446, 4586738, 4738458, 4757319, 4803818, 4799260, 4868038, 4916919, 5013956, 5117924, 5024127, 4994504, 5023635, 5012102, 5099674, 5207802, 5253566, 5289045, 5349246, 5360242, 5451233, 5500873, 5585604, 5707414, 5751135, 5879937, 6054574, 6206543, 6436882, 6608401, 6812440, 6805443, 6706333, 6722163, 6882173, 6975273, 7067148, 7251134, 7498264, 7718242, 7920669, 8228315, 8471041, 8730487, 8939924, 9087278, 9181407, 9369248, 9522463, 9574067, 9556210, 9458946, 9279811, 9219030, 9222678, 9347862, 9613366, 9967649, 10338354, 10686548, 10938193, 11166144, 11305723, 11345845, 11114675, 10981560, 10832445, 10804446, 10813748, 10756800]
3961A0756800j61647j7575J10662J37058J8456J54042K2551N5957K42879J30877
3951A1450060M4009k69455m94298m70102k69055k57353l7277J08537j2181P5456
3941I868341J97185K45018J10981K9899k09344k34791l63768k62951j11770j63611
3931I105189l31703m42711l95428o6399p0500r3223N3349K4862J01090P5632l7754
3920G922404L0204j17947l58963k36268l15429j61289j15559r9689j31216P334
3910F423582N6767k1014j26043N591n2569m8806K6J2630O1687m6292n2514n0542
3898F162503Q516J03952P2592Q7734R3216k2413j16110M2480K0947p8728O831
3887F381520Q2465K2428l5663N3497O9328K3399M806K13919k1694m2524R0970
$$ y = [10756800, 10595153, 10577578, 10688240, 10825298, 10843754, 10997796, 11020347, 11076304, 11319183, 11450060, 11494069, 11224614, 10730316, 10260214, 9991159, 9733806, 9696529, 9805066, 9792885, 9868341, 10065526, 10310544, 10421525, 10451424, 10242080, 10007289, 9643521, 9380570, 9268800, 9105189, 8773486, 8330775, 7935347, 7868948, 7798448, 7705225, 7758574, 7783436, 7884526, 7960158, 7922404, 7952608, 7834661, 7475698, 7239430, 6924001, 6762712, 6647153, 6547464, 6416248, 6423582, 6480349, 6459335, 6333292, 6338883, 6286314, 6237508, 6237534, 6250164, 6311851, 6265559, 6213045, 6162503, 6171019, 6274971, 6347563, 6435297, 6528513, 6506100, 6389990, 6432470, 6453417, 6374689, 6381520, 6463985, 6486413, 6450750, 6504247, 6573575, 6596974, 6601780, 6815699, 6794005, 6751481, 6842451]
3876F842451k4375k242O6957P7507o648M2778O5064L9909Q1379J85317J0111L2560
3864G410768J00057J34572L673J0091K4292J11904R0295k9513M9227J27481P9009
3853H111856J68798R3050L4155P9674J75532Q9615J30736J53883J08946J58115
3843I304360K46822J1230M0311K29727J42695J78822J35508J80888K91112K40947
3833A1002422J50985J08563K31286J86001J39267K46244K50257K07223K21090
3824A2743338L40229L38361L00477L98021L93355L69403N68141N20754N33870
3815A6505949N10313N74639N73559N88958P84940Q06948R05041J071321J214538
3806B3536206J436515J470104J609263J795691K031525K481517K874908L399964
$$ y = [6842451, 6818076, 6815834, 6882791, 6960298, 6953650, 6996428, 7061492, 7101401, 7182780, 7368097, 7378208, 7410768, 7510825, 7645397, 7649070, 7659161, 7683453, 7795357, 7885652, 7856139, 7905366, 8032847, 8111856, 8280654, 8373704, 8407859, 8487533, 8663065, 8752680, 8883416, 9037299, 9146245, 9304360, 9551182, 9562412, 9602723, 9832450, 9975145, 10153967, 10289475, 10470363, 10761475, 11002422, 11153407, 11261970, 11493256, 11679257, 11818524, 12064768, 12315025, 12522248, 12743338, 13083567, 13421928, 13722405, 14120426, 14513781, 14883184, 15451325, 15972079, 16505949, 17016262, 17590901, 18164460, 18753418, 19538358, 20345306, 21250347, 22321668, 23536206, 24972721, 26442825, 28052088, 29847779, 31879304, 34360821, 37235729, 40635693]
3798D0635693M005080M583103M829996M180811K140757j213357l714376n810141
3790D9637566o202356m998487l856177k739310k009490j576045j282421r75610
3782B5997670q34782o77725n75256l31461m34967k24922j23500L3973q388o5014
3772B2755628L1565J80631K85374K25348M28055N00089N06807M87767P20893Q32971
3762B6955128J058309J067092J277731J317767J558483J767401K157581K320736
3754C9480228K614093L091867L646452M185634M481172M041598K189258m59172
3746F3271130k144727l473068n399456n686922m490293l360039k643336j947778
3738C4125511j596066j372784j163663r59462p48657o32830m94252m01704n35860
$$ y = [40635693, 44640773, 49223876, 54053872, 58234683, 60375440, 59162083, 55447707, 49637566, 43435210, 38436723, 34580546, 31841236, 29831746, 28255701, 26973280, 25997670, 25162888, 24485163, 23909907, 23578446, 23143479, 22918557, 22795057, 22829030, 22820642, 22755628, 22787193, 22967824, 23253198, 23478546, 23906601, 24406690, 24913497, 25401264, 26122157, 26955128, 28013437, 29080529, 30358260, 31676027, 33234510, 35001911, 37159492, 39480228, 42094321, 45186188, 48832640, 53018274, 57499446, 61541044, 63730302, 63271130, 61126403, 57653335, 52253879, 46566957, 42076664, 38716625, 36073289, 34125511, 32529445, 31156661, 29992998, 29033536, 28284879, 27652049, 27157797, 26756093, 26220233]
3729B6220233m18356k54349l11821l24225j92921k82515k65174j82259j24317
3720B3864296k01696q0340Q2549j17539k1561j5809m1046L6391Q08Q1379M8780
3709B3636212J0856R8597J29880K20480J64494J90837K85138L21860K58399L81153
3699B5697906L78408N26623N09570M78646M61489N57985P20233P46184R05759
3690C0982803Q95758J011808J002168J120704J303942J512108J448929J323092
3682D0601312J032944O58586L73725N46211P84599R90038R72293J046638J178608
3673D8184954R73338J072310J200552J352268J432238J502175J568794J721307
3665E9007936J724757J656698J429539R67374Q17262R06577Q29502O18139L59032
$$ y = [26220233, 25801877, 25547528, 25235707, 24911482, 24718561, 24436046, 24170872, 23988613, 23864296, 23662600, 23582260, 23664809, 23547270, 23525709, 23509900, 23468854, 23505245, 23506053, 23587432, 23636212, 23647068, 23745665, 23875545, 24096025, 24260519, 24451356, 24736494, 25058354, 25316753, 25697906, 26076314, 26602937, 27112507, 27591153, 28052642, 28610627, 29330860, 30077044, 30982803, 31878561, 32890369, 33892537, 35013241, 36317183, 37829291, 39278220, 40601312, 41634256, 42292842, 42666567, 43212778, 43997377, 44987415, 45959708, 47006346, 48184954, 49158292, 50230602, 51431154, 52783422, 54215660, 55717835, 57286629, 59007936, 60732693, 62389391, 63818930, 64786304, 65603566, 66510143, 67339645, 67957784, 68316816]
3656F8316816K94275M83814Q09785J040883J212468J519548J704397K109627K272266
3647G9763879K468138K863146L216399L434300L794277L719730L383924K478554
3639A05122347J140286n66048k211124l394649l559615l407977k955087k180193
3631H7987940j516256q01926l51757M01300R45595J279421J598327K047711K330788
3622I3921143K346719K259919K010669J627907Q67753N5775r05264j705561k377672
3613I8101388k961095l205167l478679l578569l248637k839952k561370k171850
3605G4056069j855833j436072j198221q27659n84799l71791N3386M00849N29478
3596F8765407O50195R06899J288905J373075J521667J741847J870202K044903
$$ y = [68316816, 68611091, 69094905, 69904690, 70945573, 72158041, 73677589, 75381986, 77491613, 79763879, 82232017, 85095163, 88311562, 91745862, 95540139, 99259869, 102643793, 105122347, 106262633, 105696585, 103485461, 100090812, 96531197, 93123220, 90168133, 87987940, 86471684, 85669758, 85318001, 85719301, 86664896, 87944317, 89542644, 91590355, 93921143, 96267862, 98527781, 100538450, 102166357, 103034110, 103089885, 102184621, 100479060, 98101388, 95140293, 91935126, 88456447, 84877878, 81629241, 78789289, 76227919, 74056069, 72200236, 70764164, 69565943, 68738284, 68153485, 67781694, 67835080, 68235929, 68765407, 69415602, 70322501, 71611406, 72984481, 74506148, 76247995, 78118197, 80163100]
3588H0163100K116012K030712J978382J926245J967334J767815J618302J221132
3580I4789034R27983N73811J90838J36251j17693l44360o26574o54569o28249
3571I4246472o81931n50890m07576l70327l76822j62917j79222j19146l7740j9406
3561I1340495J3360J3256J0117k16791l85589n74421p90878j056161j250973j395408
3551H5707007j349646j526323j479486j453596j567571j630663j601461j491218
3543G3607043j434587j346660j242496j285101j233646j053222j039224r98851
3535F3973256j054196r84770r32098q89245q26100p53883p52608o54442o89862
3526E6436052n78085o31584n94989l99345m99737n39655m48120l07009k92770
$$ y = [80163100, 82279112, 84309824, 86288206, 88214451, 90181785, 91949600, 93567902, 94789034, 95717017, 96290828, 96481666, 96617917, 96500224, 96155864, 95529290, 94874721, 94246472, 93564541, 93013651, 92606075, 92235748, 91858926, 91696009, 91516787, 91397641, 91359901, 91340495, 91353855, 91367111, 91377228, 91160437, 90774848, 90200427, 89409549, 88353388, 87102415, 85707007, 84357361, 82831038, 81351552, 79897956, 78330385, 76699722, 75098261, 73607043, 72172456, 70825796, 69583300, 68298199, 67064553, 66011331, 64972107, 63973256, 62919060, 61934290, 61002192, 60112947, 59286847, 58532964, 57780356, 57125914, 56436052, 55857967, 55226383, 54631394, 54232049, 53732312, 53192657, 52744537, 52437528, 52144758]
3517E2144758l22235k82924q6397M6184J55738R6944j37657o34490r78954j047281
3507D8953686q45499o93809n07240l46730j52301J6280J78745L92816L29672J37073
3497D7462693k89596m87597o80929m63590j82034J2365L01868N24379N35749N48193
3487D7281501N45757J51580q6663j96376m5144K28003L82617M88455O65409P95621
3477E0210760Q95036R86897J005595Q60784O02841L62412K04858K64231M59180
3468E5852594N72338Q32276J206111J447610J568987J707274K058578K156323
3460F7402091K253406K491735K586422K797492K871455L016840L309920L744214
3452I0473575M178135M677254N529114O234427P036262P940850Q904357J0026396
$$ y = [52144758, 51822523, 51539599, 51453202, 51499386, 51655124, 51752068, 51614411, 50979921, 50000967, 48953686, 48108187, 47414378, 46907138, 46560408, 46408107, 46424387, 46603132, 46995948, 47325620, 47462693, 47173097, 46685500, 46004571, 45540981, 45358947, 45371312, 45673180, 46197559, 46733308, 47281501, 47827258, 47978838, 47892175, 47695799, 47650655, 47878658, 48261275, 48749730, 49415139, 50210760, 51105796, 52092693, 53098288, 53959072, 54561913, 54924325, 55129183, 55393414, 55852594, 56424932, 57257208, 58463319, 59910929, 61479916, 63187190, 65245768, 67402091, 69655497, 72147232, 74733654, 77531146, 80402601, 83419441, 86729361, 90473575, 94651710, 99328964, 104858078, 111092505, 118128767, 126069617, 134973974, 145000370]
3444A45000370J1320543J2887356J5000648J7112951J9073612K0835200K1591172
3437B62821852K0444354J5435826N485382q709472k1880727k8386126k8190449
3430B17020640k5014933k1060105j7252224j4129704j1886945r890739q440796
3423A09345194p141295o134656n359524m674205m276284l832719l398838l050504
3415G1477169k820494k347328j996216j855125j695985j468217j480304j389825
3407E6423675j344834j180326j249938j103914r03322r41180q21103p52703p33086
3398D7393269o56430p28400n80675m88749n24468m04847l71766k71565j55881
3389D3210488j77693j40212Q3035R4119J35605J04080L7268N7557l9631J05426
$$ y = [145000370, 156320913, 169208269, 184208917, 201321868, 220395480, 241230680, 262821852, 283266206, 298702032, 304187414, 295477942, 273597215, 245211089, 217020640, 192005707, 170945602, 153693378, 139563674, 127676729, 117785990, 109345194, 102203899, 96069243, 90709719, 86035514, 81759230, 77926511, 74527673, 71477169, 68656675, 66309347, 64313131, 62458006, 60762021, 59293804, 57813500, 56423675, 55078841, 53898515, 52648577, 51544663, 50641341, 49700161, 48879058, 48126355, 47393269, 46736839, 46008439, 45427764, 44939015, 44414547, 44009700, 43637934, 43366369, 43210488, 43032795, 42892583, 42975618, 43069737, 43205342, 43309422, 43346690, 43404247, 43364616, 43470042]
3379D3470042N1756Q0105P0187J09792J88200L11890M84184M34190N43264N59203
3369D6302813O73178P47035P22045P66003R80924R30759R86943J019834J208257
3360E4337791J250955J132780J160032J035582J035538J125927J081571J089797
3352F3249973J284116J380683J325386J469984J584434J537846J746313J786328
3344G5365063J893040K074918K436592K580391K611590K789345K853637K785688
3336I5390264K862838K943907L074978L419651L991479M617071N210498O159413
3328A27670099O985332P883584R168722J0726661J2435089J4372105J6459500
3321B05701092J8865122K0904235K1753740K0204025J5580738Q734700R03163
$$ y = [43470042, 43521798, 43601903, 43672090, 43781882, 43970082, 44281972, 44766156, 45200346, 45743610, 46302813, 46975991, 47723026, 48445071, 49211074, 50191998, 51122757, 52109700, 53129534, 54337791, 55588746, 56721526, 57881558, 58917140, 59952678, 61078605, 62160176, 63249973, 64534089, 65914772, 67240158, 68710142, 70294576, 71832422, 73578735, 75365063, 77258103, 79333021, 81769613, 84350004, 86961594, 89750939, 92604576, 95390264, 98253102, 101197009, 104271987, 107691638, 111683117, 116300188, 121510686, 127670099, 134655431, 142539015, 151707737, 162434398, 174869487, 189241592, 205701092, 224566214, 245470449, 267224189, 287428214, 303008952, 311743652, 312646815]
3314C12646815p303052j5178540k1116824k4753313k5997515k4466765k0966939
3307A72863867j7289137j4082448j1476142r489608p873157o720228n850516n184839
3299I4897792m608807m122801l825099l378920l044466k675427k530516k368930
3291F8342826k072158j887944j596100j356151j270676r86745p91312q45408j029376
3282E6506956j107991j499483j551371j408720j269691j154507j219993r71546
3274D6323654r60457r01632r10787r36272r07308q93892q82824q96672p20192
3265C8313618o66776o16078o88379o77701o34295o46868o52425o17449m62831
3256C2650816n24123n38859n42414m57967l21062k14405l20882k95262m05446
$$ y = [312646815, 305343763, 290165223, 269048399, 244295086, 218297571, 193830806, 172863867, 155574730, 141492282, 130016140, 120526532, 112653375, 105933147, 100082631, 94897792, 90288985, 86166184, 82341085, 78962165, 75917699, 73242272, 70711756, 68342826, 66270668, 64382724, 62786624, 61430473, 60159797, 59173052, 58381740, 57536332, 56506956, 55398965, 53899482, 52348111, 50939391, 49669700, 48515193, 47295200, 46323654, 45363197, 44461565, 43550778, 42614506, 41707198, 40813306, 39930482, 39033810, 38313618, 37646842, 37030764, 36342385, 35664684, 35030389, 34383521, 33731096, 33113647, 32650816, 32126693, 31587834, 31045420, 30587453, 30266391, 30051986, 29731104, 29435842, 29030396]
3247B9030396l06744j77850j99330k11254l57850k55902j98447j32467k08566
3238B6981986j81214j47054j64546j79420j81351n6853q7515j24108l6288Q2344
3228B5905981o8390m6154Q1719N597J08499l556j25411r9337j46881j42265j84600
3217B5285202j14528m8156j45745j73367j42323l24744j19531r6576p1161k9610
3207B4019461o194K6583M9945L9441p7893J15495J32751N23j12564r9472L2308
3196B4120384m5613p2580p4207j08843m9885q5612m6227p6612l1335O6442N696
3185B3601608Q467K3298J53620J86255L07074M26123K77661L69542M85012M12584
3175B6251244L53256K82533J58121Q4126j77220j56813k36059k94502k71662l33329
$$ y = [29030396, 28723652, 28545802, 28346472, 28135218, 27777368, 27521466, 27323019, 27190552, 26981986, 26800772, 26653718, 26489172, 26309752, 26128401, 26071548, 25984033, 25859925, 25823637, 25905981, 25837591, 25791437, 25873156, 25878753, 25987252, 25983696, 25858285, 25758948, 25612067, 25469802, 25285202, 25170674, 25122518, 24976773, 24803406, 24661083, 24336339, 24216808, 24120232, 24049071, 24019461, 24013267, 24039850, 24089795, 24129236, 24051343, 24166838, 24299589, 24300112, 24187548, 24088076, 24120384, 24074771, 24002191, 23927984, 23819141, 23769256, 23683644, 23637417, 23560805, 23529470, 23595912, 23601608, 23610075, 23633373, 23786993, 23973248, 24280322, 24706445, 24984106, 25353648, 25838660, 26251244, 26604500, 26887033, 27045154, 27129280, 26952060, 26795247, 26559188, 26264686, 25993024, 25659695]
3165B5659695j33604j3091O5988J48235K38744J92353L51409L47197K19138J55575
3155B7231639K09775K07979J81636o517j89501k57345k64609l00780k03038j58622
3145B6450617j08974k8843m9886m8964q0511j64249k41323m05351n31226m95916
3135B4295374n33267n22666m63520m20085m28686k61324l01066j43956k45089
3126B0975715j99033j66017j24783n5083q7555J5994M4265K8045Q102o225J9994
3115B0453419q0321J7443K2207P4810K0150k03852j19324p1774R179Q6265J3673
3104B0221875J6436J15731J13758J68972L9144J16294K91662K67303K29027L11142
3094B1891344L21305L50129L00512J61762J13379K1856j5409n1640j55634j12955
$$ y = [25659695, 25526091, 25513000, 25578988, 25727223, 25965967, 26158320, 26509729, 26856926, 27076064, 27231639, 27441414, 27649393, 27831029, 27824512, 27635011, 27377666, 27113057, 26812277, 26609239, 26450617, 26341643, 26312800, 26262914, 26213950, 26133439, 25969190, 25727867, 25322516, 24791290, 24295374, 23762107, 23239441, 22775921, 22355836, 21927150, 21665826, 21364760, 21220804, 20975715, 20776682, 20610665, 20485882, 20430799, 20343244, 20359238, 20403503, 20431548, 20439650, 20433425, 20453419, 20373098, 20390541, 20412748, 20487558, 20507708, 20303856, 20184532, 20112758, 20121937, 20208202, 20221875, 20238311, 20354042, 20467800, 20636772, 20675916, 20792210, 21083872, 21351175, 21580202, 21891344, 22212649, 22562778, 22863290, 23025052, 23138431, 23160287, 23144878, 23093238, 22937604, 22824649]
3084B2824649j21255k6975o6052q7514j10576k31322k52801l05179m48794l07708
3074B0866473k92765l73994k52074j99323j20631j44508q8364q6920K5991j61937
3064A9171948j51349j03739j95850j6583j71711j94867q4985j64923j19070j89313
3054A7779558N3569q1281j05919n7985o5506q1239m0347o9173p3550j4072r1255
3043A7152800j04935m5085J23104J7755N568O5458N7078J39463P0413J57126J28345
3032A7767090J82007J90274J88687K15775J85993K55995K73442L09308K36812
3023A9805383L28650M74269M48709L13237N00517N11768N39270M81382N10972
3014B3914157O30964O43949O62392P34329O45879O02341N80261N98295N96236
$$ y = [22824649, 22703394, 22676419, 22610367, 22522853, 22412277, 22180955, 21928154, 21622975, 21174181, 20866473, 20573708, 20199714, 19947640, 19748317, 19627686, 19483178, 19394814, 19307894, 19333885, 19171948, 19020599, 18916860, 18721010, 18704427, 18532716, 18337849, 18252864, 18087941, 17968871, 17779558, 17833127, 17751846, 17645927, 17587942, 17522436, 17441197, 17400850, 17331677, 17258127, 17244055, 17152800, 17047865, 17002780, 17125884, 17143639, 17149207, 17214665, 17271743, 17411206, 17481619, 17638745, 17767090, 17949097, 18139371, 18328058, 18543833, 18729826, 18985821, 19259263, 19568571, 19805383, 20134033, 20608302, 21057011, 21370248, 21870765, 22382533, 22921803, 23403185, 23914157, 24545121, 25189070, 25851462, 26585791, 27231670, 27834011, 28414272, 29012567, 29608803]
3005B9608803N89713M64558N79451M74469M38866M10885N01620N75498N53249
2996C4197112N21208M71980N10633N89202O31038M26187M83669N50698N32640
2987C8914367N25822L87556M37824L92647L52239K98282K52666J89307J67379
2978D1918089J22567M3424P3383k4718l4936j8805l3893k28580p9460j27783k35353
2967D1373935l89436l88448m63192m57540m05195m49625n05741o24643n91264
2958C7098851o33191n67436o20619o55222n78881n42706o12411n69719o44312
2949C1674354o16051p00228o73854o79841o67076o45875n63724m60944n88500
2940B6078261n71133n16484m79409n25482o17646n37395m37488m66531m01098
$$ y = [29608803, 30198516, 30663074, 31242525, 31716994, 32155860, 32566745, 33068365, 33643863, 34197112, 34718320, 35190300, 35700933, 36290135, 36921173, 37347360, 37831029, 38381727, 38914367, 39440189, 39827745, 40265569, 40658216, 41010455, 41308737, 41561403, 41750710, 41918089, 42040656, 42084080, 42157463, 42132745, 42097809, 42079004, 42045111, 41816531, 41737071, 41609288, 41373935, 40984499, 40596051, 40132859, 39675319, 39270124, 38820499, 38314758, 37690115, 37098851, 36465660, 35898224, 35277605, 34622383, 34043502, 33500796, 32888385, 32318666, 31674354, 31058303, 30358075, 29684221, 29004380, 28337304, 27691429, 27127705, 26666761, 26078261, 25507128, 24990644, 24511235, 23985753, 23368107, 22830712, 22393224, 21926693, 21525595]
2931B1525595m68516m84241l85650l43101m46224l56810k78839m23356m96957
2922A7841901l43444l36981k46888j96888l53290l93694l17140l37386k98796
2913A5017394j52396j93805k38239k83986k78291k30615k64494k13024j26729
2904A3035815j01116j79154k44019j17414j61294j68812p7467k29565j51706k39345
2894A1365923j97269k12820j42129r4944j40894j04744j98331j09933p766n3179
2884A0103914r5211k9227q5504j60338r6702J5984j505l8265j32896j78399q3473
2873I218378M6557L4184l4655m7980m0508R3707l210m8511r7555j9487N2228P4857
2861I228005r711J2443O6393O2763K7608Q1581p906k6191Q2011K2608r363O8740
$$ y = [21525595, 21057079, 20572838, 20187188, 19844087, 19397863, 19041053, 18762214, 18338858, 17841901, 17498457, 17161476, 16914588, 16717700, 16364410, 15970716, 15653576, 15316190, 15017394, 14864998, 14671193, 14432954, 14148968, 13870677, 13640062, 13375568, 13162544, 13035815, 12934699, 12755545, 12511526, 12394112, 12232818, 12064006, 11986539, 11756974, 11605268, 11365923, 11168654, 10955834, 10813705, 10718761, 10577867, 10473123, 10274792, 10164859, 10157093, 10103914, 10008703, 9979476, 9893972, 9733634, 9636932, 9652916, 9651411, 9613146, 9480250, 9301851, 9218378, 9264935, 9299119, 9264464, 9216484, 9175976, 9269683, 9266473, 9217962, 9120407, 9100920, 9153148, 9228005, 9218294, 9230737, 9297130, 9359893, 9387501, 9469082, 9461176, 9434985, 9516996, 9539604, 9530241, 9598981]
2849I598981R9450n1416R5022o9224q433J26323J44174J18811J74970M1644M3114
2838A0313416K16647J52624Q8502Q4125N1997J29730L7187L5713J11313J645j20272
2827A1102627m6821J13445r944L2392P3032Q2065q3091j8352L6078j9166k6418
2816A1235847j01482N8284o0760k1441r3031j28326L4541O9123j5033K9627J1898
2805A1019247q2458m9475L8160m9679q6804l3414p7842l9120n3713j9550J0838
2794A0576190J3677j00736p999K8713n5432m7228M7957k7398j14591r1634p2267
2783A0149252p6384L9046j53632q7293L7172L4286Q3451p1859j37439l7423J4620
2772I793797r277r60j22418l1869j45898j17782l4702j04401k602Q420k479k2936
$$ y = [9598981, 9698431, 9647015, 9742037, 9672813, 9664380, 9790703, 9934877, 10053688, 10228658, 10270302, 10313416, 10530063, 10682687, 10771189, 10855314, 10907311, 11037041, 11074228, 11109941, 11221254, 11222899, 11102627, 11055806, 11169251, 11159307, 11191699, 11264731, 11346796, 11263705, 11245353, 11281431, 11262265, 11235847, 11134365, 11192649, 11131889, 11110448, 11017417, 10889091, 10923632, 10992755, 10977722, 11007349, 11019247, 10936789, 10887314, 10925474, 10875795, 10788991, 10755577, 10677735, 10638615, 10584902, 10565352, 10576190, 10589867, 10489131, 10481132, 10509845, 10454413, 10407185, 10455142, 10427744, 10313153, 10221519, 10149252, 10072868, 10111914, 9958282, 9870989, 9908161, 9942447, 10025898, 9954039, 9816600, 9779177, 9793797, 9784520, 9783560, 9661142, 9629273, 9483375, 9365593, 9330891, 9226490, 9223888, 9232308, 9229829, 9206893]
2760I206893r938l2158j6561R4112q0101j16760J7649O0383P2597L3030l602J79476
2748I405020J18393J26758K5393O0527J26677J13429P926K2969J24271O7578J1011
2737A0209952O9364J7475p6409J6070j50215j37115q2251j22562j00626j06555
2727I537128j51560o5806j49083Q123k1233l574N6262q580J9009P4098Q6042K15901
2715I596727R9981K960J5348M7557J07612J58999J46517J46896J40229K40410
2705A0703236K32704P0162K2386P7969P1167n151o0047j80597m4567l4937q1933
2694A0770392o9050K505L1888J4889j0348J07381J00833J54334J40485J37547
2684A1380856J07032Q0331J86502J68768P7456J46608J35243K33851K60420K65704
$$ y = [9206893, 9196955, 9164797, 9148236, 9242348, 9162247, 9045487, 9063136, 9123519, 9196116, 9229146, 9225544, 9405020, 9523413, 9650171, 9675564, 9736091, 9862768, 9976197, 9984123, 10007092, 10131363, 10198941, 10209952, 10279316, 10296791, 10220382, 10236452, 10086237, 9949122, 9866871, 9744309, 9643683, 9537128, 9385568, 9319762, 9170679, 9178802, 9157569, 9153995, 9210257, 9201677, 9220686, 9294784, 9380826, 9596727, 9696708, 9699668, 9715016, 9762573, 9870185, 10029184, 10175701, 10322597, 10462826, 10703236, 10935940, 11006102, 11028488, 11106457, 11177624, 11172473, 11112426, 10931829, 10887262, 10852325, 10770392, 10701342, 10703847, 10735735, 10750624, 10740276, 10847657, 10948490, 11102824, 11243309, 11380856, 11487888, 11568219, 11754721, 11923489, 12000945, 12147553, 12282796, 12516647, 12777067, 13042771]
2674A3042771K92280K37634L04610K66473K35028K47082J50504J78532J01775
2665A5056689J62082J30552R8456J85375J89790L31245L02427K73904K70099M11124
2655A7411743M28480M29104M59574M06653M68539M95060L82393N04131N21403
2646B1507080M78167M44148M97580N62403N44121N83814N62911N53942N78323
2637B6312489N40399M85372N52452M47498M56990M88315L26350M45873M21048
2628C0476786L19494M00277L49332M16522M33391M07698L98958L45015L76923
2619C3924396K82779L77325L53927L67563L58354K74989K79377K44310L36228
2610C6799248L98276L97018M93156M67797M19238N38472N21776O25217O68024
$$ y = [13042771, 13335051, 13572685, 13877295, 14143768, 14378796, 14625878, 14776382, 14954914, 15056689, 15218771, 15349323, 15447779, 15633154, 15822944, 16154189, 16456616, 16730520, 17000619, 17411743, 17840223, 18269327, 18728901, 19135554, 19604093, 20099153, 20481546, 20985677, 21507080, 21985247, 22429395, 22926975, 23489378, 24033499, 24617313, 25180224, 25734166, 26312489, 26852888, 27338260, 27890712, 28338210, 28795200, 29283515, 29609865, 30055738, 30476786, 30796280, 31196557, 31545889, 31962411, 32395802, 32803500, 33202458, 33547473, 33924396, 34207175, 34584500, 34938427, 35305990, 35664344, 35939333, 36218710, 36463020, 36799248, 37197524, 37594542, 38087698, 38555495, 38974733, 39513205, 40034981, 40660198, 41328222]
2601D1328222P44187Q45037Q67910R39802J012856J115062J089358J215035J253524
2592E0410993J299727J357647J239061J253203J441266J297535J264348J506586
2584F1070366J547108J481184J699881J724756J713393J664048J696234J671599
2576G4268569J715583J760090J830140J786686J826284J948073J907624K038920
2568H9081969K281343K484571K535128K809295K933792L054310L323674L605551
2560A12109633L667211L733478L617931L291026K904343K466569J945799J405420
2552A35141410P73659K72368k13364m71609n27176n55514n18750n00725o12871
2543A32787428o64885o18451q01682j183328j726930k345549l042414l578830
$$ y = [41328222, 42072409, 42917446, 43785356, 44725158, 45738014, 46853076, 47942434, 49157469, 50410993, 51710720, 53068367, 54307428, 55560631, 57001897, 58299432, 59563780, 61070366, 62617474, 64098658, 65798539, 67523295, 69236688, 70900736, 72596970, 74268569, 75984152, 77744242, 79574382, 81361068, 83187352, 85135425, 87043049, 89081969, 91363312, 93847883, 96383011, 99192306, 102126098, 105180408, 108504082, 112109633, 115776844, 119510322, 123128253, 126419279, 129323622, 131790191, 133735990, 135141410, 135915069, 136187437, 135974073, 135502464, 134975288, 134419774, 133901024, 133400299, 132787428, 132122543, 131504092, 130702410, 129519082, 127792152, 125446603, 122404189, 118825359]
2535A18825359l768861l988496m013018l894901l642648l476917l086187k906420
2527I0047911k491411k202502k001461j942897j854593j681520j515315j376872
2519G4981340j382534j197836j187241j048189j101770r94573r52865q86953q69341
2510F5360038q04907r12916r52456q49752r39034r48632q90316r85668r18099
2501E7158258r04289j038819j000261q62168q43590r49676q54661r24479q57615
2492D8922700p93874p97478p79845o63822p39824o79250o94217o83900o82916
2483D2407574p47740o40343o59300p22706p77974p28176o07009n69180n54200
2474C6400946n09631m53504m81601m62859l99749m78225n01218m49932m40778
$$ y = [118825359, 115056498, 111068002, 107054984, 103160083, 99517435, 96040518, 92954331, 90047911, 87556500, 85353998, 83352537, 81409640, 79555047, 77873527, 76358212, 74981340, 73598806, 72400970, 71213729, 70165540, 69063770, 68069197, 67116332, 66229379, 65360038, 64555131, 63642215, 62689759, 61840007, 60900973, 59952341, 59062025, 58076357, 57158258, 56253969, 55215150, 54214889, 53352721, 52509131, 51559455, 50704794, 49780315, 48922700, 48128826, 47331348, 46551503, 45887681, 45147857, 44468607, 43774390, 43090490, 42407574, 41659834, 41019491, 40360191, 39637485, 38859511, 38131335, 37524326, 36955146, 36400946, 35891315, 35437811, 34956210, 34493351, 34093602, 33615377, 33114159, 32664227, 32223449]
2465C2223449m85903m80786m22515l63297l21381l68219l48004l58598l83395
2456B8691351k91836l58406j55627p6102k51904k57216k97748k60573j29573j24631
2446B6487735j51276k52052l19469j80842j58640l85500k70549k19499k92491
2437B4257417l07835l51007k57749k71371k98672l28625l17953k55007l08119
2428B1561079k52523l38136k62396k37558k75781k87861l21286k38869j32970
2419A9213699k46838j21570k39348j85199j51313j00033j43557j9401j32526j79404
2409A7694510k01050j38788j96975k17791j27099j90855j37090k61131j85923
2400A6037808j45310k257l4806j72046j02428j37724L6352L7566n595j2046q7820
$$ y = [32223449, 31737546, 31256760, 30834245, 30470948, 30149567, 29781348, 29433344, 29074746, 28691351, 28399515, 28041109, 27885482, 27809380, 27557476, 27300260, 27002512, 26741939, 26612366, 26487735, 26336459, 26084407, 25764938, 25584096, 25425456, 25039956, 24769407, 24549908, 24257417, 23949582, 23598575, 23340826, 23069455, 22770783, 22442158, 22124205, 21869198, 21561079, 21308556, 20970420, 20708024, 20470466, 20194685, 19906824, 19585538, 19346669, 19213699, 18966861, 18845291, 18605943, 18420744, 18269431, 18169398, 18025841, 18006440, 17873914, 17694510, 17493460, 17354672, 17157697, 16939906, 16812807, 16621952, 16484862, 16223731, 16037808, 15892498, 15890241, 15855435, 15683389, 15580961, 15443237, 15479589, 15517155, 15511560, 15499514, 15411694]
2389A5411694Q0982Q4594J8747q0799k3238Q4376P372n8167K9155j56256k00276
2378A5198184J5716K5859O0521N3401M4716l2866j44965J3030o9093n0972j35937
2367A4977594j15355r8173p8300o0263M2929l3025m5815P2984L5257K3417m6621
2356A4674629K1510P7092p0473k32269k58357j05083k76056k95506l04014q8451
2346A3143022k17604k75220l41699k63432j97196k18701j81453j31889k00538
2337A1115290k52502j89703j01897j86339l7926n1019j68478q9329j00658q6409
2327I851030j67492j4273r0447j27618k08957j87743p9936j76715k15188j63864
2317H418797j28661j68094k13794j89598j66434j74298j59909j09819l7687j06659
$$ y = [15411694, 15492676, 15577270, 15596017, 15515218, 15491980, 15576356, 15583728, 15525561, 15554716, 15398460, 15198184, 15213900, 15239759, 15300280, 15353681, 15398397, 15365531, 15220566, 15233596, 15164503, 15113531, 14977594, 14862239, 14764066, 14685766, 14625503, 14668432, 14635407, 14589592, 14662576, 14697833, 14721250, 14674629, 14696139, 14773231, 14702758, 14470489, 14212132, 14107049, 13830993, 13535487, 13231473, 13143022, 12925418, 12650198, 12308499, 12045067, 11847871, 11629170, 11447717, 11315828, 11115290, 10862788, 10673085, 10571188, 10384849, 10346923, 10295904, 10127426, 10038097, 9937439, 9851030, 9683538, 9669265, 9578818, 9451200, 9242243, 9054500, 8974564, 8797849, 8582661, 8418797, 8290136, 8122042, 7908248, 7718650, 7552216, 7377918, 7218009, 7108190, 7070503, 6963844]
2307F963844j43771q1033j13513l3237o0749q1370j40140j73075m1185L1566o709
2296F120628p3677p7561k30o872j31125j14176q3207j38017k5403j62352p777
2285E300231n8177m8696P7553r3305M0811Q2526j07697j63716J0064k221p1093
2274D966280K0107j6201p0149q1810L6287j521k1026l6081q0086k805q313j9010
2262D685672P044q0540M437p1963m3694J153n9066L0236K7061q7402Q87q086j0985
2249D394754N1544M0630K4714l9521m9686m8600r8152j3890q4138n327l4499K0946
2237D158775k449l0875K8042k5064M084J8273m4068j9845k6258k1854J2747p3131
2225C978377R897l3948l6895l2403O5928Q6311r3173L2330N6290o8921r000k9167
$$ y = [6963844, 6820073, 6739040, 6625527, 6592290, 6531541, 6450171, 6310031, 6136956, 6095771, 6127337, 6120628, 6046951, 5969390, 5969160, 5962288, 5831163, 5716987, 5633780, 5495763, 5470360, 5308008, 5300231, 5242054, 5193358, 5270911, 5177606, 5218417, 5300943, 5193246, 5029530, 5039594, 5037373, 4966280, 4986387, 4970186, 4900037, 4818227, 4854514, 4852993, 4831967, 4795886, 4715800, 4712995, 4704682, 4685672, 4692716, 4612176, 4616613, 4544650, 4500956, 4502109, 4443043, 4473279, 4500340, 4412938, 4413825, 4405739, 4394754, 4446298, 4486928, 4511642, 4472121, 4422435, 4373835, 4275683, 4261793, 4177655, 4172328, 4137829, 4158775, 4156326, 4125451, 4153493, 4128429, 4132513, 4150786, 4106718, 4086873, 4060615, 4038761, 4051508, 3978377, 3988274, 3954326, 3917431, 3885028, 3950956, 4037267, 3944094, 3976424, 4032714, 3963793, 3954793, 3925626]
2213C925626Q1029k5247l3402Q82J14950O934L4147O4924R180J17811n3574m0696
2201D202564n5325q5222m7627L0511j24664j80488k3511j1982l6391m6279m5590
2190C575996q2217l9302M1595J5647p2902m2023n3701l4361l9701r5189r4150
2179C079692m0483J6695n2073P4043R5405j02713M2275P3579K7260j01217l6592
2168C075871J2611o1813j39895k9309N1519O3232n7689p8922o6904r923m846O0732
2156B814664k286M1417K0551n0065j02403j9075N8624m2705n201q2569j5920j21810
2144B493222M3864N1548o7996m6589Q2680N1603j1632l6093j03088n1230k914
2133B403375L4317o411j20139n5466N7692J3986R929P13K2696r5749k9701J04103
$$ y = [3925626, 4006655, 3981408, 3948006, 3948888, 4063838, 4070772, 4104919, 4169843, 4179023, 4296834, 4243260, 4202564, 4147239, 4062017, 4014390, 4044901, 3920237, 3739749, 3716238, 3704256, 3667865, 3621586, 3575996, 3493779, 3454477, 3496072, 3511719, 3438817, 3396794, 3343093, 3308732, 3269031, 3173842, 3079692, 3039209, 3055904, 3003831, 3077874, 3173279, 3070566, 3112841, 3186420, 3213680, 3112463, 3075871, 3088482, 3026669, 2886774, 2857465, 2908984, 2972216, 2914527, 2835605, 2768701, 2758778, 2753932, 2814664, 2812378, 2853795, 2874346, 2824281, 2721878, 2702803, 2761427, 2718722, 2713521, 2630952, 2615032, 2493222, 2537086, 2588634, 2520638, 2474049, 2556729, 2608332, 2596700, 2560607, 2457519, 2406289, 2403375, 2437692, 2431281, 2311142, 2255676, 2313368, 2327354, 2337283, 2337996, 2360692, 2264943, 2235242, 2339345]
2121B339345L6123L4085n6739j07725q5880l7006N6914L1730o6578M9945q8138
2110B106076k457K8062J2031L4739j02191J4668L8434r2621j03189K4934O9924
2099B028410j27032p5171J51056m8557q1441L8872P0322L0606K7586Q9623k8932
2088B075342p0399j0683j3842N2176j41384l679J0695l0277o7070p32L1964K0969
2076A853080j6309m6375K8915L3701J5418o4388P7255l8535k9235p8026m3818
2065A691683Q9237O9483P355k6994j05566j7568R2751q08O0517R3716o4545p6101
2053A813160n6218r7429Q3287J07867K984k2373l7213R083O6137K0019K9707R4017
2041B013028r8817p5156p3723M8260K4027k490K4773M8533L4497N5290j4036o6046
$$ y = [2339345, 2375468, 2409553, 2352814, 2245089, 2159209, 2122203, 2179117, 2210847, 2144269, 2194214, 2106076, 2103619, 2131681, 2143712, 2178451, 2076260, 2090928, 2129362, 2036741, 1933552, 1958486, 2028410, 1901378, 1826207, 1977263, 1928706, 1847265, 1886137, 1956459, 1987065, 2014651, 2104274, 2075342, 2004943, 1994260, 1980418, 2032594, 1891210, 1887531, 1898226, 1867949, 1800879, 1800147, 1832111, 1853080, 1836771, 1790396, 1819311, 1853012, 1868430, 1804042, 1881297, 1842762, 1813527, 1735501, 1691683, 1780920, 1850403, 1857758, 1830764, 1725198, 1707630, 1800381, 1799573, 1860090, 1953806, 1889261, 1813160, 1756942, 1659513, 1742800, 1850667, 1853651, 1831278, 1794065, 1803148, 1869285, 1889304, 1919011, 2013028, 1914211, 1839055, 1765332, 1813592, 1837619, 1835129, 1859902, 1908435, 1942932, 1998222, 1984186, 1918140]
2029A918140J24620R8925j6107k5888o9855M4172l9996q0438k495q209l3740K5411
2017A934540J1451j0420K1855M1024J07557K2136P0993j5368j7269J6877Q5656
2006B269032m1264n1422P1189j3136J3992R6618J00849k8342J6889l749R11L4086
1994B465653m1019O5633Q3874q4497j6091O9078m2117N3080P8174k040M3888r167
1982B664449n3892Q3234K8249L0604N1349K9154m8785L4645j816J0994K6587R5522
1970B950294Q262L1392P5094p5730M9669L5468k182Q9225k9622R0329k6783j9953
1958C175463M0952L5907J7326K3741O4661N8750K11620l5883r468O775q3361J17729
1946C624212J15781j4144l07N01j935P0164j07536Q5522M4938r085J32235r9528
$$ y = [1918140, 2042760, 2141685, 2125578, 2099690, 2029835, 2074007, 2034011, 1953573, 1951078, 1942869, 1909129, 1934540, 1945991, 1935571, 1957426, 1998450, 2106007, 2128143, 2199136, 2183768, 2166499, 2183376, 2269032, 2227768, 2176346, 2247535, 2234399, 2248391, 2345009, 2445858, 2417516, 2434405, 2430656, 2431567, 2465653, 2424634, 2490267, 2574141, 2489644, 2473553, 2542631, 2500514, 2553594, 2631768, 2629728, 2673616, 2664449, 2610557, 2693791, 2722040, 2752644, 2803993, 2833147, 2784362, 2819007, 2817191, 2828185, 2854772, 2950294, 2958556, 2989948, 3065042, 2989312, 3038981, 3074449, 3072267, 3161492, 3131870, 3222199, 3195416, 3175463, 3216415, 3252322, 3269648, 3293389, 3358050, 3416800, 3628420, 3592537, 3583069, 3589844, 3506483, 3624212, 3739993, 3725849, 3725542, 3726043, 3724108, 3794272, 3686736, 3772258, 3817196, 3808111, 3940346, 3840818]
1934C840818J6268j1856P4600K7846R7977j9715n0903N5314J02619j01146N807
1923D037629K8254M509P7500o1247Q6446J0597k789M083k5157R9281L69j0184
1911D249291j419k7198m719p9594j22567K8704m06p1458N9762O023K1703J2662
1899D070784n4834r2787p760n6268l3137J822K6319l8013m4226q5437k5757P345
1887C668051j8605J4529j4173j08402j08745M2873P5113l2380o953k4218M1335
1876C528425j6363j01706o1562o8009J1655J5588j09853m6909K186J508M2178
1865C197138j59568m9414p8980Q1014p735j34302l0572n7779n6037r8430O905
1854B612240n2369l1974P6563j8466N3478K962o3273m0779j7445M3153p3621p5375
$$ y = [3840818, 3857086, 3845230, 3919830, 3947676, 4045653, 4025938, 3975035, 4030349, 4132968, 4031822, 4037629, 4065883, 4070392, 4147892, 4086645, 4173091, 4183688, 4180899, 4184982, 4159825, 4259106, 4259475, 4249291, 4247872, 4220674, 4215955, 4136361, 4013794, 4042498, 4042092, 3970634, 4030396, 4036419, 4058122, 4070784, 4015950, 3923163, 3915403, 3859135, 3825998, 3827820, 3854139, 3816126, 3771900, 3686463, 3660706, 3668051, 3649446, 3663975, 3649802, 3541400, 3432655, 3475528, 3550641, 3518261, 3511308, 3487090, 3528425, 3512062, 3410356, 3348794, 3280785, 3292440, 3308028, 3198175, 3151266, 3153452, 3154960, 3197138, 3037570, 2988156, 2909176, 2990190, 2982455, 2848153, 2817581, 2759802, 2703765, 2605335, 2612240, 2559871, 2527897, 2604460, 2585994, 2639472, 2642434, 2579161, 2538382, 2520937, 2564090, 2490469, 2415094]
1842B415094K1203j5578p0190p9946j6598p356q3802j9795j391j1394O590l7789
1830B099048r5504l0329N744N3396r8494l5944K5839K6061k039J6799P2788p2474
1818A964891n3899O933p153n2490p5843o6068J5769L5000L057m3726L3524j3377
1806A746618m7854o0758q751K8316q4741q899q44j32173K4336R2176p9434N4864
1794A522856o6574r1288L1409L938k1288n3985l4048O7105j6640k2002o2344p2869
1782A184270L2673k1211L4726m7719K7442l0502q698n9739n8235K1531Q932p1310
1770A012160O2029L9656L2209k0866Q846j05382N8329j8500j10895J5821Q5224
1759A058631K4187j09538J17892q6488m7557l5681p207O102o1103q8225R2353
$$ y = [2415094, 2436297, 2420719, 2350529, 2270583, 2253985, 2246629, 2162827, 2143032, 2141641, 2130247, 2136837, 2099048, 2003544, 1973215, 1978959, 2032355, 1933861, 1897917, 1923756, 1949817, 1947778, 1964577, 2037365, 1964891, 1910992, 1917925, 1910772, 1858282, 1782439, 1716371, 1732140, 1767140, 1770197, 1726471, 1759995, 1746618, 1698764, 1638006, 1629255, 1657571, 1572830, 1563931, 1563087, 1430914, 1455250, 1547426, 1467992, 1522856, 1456282, 1364994, 1396403, 1400341, 1379053, 1325068, 1291020, 1358125, 1341485, 1319483, 1257139, 1184270, 1216943, 1195732, 1230458, 1182739, 1210181, 1179679, 1170981, 1111242, 1053007, 1074538, 1083470, 1012160, 1074189, 1113845, 1146054, 1125188, 1134034, 1028652, 1086981, 1068481, 957586, 973407, 1058631, 1082818, 973280, 1091172, 1004684, 957127, 921446, 914239, 920341, 859238, 771013, 863366]
1748H63366J66769K0524j5004K1510l7966r7255l0930K4705J0778n1201j08O2740
1736I37928k8113k5836j6167n9573j4530L3453L9751L7597k6170j6228J9071R343
1724H90526J7702N2472j20078p8712M337K3741L3013K8060P526q8563j7598J6833
1712G69259r5093j7904J0379N6207m849n6605n0769p600P2100N1518j49408J6457
1700E93692J10543M685j01595p0412R4148p7550M2438o1168M1451K6228M2850
1689F45310O5551r0886m769k9582l3973k4686p4411P8716J25660k730q8568p5407
1677D90225P1648l6195n0270j6044J02673m0336M1278q8533q1586M4984N854r385
1665D34313N3023Q0181j7591r0875L8158m010l9104J0537J8121j3162J9985P8288
$$ y = [863366, 1030135, 1050659, 1035655, 1057165, 1019199, 921944, 891014, 915719, 926497, 875296, 875188, 937928, 909815, 883979, 867812, 808239, 793709, 827162, 866913, 904510, 878340, 862112, 881183, 890526, 908228, 960700, 840622, 761910, 766247, 789988, 823001, 851061, 858587, 770024, 752426, 769259, 674166, 656262, 666641, 722848, 717999, 661394, 610625, 603025, 675125, 726643, 577235, 593692, 704235, 708920, 607325, 536913, 631061, 553511, 595949, 534781, 576232, 602460, 645310, 710861, 619975, 615206, 585624, 551651, 526965, 452554, 531270, 656930, 654200, 565632, 490225, 561873, 525678, 475408, 459364, 562037, 521701, 562979, 474446, 392860, 437844, 443698, 434313, 487336, 567517, 549926, 459051, 497209, 493199, 454095, 464632, 482753, 469591, 489576, 567864]
1653E67864r3365m7758M967k1658p8311M171j5386P3695N0937J5439p4333O3575
1641D49837l7616j03211K6043L4524l8601O930J34643L8727q4422l7402q8543
1630C00909n1106N0644J34539l0479P4552M654q6855L4383q812j29383L3282l5435
1618B90893M3575L1617O695J3805R248l6292P795n171m0652l9809l5091M7704
1606B94317r911M6274n9994O468J0853k966J9681j9294J7636J02963k118j14597
1594B89312K0145r356J3048j6150k8908j2875K1574n4728L4079j6878M4139M9891
1582C33293L820J41624j08089j1285J6952J1817j29419k3088o4202K2674R6198
1571B90295Q6990r6258m9221L8555J8189L2634J3316j25345O3708j4928j3510
$$ y = [567864, 474499, 426741, 431708, 410050, 331739, 335910, 320524, 394219, 445156, 460595, 386262, 449837, 412221, 309010, 335053, 369577, 330976, 337906, 472549, 511276, 426854, 389452, 300909, 249803, 300447, 434986, 404507, 479059, 483713, 396858, 431241, 422429, 293046, 326328, 290893, 334468, 366085, 372780, 386585, 395833, 359541, 367336, 362165, 321513, 281704, 246613, 294317, 284406, 330680, 270686, 277154, 288007, 285041, 304722, 285428, 303064, 406027, 403909, 289312, 309457, 300101, 313149, 296999, 268091, 255216, 276790, 222062, 256141, 239263, 283402, 333293, 337113, 478737, 370648, 359363, 376315, 388132, 258713, 235625, 171423, 194097, 290295, 377285, 281027, 231806, 270361, 288550, 321184, 334500, 209155, 272863, 257935, 244425]
1560B44425j6957N4730J0755J3770K9321N441J2804j6294K4053n935L7176J5618
1548D08907j70413N5435j3971p6199K4817R5494j14490j16181L6644J6704J76657
1537C23404J793m4187p549O5734j24888j7822o6472o3567k2970J7135Q9474M788
1525A54873M4063P7470M6083M0858p9890l9544N8481O9571r6226j20990J00019
1514B54768J8855j1377L207r4079J8935L1122P4107J499J977r8583J9516M4796
1502B64743P4493M455j28627j05441O5638K0297J684J9711N178J8828J6898j5762
1490B42095l2519K3844j1509N342j3191K0803K988l405m2625L5287K4770n2023
1478A99857L705l0750O2370k118m2098Q90l6341o962l415N4790l7395m197J7556
$$ y = [244425, 227468, 282198, 292953, 306723, 336044, 341485, 354289, 337995, 362048, 356113, 393289, 408907, 238494, 293929, 279958, 203759, 228576, 324070, 209580, 93399, 130043, 146747, 323404, 325197, 281010, 273461, 339195, 214307, 196485, 130013, 66446, 43476, 60611, 150085, 154873, 198936, 276406, 322489, 363347, 283457, 243913, 302394, 371965, 275739, 154749, 254768, 273623, 262246, 265453, 171374, 190309, 221431, 295538, 297037, 299014, 200431, 219947, 264743, 339236, 343691, 215064, 109623, 175261, 195558, 197242, 216953, 222131, 240959, 257857, 242095, 209576, 233420, 221911, 227253, 214062, 234865, 237853, 234448, 191823, 227110, 251880, 199857, 203562, 172812, 235182, 233064, 190966, 191856, 155515, 148553, 145138, 199928, 162533, 158336, 175892]
1465A75892O3923m5308o7513J1475Q4337L6760K9151q8357L1388k1010n1077m479
1453A55182r9845J02039N4792n4674j7101M4910K3325k54l6142J2144p5187m1043
1441F8146l0289M3398K6822n0382L3578Q7278N3157j12997l660Q4356M2486o4001
1429A77892l4436k9940n8831R299j7711Q2329n4953o5055L3686J17579j4380K5328
1417A70807P037k8398o2732P006p4708n6712Q3231K2076l9067N31j104k7337J8236
1404A8866Q7687L9186l5712J5951n8732o226P991J6381O3326n2890m0412p7617
1392b2201J5224M3296l3686Q5902P1769j7664n4427N2932j0052j07524l0134J01152
1380I4587k4907j9136k712J47713j51261k0897R6858l3851j2266R701j1308P777
$$ y = [175892, 239815, 194507, 126994, 138469, 222806, 259566, 288717, 200360, 231748, 210738, 159661, 155182, 55337, 157376, 212168, 157494, 140393, 185303, 208628, 208374, 172232, 184376, 109189, 68146, 37857, 81255, 108077, 57695, 91273, 178551, 231708, 118711, 115051, 199407, 241893, 177892, 143456, 113516, 54685, 63984, 46273, 128602, 73649, 8594, 42280, 159859, 145479, 170807, 177844, 149446, 86714, 93720, 19012, -37700, 45531, 67607, 28540, 29071, 27967, 630, 18866, 106553, 145739, 110027, 125978, 67246, 61020, 69011, 85392, 148718, 95828, 55416, -22201, -6977, 36319, 2633, 88535, 160304, 142640, 88213, 141145, 131093, 23569, -6565, 94587, 69680, 50544, 47832, 195545, 44284, 23387, 120245, 86394, 74128, 83829, 72521, 80298]
1368H0298k0221j4036J00953K189m9858L376j16803K2493R268Q3897M5745J5970
1356A63271j0433p7725j1030J9305o1921r6719J11682L0790J2687l9690N627Q759
1344E4603j1618O6664n2663j5110P734N2528L651r813q8896l0229J5743L0836
1332B3430Q5299p6991k8922K1427O1764k0636K3368j7056j17173N2511L3329m630
1320C5720m2078j32281M8480L9903J0043L9528R4937k0224l6651L796J421j49437
1308a06843o5231K8133M3623L4466Q2388j2917n9966m043P3105m1550N6573N1418
1296G9156o315M0673q4792p0281Q8751j4532r7110R1258Q0291j7164K3661j17
1284A13479L9485Q6565j02701k5266p3395K5506N4683L5279o5858r2731J2696
$$ y = [80298, 60077, 46041, 146994, 149183, 99325, 102701, -14102, 8391, 17659, 101556, 147301, 163271, 152838, 75113, 64083, 83388, 21467, -75252, 36430, 67220, 79907, 40217, 45844, 54603, 42985, 109649, 56986, 41876, 49610, 102138, 105789, 95976, 7080, -23149, -7406, 23430, 108729, 31738, 2816, 24243, 86007, 65371, 88739, 71683, -45490, 7021, 40350, 35720, -6358, -138639, -90159, -50256, -40213, -685, 94252, 74028, 37377, 41173, 42594, -106843, -172074, -143941, -100318, -65852, 16536, 3619, -56347, -60390, 12715, -28835, 27738, 79156, 72841, 113514, 28722, -41559, 47192, 32660, -64450, 26808, 107099, 89935, 113596, 113479, 152964, 239529, 136828, 111562, 38167, 63673, 118356, 153635, 87777, -4954, 7742]
1273G742O1962m3048l010K3838N8750J5169r4831K0893J256m4159J9142k7179
1261c475l088P9134L8444j233j26912k2777k2379P0723N5687j9703J5668K955
1249F3044m4925n3381L413L7336k1019m4389K277M4744k080O178m5261N9259M364
1236I560L7566O3004K4673m1709j1235n3301J0403q153L340k7874n1868N7401
1224A1807M6016J1828O2037J7847o2957R713p7787q7006r147Q6315J4057q3125
1212f0402o2286O3406J25329R4158p1182K817l3410j7373j5546K6577N2685m5572
1200E9201k3251J5132n4915M150j721J48n8843M2164M4976r449n1129J29668l7666
1187E8465l5708M5997k8565L0910r6618n2361L6709M4169m080K3115N9834j51350
$$ y = [7742, 69704, 26656, 23646, 47484, 106234, 121403, 26572, 47465, 48721, 4562, 23704, -3475, -6563, 72571, 111015, 109782, -17130, -39907, -62286, 8437, 64124, 44421, 60089, 63044, 18119, -35262, -31849, 5487, -15532, -59921, -57644, -12900, -14980, -8802, -54063, 5196, 9560, 47126, 110130, 134803, 93094, 81859, 28558, 38961, 30808, 34148, 6274, -45594, 11807, 57823, 69651, 131688, 149535, 86578, 96291, 18504, -68502, -77649, 8666, 22723, -60402, -122688, -59282, 66047, 160205, 89023, 91840, 58430, 41057, 25511, 52088, 104773, 59201, 35950, 51082, -3833, 317, -1404, -1256, -60099, -17935, 27041, 17592, -33537, 96131, 58465, 22757, 68754, 40189, 71099, -25519, -77880, -41171, 2998, -1082, 22033, 81867, -69483]
1175f9483O5525P4520l4730M8269j7867O5074Q767o2082P4508m9146M0752j3559
1163A30548k5254l7590n7186k2524M023J67913p3896j9471M5472L3001m9559l6591
1151E8886n4084o3958N3575L3938Q7340N1142J03483n5578j20938j6387n3207
1140B4212Q2083P4665m216M1160o3392j43222P969K9668J9325l3106R7511J5668
1128A48325P9926j04004L2822N5359l5695j1236o4037L9691J13398J9598o3996
1117B10151L2196o7903r8756n3000P7578J11888l9682O8135l925o1742k049P1275
1105B44166J5904J1450k6932l2325K2171j4327P9476L733P1687Q175K9559l3432
1093C79305P510K8999q6516n4251j6422L4501L8043M2367O5185j2032N4329O8110
$$ y = [-69483, -3958, 70562, 35832, 84101, 66234, 131308, 140075, 77993, 152501, 103355, 144107, 130548, 105294, 67704, 10518, -12006, -7983, 159930, 86034, 66563, 112035, 145036, 95477, 58886, 4802, -59156, -5581, 28357, 115697, 166839, 270322, 214744, 93806, 77419, 24212, 106295, 180960, 176744, 217904, 154512, 11290, 19259, 48927, 68252, 35146, 132657, 148325, 228251, 124247, 157069, 212428, 176733, 165497, 101460, 141151, 254549, 274147, 210151, 242347, 174444, 75688, 22688, 100266, 212154, 172472, 240607, 236682, 174940, 172891, 244166, 260070, 271520, 244588, 212263, 234434, 220107, 299583, 303316, 375003, 383178, 412737, 379305, 386815, 415814, 329298, 275047, 258625, 293126, 331169, 373536, 438721, 426689, 481018, 549128]
1081E49128M0197r203r2773K3513K7473M7873M1254m7658o446k6201n3801l6022
1069D57334o614J6542R2380J30757M2180l1635j50658J18184N4608L9479o876
1058G55681q326O3100O417j3746O0600K2709l6702N7071Q279J02198L2771L1586
1046A081638j8352j6130k1313J06015L9274P1344J34363n6701O73J63011J81632
1035A665454n330J1904J62232O9263K5766K9310M7562o0643R1670J36080J65262
1024B338530O5150J04857J52981J03582J56659J76088K78663K44328K46507J92370
1014D059715K13359L03392M05782K65058L35086L88423M10839L69675M30847N73162
1004G755338P05127Q83716Q44242J006240J387017J585884J955555K254652K673569
$$ y = [549128, 589325, 580122, 487349, 510862, 538335, 586208, 627462, 579804, 573358, 547157, 493356, 457334, 450720, 467262, 559642, 690399, 732579, 700944, 550286, 668470, 723078, 762557, 755681, 747355, 810455, 816872, 803126, 863726, 886435, 849733, 906804, 915083, 1017281, 1050052, 1081638, 1063286, 1047156, 1025843, 1131858, 1171132, 1242476, 1376839, 1320138, 1320811, 1483822, 1665454, 1660124, 1672028, 1834260, 1903523, 1929289, 1958599, 2006161, 1945518, 2037188, 2173268, 2338530, 2403680, 2508537, 2661518, 2765100, 2921759, 3097847, 3376510, 3620838, 3867345, 4059715, 4273074, 4576466, 4982248, 5247306, 5582392, 5970815, 6381654, 6751329, 7182176, 7755338, 8460465, 9344181, 10188423, 11194663, 12581680, 14167564, 16123119, 18377771, 21051340]
995B1051340K966360L461684L267192J342024l398859n881862m508163l197034
987A5102682k262254j795686j299686j147801r29579p31939n24585m41138k83636
978E686378k28483l20688k59633k62944l85407l90015k80069j68886j77214k41716
968B971323k24493j04467p2299j94106j24062k7685j17917p0998j06602n191j20109
957A803394j00686j06610q802P4206q5670j58149p5862o3837r245q992n7814M8345
945A250278J8715j19648q8540l4829M4166M5394l9145k35509j09907N5606L0081
934H16662j4596k6642J3796M876n7304l3776k4311J4939l4373q6608n5576L3365
922E50452P8805l6918j13155L166j4008n7156k1664N1124K4705k3531P284M167
$$ y = [21051340, 24017700, 27479384, 30746576, 32088600, 28689741, 22807879, 18299716, 15102682, 12840428, 11044742, 9745056, 8597255, 7667676, 6935737, 6411152, 5970014, 5686378, 5457895, 5137207, 4877574, 4614630, 4229223, 3839208, 3559139, 3390253, 3213039, 2971323, 2746830, 2642363, 2570064, 2375958, 2251896, 2224211, 2106294, 2035296, 1928694, 1923503, 1803394, 1702708, 1596098, 1587296, 1661502, 1575832, 1417683, 1341821, 1277984, 1268739, 1259747, 1201933, 1250278, 1268993, 1149345, 1060805, 1025976, 1070142, 1115536, 1076391, 840882, 730975, 786581, 816662, 802066, 775424, 789220, 794096, 736792, 703016, 678705, 693644, 659271, 572663, 517087, 550452, 629257, 592339, 479184, 482350, 468342, 411186, 389522, 440646, 465351, 441820, 449104, 453271]
910D53271M9348p6899Q003j0875l1784q645j7173j9738L9240K5026k5908L806
898C87672m7611o0324N7021K4629L8936O2899o1490j46867k0692K1383M0679l6011
886B60224r2954J6624Q8449j00339k2681J9201R2166M585l8908o1091J33603R1739
874C90618o1874j07790o944m0373k3276L7175k6516K4383j9566N1044L6644r3088
862A60437j3863J1943J4272M9437k3288j1918o9888j9041L3415m943l9352j0553
850G6658l6221K3967Q5680l6585m2091p6506k7989M6235K3122O8814m1642L7216
838A00658q6390k169J36927L2785j2898k563k8197p1308n452J4214m7790L0631
826E8448K7558q6322p5142J3408J37123L1889J6923p1229N2702n6689j1001L4763
$$ y = [453271, 502619, 425720, 433723, 422848, 391064, 382419, 365246, 345508, 384748, 409774, 383866, 387672, 340061, 279737, 336758, 361387, 400323, 463222, 401732, 254865, 234173, 255556, 296235, 260224, 167270, 183894, 272343, 172004, 149323, 168524, 260690, 265275, 226367, 165276, 298879, 390618, 328744, 220954, 214010, 173637, 150361, 187536, 161020, 185403, 165837, 216881, 253525, 160437, 146574, 158517, 172789, 222226, 198938, 187020, 117132, 98091, 131506, 126563, 87211, 76658, 40437, 64404, 150084, 113499, 71408, -5098, -33087, 13148, 36270, 105084, 63442, 100658, 14268, 12099, 149026, 181811, 168913, 166350, 138153, 66845, 61393, 75607, 27817, 58448, 86006, -316, -75458, -62050, 75073, 106962, 123885, 52656, 105358, 48669, 37668, 72431]
814G2431m8465M1079k9824J10922n2518k0214j57786N231R0402J8327Q9283o2173
802E6695r9510N3001L3834j608j6767P2804O9781p4556l2564r1037M3917N2882
790F6872m200o6258j2838O6070J6622m0713p3199J9060k6949M936n4457j625P7433
777b9246P4956p6053o3874J09697n4733R181J02634j14978N7392l6879n473K6978
765c98j9629l0284J28278M4485j31549N6050k3814j9120m8872P072N7674o723
753A3170K5410q8926j17764R1628O9449n2162j7516P9138m3259K6444p422m4011
741f5821q6441L5742N7039J8324O183j09433L6301N9058N5907P6208k1347p5885
729a4165l0077j1709L2228k6857r5240L5643M7526P9287J2958j1532j09714P5519
$$ y = [72431, 23966, 65045, 35221, 146143, 93625, 73411, -84375, -79144, 11258, 29585, 118868, 56695, -42815, 10186, 44020, 42412, 25645, 98449, 168230, 93674, 61110, -29927, 13990, 66872, 62672, -3586, -16424, 49646, 66268, 25555, -47644, -28584, -55533, -50597, -105054, -106679, -29246, 45710, -30343, -94217, 15480, -39253, -30072, 72562, -42416, 14976, -21903, -27376, -398, -20027, -50311, 77967, 122452, -9097, 46953, 23139, 4019, -44853, -37781, 19893, 13170, 38580, -50346, -168110, -76482, -7033, -59195, -76711, 2427, -40832, -14388, -21810, -65821, -152262, -116520, -59481, -41157, -34974, -144407, -108106, -49048, 6859, 83067, 61720, -14165, -44242, -55951, -23723, -50580, -145820, -110177, -62651, 16636, 29594, 18062, -91652, -16133]
717a6133M3449j06364l6826k8275Q1012M1459r4460N1631M1002l7268N0628q623
705a8768O8616K8626l3779p58L6561k9097p2013K0624l0932o0476n7568M9274
693i9690K8146p9995L1595M2189Q1076m7106M348M1803n4749O4840k2079l7076
681d6698n5554L0762k4362m0609M4026o416O1027p946O1943o7689j00746Q7236
669f5026M8769j8696n0045l6704j6006K2262R028p472Q9846k8899n2017o0316
657a65276k5736J7417o657M7473j0417l9293K2041O9548L6263l5240K7357k2314
645h4834O4931m8651n4439l4983K4736N3347M039n4509k3122j7675m0863O1453
633a50570l1199L6048J73547L7376j18528m5438O3084R0939m6840l5952q2398
$$ y = [-16133, 27316, -79048, -115874, -144149, -63137, -21678, -116138, -64507, -23505, -60773, -10145, -18768, 49848, 78474, 44695, 43937, 80498, 51401, -20612, 12, -30920, -91396, -148964, -99690, -71544, -151539, -119944, -77755, 3321, -43785, -39437, 2366, -52383, 12457, -9622, -46698, -102252, -71490, -95852, -136461, -92435, -98851, -37824, -45770, 16173, -51516, -152262, -65026, -16257, -34953, -84998, -121702, -137708, -115446, -106418, -113890, -24044, -52943, -104960, -165276, -191012, -173595, -180252, -132779, -143196, -182489, -160448, -90900, -54637, -89877, -62520, -84834, -19903, -68554, -122993, -157976, -133240, -79893, -75854, -130363, -153485, -171160, -212023, -150570, -181769, -145721, 27826, 65202, -53326, -98764, -35680, 55259, 8419, -27533, -109931]
622a09931m9411K3609K9387n3517M3904L550J0802K1878m6595L5085l4195n4627
610a80061N2672K0078Q4875r7677j49516K0121J2715L493J773J03723P445j9079
598a39438M3490l8308k0690l630O9392m0585P251J4098K3098j08366o243N8298
586a41633P034J1396k987M628j4168J5116l687j5373K4644K094j7500K0449o3914
573a73901R584L6245k1823j1706M1944P1744m3515O483j4160o7398Q369J381R528
560a47225j5477M6135j12948l4133K500P8302L1687l3153J01779L7955j3883N9281
548H20j41572p4206J9885j6062K4745L7465j2216K4958L1061j8342l7982R0551
536g0895Q984o3330P2931L0954l0299j07855k9382N5139L1751L6414q6310L1825
$$ y = [-109931, -159342, -135733, -106346, -159863, -115959, -112409, -101607, -79729, -126324, -91239, -125434, -180061, -127389, -107311, -22436, -120113, -269629, -249508, -236793, -233300, -231527, -127804, -120359, -139438, -95948, -134256, -154946, -158576, -89184, -129769, -122518, -108420, -85322, -193688, -199931, -141633, -134599, -123203, -126190, -121562, -135730, -120614, -124301, -139674, -115030, -112936, -130436, -109987, -173901, -164317, -128072, -149895, -161601, -119657, -47913, -91428, -84945, -99105, -166503, -158134, -156753, -147225, -162702, -116567, -229515, -263648, -261148, -182846, -151159, -184312, -82533, -44578, -58461, 820, -140752, -214958, -195073, -211135, -186390, -148925, -161141, -136183, -105122, -123464, -161446, -70895, -61911, -125241, -52310, -21356, -51655, -159510, -188892, -133753, -102002, -65588, -151898, -120073]
524a20073L0570q1919K4327l9944k0386J06458R3082r5754K475M3451q2329l3759
512a73801k8232K1439K5792O1929l4759r392J1767r097n5188L4516q21l6808k69
499a92924N587j5556m8353L7921k5550L6673N7510p609J5664k7218k756J27852
487c8759r0220n3077M1800J02359r1301N8696j5093j10586J14179j04780R993
476a76789N7909L405N5665K3961r5227m0280N52Q392M9957j11062L429p0471J00523
463a90036Q3403j2908K7602p6104N611K263M9595R327M6305m3967q9471K7741
451a60639k2012k529p147k2465k5201L6077P3741K162l0073m878P7484p7697n612
438a68789j8129p5844J05590m7180p2859K4960L1789M1136O5369m2999K6421j0197
$$ y = [-120073, -89503, -171422, -147095, -187039, -207425, -100967, -7885, -103639, -101164, -57713, -140042, -173801, -202033, -180594, -154802, -92873, -127632, -137024, -125257, -134354, -189542, -155026, -155847, -192655, -192924, -187337, -202893, -251246, -213325, -238875, -202202, -144692, -152301, -136637, -163855, -166611, -38759, -128979, -182056, -140256, -37897, -129198, -70502, -85595, -196181, -82002, -186782, -176789, -118880, -115475, -59810, -35849, -131076, -171356, -170804, -162412, -112455, -223517, -220088, -290559, -190036, -106633, -119541, -91939, -168043, -162432, -160169, -110574, -101247, -54942, -98909, -188380, -160639, -182651, -185180, -192327, -214792, -239993, -203916, -130175, -128013, -158086, -162964, -85480, -163177, -168789, -186918, -262762, -157172, -204352, -277211, -252251, -220462, -179326, -113957, -156956, -130535, -140732]
426a40732J816L7016L7326m9550m2980k6854p8294O8300n860J03228l4343m4571
414a75498J18097N1937L489n5540q6379m2649j4568J4024P0812L3996M642O0379
402a7258j7048n0194k3653m9673j4411M1534L2093j12174N5003K8004q6995O5120
390a49652l5676l2255L3840K4071O5386M452l6159o9516O7254k0447j0520m5504
378b04726k9345M0266j7640J6973k2155L3638q9562L5120O6750R70j3035l537
366a86283L5628m4123j3020L9804r2939K6183q571O35J33851j9426J4498j452
354a15215p9939J2310M4151M3270K3524m4472m4942n7179j33492O7761J1077J0172
342b62974Q4098J0164N2495K484r4567j6554K6253J7899k3135K1986j2119M2426
$$ y = [-140732, -138916, -101900, -64574, -114124, -157104, -183958, -262252, -193952, -199812, -96584, -130927, -175498, -57401, -5464, -1975, -57515, -143894, -186543, -201111, -187087, -116275, -82279, -77637, -17258, -34306, -84500, -108153, -157826, -172237, -130703, -98610, -210784, -155781, -127777, -214772, -149652, -185328, -217583, -183743, -159672, -94286, -89834, -125993, -195509, -128255, -148702, -159222, -204726, -234071, -193805, -211445, -194472, -216627, -182989, -272551, -237431, -170681, -169711, -182746, -186283, -150655, -194778, -207798, -167994, -260933, -234750, -243321, -242686, -108835, -128261, -113763, -115215, -195154, -182844, -138693, -95423, -71899, -116371, -161313, -218492, -351984, -284223, -273146, -262974, -178876, -168712, -116217, -113733, -208300, -224854, -198601, -180702, -203837, -181851, -193970, -151544]
330a51544L1556j19054N2725j0635k225P0996J2561j9058J0793J1601j0994l1880
318a55158M9410o3184j10590M4563O2911N6414N0570j38535N3431R0929j8141
307g7380P0534o3540m5207p6207m1533l2080M7478K8251j0652p717M2633j4922
295a80342l913k5165j3032K0170l8551K6082r367J2081K0308L8897m1378l7472
283b31682J8134j535j9407N0076L5908J1750p0004l5304N2387o919k4323O8603
271a52316m3983o9372Q424P154r9290J0747J38155Q2701j11432p9K8997k7547
259b27841j1627J1017l2119l3973K296P957P8334q5149j1100J5107N7739R6747
247a32612q7376n9836l643n000M2863L0020m2421m2380J9279M3240l5309p7355
$$ y = [-151544, -119988, -239042, -186317, -196952, -199177, -128181, -115620, -134678, -123885, -112284, -123278, -155158, -105748, -168932, -279522, -234959, -172048, -115634, -65064, -203599, -150168, -59239, -77380, -6846, -70386, -115593, -191800, -233333, -265413, -217935, -189684, -200336, -208053, -165420, -180342, -184255, -209420, -222452, -202282, -240833, -214751, -224118, -212037, -191729, -152832, -194210, -231682, -213548, -215083, -234490, -184414, -148506, -136756, -206760, -242064, -189677, -196596, -220919, -152316, -196299, -265671, -257247, -250093, -349383, -338636, -200481, -117780, -229212, -229291, -200294, -227841, -239468, -228451, -260570, -294543, -292247, -284290, -205956, -291105, -302205, -287098, -229359, -132612, -219988, -279824, -283467, -288467, -245604, -215584, -258005, -300385, -281106, -237866, -273175, -350530]
235c50530M1890J05090K6048k2220m5433n8858N7643P4016N8694l6932k0226p2645
223b43463O8837K8446r042p325j36833J2679P4355j1755L9608n9409J8573J2884
$$ y = [-350530, -308640, -203550, -177502, -199722, -245155, -304013, -246370, -172354, -113660, -150592, -170818, -243463, -174626, -146180, -155222, -162547, -299380, -286701, -212346, -224101, -184493, -243902, -225329, -212445]
$$ [...]
##END NTUPLES=NMR SPECTRUM
##END=
