##TITLE=1H_CA-8853-1
 CDCl3, 8 sc, 
 13.05.2021
##JCAMPDX= 6.0         $$ Bruker NMR JCAMP-DX V2.0
##DATA TYPE= NMR SPECTRUM
##DATA CLASS= NTUPLES
##ORIGIN= UXNMR, Bruker Analytische Messtechnik GmbH
##OWNER= root
$$ XWIN-NMR		Version 3.5
$$ Thu May 13 10:41:01 2021 Russian Standard Time (UT+4h)  she@DPX200
##.OBSERVE FREQUENCY= 200.131506
##.OBSERVE NUCLEUS= ^1H
##.ACQUISITION MODE= SIMULTANEOUS
##.ACQUISITION SCHEME= undefined
##.AVERAGES= 8
##.DIGITISER RES= 18
##SPECTROMETER/DATA SYSTEM= spect
##.PULSE SEQUENCE= zg30
##.SOLVENT NAME= CDCl3
##.SHIFT REFERENCE= (INTERNAL, CDCl3, 0, 16.0424)
##AUDIT TRAIL= $$ (NUMBER, WHEN, WHO, WHERE, WHAT)
$$ ##TITLE= Audit trail, XWIN-NMR		Version 3.5
$$ ##JCAMPDX= 5.01
$$ ##ORIGIN= Bruker BioSpin GmbH
$$ ##OWNER= she
$$ F:/spectra/data/she/nmr/H-F/1/pdata/1/auditp.txt
$$ ##AUDIT TRAIL=  $$ (NUMBER, WHEN, WHO, WHERE, WHAT)
(   1,<2021-05-13 10:39:42.54 +0400>,<she>,<DPX200>,
      <created by zg, POWCHK disabled, PULCHK disabled
       configuration hash MD5:
       00 E9 B6 7A A2 85 ED C7 34 08 36 98 17 FE 4E 26
       data hash MD5: 16K
       59 9C 89 BA 76 E0 33 44 3C 95 E2 58 2C 4D 39 5B>)
(   2,<2021-05-13 10:39:45.04 +0400>,<she>,<DPX200>,
      <Start of raw data processing
       efp BC_mod = 2 LB = 0.24 FT_mod = 6 PKNL = 1 PHC0 = -11119.48 PHC1 = 11.001 SI = 16K 
       data hash MD5: 16K
       30 F7 55 AB DC 11 10 C8 F6 77 F8 D7 9A 1D 6F EB>)
(   3,<2021-05-13 10:40:06.01 +0400>,<she>,<DPX200>,
      <pk PHC0 = -1.481453 PHC1 = -4.023314e-07 
       data hash MD5: 16K
       9F E4 B9 D2 89 5F 02 60 05 EE 28 AA A4 15 10 AF>)
(   4,<2021-05-13 10:40:08.95 +0400>,<she>,<DPX200>,
      <abs ABSG = 5 
       data hash MD5: 16K
       B1 B3 89 36 5A A1 F1 80 82 E0 8B 46 87 5A 0C A5>)
$$ ##END=
$$ 
$$ hash MD5
$$ 51 45 1F 1F FC 88 BF 1E 4D A1 15 EE 5F AB D8 2A
##$RELAX= 
##$RELAX= 
##$RELAX= 
##$RELAX= 
##$RELAX= 
##$RELAX= 
$$ Bruker specific parameters
$$ --------------------------
##$DU= <F:/spectra>
##$EXPNO= 1
##$NAME= <H-F>
##$PROCNO= 1
##$TYPE= <nmr>
##$USER= <she>
##$AMP= (0..31)
100 100 100 100 100 100 100 100 100 100 100 100 100 100 100 100 100 100 
100 100 100 100 100 100 100 100 100 100 100 100 100 100 
##$AQSEQ= 0
##$AQ_mod= 1
##$AUNM= <au_zg>
##$AUTOPOS= <>
##$BF1= 200.13
##$BF2= 200.13
##$BF3= 200.13
##$BF4= 200.13
##$BF5= 200.13
##$BF6= 200.13
##$BF7= 200.13
##$BF8= 200.13
##$BYTORDA= 1
##$CFDGTYP= 0
##$CFRGTYP= 5
##$CHEMSTR= <none>
##$CNST= (0..31)
1 1 145 1 1 1 1 1 1 1 1 1 1 1 1 1 1 1 1 1 1 1 1 1 1 1 1 1 1 1 1 1 
##$CPDPRG= <>
##$CPDPRG1= <>
##$CPDPRG2= <>
##$CPDPRG3= <>
##$CPDPRG4= <mlev>
##$CPDPRG5= <mlev>
##$CPDPRG6= <mlev>
##$CPDPRG7= <mlev>
##$CPDPRG8= <mlev>
##$CPDPRGB= <>
##$CPDPRGT= <>
##$D= (0..31)
0 1.2 0 0 0 0 0 0 0 0.06 0 0.03 0 0 0 0 0.0002 0 0 0 0 0 0 0 0 0 0 0 0 
0 0 0 
##$DATE= 1620887982
##$DBL= (0..7)
120 120 120 120 120 120 120 120 
##$DBP= (0..7)
150 150 150 150 150 150 150 150 
##$DBP07= 0
##$DBPNAM0= <>
##$DBPNAM1= <>
##$DBPNAM2= <>
##$DBPNAM3= <>
##$DBPNAM4= <>
$$ [...]
##$SUBNAM3= <"">
##$SUBNAM4= <"">
##$SUBNAM5= <"">
##$SUBNAM6= <"">
##$SUBNAM7= <"">
##$SUBNAM8= <"">
##$SUBNAM9= <"">
##$SW= 16.9725357007746
##$SWIBOX= (0..15)
0 0 2 0 0 0 0 0 0 0 0 0 0 0 0 0 
##$SW_h= 3396.73913043478
##$TD= 16384
##$TD0= 1
##$TE= 0
##$TE2= 300
##$TE3= 300
##$TEG= 300
##$TL= (0..7)
0 120 120 120 120 120 120 120 
##$TP= (0..7)
150 150 150 150 150 150 150 150 
##$TP07= 0
##$TPNAME0= <>
##$TPNAME1= <>
##$TPNAME2= <>
##$TPNAME3= <>
##$TPNAME4= <>
##$TPNAME5= <>
##$TPNAME6= <>
##$TPNAME7= <>
##$TPOAL= (0..7)
0.5 0.5 0.5 0.5 0.5 0.5 0.5 0.5 
##$TPOFFS= (0..7)
0 0 0 0 0 0 0 0 
##$TUNHIN= 0
##$TUNHOUT= 0
##$TUNXOUT= 0
##$USERA1= <user>
##$USERA2= <user>
##$USERA3= <user>
##$USERA4= <user>
##$USERA5= <user>
##$V9= 5
##$VALIST= <valist>
##$VCLIST= <CCCCCCCCCCCCCCC>
##$VD= 0
##$VDLIST= <DDDDDDDDDDDDDDD>
##$VPLIST= <PPPPPPPPPPPPPPP>
##$VTLIST= <TTTTTTTTTTTTTTT>
##$WBST= 1024
##$WBSW= 4
##$XGAIN= (0..3)
0 0 0 0 
##$XL= 0
##$YL= 0
##$YMAX_a= 526849
##$YMIN_a= -539187
##$ZGOPTNS= <>
##$ZL1= 120
##$ZL2= 120
##$ZL3= 120
##$ZL4= 120
##$ABSF1= 15.94502
##$ABSF2= -1.027642
##$ABSG= 5
##$ABSL= 3
##$ALPHA= 0
##$AQORDER= 0
##$ASSFAC= 0
##$ASSFACI= 0
##$ASSFACX= 0
##$ASSWID= 0
##$AUNMP= <proc_1d>
##$AZFE= 0.1
##$AZFW= 0.1
##$BCFW= 0
##$BC_mod= 2
##$BYTORDP= 0
##$COROFFS= 0
##$CY= -3
##$DATMOD= 1
##$DC= 0
##$DFILT= <>
##$DTYPP= 0
##$F1P= 0
##$F2P= 0
##$FCOR= 1
##$FTSIZE= 16384
##$FT_mod= 6
##$GAMMA= 0
##$GB= 0
##$INTBC= 1
##$INTSCL= 1.334414e-10
##$ISEN= 128
##$LB= 0.24
##$LEV0= 0
##$LPBIN= 0
##$MAXI= 10000
##$MC2= 0
##$MEAN= 0
##$ME_mod= 0
##$MI= 1.114404
##$NCOEF= 0
##$NC_proc= -5
##$NLEV= 6
##$NOISF1= 3.799351
##$NOISF2= 2.8
##$NSP= 0
##$NTH_PI= 0
##$NZP= 0
##$OFFSET= 16.0424
##$PC= 1
##$PHC0= -11120.96
##$PHC1= 11.001
##$PH_mod= 1
##$PKNL= yes
##$PPARMOD= 0
##$PSCAL= 0
##$PSIGN= 0
##$REVERSE= no
##$SF= 200.129993803883
##$SI= 16384
##$SIGF1= 3
##$SIGF2= 2
##$SINO= 5.538805
##$SIOLD= 16384
##$SREGLST= <1H.CDCl3>
##$SSB= 0
##$STSI= 16384
##$STSR= 0
##$SW_p= 3396.73913043479
##$SYMM= 0
##$S_DEV= 0
##$TDeff= 16384
##$TDoff= 0
##$TI= <>
##$TILT= no
##$TM1= 0
##$TM2= 0
##$TOPLEV= 0
##$USERP1= <user>
##$USERP2= <user>
##$USERP3= <user>
##$USERP4= <user>
##$USERP5= <user>
##$WDW= 1
##$XDIM= 16384
##$YMAX_p= 299416263
##$YMIN_p= -346269
$$ End of Bruker specific parameters
$$ ---------------------------------
##NTUPLES= NMR SPECTRUM
##VAR_NAME=  FREQUENCY,     SPECTRUM/REAL,   SPECTRUM/IMAG
##SYMBOL=    X,             R,               I
##VAR_TYPE=  INDEPENDENT,   DEPENDENT,       DEPENDENT
##VAR_FORM=  AFFN,          ASDF,            ASDF
##VAR_DIM=   16384,         16384,           16384
##UNITS=     HZ,            ARBITRARY UNITS, ARBITRARY UNITS
##FACTOR=    0.207333158178282, 1,           1
##FIRST=     3210.56548466771, 0,            0
##LAST=      -186.173645767081, 0,           0
##MIN=       -186.173645767081, -346269,     0
##MAX=       3210.56548466771, 299416263,    0
$$ Real data points
##PAGE= N=1
##DATA TABLE= (X++(R..R)), XYDATA
$$ [...]
7230D002J2434l5180J8193M9781j9226n5136p34K8356j8906J4916K1828K3744
7218D4072j6428k5244l0967Q990j4077k3361j564j5946L5104J8684O4015m2428
7206H50O396J0798j8144p6760L0237J9186K8419K3955m7531l7782n755j5612K6589
7193e5154J5461k8048N2855J9860n2053L0453L5370j1727m2844k9185N0832k0331
7181c4511J7534l2448k6010J2282L5607l555K704j6867J0910Q714p35j7034k3871
7168f7280p529M129j8631K7635M7211p18J3720j4624J774O939n547J6949Q451
7155A2479R53q026J2056l2437k2384L0299J6902J0964k1005j8369l070j8359L4656
7142e341l1681L000M3194m8794j0164k0598L271q023l3569K6383Q84K2923L0319
$$ y = [4002, 16436, -18744, -551, 49230, 30004, -25132, -25866, 2490, -16416, -1500, 20328, 44072, 27644, 2400, -28567, -19577, -33654, -57015, -58579, -74525, -39421, -20737, 43278, 850, 7246, 18044, -100, -76860, -46623, -27437, 982, 24937, -22594, -60376, -66131, -81743, -55154, -39693, -67741, -14886, 4974, -47079, -16626, 18744, 7017, -35827, -65012, -14180, -34511, -16977, -49425, -75435, -63153, -27546, -31101, -28397, -45264, -34354, -25640, -26375, -43409, -67280, -74809, -70680, -89311, -61676, -14465, -15183, -1463, -16087, -14313, -7374, -12921, 4028, 12479, 13432, 5406, 17462, -14975, -37359, -7060, 9842, 20806, -199, -18568, -21638, -39997, -5341, -37022, -34022, 9172, -39622, -49786, -70384, -67113, -75136, -108705, -82322, -81438, -58515, -28196]
7129b8196n512L0383O347j036k6031l690k5772j3797j1980L9476J7999m6577J6634
7116e1752J1944K1785J3722K436K7939q543m2023k2711L2705L1453j8221k1549
7104b2815K2604l5080J9557O11l137M504J0431N3634k1408n2458n512O0698Q691
7091D0320m907l9355l0495q624P003J1512P184L819K6263O393j05375J2779K2025
7078e1458J6045J6211l4284N2063Q11m1202J9487k381p73L2228J5902n11n6973
7065c4835L5309J7875n4994P925K400j4582q564M7021M3100k0826M558J7912k1449
7052B0850k0628n806l0811K1659J3033n9060K5680O8913k1139m4961k5271J5376
7040d2165O8777n4408j1962M8090q202j230O724K78n1859j4652N5173N560P410
$$ y = [-28196, -33708, -3325, 3022, 1986, -24045, -27735, -53507, -67304, -79284, -39808, -21809, -68386, -51752, -39808, -18023, -4301, -1865, 26074, 17531, -24492, -47203, -14498, 16955, -1266, -22815, -211, -35291, -15734, -15123, -18260, -13756, -3325, 50309, 28901, -23557, -29069, 31629, 40320, 35413, -3942, -34437, -43061, -36058, -24546, -17362, -13543, 12720, 19113, -86262, -73483, -51458, -35413, -19202, -53486, -1423, -612, -41814, -22327, -24708, -25481, 6747, 22649, 22138, -34835, 474, 18349, -36645, -28720, -26320, -40902, -49466, -2445, 40655, 19829, 24387, 42299, 20850, 222, -5584, -36395, -14736, -1703, -60763, -35083, 33830, 12691, -32270, -57541, -42165, 26612, -27796, -39758, 8332, 130, -1100, 5624, 5902, -45957, -60609, -5436, 124, 7534]
7027G534J0825l7646k056O073M91j1493j1104k9618M3436p600l3561M5936L416
7014a5367m3149N4797j5762J8262L2048k5035K6988m8777l8515J6211K566j3130
7002d8863K4430K2100l2762l5821L1294j2869J7853Q016K5156j3504n443O625
6990a3788j671q661l4053L950L9168m377j1687J0188J7122j9073K129n80k9571
6977e0904K5748L3509k3526m8413L979M2159J6288m6972k5999k684M9837R09j1425
6964c7494O969p391j6442L0611J226j505o9141K5538N0516K3492Q422o269P439
6951A5971j2780k7953Q714p352k4545l320K3963J0292l753k470J113K2806J1769
6938A2455J5977j3028m580R899l8425N084M4107l2599r452k6408K1767o711J850
$$ y = [7534, 18359, -19287, -21343, -15270, -14779, -26272, -37376, -66994, -23558, -31158, -64719, -18783, -15367, -58516, -3719, -19481, -1219, 30829, 5794, 32782, -15995, -54510, -38299, -35733, -48863, -24433, -2333, -35095, -70916, -39622, -52491, -34638, -26622, -1466, -14970, -20413, -13788, -15459, -24120, -58173, -54223, -15055, -19432, -31119, -20931, -3809, -22882, -20753, -21333, -50904, -25156, 8353, -15173, -63586, -59607, -17448, -1160, -48132, -74131, -76815, -26978, -26069, -37494, -30525, -37916, -54358, -23747, -22521, -24026, -93167, -67629, -17113, 6379, 14801, 8532, 15971, 3191, -24762, -16048, -23400, -47945, -51265, -27302, -17010, -20763, -23233, -22120, 686, 12455, 28432, 15404, 10824, 20723, -17702, -12618, 31489, -1110, -10562, -36970, -15203, -21914, -20064]
6925b0064J0140j882o061L7226j2918J2690j4867n983k180M824R033J113l8418
6912b7347j0113m660L9586l0915l6536J7250K5315O045J127o135j6963Q949k6177
6899f0574K8414J0867j48J2530L1879J2290j7594m0132N26J7200j7652J2840m230
6886a3784n238J8191J2535J1229n3899m6529l938P9207m135L3815k5400J8868
6874B0922j9132j225j8698K5724j6629L174K5987m5449J4656j3890j6409k7455
6862f8424K2218J8863j343r807r809j5021K8369l335k8991m333N027J3542l651
6849e6695K6182K1866j4841J2481j3846J1948l1394p26j6789m569M4563j841J5663
6836g998q363l3934M2487j4198J1119k1052k3672M6709k5270l15p729J0289K9753
$$ y = [-20064, -9924, -11806, -17867, 19359, 6441, 19131, 4264, -1719, -3899, 925, 9958, 11071, -27347, -37460, -42120, -2534, -33449, -69985, -52735, -27420, -21375, -20248, -26383, -43346, -34397, -60574, -32160, -21293, -21441, -8911, 22968, 35258, 17664, -22468, -21942, -4742, -22394, -9554, -13784, -19022, -831, 11704, 22933, -30966, -77495, -81433, -2226, -6361, 27454, 2054, 20922, 1790, 565, -18133, 7591, -9038, -5864, 20123, -25326, -10670, -24560, -40969, -68424, -46206, -27343, -28686, -38493, -48302, -63323, -34954, -38289, -67280, -71613, -66586, -53044, -56695, -30513, -8647, -23488, -11007, -24853, -12905, -44299, -45025, -61814, -66383, -21820, -23661, -7998, -16361, -50295, -7808, -22006, -10887, -31939, -55611, -8902, -34172, -34487, -42216, -31927, -2174]
6823b174M8536r724o9446m048j3415K365J4856m3166m0017O8885M584J1906K3483
6810g375j4297l4476K6209L6188J6193m0670m6376j0002l1760N6653J9158N358
6798b5197k7016j837J8522L0034R123l8310J8850l1742m473J399K7670J5648k5512
6785c2841j9425l4703N9967n2217K8695K616k3695m123K0710k34m1047P1394j588
6772b6491K0962k5980p458K6596O426K1021m245l5608l3785k5533o273M6767N0763
6759G162j8429p552K4581j0382J9469n154l7686l1618j0611L2208N9570l8328
6747a6770k0431K782R448M764l2643r541K7727k0820L4150K4258k8657l4730j30
6734f0593K10K0758j7189K0684K0000k0258R021k1085j5348Q154L3866j5736m965
$$ y = [-2174, 46362, 36638, -32808, -36856, -50271, -47906, -33050, -76216, -116233, -47348, -42764, -30858, -7375, -21672, -56148, -29939, 6249, 22442, -18228, -64604, -74606, -106366, -49713, -30555, -25197, -52213, -54050, -35528, -5494, 3629, -34681, -15831, -47573, -52046, -50647, -22977, -7329, -32841, -52266, -86969, -27002, -79219, -50524, -47908, -71603, -75726, -55016, -55250, -96297, -24903, -26491, -5529, -31509, -38967, -12371, -5945, 15076, 10831, -24777, -58562, -84095, -90368, -43601, 7162, -11267, -18819, 5762, -4620, 14849, 9695, -27991, -59609, -70220, -38012, 21558, -16770, -37201, -34419, -24971, -20207, -52850, -62391, -34664, -55484, -21334, 2924, -25733, -60463, -60593, -60383, -39625, -56814, -36130, -16130, -36388, -27367, -48452, -63800, -55646, -21780, -37516, -42481]
6721d2481l888Q060O080J4249K6417m4127m0306J7324M4021J3533j0962l017M288
6708a0809r738K4606k741n9107J4221N706N5814L908l2030k0541j461J5171N411
6695a1590j4618r031K747j9604j995K8196J3453L736K135L9429p1197j7365k7678
6682h3382J2012j7561J3009P0384K870j3188K293j3870R372p437L7102k4532j7202
6669c0130j738l0496k1208J5523N495R770N0893m3587O808K0460k1752m6785K0353
6656f6394J3283J7018L2366j1446k0221r493j1055M1694L8411n5290J4711L2748
6644A6332m4248N6977m0648j6294k6669j8235j5114N8563M649K9591R383m9613
6632c5326l823J3291l0623R260M2141k2387P491J1813n0255J1971j2198m1122
$$ y = [-42481, -46369, -38309, -32229, -17980, 8437, -35690, -75996, -58672, -14651, -1118, -12080, -15097, -10809, -20547, 4059, 1318, -57789, -43568, -37862, 17952, 21860, -10170, -30711, -32172, -17001, -11590, -26208, -35239, -32492, -52096, -54091, -25895, -12442, -8706, -6571, 32858, -38339, -55704, -83382, -71370, -88931, -75922, -5538, -2668, -15856, -13563, -27433, -18061, -25498, 11604, -12928, -30130, -31868, -62364, -83572, -68049, -62554, -52784, -1891, -45478, -38670, -18210, -39962, -86747, -66394, -53111, -36093, -3727, -15173, -35394, -44887, -55942, -14248, 24163, -31127, -16416, 16332, -27916, 29061, -11587, -27881, -54550, -72785, -87899, -29336, -24687, 4904, 14287, -35326, -39149, -25858, -56481, -47221, -5080, -27467, -19976, -8163, -58418, -46447, -58645, -99767]
6620i9767L4300L8402L094P538L4361l5609j386K8035o398l3137K810J7546j0321
6607b0532P094K615L547j1604J753J6323J6075k0948J7648P1731m5901n6081k5599
6594d3879K2035L7020j2762j5460m197k4941p242K9644O1069o823l8039o45j9149
6581b3369o251L3309j477m1983j3219l429J1160L771J8930j5462k0083K3560Q3480
6568D8937m2115o7495N9986j9669j4636o72K9406k153J6322l0745k6958r993j332
6555f1117m294M612L6549j1321l5851L6106m685K5169k5396J1833J9072l3517
6543d2840Q853k6656O032L4979O195j9745j5776P7359l256o257j9469j8071M996
6530a3656j6158K640j2744k1039j8691L8761N662J9787J4168K7762m3228m4072
$$ y = [-99767, -65467, -27065, -23971, -16433, 17928, -17681, -19067, 8968, 2570, -30567, -27757, -10211, -20532, -13438, -10823, -7276, -18880, -17127, -804, 15271, -5677, 11971, 83702, 37801, -18280, -43879, -21844, 15176, 2414, -13046, -17243, -42184, -49426, -19782, 41287, 34464, -3575, -4220, -23369, -29620, 3689, 2212, -39771, -52990, -56419, -45259, -41488, -22558, -38020, -58103, -34543, 48937, 6822, -60673, -687, -20356, -34992, -35664, -6258, -8411, 7911, -22834, -49792, -59785, -61117, -65411, -60799, -24250, -35571, -71422, -35316, -40001, -14832, -40228, -28395, -9323, -42840, -33987, -60643, -54611, -19632, -13437, -33182, -48958, 28401, 25145, 18888, -581, -18652, -13656, -29814, -27174, -39918, -60957, -79648, -40887, -35225, -15438, -1270, 26492, -16736, -60808]
6518f0808J1423K0469k115K0610j9263K015j3313N6859o708J4500J4254j4279
6506B3644l5067n891k3024k9691m586j0829M7978L5977o418m3047k9392p847L8725
6493d9468J8270j7490J428K8546M957N07l3963o89N415K1754J7214k8922O528
6480b5913k960r645N750O6965j8355m4204J6137O323K729j4222J6985j6255j7827
6467c4492k0724L2308J1731K1088m9345p889K4886N991P663K5887r29j3908K0708
6454B2975k3843l8737n830M2451j3916J2947k7263o3257K1115M6901K7548J5384
6442A6475J1193k4662j889l4404K2234k0628J0769L0711j439N464J854Q624j1831
6429A2471K2445o1417L95K8660l1393j5704L7040j4573m979P1515K5568o8379
$$ y = [-60808, -49385, -28916, -31031, -10421, -29684, -27669, -40982, 15877, 9169, 23669, 37923, 23644, -11423, -17314, -40338, -70029, -74615, -85444, -37466, -1489, -7907, -50954, -80346, -88193, -49468, -31198, -48688, -47260, -18714, -13757, -13250, -47213, -47902, -42487, -20733, -3519, -32441, -25913, -28873, -38518, -32768, 34197, 15842, -28362, -12225, -5902, -3173, -17395, -410, -16665, -34492, -55216, -22908, -11177, 9911, -39434, -47323, -22437, -16446, -8783, 17104, 16175, 2267, 22975, -868, -39605, -45435, -2984, -16900, -3953, -31216, -94473, -73358, -26457, 1091, 16475, 27668, 3006, 1117, -33287, -11053, -31681, -20912, 9799, 8360, 13824, 15678, 24302, 12471, 34916, -26501, -26106, 2554, -28839, -44543, -7503, -22076, -27055, 44460, 70028, 1649]
6417A649L517J9230k0750k8470K3246Q748k3428j940K7635M100J8929n818n2450
6404b5802M6315j4544l602L580j2817L1201n92k4953l9816R09M65J6238J8302
6391e116L3332k6874k7695J5962k0135L1772n665j3485q791n1829K1021J3220
6379d4283j2832K9949K8795j4661J12m5348O711K9124l7131l886L5602J2187L839
6366a1822M9361R349l3375l5252j389j9597L985k0492j0447R824L6118M7871k0768
6353C366k2907K6015P780j2500l0615N1251k0739k583L2502m4467m025J7886j2912
6340a1948n322L4378j1433k2763O083p822o047q235K2961J4014j1624J339J1192
6327D773K0028n886j8380m654j3684m84O0994j49p5088Q839J3140o1168K4595
$$ y = [1649, 5166, 24396, 3646, -24824, -1578, 7170, -16258, -18198, 9437, 13537, 32466, 26648, -25802, 20513, 5969, 2367, 5947, -6870, 24331, 23739, -1214, -41030, -40121, -39656, -23418, -5116, 28216, 1342, -26353, -10391, -30526, 1246, -4419, -17904, -26695, -78524, -57503, -44283, -57115, -27166, 1629, -13032, -12920, -58268, -51557, -22433, -59564, -63450, -27848, -15661, -11822, 37539, 46888, 13513, -21739, -23128, -42725, -38740, -59232, -69679, -59855, -23737, 24134, 3366, -19541, 6474, 14254, 1754, -28861, 22390, 1651, -932, 31570, -12897, -16922, 964, -11948, -17270, 17108, 5675, -17088, -11005, -18827, -24874, -33109, -10148, 3866, -7758, -6419, 4773, 24801, 18915, 535, -4119, -17803, -18287, 42707, 42558, -32530, -23691, -10551, -71719, -47124]
6314d7124K4790j7393J0364M5104j3563P140m6145l7479M4296L1480N669O319
6302A3458M924K116J9990M0045l9401l5235R698l6724J3627K6845J310n267K5020
6289D0406j4380j0840j8102L2556j6774l2657J3458l8123K1917l649l8421L1797
6277c2812N7179L9856l5638m6687l4193R16L5672J549j813q148k3585k6621M1047
6264c3278M2846l0513r557o761M788K3652K899L3156r205m3794k1513j2802K7409
6251c2673N8417j9991O882J8103l4070K3871j3487m531P347j9953J8772Q419m0828
6238b3722k5551L4985J0154O813j3518l2536J3023m202J9473R461K5742N287o2085
6225c6676K4755N810L5929Q959m5612m9426j4714L2499L1281J0845k4799N793
$$ y = [-47124, -22334, -39727, -29363, 15741, 2178, 9318, -36827, -74306, -30010, 1470, 7139, 13458, 18382, 20498, 40488, 80533, 41132, 5897, 15595, -21129, -7502, 19343, 20653, 15386, 40406, 26026, 15186, -2916, 29640, 12866, -19791, -6333, -44456, -22539, -26188, -64609, -32812, 24367, 64223, 28585, -18102, -52295, -51379, -15707, -14158, -15971, -24119, -47704, -74325, -33278, 9568, -20945, -30502, -37263, -32475, -8823, -5924, 27232, 18027, -25767, -47280, -60082, -32673, 25744, 5753, 12635, 30738, -3332, 20539, 7052, 2521, 9868, -10085, 8687, 17106, -23722, -49273, -14288, -4134, 2679, -10839, -43375, -30352, -34554, -15081, -5620, 20122, 25409, -36676, -11921, -6111, 29818, 38777, -6835, -56261, -70975, -38476, -7195, 3650, -21149, -15356]
6213a5356N8361j0675n169M2066j5420k9475k1280J1057r853L0651l055o7559
6201c5707j7653M4540P760K1418l6554k1890J9758j0920k3737K6298K2898j6109
6189a9898P783J1588k7194j3954J5771L0990N797l9876K3453J543K7805M235L5233
6176F3276j9974m3749L729J2123J1145n0863m9291L1905K6087P3414j4462j9524
6164B3816J6193m438j1231k6520l6703k5927M3079K0275L0876l1961L0408o2175
6152c4308L085K4264n227M4262j7082J7825l1379l2081J995J4474L0959l3361
6140a6574k3602N3405L804k1603L576J6771l4848j5625k4410K1838j176j9560
6128e8004L8916k8806J2029o525L6556p213o377p60j5486k1j0531J3806O25L2745
$$ y = [-15356, 43005, 32330, 27161, 69227, 53807, 24332, 3052, 14109, 4256, 34907, 31852, -35707, -53360, -8820, -1060, 20358, -16196, -38086, -18328, -29248, -52985, -26687, -3789, -19898, -12115, -527, -27721, -41675, -25904, 5086, 10883, -28993, -5540, -3997, 23808, 28043, 63276, 43302, -447, 3282, 15405, 26550, -24313, -73604, -41699, -15612, 57802, 43340, 23816, 40009, 35571, 24340, -2180, -38883, -64810, -21731, -1456, 29420, -2541, 27867, -34308, -31223, -6959, -12186, 32076, 14994, 32819, 1440, -30641, -28646, -14172, 16787, -16574, -40176, 13229, 17033, -4570, -994, 15777, -19071, -34696, -59106, -37268, -38444, -58004, -19088, -47894, -35865, -42390, -5834, -13047, -19424, -20184, -35670, -35691, -46222, -32416, -31791, 954]
6114I54L6956k8463Q709K263n3604O72J1553n809R657r478k3099M2081K2695k1170
6100f083l9911k039P145j0798L4916j649N3544j4487m031l0717M1142M869m8297
6087a6396L5604m78k2496p756K0448N446j0620L436j8029J7902J4363l0604j6940
6074b6120J8915K6865j5133J8636k1726J8512L511j2735Q257M5412j2951j0710
6062D0733k9419k3117o706M1608j0229j3076L198L4229J5991n649k5013j6858
6050E692K287J2213P984P434l0330k963l2081K5560K211Q205M0983L405k7313
6037B3287j423K733j6783R717m833l232k3008l801K4124j5570J5571L0097k8259
6024H620m1907k2143R8669K2211j1242j3617k1174n9822O4128M6425k0102m5503
$$ y = [954, 37910, 9447, 18156, 20419, -33185, -32513, -20960, -26769, -17112, -26590, -49689, -7608, 15087, -6083, -45994, -48033, -40888, -51686, -16770, -18419, 35125, 20638, 16607, -14110, 27032, 31901, -16396, 19208, 18730, -3766, -11522, 8926, 14372, 3752, 7188, -10841, 7061, 21424, -9180, -26120, -7205, 19660, 4527, 23163, 1437, 19949, 23460, 10725, 18982, 64394, 51443, 40733, 11314, -11803, -18509, 23099, 12870, -206, 2992, 37221, 53212, 47563, 22550, 5692, 7979, 20192, 28176, 35610, 5280, 2317, -29764, -4204, -1993, 6212, 47195, 50600, 23287, 21864, 24597, 7814, 17531, 12698, 9466, -13542, -17343, 6781, -8789, 6782, 36879, 8620, -33287, -55430, 43239, 65450, 54208, 40591, 19417, -40405, 23723, 70148, 50046, 4543]
6012D543j1525Q956q451p262K8010k0774j1456l143N4984J8153n6116p74K623
5999b232j9J920n6084J7441M1880k3790R268j5068J9961j6202p982K8066m374
5986g215O208K2533k2412l3513J5285p597M9006J3395j8004L36L1167K6755m3967
5973C1977n848k5920n174L4103L6840m4108j3984R823k555m0454m4057M0832J8566
5960i959j0024j0717K0417J4622j0619l0446N4105o922m1143J8297L6715l6923
5948a2597k0774J2456K240N7616j0886j7058l2239K9932K7241j3568k9879K690
5936d826K2518J1346m922k8180J746J5582n034k0205k3353K2686l6478K8305j6576
5923c7391j5885j1278K1648N1072J832K8895k9200j2426K4210L2784j518j7128
$$ y = [4543, -6982, 1974, -6477, -13739, 14271, -6503, -17959, -21102, 33882, 52035, -4081, -4855, -2232, -2251, -331, -56415, -38974, 2906, -20884, -11616, -26684, -6723, -22925, -30907, -2841, -7215, -1007, 21526, -886, -34399, -19114, -26711, 22295, 35690, 17686, 18022, 49189, 75944, 31977, 26129, 209, -4965, 29138, 65978, 21870, 7886, 17709, 15154, -25300, -69357, -28525, -9959, -19983, -30700, -10283, 4339, -6280, -36726, 17379, 10457, -30686, -12389, 24326, -12597, -33371, -20915, -18675, 38941, 28055, 10997, -21242, 8690, 35931, 22363, -7516, -4826, 17692, 29038, 24116, -4064, -2318, 13264, 8230, -11975, -35328, -12642, -49120, -20815, -37391, -53276, -64554, -42906, 8166, 9998, 38893, 9693, -2733, 21477, 54261, 52743, 35615]
5911C5615k1657k3284O346L1415K0920m1676j8174J1075k427M1909j9908m122
5899A6032k1284J7192J0537K5669N046Q645p3449j3521j0054L2362j4264k5070
5887d2159K4675p662q62M2311R308k3302N1715j3702m0957J6959M520k7177K8403
5874B2070J1660l2505k6667J0220L528L0247k102n116k4166j5037k1677M1981
5862g564K6333j1060M1329l466m4597O417k287K4256k367K514K9676J1209k7756
5849D2637K755k5605L2530j0056j6609k3146N7167K0047r536m6935k0179J0108
5837A3178J1700o201K634k2468j7460l4072Q376J3551M794K4553j5180K684Q195
5824e716O7991l3954k1893J7380N817l363J4258l4597L1811J968k1167J5220r981
$$ y = [35615, 13958, -9326, -2980, 28435, 49355, 7679, -10495, 580, -1847, 40062, 20154, 16032, -5252, 11940, 22477, 48146, 53192, 61837, -11612, -25133, -35187, -2825, -17089, -42159, -17484, -25146, -26008, 16303, 25611, 2309, 54024, 40322, -635, 16324, 20844, -6333, 22070, 33730, 1225, -25442, -15222, -11694, 18553, 16451, 11335, -12831, -27868, -49545, -7564, 18769, 7709, 49038, 45572, 975, 7392, 5105, 29361, 26994, 29508, 59184, 70393, 42637, 45392, 19787, 52317, 42261, 25652, 2506, 59673, 79720, 70184, 23249, 3070, 13178, 24878, 18677, 21311, -1157, -18617, -52689, -44313, -30762, -25968, -1415, -16595, -13911, -5716, 62275, 28321, 6428, 23808, 29625, 26262, 40520, 5923, 37734, 39702, 18535, 33755, 23774]
5811B3774l6062J2808j4280J1735Q822j8967m7335K4146N3591J1844N30l0501
5799A05N260J5352k1721l8636k510j352j8163O0536M2457l8374k7526O9155q373
5786C6210M297K4645R200k4439l21J187K116J9419M60n9589P042J105r725j0368
5772A239j0481K4239N867K4097k3998k686m9720K8175k2189J8048P5416J8663
5760H6670o9764n2205o126K6740L1574j2553L7493j2202K2516j7953k6811q928
5748a549P898k2837J2175O7567j8376l2630j8616j8639O2771P300j6574k058Q824
5735C5256k9166K1992J7438J0167J0368k6938J0290N780J4367o2757l0940j9416
5723d3559K3006M1823L1383L018n499m1921k1677N724r832J95q974J3320L4618
$$ y = [23774, -12288, 520, -13760, -2025, 6797, -12170, -59505, -35359, 18232, 30076, 30606, 105, 5365, 20717, -1004, -39640, -42150, -43502, -61665, -1129, 41328, 2954, -24572, 44583, 36210, 40507, 65152, 74352, 49913, 49592, 50779, 52895, 72314, 72774, 13185, 20227, 21332, 11607, 1239, -9242, 14997, 20864, 44961, 20963, 18277, -31443, -3268, -25457, -7409, 68007, 86670, 16906, -35299, -41425, -14685, 16889, 4336, 41829, 29627, 52143, 34190, 7379, -1549, 6349, -16488, -4313, 63254, 44878, 12248, -6368, -25007, 37764, 45064, 28490, 26432, 35256, 6090, 28082, 45520, 55687, 66055, 39117, 49407, 55187, 69554, 6797, -24143, -43559, -20553, 21270, 52653, 55671, 50172, 8251, -13426, -7702, -17534, -17339, -26313, -12993, 21625]
5710B1625j4873n2184j0712J5217L8628J8107k3339K2140L2155k588l9010J8347
5698B3513R723K2267J3237k6650k9387J0252P2111l5021k8897J9390k0110O1823
5686I2251K891n7789k5527J9488k9667k0758L0747J2118J5143L2486m0420j3645
5674A7318O5606J9114l5190l7966M8519j9296l7847k2491J8505K298k2956k6893
5662c1279P625N064j7520N9756j6070N1298m2179M5137l0730M312M4625k8089
5650E1950j7026L474J0961M0721l0822j2623J4568j1698J2268k4079K450k7767
5638A2377Q749P429j0733J1660q297k1690L8794J9157R432m1313K7127j2179k5358
5625A5155J964O774J1034k7904j7264J6811q456M1074l4880L4696L811j6819l4817
$$ y = [21625, 6752, -45432, -56144, -40927, -2299, 15808, -7531, 14609, 46764, 44176, 5166, 23513, 33236, 55503, 68740, 42090, 12703, 22955, 95066, 60045, 31148, 50538, 30428, 92251, 95142, 37353, 11826, 31314, 1647, -19111, 11636, 23754, 38897, 71383, 30963, 17318, 82924, 102038, 66848, 28882, 77401, 58105, 20258, -2233, 16272, 18570, -4386, -31279, -23654, -18590, -36110, 23646, 7576, 58874, 16695, 61832, 31102, 35414, 80039, 51950, 34924, 38398, 49359, 90080, 59258, 46635, 61203, 49505, 61773, 37694, 40144, 12377, 21126, 28555, 17822, 29482, 21185, -505, 38289, 57446, 66878, 25565, 52692, 40513, 15155, 17119, 23893, 34927, 7023, -10241, 6570, -1886, 39188, 4308, 39004, 42815, 25996, -8821]
5612h821N204K3590q910N3671k8377k6120L1322l3460j9343N776N3101N944n6275
5599b698J6927N7584k1055m4638J9113M0235M733n8581k2343M9996J6084m424
5587E0933l636J255k5741p500L8210J8813k5842o683K7750k1720L9128k2437m4202
5574A8328k5012L930O0911O4735l2797k6281k7958k3393J447J0967j8294k7526
5562b0943j205n7654P6152q958j2861N6138l4467J2007J9112l1873Q944P378k6650
5549a4880J3368P1094j7703J0126K925J1590k6053j1808J1272l4845m3395o55
5537b8964K6251K9685K9130o201j6578L1220L7279m8395m88k5457n593L0147L507
5524E5543k3353O1406j0023m2838O412k1796l1971R836K4130J3435K305M8937
$$ y = [-8821, -3617, 19973, 11063, 64734, 36357, 10237, 41559, 8099, -11244, -5468, 47633, 53577, -2698, 14229, 71813, 50758, 6120, 25233, 65468, 70201, 11620, -10723, 39273, 55357, 50933, 47297, 48552, 22811, 15311, 53521, 72334, 46492, 39809, 67559, 45839, 84967, 62530, 18328, -6684, -2754, 58157, 122892, 90095, 63814, 35856, 12463, 13910, 24877, 6583, -20943, -22148, -79802, -3650, -12608, -25469, 30669, -3798, 8209, 27321, -4552, 4392, 11770, -14880, -1512, 69582, 51879, 62005, 64930, 76520, 50467, 38659, 49931, 15086, -28309, -28964, -2713, 26972, 56102, 49901, 33323, 64543, 101822, 53427, 52939, 27482, 21889, 52036, 55543, 32190, 93596, 83573, 40735, 47147, 25351, -6620, 3216, 27346, 40781, 43086, 92023]
5512I2023j1183q279J4029L940j4830j820m3606M807M048q857O2833l424o3867
5499B5814J6962N7630j7406j2604K3826J0888K4090J620l6050o8532m517R41N10
5486B3172j1210J552N9766K4648n1499j8978n304k7810P9571J027n0161O457M2398
5473G3629k7172J8372J7758J4909J9347k9128M863p899m4168k1550j0189L2270
5461D1042L4184q866j0823k3870L204L6841N8095l9551m4705n783N4687k4830
5449F9625k5499J0992m05j1519o796J0143l091J6372L0001J2653L1979J1270m1817
5436A03908M388j3057j4292L7700j2186n5128J2394n731J3089J0776J5359k0916
5424G6304O465M6442L7939o6372L4937L0399l0147O8691K0276n9317k0204l5656
$$ y = [92023, 80840, 72561, 86590, 90530, 75700, 73880, 30274, 35081, 39129, 30272, 93105, 89681, 25814, 42776, 100406, 83000, 70396, 94222, 105110, 129200, 130820, 94770, 26238, 21721, 22662, 23172, 11962, 13514, 73280, 97928, 46429, 27451, 22147, -5663, 73908, 74935, 24774, 31231, 73629, 46457, 64829, 82587, 97496, 116843, 87715, 92578, 84679, 40511, 18961, 8772, 41042, 75226, 66360, 55537, 31667, 34871, 71712, 129807, 90256, 45551, 39768, 94455, 69625, 44126, 55118, 54713, 43194, 36398, 46541, 43450, 59822, 89823, 102476, 134455, 145725, 103908, 108296, 95239, 80947, 118647, 106461, 51333, 63727, 57996, 71085, 81861, 97220, 76304, 82769, 129211, 167150, 100778, 135715, 166114, 135967, 204658, 224934, 165617, 145413, 109757]
5412A09757k481J8506p602j759J9896N3064j6564N163m1398j936j2927p1399p194
5399D3126k8801L3599M5228J9518M298J1496l3806l4814R206r716K3756m483j7522
5386F1085q405L7172P166m8384N317k568J5949K3993M467Q580k6078J8081j3714
5373H2661K8058R454m8799P260L8055k0027k2281j2608K855M7186p844q817L68
5360I5521N164Q540N336m1680p350P921j7466k0449J4939M4959M3280j515J3589
5347A50789m6548j1833J2956j2164k4181M452J8145M033P799j049l1306j4413
5335E6680M538L2626J8284K351l4808K5190J5851J1541J3979m1421j3034k8902
5323F2875k8636L0158M409L1972J5506l7589m041L465O2901n313l0737k6583P9630
$$ y = [109757, 107276, 125782, 118180, 116421, 136317, 189381, 172817, 177980, 136582, 134646, 121719, 50320, 43126, 14325, 47924, 93152, 112670, 116968, 128464, 94658, 59844, 69050, 59334, 83090, 78607, 61085, 52680, 89852, 97018, 48634, 53951, 51383, 67332, 91325, 95792, 104372, 78294, 96375, 82661, 110719, 120173, 71374, 78634, 116689, 96662, 74381, 61773, 64628, 111814, 103970, 95153, 95521, 100685, 109225, 114561, 72881, 65531, 73452, 55986, 35537, 50476, 95435, 138715, 137200, 150789, 104241, 92408, 105364, 93200, 69019, 73471, 91616, 95649, 103448, 102399, 71093, 56680, 61218, 93844, 112128, 114479, 79671, 104861, 120712, 132253, 146232, 104811, 91777, 62875, 34239, 64397, 68806, 100778, 116284, 78695, 74654, 78119, 141020, 135707, 104970, 78387, 158017]
5310A58017m162p478m5028j4553K4413j4809J5120O204l1721k0271k3197K7203
5298F9738o347k8417j4411J9930L3082L2439K0179J9432l2279j443K8003k0491
5286A19415J9428l4590j0483O588k5306K2565k1100N3427k4292k4056O3291J4553
5274A59440j0318O887J1154j9911Q512J4450N820P091k2250k5602J2883j6709
5262A31447K0585k9584L6381J3240k7778Q488M511k3377k0811k7237K7900M9238
5250A63003J2583m9268l8059J9376M6892K3413m9512j8141q648m34p281L0242
5238A24166M2766j0917k1511J56m5707k3200N452M4134L6720K8123m4973p981
5226A27228P20m4949M5132P893j6747M321K1395J7061l8201j9572J4355J2883
$$ y = [158017, 153855, 146377, 101349, 86796, 111209, 96400, 111520, 117724, 86003, 65732, 42535, 69738, 63391, 34974, 20563, 40493, 73575, 106014, 126193, 145625, 113346, 111903, 139906, 119415, 138843, 104253, 93770, 100358, 75052, 97617, 76517, 129944, 105652, 81596, 144887, 159440, 149122, 156009, 167163, 147252, 155764, 170214, 176034, 183125, 160875, 135273, 148156, 131447, 152032, 122448, 158829, 172069, 144291, 152779, 157290, 133913, 113102, 85865, 113765, 163003, 175586, 126318, 88259, 107635, 154527, 177940, 128428, 110287, 101639, 101205, 93924, 124166, 166932, 156015, 134504, 134660, 88953, 65753, 71205, 115339, 152059, 180182, 135209, 127228, 127948, 82999, 128131, 136024, 119277, 123598, 144993, 162054, 123853, 104281, 118636, 131519]
5214A31519L9169j6666l9056K0222J4620K1330j3430l1580k5731p704k785J8782
5202A08690R792j5935Q177p0890q951L7927N3202L358p704m506K3884l8199j1135
5189H7710O961N357L6601k9364j4934K3029J8319J5967l7806l4632j4113P654
5177G0749M4478L8464k3904m7963j904K1675k586q028n019P717Q476j8767K3988
5164A07376Q780J534j2766j1843k3443Q589j54J6981j2397J745L264m9446L5777
5151G3997K05M6188o227M9225k5449l3542o070j5511K0566k6829L6381m382j5612
5138I2940K9382j0096n396k8834J8595k538m2965M1409J0014R303L5238k9873
5126A17179j7983q021k2474L0764j5804K4557M996k9745K5811L9909r645n8036
$$ y = [131519, 170688, 154022, 114966, 135188, 149808, 171138, 157708, 126128, 100397, 92693, 89908, 108690, 118482, 102547, 110724, 39834, 30883, 68810, 122012, 125370, 117666, 113160, 137044, 98845, 87710, 94671, 100028, 136629, 107265, 92331, 115360, 133679, 149646, 111840, 77208, 63095, 70749, 115227, 153691, 129787, 81824, 79920, 101595, 99009, 90981, 85962, 93679, 102155, 83388, 107376, 116156, 117690, 104924, 93081, 69638, 78227, 78073, 95054, 82657, 84402, 87666, 38220, 73997, 74202, 120390, 114163, 163388, 137939, 104397, 98327, 82816, 103382, 76553, 112934, 108552, 92940, 122322, 112226, 106830, 77996, 96591, 94053, 51088, 92497, 102511, 111814, 147052, 117179, 99196, 91175, 68701, 99465, 83661, 108218, 113214, 83469, 109280, 149189, 139544, 81508]
5114H1508K0428J425J2001m69J3260P182n0507K3719o694K3305p496l1593L0239
5101A16308j2072l1493L4217l5408K2437K3099k966M166J8550k0200j0913L8970
5089A44695M0588r90r4054j3066O7909L6760l7124l5017N7163l8947n553J1174
5077A33538m2636J5646J5841m3882l639P72N7139O636m2406k5500J3185O010k324
5064H8380J958L3795j2829n953L3802j2695J4832n1661J851O7617L4897j8825
5052A75169k5631K4164k2186o5330q827J3856K9269n1398l728N1820j9423l548
5040I4207J1762N5031j5663j857R839k1291j4154k3487J8166K8648l1554l2393
5028G7254J2137j7173o948k3899M0451J508J9540P065j2848k019k84L3045j3563
$$ y = [81508, 101936, 103361, 115362, 114893, 128153, 135335, 84828, 108547, 101853, 125158, 117662, 86069, 116308, 104236, 72743, 106960, 71552, 93989, 117088, 114122, 118288, 136838, 116638, 105725, 144695, 185283, 184293, 90239, 77173, 145082, 181842, 144718, 109701, 166864, 127917, 122364, 133538, 90902, 106548, 122389, 78507, 74868, 75640, 132779, 139415, 97009, 71509, 84694, 90704, 88380, 90338, 124133, 111304, 105351, 139153, 126458, 141290, 89629, 91480, 159097, 193994, 175169, 149538, 173702, 151516, 86186, 77359, 91215, 120484, 69086, 65358, 117178, 97755, 94207, 105969, 161000, 145337, 143480, 153319, 132028, 117874, 94387, 112553, 141201, 109647, 77254, 89391, 72218, 65270, 41371, 81822, 83330, 102870, 109935, 97087, 95068, 94784, 127829, 114266]
5015A14266J3411l6044l0952j3154k6158M2394Q4295J1185l4803J8843J784m860
5003A40207k9946M9498M931k4181k5427j8035L9338j14j606K3498l078R278j0101
4990A54262k207J2163Q858k6722j0749j9830k407K1278p433L646J0909l5977p349
4977I8442K6151J6107n212J4496J92j5756l3665J4061J5575O733k712J8930l694
4964A49648L6100l1193k9494O273l6900L9873k161k6561J399j0854K0201j7337
4952I8994L331K7119N79j1781K033L3020k2556k0004P18K921J2237K7914j3932
4939A40593k971k1676M3728J2387n5359m2539l079l302K625K7640J0835l4466
4927G4416O1053J6328q993J0581j8048O456M220k5437N363M521j1094L902N886
$$ y = [114266, 127677, 91633, 60681, 47527, 21369, 63763, 148058, 159243, 124440, 143283, 145067, 140207, 110261, 159759, 164690, 140509, 115082, 97047, 136385, 136271, 134665, 158163, 155085, 164363, 154262, 152055, 164218, 173076, 146354, 135605, 115775, 113368, 134646, 127213, 130859, 141768, 105791, 98442, 124593, 140700, 135488, 149984, 150176, 134420, 100755, 114816, 130391, 137124, 134412, 153342, 149648, 185748, 154555, 125061, 131334, 94434, 134307, 132146, 105585, 106984, 96130, 116331, 98994, 102325, 129444, 130023, 118242, 120275, 153295, 130739, 110735, 111453, 114374, 126611, 154525, 140593, 137622, 115946, 159674, 172061, 116702, 74163, 71084, 67782, 70407, 98047, 108882, 74416, 135469, 151797, 142804, 153385, 135337, 141793, 146013, 120576, 125939, 130460, 119366, 123268, 129154]
4914A29154j5832N5198R960j010L9417k0416l8961p577K225L921L8123j720j8436
4901A74046j0455j3485M8224k2578p466J9786k9268R582Q737J2492L004l6423
4889A56196L2803j5404m6351q648K6092j1824M3300r682k2057N6077k6609r703
4877A64190j3047k2185J6188J1391n908M4049k0218l801k7354L2127l973K1658
4865A93117q468m619r173l6526j3317J6524K3772j1348J1913N11L406m5075K5819
4852A46536N365q463l0357M143j2756K1501M8517J2652L1246J8004l9835l6667
4840A59886O923J1123J5064J740j8918l6372n690k8455K2634K6450R5058n5412
4828A94031n0543J3914J4270K1490j1185k4122r271N8592j3716r541L360m5245
$$ y = [129154, 113322, 168520, 178480, 177470, 216887, 196471, 157510, 149933, 152158, 156079, 194202, 192482, 174046, 163591, 150106, 198330, 175752, 168286, 188072, 158804, 168386, 177123, 189615, 192619, 156196, 188999, 173595, 127244, 118596, 144688, 132864, 176164, 166482, 144425, 200502, 173893, 164190, 151143, 128958, 145146, 156537, 150629, 194678, 174460, 170659, 143305, 175432, 171459, 193117, 184649, 180030, 170857, 134331, 121014, 137538, 161310, 149962, 161875, 162386, 165792, 120717, 146536, 151901, 143438, 113081, 117224, 104468, 125969, 174486, 187138, 218384, 236388, 196553, 159886, 166809, 177932, 192996, 194736, 175818, 139446, 133756, 105301, 127935, 154385, 249443, 194031, 143488, 157402, 171672, 193162, 181977, 157855, 148584, 207176, 193460, 183919, 187279, 142034]
4816A42034L8171L3134J2846N211o4107K4321M555k4839N980K3749J3860j9782
4804A95133q505J4208j7959n095J7570r586l0760J1375J7824N0856j3985k8724
4792A92352L2925K844j9637K6624n7098K2389J3264k1571J776k2196K8135l076
4780A96731j4952k8535r874q244K377L8255J7231j4838j8011J3121j6157k1530
4768A35574M4075K2276L5439k3855k7786J1907K6009m2460k4130K8008J4099J2856
4756B12012M5199k6685j1083k8872Q29L2659R587L1203k7533l7293j5775n4666
4744A29582k107J2783j2858K9664J5954K2257L876j7368M8445K0324l0391M537
4732B24698J0644M8036J1011k8034l8818m756J2282k0825k0958j9109M7501l952
$$ y = [142034, 180205, 213339, 226185, 231396, 167289, 191610, 196165, 171326, 177306, 201055, 214915, 195133, 186628, 200836, 182877, 177782, 195352, 185766, 155006, 166381, 184205, 235061, 221076, 192352, 225277, 228121, 208484, 235108, 178010, 200399, 213663, 192092, 193868, 171672, 199807, 196731, 181779, 153244, 143370, 135126, 137503, 175758, 192989, 178151, 160140, 173261, 157104, 135574, 179649, 201925, 237364, 213509, 185723, 197630, 223639, 181179, 157049, 185057, 199156, 212012, 257211, 230526, 219443, 190571, 191400, 224059, 233646, 264849, 237316, 200023, 184248, 129582, 127475, 140258, 127400, 157064, 173018, 195275, 199151, 181783, 230228, 250552, 220161, 224698, 235342, 283378, 294389, 266355, 227537, 222781, 235063, 214238, 193280, 174171, 221672, 217720]
4720B17720m538l932k4809J485K671l7307O597K0725o503L8118o1Q536n122L070
4706B16650n2653J7812M5679n4614k8687L1876K2652L7009J1157j8056n4470Q768
4694A83123M7267m9616J24K2246R864r928O230L6606m8101l1363K1185l177J4410
4681A98870L3392J9834m8712q105R931k5321J2767N906k2050N0185K8859l1886
4669B23670l7194M5358J8967l9489j8231K2839k4395o130L1703n1546M4747J3655
4657B23954m9827R025M2824k2083N838L2498N512k6460o158j450j580J8162n2962
4644A77293l2906N7725m8416j7024K6592j1478K9076K0660n417K225K0769L134
4632B22233n9305j1616J6327K9820N5595K9521k2366R046j6826J0452K4350k1954
$$ y = [217720, 213182, 209250, 184441, 185926, 188597, 151290, 157887, 178612, 172109, 210227, 210166, 218702, 213580, 216650, 163997, 181809, 227488, 172874, 144187, 176063, 198715, 235724, 246881, 228825, 174355, 183123, 230390, 180774, 180898, 203144, 213008, 203080, 209310, 245916, 197815, 166452, 187637, 184460, 198870, 232262, 252096, 203384, 195279, 205210, 179889, 192656, 198562, 176512, 226697, 255556, 223670, 186476, 231834, 250801, 211312, 193081, 215920, 191525, 185395, 217098, 165552, 210299, 223954, 174127, 183152, 225976, 203893, 209731, 242229, 247741, 221281, 215123, 213673, 212093, 230255, 177293, 144387, 202112, 153696, 136672, 163264, 151786, 180862, 201522, 196105, 198330, 219099, 222233, 162928, 151312, 167639, 197459, 253054, 282575, 260209, 269255, 252429, 262881, 287231, 265277]
4620B65277l8666l976J6390J5232p867m71K628k6224J3115l193j2794j0204N2650
4607B61897K2556j7305j8352l0643N1193q996j1518K0886J4302L0897k3873k3976
4595B67068j1492M5352n5455J7420K778m0162L2135k6293K8497N059o4360j7341
4583A83206K7620N3988Q972j044M421l1401j3743J4217K8059p537L1101k981J3461
4570C08339q643j5692J5083j1928L31Q73K1739l9577j035M838m3104j5554l902
4557B11768K3752L0641N13J5856j2294n781q014J0156K7653L9640J3837l7984
4545C09743k2967P044O317Q846K5744J4290m4391j339J6961K3898l3791P020j8743
4532B98632n5097j6860L7926O0042M9259K4545m4126R766M967j7440R689j0692
$$ y = [265277, 226611, 222635, 239025, 254257, 246390, 245919, 248547, 222323, 235438, 232245, 219451, 209247, 261897, 284453, 267148, 248796, 218153, 269346, 260350, 248832, 269718, 284020, 314917, 291044, 267068, 255576, 300928, 245473, 262893, 265671, 225509, 257644, 231351, 259848, 264907, 200547, 183206, 210826, 264814, 273786, 272742, 277163, 245762, 232019, 246236, 274295, 266758, 297859, 294878, 308339, 299696, 284004, 299087, 287159, 287490, 288363, 310102, 270525, 269490, 274328, 231224, 215670, 211768, 235520, 266161, 266674, 282530, 270236, 264455, 256441, 266597, 294250, 333890, 347727, 309743, 286776, 293820, 300137, 308983, 334727, 349017, 304626, 303287, 320248, 344146, 310355, 317375, 298632, 243535, 226675, 264601, 324643, 373902, 398447, 354321, 364087, 369054, 351614, 361303, 350611]
4520C50611k0819K6788O2498m8960j8435K8998k2527l6923K3076L67J2235j0011
4508C46898m5424L4047J4831j1531J2585R250J1515N223J8983r051j1544j7439
4496C58343k2800k6765N4592J7643k2147M0790K9729J0208p544K4432l6917J1906
4484D31470j5247K1061L6322J9561k9947n225l6876J1430L3226l023j1071M1498
4472D93179n459J1666J7312m6625k3780k097J1805K5713M7515J0281J987k0960
4460E20537l373L4352J1976K6160N3542K491j9336K865N36M8473L9748N5933R1968
4447H65872K4016m7380N7247M9717N0224k9575n22K8508q2177N734O0064J4705
4435I96433K8902L1334m6033j7303M7187j86m848N0173L5983L0469J3745J16942
$$ y = [350611, 329792, 356580, 419078, 370118, 351683, 380681, 358154, 321231, 344307, 344674, 356909, 346898, 301474, 335521, 350352, 338821, 351406, 360656, 372171, 377394, 396377, 387326, 375782, 358343, 335543, 308778, 363370, 381013, 358866, 399656, 429385, 439593, 432049, 456481, 419564, 431470, 416223, 437284, 473606, 493167, 463220, 457995, 421119, 432549, 465775, 462752, 451681, 493179, 487720, 499386, 516698, 470073, 446293, 444196, 456001, 481714, 529229, 539510, 541497, 520537, 517164, 551516, 563492, 589652, 643194, 645685, 626349, 629214, 629750, 678223, 717971, 773904, 865872, 889888, 842508, 899755, 949472, 999696, 970121, 969599, 998107, 915930, 921664, 981728, 996433, 1025335, 1056669, 1010636, 993333, 1040520, 1040334, 1035486, 1085659, 1121642, 1152111, 1165856, 1282798]
4423A282798P6752K5777P6686L6604L3648M4587O2716L7392O3283k4129l1695
4412A684419R131j49078j31566j35241l1045p0913k9238k4174l9485n5164n0516
4401I77130l3991p560j1111o3826k5757l3895L3328P808j7120L1064L6424L6987
4389I29481j5864l2170P6340K9858N0704L2184p2670k5164k0791q5280q8026q0114
4377F98488o001j0394n3840j7173K4743k0746Q880l2192r183J8219K5277j4928
4365F11150Q10k0988o444j5179J329N1557k3917J7630n7135p559k3020J7414J2369
4352E58017m5853p343l3771M9572L1442l2395M363k2572l216M2355k855n9200
4340D78544j6614M2627j2397j906J3383k0842L1835j3403j5080M1665K8934K4523
$$ y = [1282798, 1359550, 1385327, 1462013, 1498617, 1532265, 1576852, 1639568, 1676960, 1740243, 1716114, 1684419, 1693550, 1544472, 1412906, 1277665, 1246620, 1175707, 1146469, 1122295, 1082810, 1027646, 977130, 943139, 935579, 924468, 860642, 834885, 800990, 834318, 842126, 825006, 856070, 892494, 929481, 913617, 881447, 957787, 987645, 1038349, 1070533, 997863, 972699, 951908, 866628, 778602, 698488, 692487, 682093, 628253, 611080, 635823, 615077, 623957, 591765, 582582, 600801, 626078, 611150, 611960, 590972, 584528, 569349, 570678, 622235, 598318, 615948, 558813, 551254, 528234, 545648, 558017, 512164, 504821, 471050, 520622, 552064, 519669, 524032, 501460, 498244, 540599, 537744, 478544, 461930, 504557, 492160, 490254, 503637, 482795, 514630, 501227, 486147, 527812, 556746, 581269]
4328E81269k5542m5601l7407M6327O6740k4078j9377j1257L2404k8634j0125K4158
4316E48877o575o1096Q093K9457L0979K069J1005L0610o233q480j8805l7840J7937
4303E39998Q475k1635N1946K6371r830M360n9291m1008P57K8469J1382o234J3787
4290E47547M4058p730j9653j397j1509J9368J5680J8805l236m7320n329K2957
4278E72241l3097J1470M648N794M6046r746j9180J2211K3042l7032n3697k5821
4266D96879M9510P7754J1408j3478m2170j0635r585N0525M4343j1389k6121k828
4254F14213k071R0849k3161k5591Q1839j8579K3061O5290J0853L6125L1025M6554
4242I30407K7476P1170N2130O1780k4901r2039j8142m2086j5510m8996m1628L1944
$$ y = [581269, 555727, 510126, 472719, 519046, 585786, 561708, 542331, 531074, 563478, 534844, 524719, 548877, 542302, 481206, 489299, 518756, 549735, 551804, 562809, 593419, 587186, 578706, 559901, 522061, 539998, 548473, 526838, 578784, 605155, 595325, 599685, 540394, 499386, 500143, 528612, 539994, 533760, 547547, 591605, 583875, 564222, 562825, 551316, 570684, 586364, 605169, 601933, 554613, 549284, 572241, 539144, 550614, 555262, 561056, 607102, 597356, 578176, 590387, 613429, 576397, 522700, 496879, 546389, 624143, 635551, 622073, 579903, 569268, 559683, 610208, 654551, 643162, 617041, 614213, 612142, 702991, 679830, 654239, 736078, 717499, 740560, 805850, 816703, 852828, 883853, 930407, 957883, 1029053, 1081183, 1142963, 1118062, 1026023, 1007881, 965795, 950285, 901289, 859661, 891605]
4230H91605j5313R745n1924R192K1684K1098j7344j1256L8094q983L895K2328
4218I12821O3044M8094O9635J9463O0935r180R6357J07146J10841R7023J21758
4207A697937J31881O671j48765j85157k05053j22747k0824o3343N488l8031m7363
4196A010694m0433P42m923K6610N073n3693j8137M6801K0332j8767m0636k6379
4184I07284M0297N4941P934M4324l574N7047P7587J473Q7615J07170L267q7111
4172A298254p2882n9497m6690m2366p3618o850l9950L658l0676p8647N810K4032
4160H80578k7493n712j992n4362L8381K67k8930L9166j2627k6450l9078K144L8337
4147H02229Q4159k6938o1274P1823K0429k8956J8290K3474m4003K3935j656r907
$$ y = [891605, 876292, 886037, 834113, 843305, 864989, 886087, 868743, 857487, 895581, 886598, 890493, 912821, 975865, 1023959, 1093594, 1113057, 1173992, 1164812, 1261169, 1368315, 1479156, 1576179, 1697937, 1829818, 1836489, 1687724, 1502567, 1297514, 1174767, 1153943, 1090600, 1096088, 1058057, 1010694, 970261, 971003, 966080, 992690, 997763, 944070, 925933, 972734, 993066, 974299, 933663, 907284, 947581, 1002522, 1010456, 1054780, 1051206, 1108253, 1185840, 1187313, 1274928, 1382098, 1385365, 1298254, 1225372, 1165875, 1119185, 1076819, 1003201, 996351, 956401, 960059, 929383, 850736, 856546, 880578, 853085, 847373, 845381, 791019, 829400, 829667, 800737, 839903, 827276, 800826, 761748, 763892, 802229, 886388, 859450, 798176, 869999, 890428, 861472, 879762, 903236, 859233, 883168, 881512, 871605]
4135H71605J1344M9813K8805m2478j3755M1360o31j4061K0893L001J0981j4737
4123I52140J9548Q639k46M2743j7453r866K6311j1122L4632O2436L1039J3373
4111A152174j7909J8945N5066M008M865J8079J3187L5410M8915J01426P8099Q2393
4099A594658M4050J62309J31067Q4999J25962K31314J34398N3096p0733j58166
4089B332954k66974k29999j66321r8293q9286o7899N484n8580q6606l4472J2933
4078A252941l699k3526j7734L979Q619j6537L2520N4439L0792k3861k5829N038
4066A277142r194N328J9164M0844L6444L4833m6036m419P747n1111K8701P4961
4054A414404N834m6117m750L4734n565M1162K8547L9659J9653L1961K3983K7778
$$ y = [871605, 882949, 932762, 961567, 919089, 905334, 946694, 946063, 932002, 952895, 955896, 966877, 952140, 971688, 980327, 980081, 1022824, 1005371, 995505, 1021816, 1010694, 1045326, 1107762, 1138801, 1152174, 1134265, 1153210, 1208276, 1212284, 1217149, 1235228, 1248415, 1283825, 1332740, 1434166, 1512265, 1594658, 1638708, 1801017, 1932084, 2017083, 2143045, 2374359, 2508757, 2561853, 2491120, 2332954, 2065980, 1835981, 1669660, 1571367, 1482081, 1414182, 1419666, 1361086, 1274480, 1240008, 1252941, 1249242, 1225716, 1207982, 1211961, 1220580, 1204043, 1236563, 1291002, 1321794, 1297933, 1272104, 1277142, 1267948, 1273276, 1292440, 1333284, 1369728, 1404561, 1358525, 1354106, 1361853, 1310742, 1339443, 1414404, 1420238, 1374121, 1369371, 1404105, 1398540, 1439702, 1468249, 1507908, 1527561, 1559522, 1583505, 1611283]
4042A611283K0938l551K706J4868k4198O5351K9386J8735L3635J8836L3534K9435
4030A850958M3451J9461L0614P2648J05397Q3554Q5437O6321R9943J14598J75868
4019B748250K33506J57721J66185J0711j37795j48166j00344k02227j24807j19606
4009B483428j51191l4148m9224n0617j3166K2242K537K711J6255k6110M4732M3703
3997B291152k0506L6836L5810j3450j5992K1697P7751j0762K2133L8949J9077
3986B482695j6906l853J4571M5095K0924K5211K8774J4677J5310J8253L9237O4741
3974B748729J4008J1425M1663K5888M1104M0282K8716K9120N9902M5008K8338
3963C114183L8985O4050J9280J0731m522P1582N0430K0793M6609M9420P2312N9564
$$ y = [1611283, 1632221, 1628670, 1631376, 1646244, 1622046, 1687397, 1716783, 1735518, 1769153, 1787989, 1821523, 1850958, 1894409, 1913870, 1944484, 2017132, 2122529, 2206083, 2291520, 2357841, 2457784, 2572382, 2748250, 2981756, 3139477, 3305662, 3316373, 3178578, 3030412, 2930068, 2727841, 2603034, 2483428, 2332237, 2298089, 2248865, 2198248, 2185082, 2207324, 2209861, 2212572, 2228827, 2202717, 2247449, 2291152, 2270646, 2307482, 2343292, 2329842, 2313850, 2335547, 2413298, 2402536, 2424669, 2463618, 2482695, 2465789, 2461936, 2476507, 2521602, 2542526, 2567737, 2596511, 2611188, 2626498, 2644751, 2683988, 2748729, 2762737, 2774162, 2815825, 2841713, 2882817, 2923099, 2951815, 2980935, 3040837, 3085845, 3114183, 3153168, 3217218, 3236498, 3247229, 3242707, 3314289, 3364719, 3385512, 3432121, 3481541, 3553853, 3613417]
3951C613417p057Q2111N6194N7797N2349Q1567P0378L774O9164M1144O3427R3554
3939D277819J70707J02340Q2370J37038J57972J59031J53253J55572J32605K44249
3929E772956K39211K34770K78547L27061L26363L23682L26507L84190J94820j01997
3919H306110j04333o836P8807J29906K58373L47927M31320M55456O24480O40710
3909A1161920O35659N58461L03287K90727M85694M82297L59684l0577m35547l80340
3899A3431265j77959R6716L28247N68678O69775P96769Q69235R36184O59807K04819
3889A8383536k38869m96445n07901j93575K0749J41166n7524j65113O0154L50250
3879A7296428M60111M23807K36787K84599M78978N94427M46964j24826p78844
$$ y = [3613417, 3606360, 3688471, 3744665, 3802462, 3854811, 3936378, 4006756, 4010530, 4079694, 4120838, 4184265, 4277819, 4448526, 4550866, 4633236, 4770274, 4928246, 5087277, 5240530, 5396102, 5528707, 5772956, 6012167, 6246937, 6525484, 6852545, 7178908, 7502590, 7829097, 8213287, 8408107, 8306110, 8201777, 8194941, 8273748, 8403654, 8662027, 9009954, 9441274, 9896730, 10521210, 11161920, 11797579, 12356040, 12659327, 12950054, 13435748, 13918045, 14277729, 14247152, 13811605, 13431265, 13253306, 13350022, 13678269, 14246947, 14916722, 15713491, 16582726, 17518910, 18178717, 18383536, 18144667, 17648222, 17140321, 16946746, 16967495, 17108661, 17051137, 16886024, 16946178, 17296428, 17756539, 18180346, 18417133, 18701732, 19180710, 19775137, 20222101, 20097275, 19318431]
3870A9318431r93630r41652o73867k82475k2843J75355L86858N58795P10225O45562
3860A8880759N04337j1436n89098o18774m41312k68616k39215n92085p30491o12404
3850A5281665m67545j67519p4709N8019J57705K78250K39600K36703J88866Q6877
3840A5817912l83830o37918n59126m54019l00130j65758j24561n4142j6375p425
3830A3114628L732O2028M8217O5790J00505J09452J21043J13065J69392J99586
3820A4107438K54635J69172K07379J86312J76995J69868K01058J47522J83436
3811A5803815J81519J69366K95628L06082M24280L46842M22467N08488M57664
3802A8916151N33175O27907P06782Q08348Q21746Q74710R53522J018060J058543
$$ y = [19318431, 18324801, 17383149, 16709282, 16426807, 16403964, 16579319, 16966177, 17524972, 18235197, 18880759, 19385096, 19373660, 18784562, 18165788, 17724476, 17455860, 17216645, 16624560, 15894069, 15281665, 14814120, 14646601, 14571892, 14629911, 14787616, 15065866, 15305466, 15542169, 15731035, 15817912, 15434082, 14796164, 14237038, 13783019, 13482889, 13317131, 13192570, 13138428, 13122053, 13114628, 13118360, 13180388, 13228605, 13294395, 13394900, 13504352, 13625395, 13738460, 13907852, 14107438, 14362073, 14531245, 14738624, 14924936, 15101931, 15271799, 15472857, 15620379, 15803815, 15985334, 16154700, 16450328, 16756410, 17180690, 17527532, 17949999, 18458487, 18916151, 19449326, 20077233, 20784015, 21592363, 22414109, 23288819, 24242341, 25260401, 26318944]
3793B6318944J168185J180105J213851J297505J409032J454284J561248J651540
3785C7254694J778066J879126K119208K433102K933201L459700M044431M558563
3777F0460091N222818N924549O839106P565433Q723479R919236J1685931J4094770
3769A30435413J7150387K0282299K3749136K6856672K9195984K9476910K2269462
3762B99416263j584711k1090991l4772814m6947177l9564982k6976391j8408582
3755A10070615j3174133j0037662p829904o186835n307875m412402l785679l450882
3747E5885243l047918k586328k371454j999755j839879j634907j494823j308027
3739C9602152j155963r25536p63500o02424o07026m20923k79256j79579p1269
$$ y = [26318944, 27487129, 28667234, 29881085, 31178590, 32587622, 34041906, 35603154, 37254694, 39032760, 40911886, 43031094, 45464196, 48397397, 51857097, 55901528, 60460091, 65682909, 71607458, 78446564, 86011997, 94735476, 104654712, 116340643, 130435413, 147585800, 167868099, 191617235, 218473907, 247669891, 277146801, 299416263, 297831552, 276740561, 241967747, 195020570, 155455588, 128479197, 110070615, 96896482, 86858820, 79028916, 72842081, 67534206, 63121804, 59336125, 55885243, 52837325, 50250997, 47879543, 45879788, 44039909, 42405002, 40910179, 39602152, 38446189, 37520653, 36757153, 36154729, 35547703, 35126780, 34847524, 34667945, 34596676]
3730C4596676O1628J33692K60643L90196N83050P24474R17012J062169J135168
3721C9864708J164854R85158M29086l01492p86280o67312k53440J3126L27234
3712D0775642O32448Q46829J046311J322682J556881J825972K077464K376429
3704E2460658K789547L271420L636371L746209L669389L826135M390963N291152
3696H3081844O496581P888680R548371J1515466J4198742J6931739J9770316K3102599
3688A92534338K6312674K7823815K7014352J3514583j0576909j6793414k0761440
3681B39067999l8584150m0748288k8847069j9587626j3759479j0450556p984583
3674G9106248o353027n275661m306156l305627k939510k403341j903909j496497
$$ y = [34596676, 34658304, 34791996, 35052639, 35442835, 36025885, 36750359, 37667371, 38729540, 39864708, 41029562, 42014720, 42443806, 42142314, 41356034, 40688722, 40435282, 40448408, 40775642, 41408090, 42254919, 43301230, 44623912, 46180793, 48006765, 50084229, 52460658, 55250205, 58521625, 62157996, 65904205, 69573594, 73399729, 77790692, 83081844, 89578425, 97467105, 107015476, 118530942, 132729684, 149661423, 169431739, 192534338, 218847012, 246670827, 273685179, 287199762, 276622853, 259829439, 239067999, 200483849, 159735561, 130888492, 111300866, 97541387, 87090831, 79106248, 72753221, 67477560, 63171404, 59865777, 56926267, 54522926, 52619017, 51122520]
3666E1122520j119893o93384l90490k11592p5416j11787o70282j805880k824449
3657D3219347l097429k589048j900918j471735j143526r13124n62163l85693k18235
3648C0937476N155K56464M14758N54049N98644M80940N4697r55638j980866k460872
3638B7904807k342179j895242j527456j180277j015028p99101o52892n36692l89987
3629A7565953l39421k62724j27132p2422N282O6124J16726K16601K88609L03458
3619A7761054M06221N30332P23096Q72390R67149J065786J161442J039651J98578
3610B4725699j122057j932301j779809j271400p42400m09845k09573M6137J48675
3601A7453126L52515N76586P16558R07092J104262J303448J560451J817841J844410
$$ y = [51122520, 50002627, 49309243, 48918753, 48707161, 48631745, 48519958, 47849676, 46043796, 43219347, 40121918, 37532870, 35631952, 34160217, 33016691, 32103567, 31541404, 31155711, 30937476, 30942631, 31199095, 31613853, 32167902, 32766546, 33247486, 33302183, 32346545, 30365679, 27904807, 25562628, 23667386, 22139930, 20959653, 19944625, 19145524, 18492632, 17955940, 17565953, 17226532, 16963808, 16836676, 16764254, 16769536, 16835660, 16952386, 17168987, 17457596, 17761054, 18167275, 18697607, 19420703, 20293093, 21260242, 22326028, 23487470, 24527121, 24725699, 23603642, 21671341, 19891532, 18620132, 17877732, 17467887, 17258314, 17304451, 17453126, 17805641, 18382227, 19098785, 20005877, 21110139, 22413587, 23974038, 25791879, 27636289]
3592B7636289J450963M62039j99378j81300J28867m55485j803292k805876k756214
3583B1476613k078699j476218r97420o24442m22054k69545k6306J94192L24116
3574A6100237N60542P12010Q81279R71794J028031R82567L88072r32431k247399
3565A8444702k561601j984084j390339j060128q15026o69069m50744m07680l57633
3556H748398l21763k96253j96388k11135k40493j73727j41947j55158j36905j14567
3546F760062j30215j29391j12048m2711q8741n8961j12794o3196J6920o1988j3645
3535E963292o5234o6719n6865k062n5761n4888l5386K5859L8513j4182l1218j0419
3523E634930j0061Q2932P6770Q2915M9267R1365P1800R2926R5926N1527J05156
$$ y = [27636289, 29087252, 29549291, 29349913, 29168613, 29297480, 28841995, 27038703, 24232827, 21476613, 19397914, 17921696, 16924276, 16299834, 15877780, 15608235, 15581929, 15776121, 16100237, 16660779, 17372789, 18254068, 19225862, 20253893, 21236460, 21624532, 20692101, 18444702, 15883101, 13899017, 12508678, 11448550, 10633524, 9964455, 9513711, 9106031, 8748398, 8426635, 8130382, 7933994, 7722859, 7482366, 7308639, 7166692, 7011534, 6874629, 6760062, 6629847, 6500456, 6388408, 6345697, 6256956, 6197995, 6085201, 6022005, 6038925, 5976937, 5963292, 5898058, 5831339, 5774474, 5772412, 5716651, 5661763, 5626377, 5652236, 5690749, 5676567, 5645349, 5634930, 5624869, 5707801, 5784571, 5867486, 5916753, 6008118, 6079918, 6172844, 6268770, 6320297, 6425453]
3512F425453J91044J55244J78198K89731K53136K90175L71595L94203M66727N13925
3502I529431N96177O62955Q02704R81101J133314J297114J417491J525182J429275
3493A9374744J035407L69210p08113j682281j985704j893616j437129j057129
3485A2015389p85050n73390l54344k34621j79776j07765L66L7404Q2923J73483
3475A0074619J96480K32512K91874L87558N83057O17993P94119R85898J125323
3466A5289433J245536J279796J264513R67819L76719n57444j389685j626545j574857
3457A5275285j205537p20845m78574l31560j81995M185J54001K54973L70267M32765
3447A3572965N54706P20851Q48021J149564J306222J591358J844064K123243K288976
$$ y = [6425453, 6616497, 6771741, 6949939, 7239670, 7492806, 7782981, 8154576, 8548779, 9015506, 9529431, 10125608, 10788563, 11591267, 12572368, 13705682, 15002796, 16420287, 17945469, 19374744, 20410151, 20779361, 20071248, 18388967, 16403263, 14509647, 13072518, 12015389, 11230339, 10656949, 10302605, 10067984, 9888208, 9780443, 9780809, 9818213, 9901136, 10074619, 10271099, 10503611, 10795485, 11183043, 11766100, 12384093, 13178212, 14164110, 15289433, 16534969, 17814765, 19079278, 20047097, 20423816, 19866372, 18476687, 16850142, 15275285, 14069748, 13348903, 12870329, 12538769, 12356774, 12360959, 12514960, 12769933, 13140200, 13572965, 14127671, 14848522, 15696543, 16846107, 18152329, 19743687, 21587751, 23710994, 25999970]
3438B5999970K385855K179057J277704k3823r26178j287387j236948j071812q99951
3429B6396487n14325j97728K40136N20410O46079M48479j96309j359428k056094
3420B3927707j798130j042009l72950J82035M82408P54789R06441P91942K11833
3411B4044066p51517j331617j134073n08246R2101M92172Q58315R48077P79963
3402B3489241L95319o0765n83136j374608k256160k711122k349662j758842j325323
3393A1464942j039624q18484o85628n21639m95434m43185l65586l44537k90938
3384F459887k45562k95477j89954k03207j56255k10688j34461j03153r9058p3113
3374D748959r5908r2915j03250r521l6337K8677k6166l9481k1039N0688j4374
$$ y = [25999970, 28385825, 30564882, 31842586, 31818763, 30892585, 29605198, 28368250, 27296438, 26396487, 25882162, 25684434, 25924570, 26444980, 27091059, 27539538, 27343229, 25983801, 23927707, 22129577, 21087568, 20714618, 20896653, 21379061, 22133850, 23040291, 23832233, 24044066, 23292549, 21960932, 20826859, 20318613, 20410714, 20902886, 21761201, 22709278, 23489241, 23884560, 23823795, 23240659, 21866051, 19609891, 16898769, 14549107, 12790265, 11464942, 10425318, 9606834, 8921206, 8399567, 7904133, 7460948, 7095362, 6750825, 6459887, 6214325, 5918848, 5728894, 5525687, 5369432, 5158744, 5024283, 4921130, 4822072, 4748959, 4653051, 4560136, 4456886, 4447365, 4411028, 4439705, 4413539, 4374058, 4353019, 4403707, 4389333]
3363D389333p1618j85838j96660j05109j10885n5417o3320o954j0206m2094O7410
3352C608642J24439J40735J22015m3966j25948j43738j97857l17894k52663j65202
3342B748563j04257k5820q4427j05606n9940r9439m9356m0300q9081k1303o2235
3331B006799m2576n7447M13j3476n2993J7584j1754j7222j6024l3323j7694n3143
3319A709144l0213l447n7214l9770p4314L3155m2597l6081j3400k3728M2304l0396
3307A433443l2276l7595K8925j8756o1688p443j1351K4228K7472J7092J8571J9650
3295A400272r017l6712o2176k8297K6379L6769j4365l177k8694n990j1870k1361
3283A241761M7791J5398j6619l4883k930Q842L2939M465j0865O114J1844j2116
$$ y = [4389333, 4317715, 4131877, 3935217, 3830108, 3719223, 3663806, 3600486, 3593532, 3583326, 3541232, 3608642, 3733081, 3873816, 3995831, 3951865, 3825917, 3682179, 3484322, 3166428, 2913765, 2748563, 2644306, 2618486, 2534059, 2428453, 2368513, 2269074, 2219718, 2179418, 2090337, 2069034, 2006799, 1964223, 1906776, 1907189, 1893713, 1840720, 1858304, 1846550, 1829328, 1813304, 1779981, 1762287, 1709144, 1678931, 1675484, 1618270, 1578500, 1504186, 1537341, 1494744, 1458663, 1445263, 1421535, 1463839, 1433443, 1401167, 1363572, 1392497, 1373741, 1312053, 1304610, 1293259, 1317487, 1344959, 1362051, 1380622, 1400272, 1391255, 1354543, 1292367, 1264070, 1290449, 1327218, 1312853, 1309676, 1280982, 1274992, 1263122, 1241761, 1289552, 1304950, 1288331, 1253448, 1250518, 1259360, 1292299, 1296764, 1285899, 1292013, 1303857, 1291741]
3271A291741r287K7492O763R133K5396M4484K5079K5227J6240N1947Q2865M5694
3259A642774J9872J0604K5283L0413p39k7761j8826L423J9494P2824J5842O3785
3247A856988P1559J753M5597O8541N4680P8280J28092j1915m3802J9789K2910
3236B292472j0963m8659q9746j20857n7364j07853m7835J2003k0226J058l6191
3225A765839j0570k022K5881k5448M5838j2260o6632k6483P752j9065O820L5090
3213A724740j7878j0452l5463p918l4737J640L5400j1524j3919K0539J3420o299
3201A657549q1252p3232J0829J8077n941J9809K4170L382r162K3579M1169L4740
3189A663717k5048q316O17p5460m4047l7855j7702l5830J8749j6409j2180N2229
$$ y = [1291741, 1282454, 1309946, 1316709, 1325842, 1351238, 1395722, 1420801, 1446028, 1462268, 1514215, 1597080, 1642774, 1662646, 1673250, 1698533, 1728946, 1728207, 1700446, 1681620, 1685043, 1704537, 1777361, 1793203, 1856988, 1928547, 1930300, 1975897, 2044438, 2099118, 2177398, 2305490, 2293575, 2249773, 2269562, 2292472, 2281509, 2232850, 2143104, 2022247, 1964883, 1857030, 1809195, 1821198, 1800972, 1802030, 1765839, 1755269, 1753247, 1779128, 1753680, 1799518, 1787258, 1720626, 1694143, 1701895, 1682830, 1689650, 1724740, 1706862, 1696410, 1660947, 1653029, 1618292, 1619932, 1655332, 1643808, 1629889, 1650428, 1663848, 1657549, 1576297, 1503065, 1513894, 1531971, 1526030, 1545839, 1570009, 1573391, 1564229, 1587808, 1628977, 1663717, 1638669, 1630353, 1630970, 1555510, 1511463, 1473608, 1455906, 1420076, 1438825, 1422416, 1410236, 1462465]
3177A462465Q386q14q811L2907j0865J8651j3549j9352P1048P4741k4069o5600
3165A525138K4175m2756m6082j435Q752l4637k8913j1782j3485k6726q748N576
3153A349077L7339N1018j2611J2808P1735K4249J8902l7741K1070J5285J9117
3142A570248n323K0968L0638k5012j7045M5725J5756k7013J6735N508j4611J3313
3130A629887M4284j4147L2526o1141j11856o7777J0738k2629M743K5534J1829
3119A481991k6869l8722J2059r123j6260M6253n8784j4050K8461L7977J0316P370
3107A460619J0438m2199r168j005L0113l9383q510m9459r369P8841O124q5512
3095A341530M5015N8740n6102K1303j6163j5150r34J6710O770m671M6335l504
$$ y = [1462465, 1470851, 1470037, 1461226, 1494133, 1483268, 1501919, 1488370, 1469018, 1540066, 1614807, 1590738, 1525138, 1549313, 1506557, 1460475, 1459040, 1467792, 1433155, 1404242, 1392460, 1378975, 1352249, 1343501, 1349077, 1386416, 1437434, 1424823, 1437631, 1509366, 1533615, 1552517, 1514776, 1535846, 1551131, 1570248, 1564925, 1585893, 1616531, 1591519, 1574474, 1620199, 1635955, 1608942, 1625677, 1631185, 1616574, 1629887, 1674171, 1660024, 1692550, 1631409, 1519553, 1451776, 1462514, 1439885, 1444628, 1470162, 1481991, 1455122, 1416400, 1428459, 1419336, 1403076, 1449329, 1390545, 1376495, 1404956, 1442933, 1453249, 1460619, 1471057, 1428858, 1419690, 1418685, 1448798, 1409415, 1400905, 1351446, 1342077, 1420918, 1427042, 1341530, 1386545, 1445285, 1389183, 1410486, 1394323, 1379173, 1378239, 1394949, 1401719, 1397048, 1443383, 1439879]
3083A439879j5133J0940O314o257L6381O9641o73m0178k4198j3795O6720l4169
3071A495472l355m911p578M9453n071j7264r228l225j8840M5587L0602q423O45
3058A543864K841L9949N6788K7883N211j6287O0672J1492J767k0660O9215O8970
3046A851705k153M7889N8016J0524M3996j6982J5435j5965l1959j119j8072j873
3034A939442J2144q214K486J1164J8424N369K76M6440O7606M7385O636L8164J1874
3021B199196J304L6313M5254R0159M8894N769M9546L5511K8809O7968O9744p127
3009B671340L1031M0041P4699P8563K0153N8949N5465L221N3394L3636Q5082N6621
2997C262195N7038L4531N0284P1392J3715J05507J37371Q1003L3130O747N6429
$$ y = [1439879, 1424746, 1435686, 1442000, 1435743, 1472124, 1541765, 1541092, 1500914, 1476716, 1462921, 1529641, 1495472, 1492117, 1487206, 1479628, 1529081, 1524010, 1506746, 1497518, 1494293, 1475453, 1521040, 1551642, 1543219, 1543864, 1546705, 1586654, 1643442, 1671325, 1676536, 1660249, 1720921, 1732413, 1734180, 1713520, 1782735, 1851705, 1849552, 1897441, 1955457, 1965981, 2009977, 1992995, 2008430, 1992465, 1960506, 1959387, 1941315, 1939442, 1951586, 1943372, 1945858, 1957022, 1975446, 1980815, 1981091, 2027531, 2095137, 2142522, 2149158, 2187322, 2199196, 2200500, 2236813, 2282067, 2372226, 2421120, 2426889, 2476435, 2511946, 2540755, 2608723, 2678467, 2671340, 2702371, 2742412, 2817111, 2895674, 2915827, 2974776, 3030241, 3033462, 3086856, 3120492, 3205574, 3262195, 3319233, 3353764, 3404048, 3475440, 3489155, 3594662, 3732033, 3813036, 3846166, 3852913, 3909342]
2986C909342Q4421J7723L9409J37512J00157M4119P0084R3364P7737P3057L6022
2975D682947Q0418J20647J08932N2928J34387Q3222J20017P7587Q4019R8523J70441
2964E814068K16741J20748J90766J32389K02536K31661K14201K07318K71678K42265
2954G844371K90958L49593K99154L32811M19066L64341L82505M69617M51433N03365
2944A1707214N56004N96348O65144O37610O43605P46642Q08863P94680Q20815
2935A7976925R34428R20926R88928R93067J004745R50925J027334J086119J077620
2926B6961017J080369J143331J177349J160144J163857J203395J183322J217818
2918C6290602J163542J158091J082459J010222J008360Q99961P81154P93209P33426
$$ y = [3909342, 3993763, 4011486, 4050895, 4188407, 4288564, 4332683, 4402767, 4496131, 4573868, 4646925, 4682947, 4763365, 4884012, 4992944, 5045872, 5180259, 5263481, 5383498, 5461085, 5545104, 5643627, 5814068, 6030809, 6151557, 6342323, 6474712, 6677248, 6908909, 7123110, 7330428, 7602106, 7844371, 8135329, 8484922, 8784076, 9116887, 9535953, 9900294, 10282799, 10752416, 11203849, 11707214, 12263218, 12859566, 13524710, 14162320, 14805925, 15552567, 16361430, 17156110, 17976925, 18911353, 19832279, 20821207, 21814274, 22819019, 23769944, 24797278, 25883397, 26961017, 28041386, 29184717, 30362066, 31522210, 32686067, 33889462, 35072784, 36290602, 37454144, 38612235, 39694694, 40704916, 41713276, 42613237, 43394391, 44187600, 44921026]
2909D4921026O21066O48219N88059N79162M67516M71370L94272L25038J29757
2900D9145485l9947j25658k98119m11783m84716m82261n33494n97995o20697o20060
2890D4930755o77550p76875p40400q72070q99499j002364j108962j195836j236299
2881C6420900j315023j216928j185298j238008j213477j149045j103804j074206
2873B6925111j074419r91747j074183j022354j029490j023725j024424r80466
2865A8704303r51158q83515q31210p93582q06733p33585o45672o90788n25816
2856A1842244n36787m88292m76930m79741m90823m09244m03082l63508l22842
2847G870995l45773l25173k75177k58652k31808k71950k03764j94568j69366j93131
$$ y = [44921026, 45542092, 46190311, 46778370, 47357532, 47825048, 48296418, 48690690, 49015728, 49145485, 49105538, 48979880, 48681761, 48269978, 47785262, 47303001, 46769507, 46171512, 45550815, 44930755, 44253205, 43476330, 42735930, 41863860, 40964361, 39961997, 38853035, 37657199, 36420900, 35105877, 33888949, 32703651, 31465643, 30252166, 29103121, 27999317, 26925111, 25850692, 24858945, 23784762, 22762408, 21732918, 20709193, 19684769, 18704303, 17753145, 16869630, 16038420, 15244838, 14438105, 13704520, 13058848, 12368060, 11842244, 11305457, 10817165, 10340235, 9860494, 9369671, 8960427, 8557345, 8193837, 7870995, 7525222, 7200049, 6924872, 6666220, 6434412, 6162462, 5958698, 5764130, 5594764, 5401633]
2837E401633j51218j25392r1747j50020j42168j18531p2593n4378j28107j20425
2827D247054r1776n8854o0105q1574j9166k085j15224m3544l9802p9396m1401
2816C614127k4882l4673J9288n2812m8850j4694o1440K412j7094j29K4034k3000
2804C382287j1666n1022j1613j5476n0654R861l5332j6167N057K3650K9743j5234
2792C243434n7430k1468M7815K9741K1519Q20K4094J6213k9958P3745N8241J00393
2780C507159K5053L5435j542J8832j1436l5661M4972L3905j2678k427O9592k2245
2768C648959k6755j3484j0045L1216j5o0890l9503j9123l2644r4562n4054r628
2756C319472j5670m7077m7520n7708l5378n3531j107j8899l4140r292m3105j2767
$$ y = [5401633, 5250415, 5125023, 5033276, 4883256, 4741088, 4622557, 4549964, 4495586, 4367479, 4247054, 4155278, 4096424, 4036319, 3954745, 3935579, 3933494, 3818270, 3774726, 3734924, 3655528, 3614127, 3589245, 3554572, 3573860, 3521048, 3472198, 3457504, 3396064, 3398476, 3381382, 3381253, 3405287, 3382287, 3370621, 3319599, 3307986, 3292510, 3241856, 3251717, 3216385, 3200218, 3205275, 3228925, 3258668, 3243434, 3186004, 3164536, 3212351, 3242092, 3263611, 3264431, 3288525, 3304738, 3274780, 3348525, 3406766, 3507159, 3532212, 3567647, 3566105, 3584937, 3573501, 3537840, 3582812, 3616717, 3604039, 3601612, 3671204, 3648959, 3622204, 3608720, 3598675, 3629891, 3629876, 3568986, 3529483, 3510360, 3477716, 3383154, 3329100, 3319472, 3303802, 3256725, 3209205, 3151497, 3116119, 3062588, 3061481, 3042582, 3008442, 2999150, 2956045, 2943278]
2744B943278J1923l8388K1428J5713k5263J5983J063j5196N1164o893J6223M1147
2732C032182l8581J2561j0840n2890o7666j2200N6232k6094q1830k7412j3087
2721B770375J7691J9204N6964j1002l3924l550j8258J3554k265N0885M1952k0797
2709B880829R682j0884q74J9655O3400L6407K5289n991J8861J5008p479k0854
2697C023049J7996K0091p7447m1461L8232K6800N858q872J1795j0354q437J2302
2685C009552K3114j2289j2617K9098K3243M5778K2260j6981R648Q4707O608M1608
2673C253729r608L8148K1810P3068M9616L9929L0022L1709L7461Q9425m568m2249
2661C608492J3014N2558L9336L7781K107K3061N134m666Q4210M6360M9657Q373
$$ y = [2943278, 2955201, 2916813, 2938241, 2953954, 2928691, 2944674, 2945737, 2930541, 2981705, 2974812, 2991035, 3032182, 2993601, 3006162, 2995322, 2942432, 2874766, 2862566, 2918798, 2892704, 2810874, 2783462, 2770375, 2788066, 2807270, 2864234, 2853232, 2819308, 2815758, 2797500, 2811054, 2808789, 2859674, 2901626, 2880829, 2890511, 2879627, 2878753, 2898408, 2961808, 2998215, 3023504, 3017513, 3036374, 3051382, 3043903, 3023049, 3041045, 3061136, 2983689, 2942228, 2980460, 3007260, 3013118, 3004246, 3016041, 3005687, 2997250, 3009552, 3032666, 3020377, 3007760, 3036858, 3060101, 3105879, 3128139, 3111158, 3120806, 3205513, 3212121, 3253729, 3244121, 3282269, 3304079, 3377147, 3426763, 3466692, 3496714, 3528423, 3565884, 3655309, 3650741, 3608492, 3621506, 3674064, 3713400, 3751181, 3753288, 3776349, 3781483, 3776817, 3861027, 3907387, 3957044, 3965417]
2649C965417K6650K7650M6185K1259j5540K8994J9049J7609N5159L9568P3484
2638D305484N4243l907M7440N9662j0761M6535L1781M0819N0860J7323K647P1187
2626D713313P5712N2211N1697N7127P7923N6785Q6735Q4941N7903J39884R7595
2615E551826J06545N1306J28889N0991O3075L8748J18175R3010J09384J49176
2605F461125J27801J44079J25722J30970J19398J80563J58655J54052J56372J34322
2595G893059J41060K56528K23412J69937K08172K12116K21915K20272K53817K93519
2585A0093807K53747L26001L22126L10631L88561L64363M55095N37275M48263
2576A3499869N10135N36733N45042N22284N96208N99894N99360N74928O20467
$$ y = [3965417, 3992067, 4019717, 4065902, 4087161, 4071621, 4100615, 4119664, 4137273, 4192432, 4232000, 4305484, 4359727, 4355820, 4403260, 4462922, 4452161, 4498696, 4530477, 4571296, 4622156, 4639479, 4642126, 4713313, 4789025, 4841236, 4892933, 4950060, 5027983, 5084768, 5171503, 5256444, 5314347, 5454231, 5551826, 5658371, 5709677, 5838566, 5889557, 5952632, 5991380, 6109555, 6202565, 6311949, 6461125, 6588926, 6733005, 6858727, 6989697, 7109095, 7289658, 7448313, 7602365, 7758737, 7893059, 8034119, 8290647, 8514059, 8683996, 8892168, 9104284, 9326199, 9546471, 9800288, 10093807, 10347554, 10673555, 10995681, 11306312, 11694873, 12059236, 12514331, 13051606, 13499869, 14010004, 14546737, 15091779, 15614063, 16210271, 16810165, 17409525, 17984453, 18604920]
2567A8604920N86394M50291N58163M92846M62152N21536M83158N34873M70467
2558B3164800M66919N27633M67429M12098M17444L05805L06194K14333J28396
2549B6411051O1332O5025P2999Q0243N5320P8287J32991J06705J20999J63361
2539B7348313K51863K08958J78972J94254K36368K29287K60407L04153L33436
2530B9546011L92648M28757N38699O36630P66298P66724Q92544J019900J093061
2521C6081272J234095J430454J552015J622359J847172J971331K102486K230535
2513E0071719K364665K416764K509975K574793K527821K564386K609325K601866
2505G0241314K610786K702097K767238K744215K896937L116397L240456L275626
$$ y = [18604920, 19191314, 19641605, 20199768, 20692614, 21154766, 21676302, 22159460, 22694333, 23164800, 23631719, 24159352, 24626781, 25038879, 25456323, 25762128, 26068322, 26282655, 26411051, 26472383, 26537408, 26610407, 26690650, 26745970, 26824257, 26957248, 27063953, 27184952, 27348313, 27600176, 27809134, 27988106, 28182360, 28418728, 28648015, 28908422, 29212575, 29546011, 29938659, 30367416, 30906115, 31542745, 32309043, 33075767, 33968311, 34988211, 36081272, 37315367, 38745821, 40297836, 41920195, 43767367, 45738698, 47841184, 50071719, 52436384, 54853148, 57363123, 59937916, 62465737, 65030123, 67639448, 70241314, 72852100, 75554197, 78321435, 81065650, 83962587, 87078984, 90319440, 93595066]
2497I3595066L449459L498684L484584L604376L695624L833574L971518M135101
2489A23267986M408539M775061N252492N646369O181526O693353P258402P817742
2481A71301470Q272124Q472151Q369932P763944O670623N401913L915060K427233
2473B22594450Q71957m98808j517716k148081k408663k291178j959550j749720
2465B10892691j583723j583435j791843k251145l050509m282749n867809p651094
2457A82830384r207721j0226272j0721508j0709413j0318194r634604q843751
2450A13168921p977215p063133o331652n656540n190909m808446m449809m210514
2442F7480703l885592l570301l275450k939480k594561k272215k042808j879363
$$ y = [93595066, 97044525, 100543209, 104027793, 107632169, 111327793, 115161367, 119132885, 123267986, 127676525, 132451586, 137704078, 143350447, 149531973, 156225326, 163483728, 171301470, 179573594, 188045745, 196415677, 204179621, 210850244, 216252157, 220167217, 222594450, 223466407, 222967599, 221449883, 219301802, 216893139, 214601961, 212642411, 210892691, 209308968, 207725533, 205933690, 203682545, 200632036, 196349287, 190481478, 182830384, 173622663, 163396391, 152674883, 141965470, 131647276, 122012672, 113168921, 105191706, 98128573, 91796921, 86140381, 80949472, 76141026, 71691217, 67480703, 63595111, 60024810, 56749360, 53809880, 51215319, 48943104, 46900296, 45020933]
2434D5020933j660597j392510j253099j122644r24252q50057p06948o26016n71106
2425C5913704m47282m81112n10838m12094m96496m62118m30132m28868l29281
2416C1915483k63097k76034k67893k61433j74843j17075j36951j45199k18453
2407C0054505k78541l16975l85267l90584m39250n25509n55775n46717m96251
2398B6119636n17479m78671l85468l86982l79760l83935l92637l74616m12021
2389B2408067m67951m17723n19513m52911n19360m75393m69410m60937l98653
2380A8226216l49446l25023l41556l00442k18663k20705k45025k06421k20306
2371A5798629j55898j66947j49087j40242j15716j52374r1922j13692j59175j26649
$$ y = [45020933, 43360336, 41967826, 40714727, 39592083, 38667831, 37817774, 37110826, 36484810, 35913704, 35466422, 34985310, 34474472, 34062378, 33565882, 33103764, 32673632, 32244764, 31915483, 31652386, 31376352, 31108459, 30847026, 30672183, 30555108, 30418157, 30272958, 30054505, 29775964, 29458989, 29073722, 28683138, 28243888, 27718379, 27162604, 26615887, 26119636, 25602157, 25123486, 24738018, 24351036, 23971276, 23587341, 23194704, 22820088, 22408067, 21940116, 21522393, 21002880, 20549969, 20030609, 19555216, 19085806, 18624869, 18226216, 17876770, 17551747, 17210191, 16909749, 16691086, 16470381, 16225356, 16018935, 15798629, 15642731, 15475784, 15326697, 15186455, 15070739, 14918365, 14826443, 14712751, 14553576, 14426927]
2361A4426927r4552j37498j26366j46124j58270j27967q3331j29542j58123j29841
2351A3135313q5074r5991r8990r1185q5516j11118j23438j55729p4339p3620j50169
2340A1990144j54233j01958j21225j26402j56576p7154r3330q1474j08709j87588
2330A0781495j42897q1726j15267r5316j07818j24513j38848j42781j12468j05203
2320I614658q3838j39941j35846j39163j07740j53240j04033j65058j43924q0668
2310H361207r0935j36667j22239j49166j03562j17195j30031p4534j49794j51851
2300G135233n6062r0955r0943r1033j05645j26427j15413n2438j17396q8020j19697
2289F081204r2036p5822o6545p4962m0671q7519p5542p5494r3499r0462q6712
$$ y = [14426927, 14332375, 14194877, 14068511, 13922387, 13764117, 13636150, 13552819, 13423277, 13265154, 13135313, 13050239, 12954248, 12855258, 12764073, 12678557, 12567439, 12444001, 12288272, 12213933, 12140313, 11990144, 11835911, 11733953, 11612728, 11486326, 11329750, 11252596, 11159266, 11077792, 10969083, 10781495, 10638598, 10556872, 10441605, 10346289, 10238471, 10113958, 9975110, 9832329, 9719861, 9614658, 9530820, 9390879, 9255033, 9115870, 9008130, 8854890, 8750857, 8585799, 8441875, 8361207, 8270272, 8133605, 8011366, 7862200, 7758638, 7641443, 7511412, 7436878, 7287084, 7135233, 7079171, 6988216, 6897273, 6806240, 6700595, 6574168, 6458755, 6406317, 6288921, 6200901, 6081204, 5989168, 5913346, 5846801, 5771839, 5731168, 5643649, 5568107, 5492613, 5399114, 5308652, 5221940]
2278E221940m4814r9828q7291m6582k2846j08000l9451o3848p6479q747J431r9010
2266D526475j42652l9996n1067q1712k3238k3448n9811p2586m5147n0228q1856
2255C854734r1871O207m7190p5417n2196m9418n4468m1131P242l7526p1168k196
2243C345602q9513j02198k0874J7990n469n0965n7799m0739j8572m0084l2344
2232B905035m2633j3506o7372j3843Q26n4494j467l5838m0255k3246m9961k9847
2220B533399k6883m8953j603k1778j9253J0352n6105Q015J348J093m460j9509
2208B355663R143J7523l2936l1815J090j0528l4323L258J1152l1891L516m6636
2196B213216l3067M1877N0050j1939k8804q897k4401L8516j7658j7080P342K5016
$$ y = [5221940, 5177126, 5077298, 4990007, 4943425, 4920579, 4812579, 4773128, 4709280, 4632801, 4624054, 4625485, 4526475, 4383823, 4343827, 4292760, 4211048, 4187810, 4164362, 4104551, 4031965, 3986818, 3936590, 3854734, 3762863, 3769070, 3721880, 3646463, 3594267, 3544849, 3490381, 3449250, 3456492, 3418966, 3347798, 3345602, 3256089, 3153891, 3133017, 3151007, 3145538, 3094573, 3036774, 2996035, 2977463, 2937379, 2905035, 2862402, 2848896, 2781524, 2767681, 2768507, 2714013, 2712546, 2676708, 2636453, 2613207, 2563246, 2533399, 2506516, 2457563, 2455960, 2434182, 2414929, 2425281, 2369176, 2377191, 2378539, 2379632, 2375172, 2355663, 2364806, 2382329, 2349393, 2317578, 2318668, 2308140, 2273817, 2277075, 2288227, 2256336, 2259852, 2213216, 2180149, 2222026, 2272076, 2260137, 2231333, 2222436, 2198035, 2236551, 2218893, 2201813, 2209155, 2234171]
2184B234171L8463J6679J2056J9133O500L3264J1460J3213N6022L8777N486J2856
2172B498080j6374N0275J4288L6960L148n4143j9744K8554l0750p74m8147m1079
2160B420294K8855R137j5758m3449n3430J5599m665r3611K6556m1243l7096o4210
2148B146979n5508r661o0640o9421K277q3668r7725l1533j7546k8356l8682l1359
2136A625157J0082Q14J0971L6721p0656o0841K5969k8751K321N2802K8229k9046
2124A603772N089K1556N1841L0796J3001P116L1409M8728M5688K28l7083J800
2112A823941P5818J1352l3583l3122r5510o9924m7614q6986j37996q4547n3693
2101A268136J8098j0443q0729k5805J7807j3570j6291r490n4634p5687J5041k2133
$$ y = [2234171, 2272634, 2289313, 2301369, 2320502, 2327002, 2360266, 2371726, 2384939, 2440961, 2479738, 2485224, 2498080, 2481706, 2531981, 2546269, 2583229, 2586377, 2532234, 2512490, 2541044, 2510294, 2509520, 2461373, 2420294, 2449149, 2458286, 2442528, 2399079, 2345649, 2361248, 2356583, 2262972, 2289528, 2248285, 2211189, 2146979, 2091471, 2081810, 2021170, 1951749, 1954026, 1870358, 1772633, 1741100, 1723554, 1695198, 1656516, 1625157, 1635239, 1636053, 1647024, 1683745, 1613089, 1552248, 1578217, 1549466, 1551787, 1604589, 1632818, 1603772, 1608861, 1630417, 1682258, 1713054, 1726055, 1733171, 1764580, 1813308, 1858996, 1859224, 1822141, 1823941, 1899759, 1911111, 1877528, 1844406, 1748896, 1678972, 1631358, 1544372, 1406376, 1321829, 1268136, 1286234, 1275791, 1195062, 1169257, 1187064, 1173494, 1157203, 1147713, 1093079, 1017392, 1032433, 1010300]
2089A010300J8086J5698K3212K1030n1073m7184k5010J475m9670J6938j1082m5229
2077H77491k4774k0184l8708J1534k3422l1139k9178Q058k8063K7392L6131n7800
2065G07338m9878J2894Q629n531J4042k6176K0916j1541L1202o009p4365m0578
2053E80943L4002J7616o6355k5039M3394m8847j8193M5294R677j9026J9537J3103
2041E86106j2100j9847j7723R2r508j1090l7390J6637J635k6295k2965q959K0135
2028D58728K189q223j5169M5767O0940p7472J492N247K0387P994l2225n0414k3294
2015C95947M7474l4456L406J7393j3854l6437l973N906N80K34j4450K6337K170
2002C96277O219l1137l1114M8163j2883j8905L0519p40k8787m3175m1224P4671
$$ y = [1010300, 1028386, 1044084, 1067296, 1088326, 1037253, 990069, 965059, 966534, 916864, 933802, 922720, 877491, 852717, 832533, 793825, 805359, 781937, 750798, 721620, 729678, 701615, 729007, 765138, 707338, 657460, 670354, 678983, 673452, 687494, 661318, 682234, 670693, 701895, 695886, 621521, 580943, 614945, 632561, 566206, 541167, 584561, 535714, 517521, 562815, 572492, 553466, 573003, 586106, 574006, 554159, 536436, 536528, 527020, 515930, 478540, 495177, 496812, 470517, 447552, 438593, 458728, 460917, 452694, 437525, 483292, 544232, 466760, 468252, 473499, 493886, 501880, 469655, 419241, 395947, 443421, 408965, 412371, 429764, 415910, 379473, 375500, 381406, 381986, 382220, 367770, 394107, 396277, 402496, 371359, 340245, 388408, 375525, 356620, 387139, 386399, 357612, 314437, 273213, 347884]
1990C47884M6578j2953j604R592m9067l278O449K6192p875j2435j7353j5896R393
1977C25627P699p67k0389k4552K5313l8152J5952J3346j5912K8274k3478L6686
1965C29647K623n6446l5527K6989J6740J2157L6090j5686j2982N996m087L2393
1953C37907l0567l2445M1049n0858k5053O6202L6050k0018J128J4134k4614j651
1941C11264K5435R774j5600j9193J9756k2795l7390N50J4163R326J093k5228K605
1928B73760Q506O026M739o238K6817N7574K9361n4611j3944k4209k5530K5857
1916C08108N0505m9326M6156K6892n5612j025M0745j3041J3544k924Q354K2324
1904C94700m3980n309j3127K0505L1997o081L619m1575K1996L0483J3759M0201
$$ y = [347884, 394462, 381509, 379905, 389497, 340430, 337152, 343601, 369793, 361918, 349483, 332130, 316234, 325627, 333326, 332559, 312170, 287618, 312931, 274779, 290731, 304077, 288165, 316439, 292961, 329647, 332270, 275824, 240297, 267286, 284026, 296183, 332273, 316587, 303605, 309601, 305514, 337907, 307340, 274895, 315944, 265086, 240033, 306235, 342285, 322267, 323395, 337529, 312915, 311264, 336699, 346473, 330873, 311680, 331436, 308641, 271251, 271801, 285964, 295290, 296383, 271155, 273760, 282266, 288292, 293031, 286793, 313610, 371184, 400545, 345934, 331990, 307781, 282251, 308108, 358613, 309287, 355443, 382335, 326723, 325698, 366443, 353402, 366946, 364022, 372376, 394700, 350720, 345411, 332284, 352789, 384786, 378705, 382324, 340749, 362745, 393228, 406987, 447188]
1892D47188R073n857j330o4021N457M2411O123j5071N7632K6571J509N5453L3407
1879E98545K7435q109J3880J2564L9619n613m247O045p157O5476N5285R133N2667
1866H55523N8161P9760O3527K7774M4516N5943J24056M2141P8256P0860K7549
1855A528066M805O5461N0557r415r817J961k826k5232o1009o2789k8708N3118
1843A504172l5445l8929L1304l1925n6383m7009M6216l9798O952K6635O2358J0812
1831A438960L4598P1873Q6112J28478P8990R8460J41070J01073J34530Q6896J70357
1820B571397J52136J51134J86075Q8932K9617K7567l0821j2346j40528k16130
1810B807033j07570j09587l0108q6853r4911j27198j39142j32190j33123j42096
$$ y = [447188, 456261, 450404, 449074, 385053, 390510, 432921, 439044, 423973, 481605, 508176, 509685, 565138, 598545, 625980, 617871, 631751, 644315, 683934, 678321, 674074, 680119, 672962, 738438, 793723, 802856, 855523, 913684, 993444, 1056971, 1084745, 1129261, 1185204, 1309260, 1351401, 1429657, 1500517, 1528066, 1532871, 1598332, 1648889, 1639474, 1629657, 1631618, 1628792, 1603560, 1542551, 1479762, 1451054, 1504172, 1468727, 1429798, 1461102, 1429177, 1372794, 1325785, 1372001, 1332203, 1339155, 1365790, 1428148, 1438960, 1473558, 1545431, 1631543, 1760021, 1839011, 1937471, 2078541, 2179614, 2314144, 2401040, 2571397, 2723533, 2874667, 3060742, 3149674, 3179291, 3206858, 3176037, 3163691, 3023163, 2807033, 2699463, 2589876, 2559768, 2472915, 2378004, 2250806, 2111664, 1979474, 1846351, 1704255]
1800A704255r4212r3609m9397l1066l0248J4808P873j6158k5962K7802N6004O8656
1788A538746K4741k4388L6129P3005J01519J27773M1130M0660Q1423N6422K8718
1777B125878J1515o3497l7767j01646j03376m6791m7047p9956m1122r7259q3787
1766A435145j06540r6003j07003o3547o2993p3279p9035j3246j6501o0478n4056
1755G02464o9831k4231O4638j9514k9065K9168o855q909j4079k2743n1563K5599
1743E75079m0200o3757J7854K0322n915j5729l4890K6957J1694n4109j1801k0272
1731D05233l9692N7835M2947K4732k9551o0698J0551J0917m494j3063l9844l7729
1719C27144L2329l71l3907K1449k4740J6882N825j2276k1523k3414q776J6265
$$ y = [1704255, 1610043, 1516434, 1467037, 1435971, 1405723, 1420531, 1428404, 1412246, 1386284, 1414086, 1470090, 1538746, 1563487, 1539099, 1575228, 1648233, 1749752, 1877525, 1918655, 1959315, 2040738, 2097160, 2125878, 2137393, 2073896, 2036129, 1934483, 1831107, 1784316, 1737269, 1657313, 1616191, 1518932, 1435145, 1328605, 1232602, 1125599, 1062052, 999059, 925780, 846745, 833499, 816998, 756520, 702464, 632633, 608402, 673040, 653526, 624461, 653629, 646774, 637865, 623786, 601043, 549480, 575079, 534879, 471122, 488976, 509298, 503383, 487654, 452764, 479721, 491415, 437306, 425505, 405233, 365541, 423376, 466323, 491055, 461504, 400806, 411357, 422274, 417780, 404717, 364873, 327144, 359473, 359102, 325195, 346644, 321904, 338786, 344611, 332335, 310812, 287398, 278622, 294887]
1707B94887j4746M4104J700p669l746K5334l1117J584J0812m2838j2178N149N7681
1694C28957n8088p8125J1608O276J4833k4876L618L1153k1985o0809J2153J199
1682A65914Q536K1307o741m2388K4629o646J1229j4522o115j1311j4031L7026
1670A66887M123j9794K0235k7828p425L0650o67l6273k6041J3530k369K7801k5043
1657A17786l8378M886k7246L1498L1937M7769l5176k2017m613j1008M4631k4296
1645A15773L7973k9890q89J85m7269j3173k561l2620K3892J0339l9265n9631K8694
1632h442K1480M5918j7861N180L1329L6076m5147l5272J6947J0307r896J8862
1620F9481N376k2442n466m586l7655J5137J5367k8253J6378n920K6514K5782k8723
$$ y = [294887, 280141, 324245, 325945, 318276, 314530, 339864, 308747, 310331, 321143, 278305, 266127, 271276, 328957, 270869, 192744, 204352, 210628, 225461, 200585, 204203, 235356, 213371, 152562, 164715, 165914, 174450, 195757, 189016, 146628, 171257, 164611, 175840, 161318, 155203, 143892, 129861, 166887, 171010, 151216, 171451, 143623, 136198, 166848, 166181, 129908, 103867, 117397, 115028, 142829, 117786, 79408, 84294, 57048, 88546, 120483, 168252, 133076, 111059, 106446, 95438, 140069, 115773, 153746, 123856, 122967, 123152, 75883, 62710, 60149, 27529, 51421, 61760, 22495, -37136, -8442, 13038, 58956, 41095, 46275, 77604, 113680, 68533, 33261, 50208, 60515, 50619, 69481, 74857, 52415, 46949, 42363, 4708, 19845, 35212, 6959, 23337, 17417, 43931, 69713, 40990]
1607D0990j6238k4650j0473L7384K6558Q18l8000q730N953j1858l4221J2772L3977
1594A4282J7332J6979k3451k2889q376K1910K8306j4602n1518J5308q992j9673
1582c5384o019N3640M6436l0949j9643J0209p14l6724J1214O822K8712Q712j1117
1569B5195j7476j8742Q315q661O561q833J4015N5394Q058r614J4711o0645J200
1556I478J6682L099J2542j3553m8507K6626M3466j8652l1281p188k1480M8104
1544A9336M9067K3526m0601k159p710j5916P947P182K1151J8l626L1302J3999
1531A03516k9730K7891P085q777l3985J3421K2173J8936K4368O894j2795r84k7222
1518A10791j4512k917K3150o3534L3038J9878J7102N7265K7824o5674m8545K0124
$$ y = [40990, 24752, 102, -10371, 27013, 53571, 54389, 16389, 7659, 13612, 1754, -32467, -19695, 14282, 31614, 48593, 25142, 2253, -6123, 15787, 44093, 29491, -22027, -6719, -15711, -35384, -41403, 12237, 58673, 27724, 8081, 18290, 17576, -19148, -7934, -1112, 27600, 36312, 25195, 7719, -11023, -2708, -11369, -4808, -13641, 374, 55768, 63826, 54212, 68923, 8278, 9478, 26160, 29259, 41801, 28248, -20259, 6367, 49833, 31181, -100, -7288, -28768, 19336, 68403, 91929, 51328, 49169, 41459, 25543, 33490, 40672, 61823, 61841, 58215, 89517, 103516, 73786, 101677, 108762, 99985, 66000, 79421, 101594, 120530, 144898, 151792, 138997, 138013, 110791, 96279, 93362, 116512, 52978, 86016, 105894, 122996, 180261, 208085, 142411, 93866, 113990]
1506A13990K4218k6514O197O1123K1096L770Q937j4419L0853j0025j4087K7580
1494B32719l732P39J4708N254N1271J0489K2613j8532k152J6388J4461j6493L9733
1481C67466N6420L6638K4359k7610J6402L3713m429j8433K5070k484p120j2350
1469D87642J2678K5399j6239K2731J6247N9382J1411j0427M3992l4497N3490K4799
1457F96608J0223j5469M1034M0319K8105L0848k2435L9031J4054J4046m5955J1070
1445H41479P202Q4230N1533k9066j0315r724j1133Q481J4827l4195k471L8690
1433I49538J8666m8818K9167J4328J8024j538l879K7699J4454R582L9218J6964
1421A083405L8741N3110L3537l89N3022J5017K73J9747J9509j5868l9463m1870
$$ y = [113990, 138208, 111694, 117891, 179014, 200110, 203880, 212817, 198398, 229251, 219226, 205139, 232719, 228987, 229726, 244434, 249688, 300959, 311448, 334061, 315529, 313377, 329765, 344226, 327733, 367466, 423886, 460524, 484883, 457273, 473675, 507388, 502959, 484526, 509596, 507112, 499992, 487642, 500320, 525719, 509480, 532211, 548458, 607840, 619251, 608824, 652816, 618319, 671809, 696608, 706831, 691362, 732396, 772715, 800820, 831668, 809233, 848264, 862318, 876364, 830409, 841479, 848681, 932911, 984444, 955378, 945063, 935339, 924206, 932687, 947514, 913319, 910848, 949538, 968204, 919386, 948553, 962881, 980905, 979367, 975488, 1003187, 1017641, 1027223, 1066441, 1083405, 1122146, 1175256, 1208793, 1208404, 1261426, 1276443, 1276716, 1296463, 1315972, 1300104, 1260641, 1218771]
1409A218771m704m2357l3709m6780n7903k3039J980p358M8316o6726m6022M4453
1397I84922J4904k5539K9386K639m3549k7147k6830j9727j295K1658K817j2548
1385H99691l5214J9144n926L5896M800r88M3859K5115k9231L9911n6964k3723
1373I16370m9015o4397n3032l2996J409o3175m7974n3391K1671o1406m2566M781
1361D76279L2723K1627k8276k5395O667p690k808j6759k2765l4777l6969l486
1349C58371J7732o625J5604n7274l38N3398j504m4955J7568o543n2133J8036j0661
1336C00676l9761N942l593n5484k6381R54J3355r363k1531j4940j5244p9908O4869
1323A19591k7986j6947L8418n36N763j846L1105p804j5982k9236o982q44p764
$$ y = [1218771, 1214067, 1171710, 1138001, 1091221, 1033318, 1010279, 1012259, 1004901, 1053217, 986491, 940469, 984922, 999826, 974287, 1003673, 1006312, 962763, 935616, 908786, 889059, 887764, 909422, 912239, 899691, 864477, 883621, 877695, 913591, 918391, 917403, 961262, 986377, 957146, 997057, 940093, 916370, 867355, 802958, 749926, 716930, 718339, 655164, 607190, 553799, 575470, 514064, 471498, 476279, 509002, 530629, 502353, 476958, 483625, 475935, 473127, 456368, 433603, 398826, 361857, 358371, 376103, 369478, 385082, 327808, 327470, 380868, 379364, 334409, 351977, 345434, 293301, 311337, 300676, 260915, 266857, 263264, 207780, 181399, 182353, 195708, 186345, 164814, 149874, 134630, 54722, 119591, 91605, 74658, 113076, 112540, 118303, 116457, 147562, 139758, 123776, 94540, 87558, 86714, 78950]
1310G8950k8661j4110j6176N039M6452k8588K919O420p974O448N7451k7077r598
1297G1495l9446j0484K5539n619j4122k0724K0354l7618k7870k6537Q413M5890
1285a0729L3564l0286J9636j8406j6823K1848l263R929J248J6966p123j6490l3932
1272c3861N9421j8563K1973K346m3209j7442L652O006J4755K3220j6244j9446
1260a7392k5366L2506K9452l3845k0572L7572m527j9279M540j8276L289L4145
1248B247K6723m639J0845m5275j5292M3412m9236J5564j9514j9800L2731R03J6521
1235d810J274J9427k2688m6112K7070j9638J7471p728l853J8587M2830O803l8252
1222i619l3588n98K9149m0709L626K2554K5823L45K44m021j8179j3593K6294K38
$$ y = [78950, 50289, 36179, 20003, 25042, 71494, 42906, 45825, 52245, 44271, 50719, 108170, 81093, 71495, 32049, 21565, 47104, 41485, 27363, 6639, 26993, -10625, -38495, -65032, -56619, -10729, 22835, -7451, 12185, -6221, -23044, -1196, -4459, 5470, 6718, 23684, 16561, 71, -33861, 25560, 6997, 28970, 31316, -11893, -29335, -25683, -19677, -4922, 18298, 2054, -17392, -42758, -10252, 19200, -14645, -35217, 2355, -2172, -21451, -16911, -35187, -31898, 2247, 28970, 24331, 35176, -10099, -25391, 18021, -31215, -15651, -35165, -54965, -22234, -21331, -4810, -3536, 15891, -6797, -52909, -25839, -45477, -28006, -35734, -39587, -21000, 21830, 28633, -9619, -43207, -43805, -14656, -55365, -51739, -29185, -3362, -3017, -2773, -6794, -24973, -38566, -12272, -12034]
1208a2034J9051J2730r008j2072J8761J3221j0226k4792k473L0238N387R311j505
1195C6589L792j7260K522o464N9263k8364j7385J4209L3901k315J790M507m582
1182H0203m2077n9644N8768p599L3068k169l9922r900k7264K737N89k3805L3442
1169c573Q467N093k154j7664L9103p542m7919j1474M6395j2278M5080j4070k6914
1156E50j8686m996M981q101M7004L361o510J843K840k1604N003O059J8365L3072
1142F3181l6285J9657m121j6224K0540M7749o2845n2455o928j3977J4943L6417
1130I652M061m0126n9199J4066M1291o721j2452M8359N2409k0114n0673n976O026
1117a9397K4584J5605j6966K1433L0547n8j6693j7652J9131r412J4661K5147j8688
$$ y = [-12034, 7017, 19747, 10739, -1333, 17428, 30649, 20423, -4369, -6842, 23396, 28783, 38094, 36589, 40381, 23121, 25643, 19179, 78442, 50078, 32693, 46902, 80803, 78488, 80278, 84785, 80203, 38126, -21518, 37250, 29651, 62719, 60550, 20628, 10728, -16536, -13799, -13210, -37015, -3573, 4894, 9987, 7833, -9831, 29272, 21730, -26189, -37663, 8732, -3546, 41534, 27464, 550, -18136, -23132, -18151, -26252, 20752, 24113, 17603, 19446, 22286, 682, 5685, 11744, 30109, 63181, 26896, 46553, 42432, 26208, 46748, 94497, 31652, -20803, -27731, -41708, -26765, 9652, 13713, -26413, -85612, -71546, -30255, -36976, -49428, -1069, 51340, 31226, -19447, -25423, -19397, 5187, 20792, 3826, 25259, 55806, 55748, 39055, 21403, 40534, 31122, 45783, 70930, 52242]
1104E2242k3290j1189q383P401N526o8595M8100L1988j2823l8664L4712L4796
1092E1821l397j5740K0904J3191j3881J886J5603m5821j6631L4393P995l2442
1080A7881r947M4476k8064J2146J6181o1418N6398j5567j9315j3640J3787K7665
1068D0583j5026L8894k6381J7737J3646n3932J7526k1355K4428J8132J5716j9282
1056E0686m0682L1564j2943J8544K1660n8478k356J106J8663M0546j2375p055
1044D8880K9126K834J2829Q854p374q016J1492L836j3508J8657l954r613O716
1031A00759j4639P0713L3401J5982j3635j4280j0095J0673p545j7629k0701k2756
1019A10248l0168k5531K1423K443Q715M4L9797q59J1198J4181o653l4579L2841
$$ y = [52242, 28952, 17763, 9380, 16781, 22307, -46288, 1812, 33800, 20977, -17687, 17025, 51821, 48424, 32684, 53588, 66779, 52898, 54784, 70387, 24566, 7935, 42328, 50323, 17881, 7934, 52410, 24346, 36492, 52673, -8745, 47653, 32086, 12771, -869, 12918, 40583, 25557, 64451, 38070, 55807, 69453, 15521, 33047, 11692, 36120, 54252, 69968, 50686, 10004, 41568, 28625, 47169, 68829, 10351, 7995, 9101, 27764, 68310, 55935, 48880, 78006, 80840, 93669, 102523, 95149, 87133, 98625, 102461, 88953, 107610, 103656, 94043, 100759, 86120, 156833, 190234, 206216, 192581, 178301, 168206, 178879, 171334, 153705, 133004, 110248, 80080, 54549, 75972, 78415, 87130, 87174, 126971, 126112, 137310, 151491, 144838, 110259, 143100]
1006A43100J1880J8490J8132p738r263j5830M8911M2361n8231M1754K0784j6117
994B38233j9216K3465O2704L9255l3550J2045j6834r640N552q063N0115P015k9448
981C21633J302P5366k690j883Q619K11M6083n1475l1083r799L992J3641J6429
968C90346K0490N2864M3464n913J8672k6996j2391r103K4344r989L458K8534K1100
955E38880Q7188m91l0415N043L3027L4547j8402M1234M068L333p77J7096k050
942G12281R640O1483K8002N2771Q291L6199L3739Q1579P6475O2479O6318R0881
930A320138L4398N0838R7320O0198K9031J31290P2859J12395P2394J45489J58205
919B284555J82216J61096K13254K49958L74368K76016K27838K39446M04797N34503
$$ y = [143100, 154980, 173470, 191602, 183864, 174601, 158771, 207682, 250043, 191812, 233566, 254350, 238233, 219017, 242482, 305186, 344441, 310891, 322936, 306102, 296462, 302014, 293951, 344066, 351081, 321633, 322935, 398301, 395611, 393728, 402347, 402558, 448641, 397166, 366083, 356284, 360276, 373917, 390346, 410836, 463700, 507164, 501251, 519923, 492927, 480536, 471433, 495777, 485788, 489246, 517780, 538880, 626068, 625577, 595162, 600205, 633232, 667779, 649377, 690611, 694679, 698012, 697235, 714331, 712281, 721921, 783404, 811406, 864177, 872468, 908667, 942406, 1023985, 1100460, 1162939, 1229257, 1320138, 1354536, 1405374, 1502694, 1562892, 1591923, 1723213, 1796072, 1908467, 1980861, 2126350, 2284555, 2466771, 2627867, 2841121, 3091079, 3465447, 3741463, 3969301, 4208747, 4613544, 5148047]
909E148047N24769N73925P21384R33449J257227J423364J590223J746373K010756
900A5929517K009814K106333J98173m383004m138760k442823j678547j127611
892F473092q73467o67769n36540l83394k74610k25918k34449j66864j20831j22099
882B867151j30509k54192k71120j58092j11637j39667j15875j05348r9646r5752
872A385313l2494l7905o8632n8628m8483l1181k9368q483p6288m3542k2020p8469
860H49820J528j6546p2584j0242k7724j1442n8630o752l3689K5322n5418k9874
848E53769n7029j9435l4286k438l0464J6420K0497m7809L126k405n241l8584k9863
835C26258k5830K1651J639l2453Q2697K0042r3695n3955j1495L151N1501m51J115
$$ y = [5148047, 5672816, 6246741, 6968125, 7901574, 9158801, 10582165, 12172388, 13918761, 15929517, 17939331, 20045664, 20243837, 15860833, 11722073, 9279250, 7600703, 6473092, 5599625, 4931856, 4395316, 4011922, 3737312, 3511394, 3276945, 3110081, 2989250, 2867151, 2736642, 2482450, 2211330, 2053238, 1941601, 1801934, 1686059, 1580711, 1481065, 1385313, 1352819, 1314914, 1246282, 1187654, 1139171, 1107990, 1078622, 1070139, 993851, 950309, 928289, 849820, 851348, 834802, 762218, 751976, 724252, 712810, 654180, 647428, 613739, 639061, 583643, 553769, 496740, 477305, 443019, 440581, 410117, 426537, 447034, 399225, 402351, 399946, 394705, 356121, 326258, 300428, 322079, 323718, 291265, 373962, 394004, 300309, 246354, 234859, 238010, 289511, 289060, 290175]
822B90175n4433P325m825O799l0326j7728l8789j2899L3247M188L1118N349p991
809B11210j7199J5902k2923m3567J6891k3430k3521L1950L1069J8037K4667j9306
797A99780l6714M503P730m8722m2678J7851K2625K5772l5712r650n0353k5075
785B9357N4041J2646l27L4592o1412M82J8502J1951M923p563J3509K419l1279
772H1841R605J4709J043Q201m811j7311m7116l1732q796P458K0504N127r603K3225
758E2344O27j1605J877l484l8102O256N0560l569k5663J5265k4529o948J9537
745C2566J2188J9960N626l8395o409J4639l3290j8066L1344J7733r242l8659J2704
732B699N5447m1732n321l0411j277N8799J201k9505m9724p126L6324N0760J5746
$$ y = [290175, 235742, 243067, 238242, 245041, 214715, 196987, 158198, 145299, 178546, 182734, 213852, 219201, 211210, 194011, 209913, 186990, 143423, 160314, 136884, 113363, 145313, 176382, 194419, 219086, 199780, 163066, 167569, 175299, 126577, 83899, 101750, 124375, 150147, 114435, 104785, 54432, 29357, 83398, 96044, 95717, 130309, 68897, 69379, 87881, 99832, 104755, 97192, 110701, 113120, 81841, 91446, 106155, 107198, 115399, 110588, 93277, 46161, 14429, 5633, 13091, 33595, 38722, 29119, 52344, 52971, 41366, 43243, 39759, 1657, 7913, 58473, 54904, 29241, 44506, 19977, 13029, 32566, 44754, 64714, 70340, 31945, 25536, 40175, 6885, -11181, 20163, 37896, 28654, -10005, 2699, 58146, 16414, 11093, -19318, -20595, 38204, 39405, 9900, -39824, -46950, -10626, 40134, 55880]
719E5880n192m303j9684K6699l1496k5729Q638k900j7320J4583j7003j7117J6693
706a8251N0447o487l0742o660O1693k6035l3740l457L181J5758j6443N424J2477
693G165j5954k8311q882L5749L977N034k1622n5524J8560k2623L1650j0211j0002
680g0994j7482O5440L5385j7727l164J7376J2338k1071J612N5858m0755q318r512
667a014m0541P264J9091L2644K4147l3393K4802j5017l5398K9363p414M5305k387
654D7452m7233m5222M5103J6813P140l2134m2597J1134P718J6377j0665l935k7164
641e7213N662L3408n812J2272L5370K8485j0867J5044l6391n3454L662k0061K1119
628b8776L1703P642K9351l4044K1051j7000K411k4878l1923K2931J0620K8706
$$ y = [55880, 50688, 46385, 26701, 53400, 21904, -3825, 4813, 1913, -15407, -824, -17827, -34944, -18251, 32196, 25709, -5033, -11693, 50000, 23965, -9775, -13232, -10051, 5707, -10736, -5312, 7165, -8789, -37100, -45982, -10233, -6256, -1222, -22844, -78368, -59808, -82431, -50781, -60992, -70994, -88476, -23036, 12349, -5378, -8542, 8834, 21172, 101, 1713, 57571, 16816, 8498, -1014, -41555, -34291, -15200, 17444, 41591, 8198, 33000, 17983, -17415, 11948, 4534, 49839, 47452, 219, -45003, 100, 16913, 24053, -8081, -50678, -39544, -31826, -15449, -26114, -30049, -57213, -51551, -18143, -23955, -11683, 23687, 52172, 41305, 56349, 19958, -33496, -29834, -49895, -28776, 2927, 10569, 39920, 5876, 26927, 9927, 12338, -12540, -44463, -21532, -10912, 17794]
616A7794J7397K2848o1089K2107K3562N1284O86l1177n8118k1879O676O849j7150
$$ y = [17794, 35191, 58039, -3050, 19057, 42619, 93903, 94589, 63412, 5294, -16585, -9909, -3060, -20210]
$$ [...]
##END NTUPLES=NMR SPECTRUM
##END=
