##TITLE=1H_CA-8852-2x
 DMSO, 8 sc, 
 13.05.2021
##JCAMPDX= 6.0         $$ Bruker NMR JCAMP-DX V2.0
##DATA TYPE= NMR SPECTRUM
##DATA CLASS= NTUPLES
##ORIGIN= UXNMR, Bruker Analytische Messtechnik GmbH
##OWNER= root
$$ XWIN-NMR		Version 3.5
$$ Thu May 13 10:12:42 2021 Russian Standard Time (UT+4h)  she@DPX200
##.OBSERVE FREQUENCY= 200.131506
##.OBSERVE NUCLEUS= ^1H
##.ACQUISITION MODE= SIMULTANEOUS
##.ACQUISITION SCHEME= undefined
##.AVERAGES= 8
##.DIGITISER RES= 18
##SPECTROMETER/DATA SYSTEM= spect
##.PULSE SEQUENCE= zg30
##.SOLVENT NAME= DMSO
##.SHIFT REFERENCE= (INTERNAL, DMSO, 0, 15.9948)
##AUDIT TRAIL= $$ (NUMBER, WHEN, WHO, WHERE, WHAT)
$$ ##TITLE= Audit trail, XWIN-NMR		Version 3.5
$$ ##JCAMPDX= 5.01
$$ ##ORIGIN= Bruker BioSpin GmbH
$$ ##OWNER= she
$$ F:/spectra/data/she/nmr/H-F/1/pdata/1/auditp.txt
$$ ##AUDIT TRAIL=  $$ (NUMBER, WHEN, WHO, WHERE, WHAT)
(   1,<2021-05-13 10:11:23.82 +0400>,<she>,<DPX200>,
      <created by zg, POWCHK disabled, PULCHK disabled
       configuration hash MD5:
       00 E9 B6 7A A2 85 ED C7 34 08 36 98 17 FE 4E 26
       data hash MD5: 16K
       F5 60 11 DB F1 92 1C 89 D4 31 2C 13 0E 43 72 4F>)
(   2,<2021-05-13 10:11:26.20 +0400>,<she>,<DPX200>,
      <Start of raw data processing
       efp BC_mod = 2 LB = 0.24 FT_mod = 6 PKNL = 1 PHC0 = -11119.37 PHC1 = 7.401003 SI = 16K 
       data hash MD5: 16K
       44 F2 18 FA 01 F7 89 1A 74 9A 4C 78 FA 2D F7 1A>)
(   3,<2021-05-13 10:11:45.93 +0400>,<she>,<DPX200>,
      <pk PHC0 = -4.478911 PHC1 = 4.2 
       data hash MD5: 16K
       4B 70 0F 7D 9B 6B 4E 7C CB E7 DB ED CE 77 05 3E>)
(   4,<2021-05-13 10:11:49.31 +0400>,<she>,<DPX200>,
      <abs ABSG = 5 
       data hash MD5: 16K
       37 4C B4 F3 B2 01 19 D2 DD 8D A8 6D A0 10 0F 1C>)
$$ ##END=
$$ 
$$ hash MD5
$$ D3 85 29 31 30 7C 06 61 4F EE 12 A8 1C 57 A2 61
##$RELAX= 
##$RELAX= 
##$RELAX= 
##$RELAX= 
##$RELAX= 
##$RELAX= 
$$ Bruker specific parameters
$$ --------------------------
##$DU= <F:/spectra>
##$EXPNO= 1
##$NAME= <H-F>
##$PROCNO= 1
##$TYPE= <nmr>
##$USER= <she>
##$AMP= (0..31)
100 100 100 100 100 100 100 100 100 100 100 100 100 100 100 100 100 100 
100 100 100 100 100 100 100 100 100 100 100 100 100 100 
##$AQSEQ= 0
##$AQ_mod= 1
##$AUNM= <au_zg>
##$AUTOPOS= <>
##$BF1= 200.13
##$BF2= 200.13
##$BF3= 200.13
##$BF4= 200.13
##$BF5= 200.13
##$BF6= 200.13
##$BF7= 200.13
##$BF8= 200.13
##$BYTORDA= 1
##$CFDGTYP= 0
##$CFRGTYP= 5
##$CHEMSTR= <none>
##$CNST= (0..31)
1 1 145 1 1 1 1 1 1 1 1 1 1 1 1 1 1 1 1 1 1 1 1 1 1 1 1 1 1 1 1 1 
##$CPDPRG= <>
##$CPDPRG1= <>
##$CPDPRG2= <>
##$CPDPRG3= <>
##$CPDPRG4= <mlev>
##$CPDPRG5= <mlev>
##$CPDPRG6= <mlev>
##$CPDPRG7= <mlev>
##$CPDPRG8= <mlev>
##$CPDPRGB= <>
##$CPDPRGT= <>
##$D= (0..31)
0 1.2 0 0 0 0 0 0 0 0.06 0 0.03 0 0 0 0 0.0002 0 0 0 0 0 0 0 0 0 0 0 0 
0 0 0 
##$DATE= 1620886283
##$DBL= (0..7)
120 120 120 120 120 120 120 120 
##$DBP= (0..7)
150 150 150 150 150 150 150 150 
##$DBP07= 0
##$DBPNAM0= <>
##$DBPNAM1= <>
##$DBPNAM2= <>
##$DBPNAM3= <>
##$DBPNAM4= <>
$$ [...]
##$SUBNAM3= <"">
##$SUBNAM4= <"">
##$SUBNAM5= <"">
##$SUBNAM6= <"">
##$SUBNAM7= <"">
##$SUBNAM8= <"">
##$SUBNAM9= <"">
##$SW= 16.9725357007746
##$SWIBOX= (0..15)
0 0 2 0 0 0 0 0 0 0 0 0 0 0 0 0 
##$SW_h= 3396.73913043478
##$TD= 16384
##$TD0= 1
##$TE= 0
##$TE2= 300
##$TE3= 300
##$TEG= 300
##$TL= (0..7)
0 120 120 120 120 120 120 120 
##$TP= (0..7)
150 150 150 150 150 150 150 150 
##$TP07= 0
##$TPNAME0= <>
##$TPNAME1= <>
##$TPNAME2= <>
##$TPNAME3= <>
##$TPNAME4= <>
##$TPNAME5= <>
##$TPNAME6= <>
##$TPNAME7= <>
##$TPOAL= (0..7)
0.5 0.5 0.5 0.5 0.5 0.5 0.5 0.5 
##$TPOFFS= (0..7)
0 0 0 0 0 0 0 0 
##$TUNHIN= 0
##$TUNHOUT= 0
##$TUNXOUT= 0
##$USERA1= <user>
##$USERA2= <user>
##$USERA3= <user>
##$USERA4= <user>
##$USERA5= <user>
##$V9= 5
##$VALIST= <valist>
##$VCLIST= <CCCCCCCCCCCCCCC>
##$VD= 0
##$VDLIST= <DDDDDDDDDDDDDDD>
##$VPLIST= <PPPPPPPPPPPPPPP>
##$VTLIST= <TTTTTTTTTTTTTTT>
##$WBST= 1024
##$WBSW= 4
##$XGAIN= (0..3)
0 0 0 0 
##$XL= 0
##$YL= 0
##$YMAX_a= 288260
##$YMIN_a= -263581
##$ZGOPTNS= <>
##$ZL1= 120
##$ZL2= 120
##$ZL3= 120
##$ZL4= 120
##$ABSF1= 15.98749
##$ABSF2= -0.9851742
##$ABSG= 5
##$ABSL= 3
##$ALPHA= 0
##$AQORDER= 0
##$ASSFAC= 0
##$ASSFACI= 0
##$ASSFACX= 0
##$ASSWID= 0
##$AUNMP= <proc_1d>
##$AZFE= 0.1
##$AZFW= 0.1
##$BCFW= 0
##$BC_mod= 2
##$BYTORDP= 0
##$COROFFS= 0
##$CY= -3
##$DATMOD= 1
##$DC= 0
##$DFILT= <>
##$DTYPP= 0
##$F1P= 0
##$F2P= 0
##$FCOR= 1
##$FTSIZE= 16384
##$FT_mod= 6
##$GAMMA= 0
##$GB= 0
##$INTBC= 1
##$INTSCL= 1.334414e-10
##$ISEN= 128
##$LB= 0.24
##$LEV0= 0
##$LPBIN= 0
##$MAXI= 10000
##$MC2= 0
##$MEAN= 0
##$ME_mod= 0
##$MI= 1.114404
##$NCOEF= 0
##$NC_proc= -8
##$NLEV= 6
##$NOISF1= 3.799351
##$NOISF2= 2.8
##$NSP= 0
##$NTH_PI= 0
##$NZP= 0
##$OFFSET= 15.99475
##$PC= 1
##$PHC0= -11123.85
##$PHC1= 11.601
##$PH_mod= 1
##$PKNL= yes
##$PPARMOD= 0
##$PSCAL= 0
##$PSIGN= 0
##$REVERSE= no
##$SF= 200.130003340949
##$SI= 16384
##$SIGF1= 3
##$SIGF2= 2
##$SINO= 5.538805
##$SIOLD= 16384
##$SREGLST= <1H.CDCl3>
##$SSB= 0
##$STSI= 16384
##$STSR= 0
##$SW_p= 3396.73913043479
##$SYMM= 0
##$S_DEV= 0
##$TDeff= 16384
##$TDoff= 0
##$TI= <>
##$TILT= no
##$TM1= 0
##$TM2= 0
##$TOPLEV= 0
##$USERP1= <user>
##$USERP2= <user>
##$USERP3= <user>
##$USERP4= <user>
##$USERP5= <user>
##$WDW= 1
##$XDIM= 16384
##$YMAX_p= 327611040
##$YMIN_p= -1701107
$$ End of Bruker specific parameters
$$ ---------------------------------
##NTUPLES= NMR SPECTRUM
##VAR_NAME=  FREQUENCY,     SPECTRUM/REAL,   SPECTRUM/IMAG
##SYMBOL=    X,             R,               I
##VAR_TYPE=  INDEPENDENT,   DEPENDENT,       DEPENDENT
##VAR_FORM=  AFFN,          ASDF,            ASDF
##VAR_DIM=   16384,         16384,           16384
##UNITS=     HZ,            ARBITRARY UNITS, ARBITRARY UNITS
##FACTOR=    0.207333158178282, 1,           1
##FIRST=     3201.02937551826, 0,            0
##LAST=      -195.709754916533, 0,           0
##MIN=       -195.709754916533, -1701107,    0
##MAX=       3201.02937551826, 327611040,    0
$$ Real data points
##PAGE= N=1
##DATA TABLE= (X++(R..R)), XYDATA
$$ [...]
5465C121486j62802q5562l87147N25450J66768j44462J23131J15511K63351l05170
$$ 3121486 2958684 2873122 2485975 3011425 3178193 3033731 3156862 3272373 3535724 3230554
5455C230554J89889M1074J5329k88186L5862j8949Q5668m67598J44151k8798P11161
$$ 3230554 3420443 3461517 3476846 3188660 3224522 3205573 3291241 2823643 2967794 2938996 3650157
5444C650157j94992k6901o08134n1900k34242m08729Q16064K71514j43983j66681
$$ 3650157 3455165 3428264 2820130 2768230 2533988 2125259 2941323 3212837 3068854 2902173
5434B902173L36495k89876k77193k19744L00051L47712O94417j33083l42489j85968
$$ 2902173 3238668 2948792 2671599 2451855 2751906 3099618 3794035 3660952 3318463 3132495
5424C132495L07801K07577p99745J36890l64649L89532j89324Q8147L57241n27919
$$ 3132495 3440296 3647873 2848128 2985018 2620369 3009901 2820577 2908724 3265965 2738046
5414B738046O96982k88319L57825J01361O9113Q7488k13172K83624R43792n3469
$$ 2738046 3435028 3146709 3504534 3605895 3675008 3762496 3549324 3832948 4776740 4723271
5404D723271m41644q8912n03803N5853L51994p18525j55098P50643K69401l64965
$$ 4723271 4281627 4192715 3688912 3744765 4096759 3378234 3223136 3973779 4243180 3878215
5394C878215M44076J24016l18975j78218m02736j09494M64240M31155N05269k91381
$$ 3878215 4322291 4446307 4127332 3949114 3546378 3436884 3901124 4332279 4837548 4546167
5384D546167r34272K75237M49108q4202m824M30181J51544K84213L25322l71326
$$ 4546167 3611895 3887132 4336240 4252038 4247214 4677395 4828939 5113152 5438474 5067148
5374E067148j97288k54754r3184K18898m2613M93977l30646j60881j57438o1858
$$ 5067148 4869860 4615106 4521922 4740820 4698207 5192184 4861538 4700657 4543219 4481361
5364D481361K02315l3281k79670k59015j83308P01109N23253r72L07812J04552
$$ 4481361 4683676 4650395 4370725 4111710 3928402 4629511 5152764 5151792 5459604 5564156
5354E564156N33827J66289j85676l15306K85394O8422k60471N10682M02091p4233
$$ 5564156 6097983 6264272 6078596 5763290 6048684 6117106 5856635 6367317 6769408 6695175
5344F695175j93436r21437J00380L09609J38754j11058j40207J75750n1606K97929
$$ 6695175 6501739 5580302 5680682 5990291 6129045 6017987 5877780 6053530 6001924 6299853
5334F299853j10321K6024M2855P99974j26054J36897l58345j88707L02537M61804
$$ 6299853 6189532 6215556 6258411 7058385 6932331 7069228 6710883 6522176 6824713 7286517
5324G286517q5670O6363M34757m84708M6303M67917k78330K56116K44702j04147
$$ 7286517 7200847 7267210 7701967 7217259 7263562 7731479 7453149 7709265 7953967 7849820
5314G849820K29197J49001J05322o48449J20492N56828l5899l54841o48097O5161
$$ 7849820 8079017 8228018 8333340 7684891 7805383 8362211 8326312 7971471 7323374 7388535
5304G388535Q11067P16211l35550m3843j74057J40967Q03753N10212K1025M2367
$$ 7388535 8199602 8915813 8580263 8536420 8362363 8503330 9307083 9817295 9838320 9880687
5294I880687L50283m24634J41940L20882P1615O9116l1756K69921J7021k2072
$$ 9880687 10230970 9806336 9948276 10269158 10340773 10409889 10378133 10648054 10665075 10643003
5284A0643003L68012J66289L41266j96788J70599M87006k05233k156n177L03377
$$ 10643003 11011015 11177304 11518570 11321782 11492381 11979387 11774154 11771998 11766821 12070198
5274A2070198P93315K43500O8566K69441m9822L77726M7690Q99957J46184m80126
$$ 12070198 12863513 13107013 13175579 13445020 13395198 13772924 13820614 14720571 14866755 14386629
5264A4386629K47197m3916M93236M32636j01116J88825j41414J41607P29746r0406
$$ 14386629 14633826 14589910 15083146 15515782 15414666 15603491 15462077 15603684 16333430 16243024
5254A6243024L04820N15832q5634K19375M02165k4081N98150J018963M19183l43814
$$ 16243024 16547844 17063676 16978042 17197417 17599582 17575501 18173651 19192614 19611797 19267983
5244A9267983M28485J14658N15761L70880O14910J119852l889J10985J50628N15094
$$ 19267983 19696468 19811126 20326887 20697767 21312677 22432529 22428640 22539625 22690253 23205347
5234B3205347Q67594J54306j9565j1223Q70387Q43382P28565P14494P05601J88201
$$ 23205347 24072941 24227247 24207682 24196459 25066846 25910228 26638793 27353287 28058888 28247089
5224B8247089K85103N83588N88626M59033O77441J002887J99596O18057P16658
$$ 28247089 28532192 29115780 29704406 30163439 30840880 31843767 32043363 32661420 33378078
5215C3378078N89083N82342P75476R26320Q23418J125459P03292O81019N04577
$$ 33378078 33967161 34549503 35324979 36251299 37074717 38200176 38903468 39584487 40089064
5206D0089064M46366o8157J636870J522206O70912J095136P76229J656758J296340
$$ 40089064 40535430 40467273 42104143 43626349 44297261 45392397 46168626 47825384 49121724
5197D9121724J043506Q83160J384477J790963J453338J428606J978489J818869
$$ 49121724 50165230 51048390 52432867 54223830 55677168 57105774 59084263 60903132
5189F0903132J272511J453911K720704J436736J970996K043459J415983J570198
$$ 60903132 62175643 63629554 66350258 67786994 69757990 71801449 73217432 74787630
5181G4787630J558768K043813J448942J456300J577812K146754K261198J249504
$$ 74787630 76346398 78390211 79839153 81295453 82873265 85020019 87281217 88530721
5173H8530721P37371J435775J137585R23162J412441J174775J260064J841558
$$ 88530721 89268092 90703867 91841452 92764614 94177055 95351830 96611894 98453452
5165I8453452Q18854J065984O0471J238756J509402J247776J628529L48857J221100
$$ 98453452 99272306 100338290 100398761 101637517 103146919 104394695 106023224 106372081 107593181
5156A07593181J052630Q21820O03382J301058P77135R12983N19946J04251Q49496
$$ 107593181 108645811 109467631 110071013 111372071 112149206 113062189 113582135 113686386 114535882
5147A14535882P58482M39613m05292K36842o5815j46668l5766M33684p4502l12620
$$ 114535882 115294364 115733977 115328685 115565527 115499712 115353044 115317278 115750962 115676460 115363840
5137A15363840n49235n44115j37556k47079r32534k85774m1704p98033q96578
$$ 115363840 114814605 114270490 114132934 113885855 112953321 112667547 112625843 111827810 110931232
5128A10931232p97452j22246j013463q12077l42424p33634j053461j065648j089097
$$ 110931232 110133780 110011534 108998071 108185994 107843570 107109936 106056475 104990827 103901730
5119A03901730o89264j765892j933053j452723j199457j695918j919238k240207
$$ 103901730 103212466 101446574 99513521 98060798 96861341 95165423 93246185 91005978
5111I1005978k110398j279667j856666j975660j601866k007755k313616j402807
$$ 91005978 88895580 87615913 85759247 83783587 82181721 80173966 77860350 76457543
5103G6457543j513141k000456j255811k057328k040262j875656j411285q63137
$$ 76457543 74944402 72943946 71688135 69630807 67590545 65714889 64303604 63440467
5095F3440467j504313j449321p86262o19702j306378j249979j386637p52631o37772
$$ 63440467 61936154 60486833 59700571 59080869 57774491 56524512 55137875 54385244 53747472
5086E3747472m73895q80673p80107o80589M1181l07785j104300l68971j317422
$$ 53747472 53273577 52392904 51612797 50932208 50973389 50665604 49561304 49192333 47874911
5077D7874911p93767k7218o463o5505n58459m76829r8705n67924n16948j67806
$$ 47874911 47081144 47053926 47047463 46981958 46423499 45946670 45847965 45280041 44763093 44595287
5067D4595287m33302r1195J4983j088892M88958j48734o66943n60802j31902j42463
$$ 44595287 44161985 44070790 44085773 42996881 43485839 43337105 42670162 42109360 41977458 41834995
5057D1834995n43703L35638L9285j5913R7132J78953m67862n32929K99086n3537
$$ 41834995 41291292 41626930 41666215 41650302 41747434 41926387 41458525 40925596 41224682 41171145
5047D1171145k73332O86962J42116o2481n646k97794Q9548K23598K11097J373
$$ 41171145 40897813 41584775 41726891 41664410 41658764 41360970 41450518 41674116 41885213 41886586
5037D1886586J11170O18245q3503J31677l53710K53741L16157j54259J92922L33019
$$ 41886586 41997756 42616001 42532498 42664175 42310465 42564206 42880363 42726104 42919026 43252045
5027D3252045R32887M80289R32122Q40289n96112j05982P66030K31607N94292
$$ 43252045 44184932 44665221 45597343 46437632 45841520 45735538 46501568 46733175 47327467
5018D7327467L52157N59037k6411P71260Q29448M9608K63990R44878P22324J95716
$$ 47327467 47679624 48238661 48212250 48983510 49812958 49862566 50126556 51071434 51793758 51989474
5008E1989474O72395O53766J57616M19115M83399N99797J395155O193P03136J235558
$$ 51989474 52661869 53315635 53473251 53892366 54375765 54975562 56370717 56376910 57080046 58315604
4998E8315604O36663Q88270P83034M07314P71746N08687M49252Q83310N77237
$$ 58315604 58952267 59840537 60623571 61030885 61802631 62311318 62760570 63643880 64221117
4989F4221117O37085Q30019K20569J072981P96778O30442R25393J382104J349353
$$ 64221117 64858202 65688221 65908790 66981771 67778549 68408991 69334384 70716488 72065841
4980G2065841Q98696N40871N20815J311030J097696P83813R12792P05214J263957
$$ 72065841 72964537 73505408 74026223 75337253 76434949 77218762 78131554 78836768 80100725
4971H0100725J798987Q11847N65359O65943J341487L40240R11300M54202J5132
$$ 80100725 81899712 82711559 83276918 83942861 85284348 85624588 86535888 86990090 87005222
4962H7005222O72940J79929p2917n60000n58021l85197p15697p58766j104100
$$ 87005222 87678162 87858091 87785174 87225174 86667153 86281956 85566259 84807493 83703393
4953H3703393j065855j598758k229538j219160j172049k059997j733886j296832
$$ 83703393 82637538 81038780 78809242 77590082 76418033 74358036 72624150 71327318
4945G1327318k179816j780192j642001j846782j965046j252333j587332j961248
$$ 71327318 69147502 67367310 65725309 63878527 61913481 60661148 59073816 57112568
4937E7112568j406301j260449r59352j225565j197159j348972j686438j465321
$$ 57112568 55706267 54445818 53486466 52260901 51063742 49714770 48028332 46563011
4929D6563011n28698n58565j196694p35237R0329m15088j049062q48749k03211
$$ 46563011 46034313 45475748 44279054 43543817 43634146 43219058 42169996 41321247 41118036
4920D1118036J9287j012757j64053o09624R1923O4720J95919K10965k4542j06296
$$ 41118036 41137323 40124566 39960513 39350889 39442812 39507532 39703451 39914416 39889874 39783578
4910C9783578o1373N59487P8397o36427k15272P85862M89954r8610j631p39941
$$ 39783578 39722205 40281692 40360089 39723662 39508390 40294252 40784206 40685596 40683965 39944024
4900C9944024j55929j88706q14540k96498o09156p97540n88740p43085r29983
$$ 39944024 39788095 39599389 38784849 38488351 37879195 37081655 36492915 35749830 34819847
4891C4819847o84879o75961j406145j54019o26352m00579o55429l46106j084103
$$ 34819847 34134968 33459007 32052862 31898843 31272491 30871912 30216483 29870377 28786274
4882B8786274m93534n5853l81769m63356p42465n18276j19733l04p53538j130248
$$ 28786274 28292740 28236887 27855118 27391762 26649297 26131021 26011288 26010984 25257446 24127198
4872B4127198j56210Q21649l59821k84897l65361O73805R7060j76287o84682J77275
$$ 24127198 23970988 24792637 24432816 24147919 23782558 24456363 24553423 24377136 23692454 23869729
4862B3869729J85850n57334q74552j58026n06935L0085l12384j139125L9525j48264
$$ 23869729 24055579 23498245 22623693 22465667 21958732 21988817 21676433 20537308 20576833 20428569
4852B0428569m49288m82878o44128l32515n50606k81542K46958j079240j000425
$$ 20428569 19979281 19496403 18852275 18519760 17969154 17687612 17934570 16855330 15854905
4843A5854905j73971L5936m36810l47276J22308n14743l5566p83924L65092l98078
$$ 15854905 15680934 15716870 15280060 14932784 15055092 14540349 14504783 13720859 14085951 13687873
4833A3687873k50313k3662O3968j22003K29381n16715o58458j24141K80520p86050
$$ 13687873 13437560 13413898 13477866 13355863 13585244 13068529 12410071 12285930 12566450 11780400
4823A1780400j60152m12051q7625j87503k44518m53329J91406l43302O9043K90278
$$ 11780400 11620248 11208197 11120572 10933069 10688551 10235222 10426628 10083326 10152369 10442647
4813A0442647L44082l8679q6944k98435J84191K03851o69499N17730m76415k39786
$$ 10442647 10786729 10748050 10661106 10362671 10546862 10750713 10081214 10598944 10122529 9882743
4803I882743m64251N16280J75402Q2788j79904R4677m45835n92480L56707J41599
$$ 9882743 9418492 9934772 10110174 10192962 10013058 10107735 9661900 9069420 9426127 9567726
4793I567726m13495j12948L02092o15623m7799L28414q9895K34440n98618n15470
$$ 9567726 9154231 9041283 9343375 8727752 8679953 9008367 8918472 9152912 8554294 8038824
4783H038824l33150L78259K69706K99953o04204l14008P28323M479k74650L72521
$$ 8038824 7705674 8083933 8353639 8653592 8049388 7735380 8463703 8468182 8193532 8566053
4773H566053L93984J84527k81583k06126n17577k82306o1306K52060m88779N66085
$$ 8566053 8960037 9144564 8862981 8656855 8139278 7856972 7795666 8047726 7558947 8125032
4763H125032n44885k43801Q5835n5131N35175r05299k38912L11193J73387r4703
$$ 8125032 7580147 7336346 7422181 7367050 7902225 6996926 6758014 7069207 7242594 7147891
4753G147891K19641J13753n62889K08854L67299L77377j84283p1701j1140J04566
$$ 7147891 7367532 7481285 6918396 7127250 7494549 7871926 7687643 7615942 7604802 7709368
4743G709368J97227L6392J220j45174j62836J9890k9568O2659k59436o00828m4207
$$ 7709368 7906595 7942987 7944207 7799033 7636197 7656087 7626519 7689178 7429742 6828914 6784707
4732F784707K36638P4675O09002o82019M68221M54493m3363n8141L03750K85439
$$ 6784707 7021345 7096020 7705022 7023003 7491224 7945717 7902354 7844213 8147963 8433402
4722H433402o19438l07905k09098L20724n82196m1739M82529M71770j50215l45060
$$ 8433402 7813964 7506059 7296961 7617685 7035489 6993750 7476279 7948049 7797834 7452774
4712G452774k18418k03632J25012o31501N16012M68616q7781k94017m1610l92618
$$ 7452774 7234356 7030724 7155736 6524235 7040247 7508863 7421082 7127065 7085455 6692837
4702F692837M41785j89917j92419K8600N12443M0044K54716J88095K71807k35838
$$ 6692837 7134622 6944705 6752286 6780886 7293329 7333373 7588089 7776184 8047991 7812153
4692G812153k34976K71589r0483N46819l51945K2673o46293K24009N00188m36750
$$ 7812153 7577177 7848766 7758283 8305102 7953157 7975830 7329537 7553546 8053734 7616984
4682G616984r26412O34979M76438m03608k11602j93442l14541O02610J37902M02448
$$ 7616984 6690572 7325551 7801989 7398381 7186779 6993337 6678796 7281406 7419308 7821756
4672G821756L4236m1956m20149P81153j7473K32142o8271l90256l50849j54291
$$ 7821756 7855992 7814036 7393887 8175040 8157567 8389709 8321438 7931182 7580333 7426042
4662G426042j33701O22563j7314J54416j28587q4755J62876j94104N33645K00509
$$ 7426042 7292341 7914904 7897590 8052006 7923419 7838664 8001540 7807436 8341081 8541590
4652H541590k5206m45610m24802q8667K49542O3435L39248l06153l51129r399
$$ 8541590 8516384 8070774 7645972 7557305 7806847 7870282 8209530 7903377 7552248 7542849
4642G542849O88589k26660k29219Q0884O6617O04524P05787l6789p45314n7097
$$ 7542849 8231438 8004778 7775559 7856443 7923060 8527584 9233371 9196582 8451268 8394171
4632H394171k11635K19592K03269l4803K4735l66532L76984j194j84298L16426
$$ 8394171 8182536 8402128 8605397 8570594 8595329 8228797 8605781 8604587 8420289 8736715
4622H736715O63344k98436k54738l9409k45283N28594k52560J63142O8911J84284
$$ 8736715 9400059 9101623 8846885 8807476 8562193 9090787 8838227 9001369 9070280 9254564
4612I254564j19745m69660J70722j68422Q24336R5615k70336K87019n57636J1507
$$ 9254564 9134819 8665159 8835881 8667459 9491795 9587410 9317074 9604093 9046457 9057964
4602I057964j57189K95930l69442J13479L69258J56247J64965L30776n12297k51305
$$ 9057964 8900775 9196705 8827263 8940742 9310000 9466247 9631212 9961988 9449691 9198386
4592I198386M08525J59980K61589M36001K07391j27726N1436j73118m13225m55034
$$ 9198386 9606911 9766891 10028480 10464481 10671872 10544146 10595582 10422464 10009239 9554205
4582I554205L65694R37414R021l75745m30497p8363N93525n8783O72006k45081
$$ 9554205 9919899 10857313 10866334 10490589 10060092 9981729 10575254 10516471 11188477 10943396
4572A0943396K34511k78284n62238l56566M62000J12667J54154L38988k84j44521
$$ 10943396 11177907 10899623 10337385 9980819 10442819 10555486 10709640 11048628 11048344 10903823
4562A0903823K59489L72846M92809o5608k0530p9131n06535M59372M16951M86454
$$ 10903823 11163312 11536158 12028967 11963359 11942829 11863698 11357163 11816535 12233486 12719940
4552A2719940Q3132j3055n75162k79888l07821L69611N768n6359M90288P191O09985
$$ 12719940 12803072 12790017 12214855 11934967 11627146 11996757 12002525 11946166 12436454 12443645 13053630
4541A3053630O28574j57215J69951N4915K72344K48371o91463P8220J17883J03231
$$ 13053630 13682204 13524989 13694940 13749855 14022199 14270570 13579107 13657327 13775210 13878441
4531A3878441j31427j6425P09436K23135L16062L87064p20211r5906J32017L70824
$$ 13878441 13747014 13730589 14440025 14663160 14979222 15366286 14646075 14550169 14682186 15053010
4521A5053010L46045R96651M65593K37390N5678J65794r5905l71787j78930N9106
$$ 15053010 15399055 16395706 16861299 17098689 17154367 17320161 17224256 16852469 16673539 16732645
4511A6732645J23582K05709M29846N60476M61664J34888k1044O59384P51424R8958
$$ 16732645 16856227 17061936 17491782 18052258 18513922 18648810 18627766 19287150 20038574 20137532
4501B0137532L68414L1702m5821K22078r29272o28326K72731Q90965P20298Q62
$$ 20137532 20505946 20537648 20491827 20713905 19784633 19156307 19429038 20320003 21040301 21041163
4491B1041163J61907J017872L0478j91420J021746o8728K03069k1817P47937L97902
$$ 21041163 21203070 22220942 22251420 22060000 23081746 23013018 23216087 23194270 23942207 24340109
4481B4340109O74843M36115K62048M30319N72615l7107L29014j68394N73662O10038
$$ 24340109 25014952 25451067 25713115 26143434 26716049 26678942 27007956 26839562 27413224 28023262
4471B8023262O51873N24810j21561J081075M82460N15542L3462N61321R37147
$$ 28023262 28675135 29199945 29078384 30159459 30641919 31157461 31190923 31752244 32689391
4462C2689391M4221L52105O64122k36939P55574O96261J133655M56307N86845
$$ 32689391 32733612 33085717 33749839 33512900 34268474 34964735 36098390 36554697 37141542
4453C7141542R90092P56047L71494R33485J126419P23426O13900P42347Q98184
$$ 37141542 38131634 38887681 39259175 40192660 41319079 42042505 42656405 43398752 44296936
4444D4296936R40082M25805R91959Q64105P01026J006348R36509J312289J050200
$$ 44296936 45237018 45662823 46654782 47518887 48219913 49226261 50162770 51475059 52525259
4435E2525259J023662N39106O89461J184985J504924M77157R12948J952656J173171
$$ 52525259 53548921 54088027 54777488 55962473 57467397 57944554 58857502 60810158 61983329
4426F1983329J010200J292084J180576J318643P63649N04195J975084J111085
$$ 61983329 62993529 64285613 65466189 66784832 67548481 68052676 70027760 71138845
4418G1138845J062592J227089J530793J557288P67205R28117J326191J418899
$$ 71138845 72201437 73428526 74959319 76516607 77283812 78211929 79538120 80957019
4410H0957019Q37593J211023N18541J343123O66684O52101J140659P79889J914084
$$ 80957019 81794612 83005635 83524176 84867299 85533983 86186084 87326743 88106632 90020716
4401I0020716R64263L49954P81228M60949R51324M96255P57269R11689N20552
$$ 90020716 90984979 91334933 92116161 92577110 93528434 94024689 94781958 95693647 96214199
4392I6214199j29294R04392Q75535K34383l9111K7633j26500N27304J77654J96252
$$ 96214199 96084905 96989297 97864832 98099215 98060104 98087737 97961237 98488541 98666195 98862447
4382I8862447k28283l02558m20115j89366q87668n06981n01776K15739q50170
$$ 98862447 98634164 98331606 97911491 97722125 96834457 96327476 95825700 96041439 95191269
4373I5191269k20980k35632n20010l79842k23033j00334k01964p99010n54638
$$ 95191269 94970289 94734657 94214647 93834805 93611772 93511438 93309474 92510464 91955826
4364I1955826m32968q90056k98368l65310m92121r26538m03679o78659l37706
$$ 91955826 91522858 90632802 90334434 89969124 89477003 88550465 88146786 87468127 87130421
4355H7130421j063682o58042l84966p05029p79322l20455o10978L03974l67616
$$ 87130421 86066739 85408697 85023731 84318702 83539380 83218925 82607947 82911921 82544305
4346H2544305q55044n99573j031690n19437p23827m80478n34138l7074m39962
$$ 82544305 81689261 81089688 80057998 79538561 78814734 78334256 77800118 77763044 77323082
4337G7323082J16579L89692o47009j0616n651k82262j56228Q23044k73795q05816
$$ 77323082 77439661 77829353 77182344 77171728 77166077 76883815 76727587 77550631 77276836 76471020
4327G6471020l95030q1175M15389k04517m3093L03832k49364j19072N03845L39254
$$ 76471020 76075990 75994815 76410204 76205687 76162594 76466426 76217062 76097990 76601835 76941089
4317G6941089K44590P26704L32769R35723M87387J93875l28824J011477K87394
$$ 76941089 77185679 77912383 78245152 79180875 79668262 79862137 79533313 80544790 80832184
4308H0832184K70242R26163P72108M59190Q05985P31177R93028O71640P3820R18729
$$ 80832184 81102426 82028589 82800697 83259887 84065872 84797049 85790077 86461717 86535537 87454266
4298H7454266R39659J014788J219887O44918R86242P47392R64155N81183J108825
$$ 87454266 88393925 89408713 90628600 91273518 92259760 93007152 93971307 94552490 95661315
4289I5661315J471843J199185J568115J777769J651471O10523J413502J453807
$$ 95661315 97133158 98332343 99900458 101678227 103329698 103940221 105353723 106807530
4281A06807530Q21982J663710J642464J479159J602806J540505J969329J393368
$$ 106807530 107629512 109293222 110935686 112414845 114017651 115558156 117527485 118920853
4273A18920853J226900J806535J969109J378957J684190K096558K043430J320462
$$ 118920853 120147753 121954288 123923397 125302354 126986544 129083102 131126532 132446994
4265A32446994J994950K396444K027902J725417K022924K427619J995513K302736
$$ 132446994 134441944 136838388 138866290 140591707 142614631 145042250 147037763 149340499
4257A49340499K145667K734671K065275K738909K528809K375108K414989J936095
$$ 149340499 151486166 154220837 156286112 159025021 161553830 163928938 166343927 168280022
4249A68280022J640691K388037K282592K557667K634156K037875K375947K050349
$$ 168280022 169920713 172308750 174591342 177149009 179783165 181821040 184196987 186247336
4241A86247336J601626J797870J774535J701208K194055K274392J427925J716841
$$ 186247336 187848962 189646832 191421367 193122575 195316630 197591022 199018947 200735788
4233B00735788J703851J760928J753844J265743J340572N83626R87505N11808
$$ 200735788 202439639 204200567 205954411 207220154 208560726 209144352 210131857 210643665
4225B10643665K60570O7242Q56013M27158N2154L23647k48668r82133j122706
$$ 210643665 210904235 210971477 211827490 212254648 212306802 212630449 212381781 211399648 210276942
4216B10276942l29314n14216n96721j132764j613420j506625j544754j001543
$$ 210276942 209947628 209433412 208836691 207703927 206090507 204583882 203039128 202037585
4208B02037585j916229j398617k013790j685866j314196k186269k136107j822020
$$ 202037585 200121356 198722739 196708949 195023083 193708887 191522618 189386511 187564491
4200A87564491k095965j613485k309475k530218k276451k527670j625024k779622
$$ 187564491 185468526 183855041 181545566 179015348 176738897 174211227 172586203 169806581
4192A69806581k663052k466867k594055k348384k128645j506559k466061k183928
$$ 169806581 167143529 164676662 162082607 159734223 157605578 156099019 153632958 151449030
4184A51449030k000401j854755k248925k342133j878284k325384k273027j515248
$$ 151449030 149448629 147593874 145344949 143002816 141124532 138799148 136526121 135010873
4176A35010873j351424j462043k049906k143588j865273j246633k198396j558030
$$ 135010873 133659449 132197406 130147500 128003912 126138639 124892006 122693610 121135580
4168A21135580j391298j936252j904951j190779j265049j067438j702151j798244
$$ 121135580 119744282 117808030 115903079 114712300 113447251 112379813 110677662 108879418
4160A08879418j798417j103895r62558j705196j200731p02891r64877j532480
$$ 108879418 107081001 105977106 105014548 103309352 102108621 101405730 100440853 98908373
4152I8908373j142180p53510j203958r22020n99050p99898j322615r77807p06919
$$ 98908373 97766193 97012683 95808725 94886705 94287655 93487757 92165142 91187335 90480416
4143I0480416r67894q15937j037218j201085o53972o41966q45449p64661p29968
$$ 90480416 89512522 88696585 87659367 86458282 85804310 85162344 84316895 83552234 82822266
4134H2822266r86048o55392p20041o87319o4947m28706l4247o02879j010161j82307
$$ 82822266 81836218 81180826 80460785 79773466 79708519 79279813 79245566 78642687 77632526 77450219
4124G7450219J13181l07082n03712N58789m77616k85076l17666m17575J2024K85740
$$ 77450219 77563400 77256318 76752606 77311395 76833779 76548703 76231037 75813462 75825486 76111226
4114G6111226K35717Q40281O44015o85602q2244J57158J147337O27536J13191
$$ 76111226 76346943 77187224 77831239 77145637 77063393 77220551 78367888 78995424 79108615
4105G9108615k05516O98448k33972R33740P37957O56614N87853R46277K45530
$$ 79108615 78903099 79601547 79367575 80301315 81039272 81695886 82283739 83230016 83475546
4096H3475546P08042M16774J156309J250772O85293J415757R59898M43595O92356
$$ 83475546 84183588 84600362 85756671 87007443 87692736 89108493 90068391 90511986 91204342
4087I1204342J001088P86107O21677Q58263P47810K13786R75086J606047J279641
$$ 91204342 92205430 92991537 93613214 94471477 95219287 95433073 96408159 98014206 99293847
4078I9293847Q88221Q63729P17478Q26943J085294J227280K18232Q27754J055925
$$ 99293847 100182068 101045797 101763275 102590218 103675512 104902792 105121024 105948778 107004703
4069A07004703P57908J021920O40301Q15005L99073O13468O11573O27377O2737
$$ 107004703 107762611 108784531 109424832 110239837 110638910 111252378 111863951 112491328 112554065
4060A12554065m24906K31997J82188j86656L36726L06285K65459q09276j6012
$$ 112554065 112129159 112361156 112543344 112356688 112693414 112999699 113265158 112455882 112439870
4051A12439870p0182M97148l00105k06709K31903J16178j20895j65864j23214
$$ 112439870 112369688 112866836 112566731 112360022 112591925 112708103 112587208 112421344 112298130
4042A12298130q83493l12607Q4618m48774r27210p38508j188680q03218l72249
$$ 112298130 111414637 111102030 111186648 110737874 109810664 109072156 107883476 107080258 106708009
4033A06708009o95948r35133j034302o91566j170587r61216o69261r39706j160224
$$ 106708009 106012061 105076928 104042626 103351060 102180473 101219257 100549996 99610290 98450066
4024I8450066j233776q51001q44229j118165j470710j155722j171858n49826j189474
$$ 98450066 97216290 96365289 95521060 94402895 92932185 91776463 90604605 90054779 88865305
4015H8865305l02374p72405p71096r23076q48560l88912o66121J9962j166270
$$ 88865305 88562931 87790526 87019430 86096354 85247794 84858882 84192761 84212723 83046453
4006H3046453j137571r11382m60891q21347j010406p80686q44523j025566n37885
$$ 83046453 81908882 80997500 80536609 79715262 78704856 77924170 77079647 76054081 75516196
3997G5516196l37075k56879m66893l90649l06012o59003j89183o76516k9059r21953
$$ 75516196 75179121 74922242 74455349 74064700 73758688 73099685 72910502 72233986 72204927 71282974
3987G1282974n56561k07417l59374l90499k3124m03072p52333o90326j32028k07200
$$ 71282974 70726413 70518996 70159622 69769123 69745999 69342927 68590594 67900268 67768240 67561040
3977F7561040J97841k03611n06683j005278P64293j5286K45330n06771n51435
$$ 67561040 67758881 67555270 67048587 66043309 66807602 66792316 67037646 66530875 65979440
3968F5979440l28967p3058j20831k44784j78857K55955L87284j125098j61221
$$ 65979440 65650473 65577415 65456584 65211800 65032943 65288898 65676182 64551084 64389863
3959F4389863q7364j10651o47200n98687p87323m67537J00625K1876j236979p89019
$$ 64389863 64302499 64191848 63544648 62945961 62158638 61691101 61791726 61813602 60576623 59787604
3949E9787604n06591j053983r02859k41340j185067m94977l11518j530463j107200
$$ 59787604 59281013 58227030 57324171 57082831 55897764 55402787 55091269 53560806 52453606
3940E2453606o57998j02546q65701n73504r31962j209287m27621o30580o58168
$$ 52453606 51795608 51693062 50827361 50253857 49321895 48112608 47684987 47054407 46396239
3931D6396239o26819j318693m24667p04744k99787o04069q03909k91002n68614
$$ 46396239 45769420 44450727 44026060 43321316 43021529 42417460 41613551 41322549 40753935
3922D0753935j174011p64603Q8719k96102r75795o78797o84936m21726k13792
$$ 40753935 39579924 38815321 38904040 38607938 37632143 36953346 36268410 35846684 35632892
3913C5632892o65520j011399o6550l089n79018l02880J05927p02120o23838j66881
$$ 35632892 34967372 33955973 33889423 33886334 33307316 33004436 33110363 32408243 31784405 31617524
3903C1617524n64850m19258j79748K03692N0876j46853n77178l28345n33915q23842
$$ 31617524 31052674 30633416 30453668 30657360 30708236 30561383 29984205 29655860 29121945 28298103
3893B8298103j80364L69404k79598j64414j60331K87045m05129l42669m8306K98519
$$ 28298103 28117739 28487143 28207545 28043131 27882800 28169845 27764716 27422047 27373741 27672260
3883B7672260M53573J88419m84875J22925P11353n0615n868m5244j77993k80307
$$ 27672260 28125833 28314252 27829377 27952302 28663655 28613040 28607172 28561928 28383935 28103628
3873B8103628K97228J40062p26960K86425n1604N7323J09788J97401J57460L11241
$$ 28103628 28400856 28540918 27813958 28100383 28048779 28106102 28215890 28413291 28570751 28881992
3863B8881992J32701q9681Q6156O28606m9062M10585N43815O38033L72206N94616
$$ 28881992 29014693 28925012 29011168 29639774 29590712 30001297 30545112 31183145 31555351 32149967
3853C2149967K40840J14989K96317J27229M32842K73629L03553N35517N23444
$$ 32149967 32390807 32505796 32802113 32929342 33362184 33635813 33939366 34474883 34998327
3844C4998327N97654K93132P39387K61189O54690J43115R97898M04655P74698
$$ 34998327 35595981 35889113 36628500 36889689 37544379 37687494 38685392 39090047 39864745
3835C9864745M50831N83161J391846L68848N98696L90035J021079Q26814J138674
$$ 39864745 40315576 40898737 42290583 42659431 43258127 43648162 44669241 45496055 46634729
3826D6634729P69930Q45220O87204J369140J487065O44369O68712J165630N68228
$$ 46634729 47404659 48249879 48937083 50306223 51793288 52437657 53106369 54271999 54840227
3817E4840227J171108R29783Q03050Q34478J165523J071686J146216J290910R66937
$$ 54840227 56011335 56941118 57744168 58578646 59744169 60815855 61962071 63252981 64219918
3808F4219918J878611J576166K155054J003102J077493J695858J476589J831217
$$ 64219918 66098529 67674695 69829749 70832851 71910344 73606202 75082791 76914008
3800G6914008J982296J908300K016099K000983J932158K151730K373321K496627
$$ 76914008 78896304 80804604 82820703 84821686 86753844 88905574 91278895 93775522
3792I3775522K831516K502436K534107K690950L142973L762769L505231M330564
$$ 93775522 96607038 99109474 101643581 104334531 107477504 111240273 114745504 119076068
3784A19076068L486142L704999M631451N314268N626069O334208O306949P103281
$$ 119076068 122562210 126267209 130898660 136212928 141838997 148173205 154480154 161583435
3776A61583435P239322P680190Q330196Q879999Q635657R046028J0572824J0675893
$$ 161583435 168822757 176502947 184833143 193713142 202348799 211394827 221967651 232643544
3768B32643544J0865260J1228907J0405479J0113135R280058P709060O296001
$$ 232643544 243508804 254737711 265143190 275256325 284536383 292245443 298541444
3761B98541444L850413R87618p97166l255354m919113o720561q277251r227345
$$ 298541444 302391857 303379475 302582309 299326955 294407842 287687281 279410030 270182685
3753B70182685j0280861j0074152j0767965j0365742j0302116r251658r630860
$$ 270182685 259901824 249827672 239059707 228693965 218391849 209140191 199509331
3746A99509331r589428q759047q497559p498423o777296o141813o597926o044178
$$ 199509331 189919903 181160856 172663297 165164874 158387578 152245765 145647839 139603661
3738A39603661n512869n692602m358022m100997m206432l691465l495863l001413
$$ 139603661 134090792 128398190 124040168 119939171 115732739 112041274 108545411 105543998
3730A05543998l283808l116627k720683k364296l285752j993844k260895j861608
$$ 105543998 102260190 99143563 96422880 94058584 90772832 88778988 86518093 84656485
3722H4656485k822463j900036j988603j565953j726119j378239j689339j790121
$$ 84656485 81834022 79933986 77945383 76379430 74653311 73275072 71585733 69795612
3714F9795612j460362j413554j500332j414279j454964j443681j021603j656729
$$ 69795612 68335250 66921696 65421364 64007085 62552121 61108440 60086837 58430108
3706E8430108p43523o34258j048265j071253r33902j190169r10130q52403q41214
$$ 58430108 57686585 57052327 56004062 54932809 53998907 52808738 51898608 51046205 50204991
3697E0204991n59702o38477r33134p13782j084952o28142r37126Q4595o11788
$$ 50204991 49645289 49006812 48073678 47359896 46274944 45646802 44709676 44794271 44182483
3688D4182483q69552j206649j356079j61475m29404p51572p38724j416752j049892
$$ 44182483 43312931 42106282 40750203 40588728 40159324 39407752 38669028 37252276 36202384
3679C6202384L5276o81224j193296q33693l98999m69126m18697o41765k43783
$$ 36202384 36237660 35556436 34363140 33529447 33130448 32661322 32242625 31600860 31357077
3670C1357077l29914p60766j11631l25769p52839k37972k38336j284894l90378
$$ 31357077 31027163 30266397 30154766 29828997 29076158 28838186 28599850 27314956 26924578
3661B6924578n50038K48256n55718j554930n18407k48514o77553k28191o79575
$$ 26924578 26374540 26622796 26067078 24512148 23993741 23745227 23067674 22839483 22159908
3652B2159908n04730o2791q60803k54836K28667o71179K25213q1868m28834q74928
$$ 22159908 21655178 21592387 20731584 20476748 20705415 20034236 20259449 20177581 19748747 18873819
3642A8873819l0773o18364m59379M04816m36797j74630k28473J9823N1709M10685
$$ 18873819 18843046 18224682 17765303 18170119 17733322 17558692 17330219 17350042 17401751 17812436
3632A7812436m42189r05558n52346K58467k55718l06114k14734o50688o7880K80049
$$ 17812436 17370247 16464689 15912343 16170810 15915092 15608978 15394244 14743556 14675676 14955725
3622A4955725l36965K82253K29426l65759J66274l09552O13728K62532l33472
$$ 14955725 14618760 14901013 15130439 14764680 14930954 14621402 15235130 15497662 15164190
3613A5164190l17831m58105j03394j72246L4569j7177m1323l67883k13523K61766
$$ 15164190 14846359 14388254 14284860 14112614 14147183 14130006 14088683 13720800 13507277 13769043
3603A3769043J3166k00289n40815P0613j43815O214j82569M4607o31895k69023
$$ 13769043 13782209 13581920 13041105 13111718 12967903 12974117 12791548 12836155 12204260 11935237
3593A1935237n2043j56833J86644N7120l51203l36078L35375N38536Q88154l77034
$$ 11935237 11883194 11726361 11913005 11970125 11618922 11282844 11618219 12156755 13044909 12667875
3583A2667875p93692N10887m44671m63364p23138J31165M74424l84501k86830
$$ 12667875 11874183 12385070 11940399 11477035 10753897 10885062 11359486 10974985 10688155
3574A0688155n52464m66466M10229Q1393n21143l74102L49605N49262k39035k36489
$$ 10688155 10135691 9669225 10079454 10160847 9639704 9265602 9615207 10164469 9925434 9688945
3564I688945j944k62410n7214K33121N38551l3133n24972n76806M7510O1072j07972
$$ 9688945 9687001 9424591 9367377 9600498 10139049 10105916 9580944 9004138 9051648 9112720 9004748
3553I004748j18774L06498R3246n07091L87187J09784M16m88136m7712l47406
$$ 9004748 8885974 9192472 9285718 8778627 9165814 9275598 9276014 8787878 8740166 8392760
3543H392760J70232j05791M7431K4956J83127k9594M1210K27034M8482p00917
$$ 8392760 8562992 8457201 8504632 8529588 8712715 8683121 8724331 8951365 8999847 8298930
3533H298930p1393M38642O03533K29525j41164p53557K78282L8474l4066L08096
$$ 8298930 8227537 8666179 9269712 9499237 9358073 8604516 8882798 8921272 8887206 9195302
3523I195302l42405j92535K16668k62477L32783k9607k32234l51430P8509J82350
$$ 9195302 8852897 8660362 8877030 8614553 8947336 8917729 8685495 8334065 8412574 8594924
3513H594924j50344J32597k62938M55698O19226l6031k54687M91740K48065J0496
$$ 8594924 8444580 8577177 8314239 8769937 9389163 9353132 9098445 9590185 9838250 9848746
3503I848746K86849k84562K72092m89413k03442n08163K67980M53328k06523O1735
$$ 9848746 10135595 9851033 10123125 9633712 9430270 8922107 9190087 9643415 9436892 9498627
3493I498627m93460L57089N13192m9505J35977p7415n6448q4768k86626K59350
$$ 9498627 9005167 9362256 9875448 9825943 9961920 9884505 9828057 9743289 9456663 9716013
3483I716013P99672M54136L51006P5460j95217r5347J23977k89966j70337m58961
$$ 9716013 10515685 10969821 11320827 11396287 11201070 11105723 11229700 10939734 10769397 10310436
3473A0310436L98853O61188J33908K53791J58775k72306J75460J95963J93078
$$ 10310436 10709289 11370477 11504385 11758176 11916951 11644645 11820105 12016068 12209146
3464A2209146o6514j34761J43873l78161N78410K44791O19233N14014l63783q46638
$$ 12209146 12142632 12007871 12151744 11773583 12351993 12596784 13216017 13730031 13366248 12519610
3454A2519610L76758J200789P05623P0984N18632Q8681J77493O10117l88561N62325
$$ 12519610 12896368 14097157 14802780 14873764 15392396 15481077 15658570 16268687 15880126 16442451
3444A6442451M97317j42894J54923O7806R77140L7348J07307K42483M58643J01669
$$ 16442451 16939768 16796874 16951797 17019603 17996743 18034091 18141398 18383881 18842524 18944193
3434A8944193P41633J085378N17154j46024K75023M70820L74601P08345N98319
$$ 18944193 19685826 20771204 21288358 21142334 21417357 21888177 22262778 22971123 23569442
3425B3569442L08366M33894K62981J52864L45777N67335N23654O37820P91757
$$ 23569442 23877808 24311702 24574683 24727547 25073324 25640659 26164313 26802133 27593890
3416B7593890P66599O42578J273014J152395L95082J029607J576255N87608J030536
$$ 27593890 28360489 29003067 30276081 31428476 31823558 32853165 34429420 35017028 36047564
3407C6047564R01066P94577N14277J296499J243854J618246P42765J251748K429547
$$ 36047564 36948630 37743207 38257484 39553983 40797837 42416083 43158848 44410596 46840143
3398D6840143J897820K189369K665924K199680K878594L511669L170476L452899
$$ 46840143 48737963 50927332 53593256 55792936 58671530 62183199 65353675 68806574
3390F8806574L659321N003107M391176M555438N615375N930151O477698O433424
$$ 68806574 72465895 77469002 81860178 86415616 92030991 97961142 104438840 110872264
3382A10872264O105671O826489O089812P300459P897458P792102P523323O819073
$$ 110872264 116977935 123804424 129894236 137194695 145092153 152884255 160407578 167226651
3374A67226651O377349N657316N367270N325180N616130M524517N408620M317287
$$ 167226651 173604000 179261316 184628586 189953766 195569896 200094413 205503033 209820320
3366B09820320L659775K060711P25610K08486o39200j679946k163470j708011
$$ 209820320 213480095 215540806 216266416 216474902 215835702 214155756 211992286 210284275
3358B10284275k618666l751064m335108n062766n298056o546477o674814o631540
$$ 210284275 207665609 203914545 199579437 194516671 189218615 182672138 175997324 169365784
3350A69365784o150793p229326o794651p084448p773476o465603o295105p196993
$$ 169365784 163214991 155985665 149191014 142106566 134333090 127867487 121572382 114375389
3342A14375389o610224n976720o365390n275358n593383n169991m333233l466239
$$ 114375389 107765165 101788445 95423055 90147697 84554314 79384323 75051090 71584851
3334G1584851l671179l183795l829133k925830k092134k250244k820601k347700
$$ 71584851 67913672 64729877 60900744 57974914 55882780 53632536 50811935 48464235
3326D8464235k484353j548482j400878j455297k014640j325729j137599r98807
$$ 48464235 45979882 44431400 43030522 41575225 39560585 38234856 37097257 36098450
3318C6098450m85674r52505j297337o43256p60968o27345p13623j381465p29483
$$ 36098450 35612776 34660271 33362934 32719678 31958710 31331365 30617742 29236277 28506794
3309B8506794j080237j098332l27588r55712o04291n86899n73176l99001j55383
$$ 28506794 27426557 26328225 26000637 25044925 24440634 23853735 23280559 22881558 22726175
3300B2726175l27946M4539l92797r41322J5501j72686k38120J9720k87985l43524
$$ 22726175 22398229 22442768 22049971 21108649 21124150 20951464 20713344 20733064 20445079 20101555
3290B0101555r94564o7719n97071J01839j92752p5781n11840m92298k21299m04808
$$ 20101555 19106991 19039272 18442201 18544040 18351288 18275507 17763667 17271369 17050070 16645262
3280A6645262k0683k16767o9708o2603j41128r5978n25136n91846j94929k15791
$$ 16645262 16624579 16407812 16338104 16275501 16134373 16038395 15513259 14921413 14726484 14510693
3270A4510693k34153j19615l65513M29214k55822o03968k91386m2786n1879m58749
$$ 14510693 14276540 14156925 13791412 14220626 13964804 13360836 13069450 13026664 12974785 12516036
3260A2516036O02120l20710j84857j36523p13581m97775J55015j60256M3715k88758
$$ 12516036 13118156 12797446 12612589 12476066 11762485 11264710 11419725 11259469 11303184 11014426
3250A1014426o64972j61157J2035J26285J0394j13724k05396J09913j95880l2593
$$ 11014426 10349454 10188297 10200332 10326617 10337011 10223287 10017891 10127804 9931924 9899331
3240I899331K70407l08497j39144O3913m77404p2330N15865J12589p37454k77168
$$ 9899331 10169738 9861241 9722097 9786010 9308606 9236276 9752141 9864730 9127276 8850108
3230H850108P04335m57612r2382k67158j21642L96084K20514k86374l52477P08506
$$ 8850108 9554443 9096831 9004449 8737291 8615649 9011733 9232247 8945873 8593396 9301902
3220I301902j82879j021935k75629R4780N93477m83351l9304M4856L3417N9179
$$ 9301902 9119023 8097088 7821459 7916239 8509716 8026365 7987061 8031917 8065334 8124513
3210H124513K08658K51676n3588m05607N0577n17929J004001J02494L69064l71914
$$ 8124513 8333171 8584847 8531259 8125652 8176229 7658300 8662301 8764795 9133859 8761945
3200H761945m49294k25108N53624L68448m08445n11394l1360q8918j50293o086
$$ 8761945 8312651 8087543 8641167 9009615 8601170 8089776 8058416 7969498 7819205 7813119
3190G813119P69713L48999n04287R2434l09359j878l31293J7039q9686l41469
$$ 7813119 8582832 8931831 8427544 8519978 8210619 8208741 7877448 7894487 7804801 7463332
3180G463332k35617N01733J79351L62258n8388K36326J79387n0838K78621k6298
$$ 7463332 7227715 7729448 7908799 8271057 8212669 8448995 8628382 8577544 8856165 8829867
3170H829867n71915J32981L91967o43524O8037J59869j54961L93995J7137m42926
$$ 8829867 8257952 8390933 8782900 8139376 8207413 8367282 8212321 8606316 8623453 8180527
3160H180527J55984P0299M6803L96265N27486k08455l91720L65054m58624l57218
$$ 8180527 8336511 8406810 8453613 8849878 9377364 9168909 8777189 9142243 8683619 8326401
3150H326401N15869L34468p4741j98624O43093N04863J48848q8013n30340K69006
$$ 8326401 8842270 9176738 9101997 8903373 9546466 10051329 10200177 10112164 9581824 9850830
3140I850830k19503J73451J35306k25960K01059M5830k8454l25150j02110p5176
$$ 9850830 9631327 9804778 9940084 9714124 9915183 9961013 9932559 9607409 9505299 9430123
3130I430123J05679L69114N22595K29537p6181j67488K73288P54233J04104L549
$$ 9430123 9535802 9904916 10427511 10657048 10580867 10413379 10686667 11440900 11545004 11548553
3120A1548553k00446m24838n9135L27069M35652k06814k84742P48428L93128J52935
$$ 11548553 11348107 10923269 10864134 11191203 11626855 11420041 11135299 11883727 12276855 12429790
3110A2429790O67779j31576l92217L92575L34720J74255l82742M68461R7667L30040
$$ 12429790 13097569 12965993 12573776 12966351 13301071 13475326 13092584 13561045 13658712 13988752
3100A3988752J22176k44132M20550j64041k81877M07709J77196M52889J90175
$$ 13988752 14110928 13866796 14287346 14123305 13841428 14249137 14426333 14879222 15069397
3091A5069397Q94911L26032n7500m38406M18224K26003K42670j72593L38636J251342
$$ 15069397 15964308 16290340 16232840 15794434 16212658 16438661 16681331 16508738 16847374 18098716
3081A8098716k44596R1050k31774K25436L31416P350Q48440L07484j55603J18978
$$ 18098716 17854120 17945170 17713396 17938832 18270248 18277598 19126038 19433522 19277919 19396897
3071A9396897R47923K89992J15938R50785P07604K74553n477N31921p3137K07298
$$ 19396897 20344820 20634812 20750750 21701535 22409139 22683692 22678215 23210136 23136999 23344297
3061B3344297N43137M26812O60571O81855M03736O32926N33596Q04558O91144
$$ 23344297 23887434 24314246 24974817 25656672 26060408 26693334 27226930 28031488 28722632
3052B8722632N12686R09785P19964O23629M49702K09317N63972J211649R69065
$$ 28722632 29235318 30145103 30865067 31488696 31938398 32147715 32711687 33923336 34892401
3043C4892401J161995Q81247J387557R54104Q70089J003527J406665J790201J615123
$$ 34892401 36054396 36935643 38323200 39277304 40147393 41150920 42557585 44347786 45962909
3034D5962909J231600J218455J447952J504259R97708K216517J542542J960478
$$ 45962909 47194509 48412964 49860916 51365175 52362883 54579400 56121942 58082420
3026E8082420K170706K579172K317690K148830J888046K690890K831015K112133
$$ 58082420 60253126 62832298 65149988 67298818 69186864 71877754 74708769 76820902
3018G6820902K957612K172644K989786K861510L329431L606671L308491L466426
$$ 76820902 79778514 81951158 84940944 87802454 91131885 94738556 98047047 101513473
3010A01513473L337247L483015L791181L460440M021240L233652M023502L543178
$$ 101513473 104850720 108333735 112124916 115585356 119606596 122840248 126863750 130406928
3002A30406928M023587L978467L569506L771094M416594L420143L317664K656586
$$ 130406928 134430515 138408982 141978488 145749582 150166176 153586319 156903983 159560569
2994A59560569L161267K975699K760607K976229K750748K169063J848149J918899
$$ 159560569 162721836 165697535 168458142 171434371 174185119 176354182 178202331 180121230
2986A80121230K005770J558274J167660N29979K29650N72377m44633L0662p08232
$$ 180121230 182127000 183685274 184852934 185382913 185612563 186184940 185740307 185770969 185062737
2977A85062737p33902l49343j266790k361272j188317j737326k742373j984475
$$ 185062737 184328835 183979492 182712702 180351430 179163113 177425787 174683414 172698939
2969A72698939k448030k947916k955741k734985l239777k677760k835597l446072
$$ 172698939 170250909 167302993 164347252 161612267 158372490 155694730 152859133 149413061
2961A49413061l754444l041628l861158l214739l966234l486715l383553l427206
$$ 149413061 145658617 142616989 138755831 135541092 131574858 128088143 124704590 121277384
2953A21277384l391036l113792l525260l026278l169023l462343l336885l572346
$$ 121277384 117886348 114772556 111247296 108221018 105051995 101589652 98252767 94680421
2945I4680421k312694l316948k774002k885260k154945j964947k461565k126977
$$ 94680421 92367727 89050779 86276777 83391517 81236572 79271625 76810060 74683083
2937G4683083k019961r99446j698201j824118j587801j960376j735937j470374
$$ 74683083 72663122 71663676 69965475 68141357 66553556 64593180 62857243 61386869
2929F1386869j541327j992754j246263q05059o07807j292707j247232j136715
$$ 61386869 59845542 57852788 56606525 55801466 55193659 53900952 52653720 51517005
2921E1517005o10907n51134n83386m78112r74058n84375m53959j52221l14474
$$ 51517005 50906098 50354964 49771578 49293466 48319408 47735033 47281074 47128853 46814379
2912D6814379q89266l00093o94050o76655k47674K29304J98398o43100o60440
$$ 46814379 45925113 45625020 44930970 44254315 44006641 44235945 44434343 43791243 43130803
2903D3130803J00192M82540N81816j67579L17489k85276m08268L52810N3109l5076
$$ 43130803 43230995 43713535 44295351 44127772 44445261 44159985 43751717 44104527 44157636 44122560
2893D4122560K80690L33390K33596L04624N92320l6290J27220Q41994N18337N75481
$$ 44122560 44403250 44736640 44970236 45274860 45867180 45830890 45958110 46800104 47318441 47893922
2883D7893922P52804P92449J154648Q6085L52929O94269O30904J073037P40613
$$ 47893922 48646726 49439175 50593823 50679908 51032837 51727106 52358010 53431047 54171660
2874E4171660N55706J264038J653747J638712L55674P59254J224504J263908J033241
$$ 54171660 54727366 55991404 57645151 59283863 59639537 60398791 61623295 62887203 63920444
2865F3920444J552556J105184M61914J561608J380431J725177J263458R04674
$$ 63920444 65473000 66578184 67040098 68601706 69982137 71707314 72970772 73875446
2857G3875446J445550P15794J068218K012717R49155J246610R82666M55696J528716
$$ 73875446 75320996 76036790 77105008 79117725 80066880 81313490 82296156 82751852 84280568
2848H4280568J903893J164696M02477J503309J566742R07707R70413J771185J765232
$$ 84280568 86184461 87349157 87751634 89254943 90821685 91729392 92699805 94470990 96236222
2839I6236222J510334J682960J581742J563599J822341J996552J469314K243290
$$ 96236222 97746556 99429516 101011258 102574857 104397198 106393750 107863064 110106354
2831A10106354K915224K507304K547493K567704L065427L124241L182246L587219
$$ 110106354 113021578 115528882 118076375 120644079 123709506 126833747 130015993 133603212
2823A33603212M556063M048798L782353M282645M944792N258038N222444N818393
$$ 133603212 138159275 142208073 145990426 150273071 155217863 160475901 165698345 171516738
2815A71516738N998144O848081O207053O406144P262272P174785O981783P005409
$$ 171516738 177514882 184362963 190570016 196976160 204238432 211413217 218395000 225400409
2807B25400409P230301O717996Q093322P706745P205859O813677P168757P135189
$$ 225400409 232630710 239348706 247442028 255148773 262354632 269168309 276337066 283472255
2799B83472255O300765O460960N560754N067442M225972M211885L312333L015965
$$ 283472255 289773020 296233980 301794734 306862176 311088148 315300033 318612366 321628331
2791C21628331K555567K200526P07361M94488K4767j233751j118901k125427j802880
$$ 321628331 324183898 326384424 327091785 327586273 327611040 326377289 325258388 323132961 321330081
2782C21330081k387628m036347m106997m556894n154124n048873n849563o409514
$$ 321330081 318942453 314906106 310799109 306242215 301088091 296039218 290189655 283780141
2774B83780141o180196o962460o288281o390543o947758p166588o837285o827975
$$ 283780141 277599945 270637485 264349204 257958661 251010903 243844315 237007030 230179055
2766B30179055o335331p018774o324444o798605o323023o122648o262420o222361
$$ 230179055 223843724 216824950 210500506 203701901 197378878 191256230 184993810 178771449
2758A78771449n873553m937167n206919n239971n307828m748838m528197l667317
$$ 178771449 172897896 167960729 162753810 157513839 152206011 147457173 142928976 139261659
2750A39261659l771074l042718l805521l608319k780734k813692k510632k372541
$$ 139261659 135490585 132447867 128642346 125034027 122253293 119439601 116928969 114556428
2742A14556428k354423k134132k396095k387197j985853j146168k291769j605107
$$ 114556428 112202005 110067873 107671778 105284581 103298728 102152560 99860791 98255684
2734I8255684j276515j750513j817385j162171l71989j269143j200373j788416
$$ 98255684 96979169 95228656 93411271 92249100 91877111 90607968 89407595 87619179
2726H7619179j297278j164121j125501j569316j071146j149513j428501j221643
$$ 87619179 86321901 85157780 84032279 82462963 81391817 80242304 78813803 77592160
2718G7592160q37191j800266l27367j684178j666967q62856j431867q12644n84691
$$ 77592160 76754969 74954703 74627336 72943158 71276191 70413335 68981468 68168824 67584133
2709F7584133j560746j617804j266621k35780j213328o28367r65494j463262q15482
$$ 67584133 66023387 64405583 63138962 62903182 61689854 61061487 60095993 58632731 57817249
2700E7817249r42064r11331m68438j196978o79530r89975j228056q83924r17263
$$ 57817249 56875185 55963854 55495416 54298438 53618908 52628933 51400877 50516953 49599690
2691D9599690o9909p86109j087978j254011l83486m8502L61959q97229n14791
$$ 49599690 49529781 48743672 47655694 46401683 46018197 45969695 46331654 45434425 44919634
2682D4919634p85012r06638o84758k49476N0886o67187l91495K7034k61636k25117
$$ 44919634 44134622 43227984 42543226 42293750 42344636 41677449 41285954 41312988 41051352 40826235
2672D0826235o70216k4977N5477n6596n61104l54095K1197j64127r73679O5265
$$ 40826235 40156019 40131042 40186519 40129923 39568819 39214724 39235921 39071794 38098115 38163380
2662C8163380k05724N27873n05709j12601R7443k41936M51014j67305k78188k49035
$$ 38163380 37957656 38485529 37979820 37867219 37964662 37722726 38173740 38006435 37728247 37479212
2652C7479212N75135J98278l05820j70482m5476K41337L34379K5089r00466L41055
$$ 37479212 38054347 38252625 37946805 37776323 37730847 37972184 38306563 38331652 37431186 37772241
2642C7772241J66445R3994j6176O58792n27846j77432l2469m05686k99663M4098
$$ 37772241 37938686 38032680 38016504 38675296 38147450 37970018 37937549 37531863 37232200 37276298
2632C7276298L91973N9550J38942M34510M02075M50152K22713J11346j88484o7532
$$ 37276298 37668271 37727821 37866763 38301273 38703348 39153500 39376213 39487559 39299075 39231543
2622C9231543k07690J209420J185912O3433O99583K9884Q15549Q41019J013297
$$ 39231543 39023853 40233273 41419185 41482618 42182201 42212085 43027634 43868653 44881950
2613D4881950N42649J069547P67486Q85546J237723J036456R18697Q92196O41303
$$ 44881950 45424599 46494146 47261632 48147178 49384901 50421357 51340054 52232250 52873553
2604E2873553K98168J225115R39937J892596J912779P48590N33197J021073J102096
$$ 52873553 53171721 54396836 55336773 57229369 59142148 59890738 60423935 61445008 62547104
2595F2547104J832317J780835P14384J185582J189126R70513J081164J086279
$$ 62547104 64379421 66160256 66874640 68060222 69249348 70219861 71301025 72387304
2587G2387304Q65258J078911R69682J007484P60078O34988M48999M27599R71067
$$ 72387304 73252562 74331473 75301155 76308639 77068717 77703705 78152704 78580303 79551370
2578G9551370J088197J072915R29980O48577R15470O36692Q22899Q45494J365380
$$ 79551370 80639567 81712482 82642462 83291039 84206509 84843201 85666100 86511594 87876974
2569H7876974O59502R84783R70979J228398P26601J276007J006788J963379J378030
$$ 87876974 88536476 89521259 90492238 91720636 92447237 93723244 94730032 96693411 98071441
2560I8071441K321013J975348J797583K127581K822121K839166K777582L058093
$$ 98071441 100392454 102367802 104165385 106292966 109115087 111954253 114731835 117789928
2552A17789928K303845L786982L989391L819674L918268L684297M235604N128353
$$ 117789928 120093773 123880755 127870146 131689820 135608088 139292385 143527989 148656342
2544A48656342M439114M628272N439189M986889N340042N159994N228197N065431
$$ 148656342 153095456 157723728 163162917 168149806 173489848 178649842 183878039 188943470
2536A88943470N772521N530413N108946O029151N174306N464786M846627M762490
$$ 188943470 194715991 200246404 205355350 211384501 216558807 222023593 226870220 231632710
2528B31632710M984789M751277M092725M731549M422464M008861L445050K887724
$$ 231632710 236617499 241368776 245461501 250193050 254615514 258624375 262069425 264957149
2520B64957149K818220K587223K955817J936619J967478J634432J098886N16328
$$ 264957149 267775369 270362592 273318409 275255028 277222506 278856938 279955824 280472152
2512B80472152Q44318O49561J43372p14338q09797m33031r16742j422596j943514
$$ 280472152 281316470 281966031 282109403 281395065 280585268 280152237 279235495 277812899 275869385
2503B75869385k466580k110295k104604k425994l023631l619501l219888l783343
$$ 275869385 273402805 271292510 269187906 266761912 263738281 260118780 256898892 253115549
2495B53115549l554392m185602n076024m903268m663676m624213m257427m650369
$$ 253115549 249561157 245375555 240299531 235396263 230732587 226108374 221850947 217200578
2487B17200578m873151n420382n638483m504549n616541n577739m008698n544950
$$ 217200578 212327427 206907045 201268562 196764013 191147472 185569733 181561035 176016085
2479A76016085n388562m835027m718488m550021m794479m054070m594264m384216
$$ 176016085 170627523 165792496 161074008 156523987 151729508 147675438 143081174 138696958
2471A38696958l810008l905290l343023l018748l643990l372398l020361k257111
$$ 138696958 134886950 130981660 127638637 124619889 120975899 117603501 114583140 112326029
2463A12326029k378461k397269k346293k185336j583430k249284j421956j611647
$$ 112326029 109947568 107550299 105204006 103018670 101435240 99185956 97764000 96152353
2455I6152353j335937j653568j025403j950061p42561j337083j165313j031420
$$ 96152353 94816416 93162848 92137445 90187384 89444823 88107740 86942427 85911007
2447H5911007k41364j504075j539710j026147m34279r62023q85373o82681j620558
$$ 85911007 85669643 84165568 82625858 81599711 81165432 80203409 79318036 78635355 77014797
2438G7014797j344449q33462o44136j822190j399027r27915q08511j699776j453179
$$ 77014797 75670348 74836886 74192750 72370560 70971533 70043618 69235107 67535331 66082152
2429F6082152j364065j202000r14536q56920j528009p96623j407907j582437j761935
$$ 66082152 64718087 63516087 62601551 61744631 60216622 59419999 58012092 56429655 54667720
2420E4667720j472178j457207j044799j248828j688805j803422p60646n83247
$$ 54667720 53195542 51738335 50693536 49444708 47755903 45952481 45191835 44608588
2412D4608588j625305j151266p61244q29758j554263p84002p29054j038089m08288
$$ 44608588 42983283 41832017 41070773 40241015 38686752 37902750 37173696 36135607 35727319
2403C5727319m70255p64065j307122o12715o77139r80685p9157q72657p42321
$$ 35727319 35257064 34492999 33185877 32573162 31896023 30915338 30836181 29963524 29221203
2394B9221203o78584k57560n41347j050478m56214k72995o69458m10863j04192
$$ 29221203 28542619 28285059 27743712 26693234 26237020 25964025 25294567 24883704 24779512
2385B4779512m11192m86989o15081p01693q35848Q3318j32913j027071m8349o33687
$$ 24779512 24368320 23881331 23266250 22564557 21728709 21812027 21679114 20652043 20603694 19970007
2375A9970007n90801J38270r99665l19829k01316P1907p4266J89154l35167q61896
$$ 19970007 19379206 19517476 18517811 18197982 17996666 18068573 17994307 18183461 17848294 16986398
2365A6986398m63923p768M41240k33648l78399l2549j57482K11197n74735m38531
$$ 16986398 16522475 16514707 16955947 16722299 16343900 16311351 16153869 16365066 15790331 15351800
2355A5351800n49284L4569n60942l83951J50892k0275o94053M01326L90322k53853
$$ 15351800 14802516 14837085 14276143 13892192 14043084 14022809 13328756 13730082 14120404 13866551
2345A3866551j54166m02557m46720k01393p6070m25988K3458r58050l01950L12371
$$ 13866551 13712385 13309828 12863108 12661715 12585645 12159657 12183115 11225065 10923115 11235486
2335A1235486j80798l29236k01357k86675N65267L36320j25871P2329m28450o2619
$$ 11235486 11054688 10725452 10524095 10237420 10802687 11139007 11013136 11085465 10657015 10594396
2325A0594396P5423j94200l82828M56507m34621n52201m20342n75356o4888n38916
$$ 10594396 10669819 10475619 10092791 10549298 10114677 9562476 9142134 8566778 8501890 7962974
2315G962974J27032N54797n03199m2358K23256j06998P8374P2428L96215J23041
$$ 7962974 8090006 8644803 8141604 8099246 8322502 8215504 8293878 8366306 8762521 8885562
2305H885562L1499l86274l2493o98512J180j91514j98391j8172R164p27510m72155
$$ 8885562 8917061 8530787 8498294 7799782 7800962 7609448 7411057 7392885 7402049 6674539 6202384
2294F202384N17798J95793J15442J59768L1253q1998p58163O33570J03518o2053
$$ 6202384 6720182 6915975 7031417 7191185 7222438 7140440 6382277 7015847 7119365 7057312
2284G057312j07912m43235j05815o32164N5864K17596n18741K96319K78900J28241
$$ 7057312 6949400 6506165 6400350 5768186 5824050 6041646 5522905 5819224 6098124 6226365
2274F226365K56727p4422l40676n05724P18167J21408L7221m5659r33014p26842
$$ 6226365 6483092 6408670 6067994 5562270 6280437 6401845 6439066 6393407 5460393 4733551
2264D733551K90958L08069k91430k62947J42631m73833M27014M42550j82918J69791
$$ 4733551 5024509 5332578 5041148 4778201 4920832 4446999 4874013 5316563 5133645 5303436
2254E303436M12991n31116o59268L74259N71416j50016k6604L08976j04947m5589
$$ 5303436 5716427 5185311 4526043 4900302 5471718 5321702 5295098 5604074 5499127 5453538
2244E453538j07782j34017m72702K17122K48959M21040k81134K3523J36132M3409
$$ 5453538 5345756 5211739 4739037 4956159 5205118 5626158 5345024 5368547 5504679 5548088
2234E548088J95104p83716m90291k44669J50187n4262R8118k97367K06881m70096
$$ 5548088 5743192 4959476 4469185 4224516 4374703 4320441 4418559 4121192 4328073 3857977
2224C857977j38883L70715M32495j21591q4931K67686R8302O79356N05917l12309
$$ 3857977 3719094 4089809 4522304 4400713 4315782 4583468 4681770 5361126 5867043 5554734
2214E554734k14026k2918M0276O78285l89656r78290l07898J11536K35542j27199
$$ 5554734 5340708 5317790 5358066 6036351 5646695 4668405 4360507 4472043 4707585 4580386
2204D580386J51371Q407J22872k906j016906k5872J7130J69821j1457k26000q1359
$$ 4580386 4731757 4740164 4863036 4860130 3843224 3817352 3834482 4004303 3992846 3766846 3685487
2193C685487m1682L12171M91532K36874o18L03797l86154k27928m85281m06127
$$ 3685487 3643805 3955976 4447508 4684382 4683764 4987561 4601407 4373479 3888198 3482071
2183C482071M6930l43231m59700J26250O21049J72935o1212K3903n61472J70399
$$ 3482071 3529001 3185770 2726070 2852320 3473369 3646304 3585092 3608995 3047523 3217922
2173C217922P28882m36464o79245K23200l97508m18425N33833O80373L2509k60826
$$ 3217922 3946804 3510340 2831095 3054295 2656787 2238362 2772195 3452568 3485077 3224251
2163C224251N78113n00547N1104Q0055l6181j07287j80201L57567l02574k42416
$$ 3224251 3802364 3301817 3352921 3432976 3396795 3289508 3109307 3466874 3164300 2921884
2153B921884N54566m55596k60442L3611j06962k20196m70828L67230J61533l70602
$$ 2921884 3476450 3020854 2760412 2794023 2687061 2466865 1996037 2363267 2524800 2154198
2143B154198O41330N04321O6854n81008J67203k81569l82195N00148L01095N6538
$$ 2154198 2795528 3299849 3366703 2785695 2952898 2671329 2289134 2789282 3090377 3146915
2133C146915J69442l24539m72974J70110K07625N3310n3972K29675o45391J18853
$$ 3146915 3316357 2991818 2518844 2688954 2896579 2949889 2895917 3125592 2480201 2599054
2123B599054M07777n1870j5759k25036K56947n03428n50189j81737Q79207J33669
$$ 2599054 3006831 2954961 2939202 2714166 2971113 2467685 1917496 1735759 2614966 2748635
2113B748635k69788k62756l0128K74061m97967q5062L0354J1256J48731j82365
$$ 2748635 2478847 2216091 2185963 2460024 1962057 1876995 1907349 1918605 2067336 1884971
2103A884971J55411K73101j25651q1463n40939L38630M42846J64502m81696j7674
$$ 1884971 2040382 2313483 2187832 2106369 1565430 1904060 2346906 2511408 2029712 2012038
2093B012038r0333p03882J12041K90037p464M61758Q9401K48300k05108n2398
$$ 2012038 1921705 1217823 1329864 1619901 1612437 2074195 2163596 2411896 2206788 2154390
2083B154390K02847j00865j09274J8457k67685K831M51121P4246n45982k67785
$$ 2154390 2357237 2256372 2147098 2165555 1897870 1900701 2351822 2426068 1880086 1612301
2073A612301P62141k87109k41154l37317l20625M20763J49536M31721k55489M07008
$$ 1612301 2374442 2087333 1846179 1508862 1188237 1609000 1758536 2190257 1934768 2341776
2063B341776r3732n32884k41749K07548M54912J64882n06167P16243K30618k32898
$$ 2341776 2248044 1715160 1473411 1680959 2135871 2300753 1794586 2510829 2741447 2508549
2053B508549J99485j62537k44711o6048N06288l83822j76344L18906l08675J13532
$$ 2508549 2708034 2545497 2300786 2234738 2741026 2357204 2180860 2499766 2191091 2304623
2043B304623j09431M8133R5475l87873o77515j28140Q07564J76664j16234k76853
$$ 2304623 2195192 2243325 2338800 1950927 1273412 1145272 1952836 2129500 2013266 1736413
2033A736413k10418n89361j56064N13707L89533L81498n19005R2393N5163m8163
$$ 1736413 1525995 936634 780570 1294277 1683810 2065308 1546303 1638696 1693859 1645696
2023A645696l5322Q9926m6258k60858k93601j7813k18197k10355p8913J25603
$$ 1645696 1610374 1700300 1654042 1393184 1099583 1081770 863573 653218 574305 699908
2013F99908J43006l93305l0443J47651O60352k6919j58328K37112k43876k78134
$$ 699908 842914 449609 419166 566817 1227169 1200250 1041922 1279034 1035158 757024
2003G57024J85661K49049J26183o14801k99595N22317K01613m01235K26297j31619
$$ 757024 942685 1191734 1317917 703116 403521 925838 1127451 726216 952513 820894
1993H20894K93572k63732J08720j85320r5437K51280k37218j66078K4453J94673
$$ 820894 1114466 850734 959454 774134 678697 929977 692759 526681 551134 745807
1983G45807K09318J29260R1047j26304l35375l07443O72681k78061J36808j70817
$$ 745807 955125 1084385 1175432 1049128 713753 406310 1078991 800930 937738 766921
1973G66921L40311l14406l30382L21465M00723o6323k93911L42308K57976K03001
$$ 766921 1107232 792826 462444 783909 1184632 1118309 824398 1166706 1424682 1627683
1963A627683l29862k16646L4001l4583k03551j05236L4513l83909p9055J58972
$$ 1627683 1297821 1081175 1115176 1080593 877042 771806 806319 422410 343355 502327
1953E02327N40311o673k03492L95895j95788L06312l33874P73248j83796k24813
$$ 502327 1042638 1035965 832473 1228368 1032580 1338892 1005018 1778266 1594470 1369657
1943A369657k57376p87865M6273J60065j45513M929L04091O0189m37037N1148
$$ 1369657 1112281 324416 370689 530754 385241 390170 694261 754450 317413 368561
1933C68561L95765L13261p56519J26655L06578N39668N40668k98078m61014j12871
$$ 368561 764326 1077587 321068 447723 754301 1293969 1834637 1536559 1075545 962674
1923I62674j13712k17477K74237J12381M18777m23993p3893K79921J6539n17858
$$ 962674 848962 631485 905722 1018103 1436880 1012887 938994 1218915 1235454 717596
1913G17596n96124O75569O72461m90661k03796k77433j53083o5257J12256k57827
$$ 717596 121472 797041 1469502 978841 775045 497612 344529 279272 391528 133701
1903A33701k9477k0643j50264o9103K41014M08727m0699M19733j50273k427l35910
$$ 133701 104224 83581 -66683 -135786 105228 513955 473256 892989 742716 740289 404379
1892D04379J02494J37288J64035N62896K4381m50879k99176p9361J51636R4757
$$ 404379 506873 644161 808196 1371092 1395473 944594 645418 566057 717693 812450
1882H12450n17570m58957K94295L74643l47858p7696O56192j92935l53163P23479
$$ 812450 294880 -164077 130218 504861 157003 79307 735499 542564 189401 912880
1872I12880j66187m86113m1568m18523J17602M32633N41423L54510n54992K38987
$$ 912880 746693 260580 219012 -199511 -81909 350724 892147 1246657 691665 930652
1862I30652J38189m29969J00375J47507m64461p53105K85302L69829j95733L12598
$$ 930652 1068841 638872 739247 886754 422293 -330812 -45510 324319 128586 441184
1852D41184J15795L30478K02191m32209J33173n92456m90634k13203O16933L2511
$$ 441184 556979 887457 1089648 657439 790612 198156 -292478 -505681 111252 143763
1842A43763k26242J04830K48675M42894L20941m30038k87690K85994m2685P46813
$$ 143763 -82479 22351 271026 713920 1034861 604823 317133 603127 560442 1307255
1832A307255k61281N6742k02448q70785n06172k4285o21005p9326M6348L51165
$$ 1307255 1045974 1102716 900268 29483 -476689 -500974 -1121979 -1201305 -1154957 -803792
1822h03792N15793L21080J34948J62138K06886O6002N45133j01223J83404k84032
$$ -803792 -287999 33081 168029 330167 537053 603055 1148188 1046965 1230369 946337
1812I46337L2957m2879j90982m15826N01061q14774N7927M99741M31385k79552
$$ 946337 979294 936415 745433 329607 830668 15894 73821 573562 1004947 725395
1802G25395l75229O51839j17324k36744l49613N42174K30955m66338m36135J16319
$$ 725395 350166 1002005 884681 647937 298324 840498 1071453 605115 168980 285299
1792B85299L10850n3369o00209n4426k24139J98573J82129j19005K82911p22753
$$ 285299 596149 542780 -57429 -111855 -335994 -137421 44708 -74297 208614 -514139
1782e14139M17567O61495m4137M66625J02145l056J98518l82131m01011k86868
$$ -514139 -96572 564923 520786 987411 1089556 1086500 1285018 902887 501876 215008
1772B15008k32145P33162Q7394n58503n28655J39558M24642K9984K15056R8015
$$ 215008 -17137 716025 803419 244916 -283739 -144181 280461 310445 525501 623516
1762F23516J16617P21459J94215n71287m53416J16911J52626N1719p52592J02311
$$ 623516 740133 1461592 1655807 1084520 631104 748015 900641 952360 199768 302079
1752C02079k2207J56444m27402K774k21974Q6377K37310l07885L17029K05770
$$ 302079 279872 436316 8914 11688 -210286 -123909 113401 -194484 122545 328315
1742C28315J02623J95440k52252j74669J45997j50324j6853J10483k60674J31506
$$ 328315 430938 626378 374126 199457 345454 195130 178277 288760 28086 159592
1732A59592k6181p22268J50937O72264L17681j50040k12373P5942O10346l11547
$$ 159592 133411 -588857 -437920 234344 552025 401985 189612 265554 875900 564353
1722E64353l83449j60167J47047k49370K78154k5862l90129K70748M8918K07671
$$ 564353 180904 20737 167784 -81586 196568 170706 -219423 51325 100243 307914
1712C07914o1527J06421j15361j85455K23010N54837k07913l57493J02006j45082
$$ 307914 246387 352808 237447 51992 275002 829839 621926 264433 366439 221357
1702B21357r0226l30854J83429K60356J81758N07649j53444m47205j59738P1408
$$ 221357 131131 -199723 -16294 244062 425820 933469 780025 332820 173082 244490
1692B44490k71656k52009M27945n6226J87383K4594q2029K67534k39019m58780
$$ 244490 -27166 -279175 148770 92544 279927 304521 222492 490026 251007 -207773
1682b07773L08733L71982j91712M47469J85092k80761l54147j8063j29305Q1880
$$ -207773 100960 472942 281230 728699 913791 633030 278883 260820 131515 213395
1672B13395J79975k32296j52792k54599j34346L53348O72508J82680k16598m90142
$$ 213395 393370 161074 8282 -246317 -380663 -27315 645193 827873 611275 121133
1662A21133j10188Q50822j52927l11884l47q86181n82997N05243J06745m60178
$$ 121133 10945 861767 708840 396956 396609 -489572 -1072569 -567326 -460581 -920759
1652i20759O22288O6480M1703L63491J44933r8073J69298L36843L09273l85109
$$ -920759 -298471 -231991 -190288 173203 318136 220063 389361 726204 1035477 650368
1642F50368n26080K91617k85138j47303j36618k85582r9985k35437K08504l937
$$ 650368 124288 415905 130767 -16536 -153154 -438736 -538721 -774158 -565654 -569591
1632e69591L86617N96567M00493q99157P649M15479J62357k57535L00678K06602
$$ -569591 -182974 413593 814086 -85071 -77422 338057 500414 242879 543557 750159
1622G50159j80957l14529m21584J40018n77213M11179J45720p116l09795L59185
$$ 750159 569202 254673 -166911 -26893 -604106 -192927 -47207 -54323 -364118 -4933
1612d933n43964N62759P14083k55294m4393l52551O73780J23451p04554m03186
$$ -4933 -548897 13862 727945 472651 428258 75707 749487 872938 168384 -234802
1602b34802k3493j8504M62647K45575K7504L6280m15348l43989o2303O24058L85634
$$ -234802 -258295 -276799 185848 431423 458927 495207 79859 -264130 -326433 297625 683259
1591F83259K31764N45164o52465J29849M5583m73344Q4631n07742n47743J48837
$$ 683259 915023 1460187 807722 937571 983154 509810 594441 86699 -461044 -312207
1581c12207L32275K83490k83397l97193m28937K70072Q29230k6486l42071K50869
$$ -312207 20068 303558 20161 -377032 -805969 -535897 293333 266847 -75224 175645
1571A75645M9240o9120J625L42395M42029J0024m0387k62554o92770k56255j8801
$$ 175645 224885 155765 157390 499785 941814 951838 911451 648897 -43873 -300128 -318929
1560c18929k66058L62300R35738M74922m85816m6542j36888j57671L1035Q087
$$ -318929 -584987 -222687 713051 1187973 702157 655615 518727 361056 392091 400178
1550D00178m2243o7349o1937k43279K90131J61970l0331j42159K45022N45866
$$ 400178 357935 290586 228649 -14630 275501 437471 407140 264981 510003 1055869
1540A055869k42793j87280K92674o51941K37015j15337m12609J69074m6036L77706
$$ 1055869 813076 625796 918470 266529 503544 388207 -24402 144672 98636 476342
1530D76342p84933R0679J59050k43702J93359Q22216r7371m44991j05956m22902
$$ 476342 -308591 -217912 -58862 -302564 -109205 713011 615640 170649 64693 -358209
1520c58209K90218K87663M5648o58063m16821N01128j09248p8877P83712J14893
$$ -358209 -67991 219672 265320 -392743 -809564 -308436 -417684 -496561 287151 402044
1510D02044K69395k04136K28253o1009r3348k98627o01017J12854J88317m02092
$$ 402044 671439 467303 695556 634547 541199 242572 -358445 -245591 -57274 -459366
1500d59366p53970M11246L11514J04610m274J59223p8473J57874L61265r3831
$$ -459366 -1213336 -802090 -490576 -385966 -390240 -231017 -309490 -151616 209649 115818
1490A15818k60287k3530O52555L09544k88618l54943k10890K41670n90906l2713
$$ 115818 -144469 -167999 484556 794100 505482 150539 -60351 181319 -409587 -442300
1480d42300p0465N83076k65510K02562M54669m75512o07419J70352R47013J66270
$$ -442300 -512765 70311 -195199 7363 462032 -13480 -620899 -450547 496466 662736
1470F62736p49188k45867J2222O5890k49333K19517o6398J82502l99169L30143
$$ 662736 -86452 -332319 -320097 -254207 -503540 -284023 -350421 -167919 -567088 -236945
1460b36945L11858K96264m6663n83889k01049K7008L63348M14564N75697o7628
$$ -236945 74913 371177 324514 -259375 -460424 -433416 -70068 344496 920193 852565
1450H52565j5408n01421j16274m15442k57248l26408m87319O69840R24251k08591
$$ 852565 837157 335736 219462 -195980 -453228 -779636 -1266955 -597115 327136 118545
1440A18545j69360O9603K83105K50729K75637m42700k32734j4425j14925L18464
$$ 118545 -50815 18788 301893 552622 828259 385559 152825 138400 23475 341939
1430C41939q7447l72797K19775k14543L6476j49788J93208k37161l5331M99846
$$ 341939 254492 -118305 101470 -113073 -76597 -226385 -33177 -270338 -305669 194177
1420A94177p23671Q7078L71702N57424o8081o04430M93390J86340n97171o88217
$$ 194177 -529494 -442416 -70714 486710 418629 -185801 307589 493929 -103242 -791459
1410g91459K96894M953j56745O43575J99346L7210L48196l64374L25016o4179
$$ -791459 -494565 -489612 -646357 -2782 196564 233774 581970 217596 542612 478433
1400D78433J27470k53240L78479q8638j8802n10435m3891j11034p75674m69052
$$ 478433 605903 352663 731142 642504 623702 113267 69376 -41658 -817332 -1286384
1390a286384l7817N24869k90012L38013N85147k12926J89140l2242K09686K5756
$$ -1286384 -1324201 -799332 -1089344 -751331 -166184 -379110 -189970 -222212 -12526 13230
1380A3230m26343M30581o28719J92100M71571J55792R8762J48867r8518m49687
$$ 13230 -413113 17468 -611251 -419151 52420 208212 306974 455841 357323 -92364
1370i2364J45733L02034j2353l80126k56706k01683J71467K28183K91676J85373
$$ -92364 53369 355403 343050 -37076 -293782 -495465 -323998 -95815 195861 381234
1360C81234m667l46678k90442j35135K52804j98571J89133k94863m0245n1710
$$ 381234 376567 29889 -260553 -395688 -142884 -341455 -152322 -447185 -487430 -539140
1350e39140P7151M89299r9935m60359r6361M17635K07140o4593j4908j51234j04374
$$ -539140 -461989 27310 -72625 -532984 -629345 -211710 -4570 -69163 -84071 -235305 -339679
1339c39679L55483l0109k44097M59515m36707j77007M67813l92583k64112K19755
$$ -339679 15804 -14305 -258402 201113 -235594 -412601 55212 -337371 -601483 -381728
1329c81728P24535j87664J74129k47494j05771R8423J8613m3864M50841K18637
$$ -381728 342807 155143 329272 81778 -23993 74430 93043 49179 500020 718657
1319G18657j76188p55311j41841R3335K89823j70341N6642J30700j49784K66864
$$ 718657 542469 -212842 -354683 -261348 28475 -141866 -85224 45476 -104308 162556
1309A62556L65612l23562j23346j40558o01816M09635J44225O9734L94499l06714
$$ 162556 528168 204606 81260 -59298 -661114 -251479 -107254 -37520 356979 50265
1299E0265L52213p2886m61801q43488K13730R02265k50391k98785K01355J63025
$$ 50265 402478 329592 -132209 -975697 -761967 140298 -110093 -408878 -207523 -44498
1289d4498j86300J75940p5065j47546L58783k4215J37344K03143K08379j5362
$$ -44498 -230798 -54858 -129923 -277469 81314 57099 194443 397586 605965 590603
1279E90603p66707p35034M26295L63188k40570j31739k75322M19324o6800m40339
$$ 590603 -176104 -911138 -484843 -121655 -362225 -493964 -769286 -349962 -416762 -857101
1269h57101P46435J5976J94867L21598J1479q8312l5599k34669L55714l01629
$$ -857101 -110666 -94690 100177 421775 433254 344942 309343 74674 430388 128759
1259A28759m84314J44402L0345o72459L92496M86870m10300R9268K1518M5635
$$ 128759 -355555 -211153 -180808 -853267 -460771 26099 -384201 -284933 -263415 -217780
1249b17780k00447K42167R98563l20560J21615P5912J9940j22206k72667m26428
$$ -217780 -418227 -176060 822503 501943 623558 699470 719410 597204 324537 -101891
1239a01891J12802p8539m64491k5002J86848L51571n52869N12794O49767p0889
$$ -101891 10911 -67628 -532119 -557121 -370273 -18702 -571571 -58777 590990 520101
1229E20101k43037L10827k07178J78627j78306J77960m63362j51275l95637R1668
$$ 520101 277064 587891 380713 559340 381034 558994 95632 -55643 -451280 -359612
1219c59612K76851j23287P1648k73010M21814l3936j00376L49968l62832Q2724
$$ -359612 -82761 -206048 -134400 -407410 14404 -19532 -119908 230060 -132772 -50048
1209e0048r4693J01178P65063K26502q15660k25581l13340N78344l3930l46945
$$ -50048 -144741 -43563 721500 948002 132342 -93239 -406579 171765 137835 -209110
1199b09110M1187K03584k691N56866l60146m33526J64179N0141J99128J34356
$$ -209110 -167923 35661 32970 589836 229690 -203836 -39657 10484 209612 343968
1189C43968j96274l53238l10440K45805O4880N9509l4580o5691l17782j35836
$$ 343968 147694 -205544 -515984 -270179 -205299 -145790 -180370 -246061 -563843 -699679
1179f99679O0060j50167J90215L07951j80418K84370J4453r941l15118m01857
$$ -699679 -639619 -789786 -599571 -291620 -472038 -187668 -173215 -183156 -498274 -900131
1169i00131M4014O9249O26879M6563M4223J91557k21327l53633j15675J14061
$$ -900131 -856117 -786868 -159989 -113426 -69203 122354 -98973 -452606 -568281 -454220
1159d54220L42654l19699j01071R6206L61351J45778O01188m10138K42688L21454
$$ -454220 -111566 -431265 -532336 -436130 -74779 70999 672187 262049 504737 826191
1149H26191l66291m20895n085J61316k59735K84563J6692q00526L21544J21500
$$ 826191 459900 39005 33920 195236 -64499 220064 236756 -563770 -242226 -120726
1139a20726o23187j75229K59457J31741k70329O21962K19404J01025L218j76673
$$ -120726 -743913 -919142 -659685 -527944 -798273 -176311 43093 144118 147336 -29337
1129b9337K82382J0539l77686K70819n06722l04679L15904k53163N15076k24311
$$ -29337 253045 263584 -114102 156717 -350005 -654684 -338780 -591943 -76867 -301178
1119c01178J18827K75181j8426p2018o25129J58352n5073J088337j55113k22206
$$ -301178 -182351 92830 74404 2386 -622743 -464391 -519464 568873 413760 191554
1109A91554K69568n57733M0638j66383K23140J11190j68710l62672M73060L0612
$$ 191554 461122 -96611 -55973 -222356 784 111974 -56736 -419408 53652 84264
1099H4264l4880k12129m8700M15830R5277l3536j07692k04952J59899m26971o6487
$$ 84264 49384 -162745 -211445 204385 299662 266126 158434 -46518 113381 -313590 -380077
1088c80077M7684n25208N3610l2146M31918L44805N8035J13938M13160J94197
$$ -380077 -332393 -857601 -803991 -836137 -404219 -59414 -1379 112559 525719 719916
1078G19916k01176j92919k78573q9680p48613P34509K84363m73319J60584L8861
$$ 719916 518740 325821 47248 -42432 -791045 -56536 227827 -245492 -84908 -46047
1068d6047p72537m55373O72341J12486k04165Q61169j32893R5467K73254Q45528
$$ -46047 -818584 -1273957 -601616 -489130 -693295 167874 34981 130448 403702 1249230
1058A249230m80535m10861l3240M52465k93916L47491Q7005m28757k59291k54257
$$ 1249230 768695 357834 324594 777059 483143 830634 917639 488882 229591 -24666
1048b4666K08097r0872M0891j90428M11200n97883m50904O17967K15393K69442
$$ -24666 183431 92559 133450 -56978 354222 -243661 -694565 -76598 138795 408237
1038D08237l73292N0326P48956M18398L5378p05569q04948J58792N69789N921
$$ 408237 34945 85271 834227 1252625 1288003 582434 -222514 -63722 506067 511988
1028E11988o60061l39049O08196q20854J62136N86859M16307k37282k74082L60724
$$ 511988 -148073 -487122 121074 -699780 -537644 49215 465522 228240 -45842 314882
1018C14882l61182L38426J56681o8694l63006K1501L3123k62048L78602k58303
$$ 314882 -46300 292126 448807 380113 17107 38608 71731 -190317 188285 -70018
1008g0018J43790O22856L48559k67791J44009J86023J27639j55607p05952l09885
$$ -70018 73772 696628 1045187 777396 921405 1107428 1235067 1079460 373508 63623
998F3623R81183p23884j07303L9764j57564n27429P10459K53150k99088M0347
$$ 63623 1044806 320922 213619 253383 95819 -431610 278849 531999 232911 273258
988B73258O40422l9288K62528o5765k32473J08953J78884K12306K32246o34155
$$ 273258 913680 874392 1136920 1071155 838682 947635 1126519 1338825 1571071 936916
978I36916m48229K66982Q76797m79853J57460j52034m12578P19096J92501j83048
$$ 936916 488687 755669 1632466 1152613 1310073 1158039 745461 1464557 1657058 1474010
968A474010j60495M98403J77246p6163j09251O69280Q0053K94478K36589L35902
$$ 1474010 1313515 1811918 1989164 1913001 1803750 2473030 2553083 2847561 3084150 3420052
958C420052P57491L64791K75261O5792K69800M38523J273356K03805L59627J073157
$$ 3420052 4177543 4542334 4817595 4883387 5153187 5591710 6865066 7068871 7428498 8501655
948H501655Q84335J000844J16465k41820K71350K48058o74056k84174r34378m05413
$$ 8501655 9385990 10386834 10503299 10261479 10532829 10780887 10106831 9822657 8888279 8482866
938H482866r04936k03098o20273m76108o20700j59050k77574m57641k89981l72284
$$ 8482866 7577930 7374832 6754559 6278451 5657751 5498701 5221127 4763486 4473505 4101221
928D101221p5163o7342Q1040l68628l61489p689m27871m55028l1185K36848j77648
$$ 4101221 4026058 3958716 4039756 3671128 3309639 3301950 2874079 2419051 2387866 2624714 2447066
917B447066k57807n23490m69104M0271O5719J12321k01427L34076k4913j94985
$$ 2447066 2189259 1665769 1196665 1236936 1302655 1414976 1213549 1547625 1522712 1327727
907A327727M4663m17024K70898M54777q21286j40979P22449o38144j5227l10791
$$ 1327727 1372390 955366 1226264 1681041 859755 718776 1441225 803081 787854 477063
897D77063M14847k65710O4400o3508M5930j4385j61043M71075l22665Q2569J3078
$$ 477063 891910 626200 690600 627092 673022 658637 497594 968669 646004 728573 741651
886G41651j31297n6496J13613k36364N8449r4426m6071N5527p3331m21838Q6155
$$ 741651 610354 553858 667471 431107 489556 395130 349059 404586 331255 -90583 -4428
875d428l43511k38201K11093K64535O47812K20716l49616J36102k49560j66455
$$ -4428 -347939 -586140 -375047 -110512 537300 758016 408400 544502 294942 128487
865A28487P13682k90642m65556j52438K23649l83423o45507M5833P25741Q1901
$$ 128487 842169 551527 85971 -66467 157182 -226241 -871748 -825915 -100174 -18273
855a8273K36277L82655j80149j25568m67227J02077L21295k06751L66949j62263
$$ -18273 218004 600659 420510 294942 -172285 -70208 251087 44336 411285 249022
845B49022k04913m73368J36252l21472j13480J0615L45861K7304l09102K53312
$$ 249022 44109 -429259 -293007 -614479 -727959 -717344 -371483 -344179 -653281 -399969
835c99969L41661l98035M88761L92548m59909m5474R487K55180j33135j19505
$$ -399969 -58308 -456343 32418 424966 -34943 -80417 -70930 184250 51115 -68390
825f8390M777k51771l9626J98682l75792L91283k70490P167n67624O34125J039227
$$ -68390 -63613 -315384 -355010 -156328 -532120 -140837 -411327 -404160 -971784 -337659 701568
814G01568m45750n10854N90153m801n75727j57088N18000K04536J02472m34239
$$ 701568 255818 -255036 335117 330316 -245411 -402499 115501 320037 422509 -11730
804a1730m63264K90185Q3818j32235o78488M1080K10792J31486P27424J08065
$$ -11730 -474994 -184809 -100991 -233226 -911714 -870634 -659842 -528356 199068 307133
794C07133j86903l68973K86070L12269l60291k4549M66123l18277j202033L54547
$$ 307133 120230 -248743 37327 349596 -10695 -35244 430879 112602 -1089431 -734884
784g34884o1661j55344J56078L88631K30944l57608P73820p06163N27794L43234
$$ -734884 -796545 -951889 -795811 -407180 -176236 -533844 239976 -466187 61607 404841
774D04841L48094j16276m87110L8539m86426K3610M03871k88063j4967J11333
$$ 404841 752935 636659 149549 188088 -298338 -274728 129143 -158920 -173887 -62554
764f2554P6281k23087k17984O82167j27163l45074O6702r4520k5567J87433k16601
$$ -62554 13727 -209360 -427344 254823 127660 -217414 -150712 -245232 -270799 -83366 -299967
753b99967j52182j3790L51683o01789N2620K20419j7761P94247M8531m53164n45295
$$ -299967 -452149 -465939 -114256 -716045 -663425 -443006 -460767 333480 382011 -71153 -616448
742f16448m85900L36717L99867J10440L33998l22185K07308J0509J7133P7826
$$ -616448 -1102348 -765631 -365764 -255324 78674 -243511 -36203 -25694 -8561 69265
732F9265j66635m79308L5710K37385J8607j020R59N17533n34452K6853k61169
$$ 69265 -97370 -576678 -540968 -303583 -284976 -285996 -285037 232496 -301956 -275103 -536272
721e36272j84520J07902J46203p9864L99792O5239K21011K06554O5388K16084
$$ -536272 -720792 -612890 -466687 -546551 -146759 -81520 139491 346045 411433 627517
711F27517l89569j23073l61978q3291n07529J91478N54294K68738J0245J8562
$$ 627517 237948 114875 -247103 -330394 -837923 -646445 -92151 176587 186832 205394
701B05394M36246n33006N99384l45492q4758j4198l00918R7070o2310n96256K5153
$$ 205394 641640 108634 708018 362526 277768 263570 -37348 59722 -2588 -598844 -573691
690e73691k6804j076349J07571M67259P22164J31259J16325J71858N56176n14742
$$ -573691 -600495 -1676844 -1569273 -1102014 -379850 -248591 -132266 39592 595768 81026
680H1026k0497M42915j11064K2193n256N415m55690m23919r3829o72336O71597
$$ 81026 60529 503444 392380 414573 409317 414732 -40958 -464877 -558706 -1231042 -559445
669e59445q397N1555k18630N269P67400K06184l00016p8738L3278m8019J79141
$$ -559445 -567842 -516287 -734917 -729648 37752 243936 -56080 -134818 -101540 -149559 29582
658B9582L1909L24639k2608j58449k77103m47028j88171N6496J3545O20206k06500
$$ 29582 61491 386130 363522 205073 -72030 -519058 -707229 -650733 -637188 -16982 -223482
647b23482L47081p96007j39976N33910K06731K5551j16207K19886K02640l58092
$$ -223482 123599 -672408 -812384 -278474 -71743 -46192 -162399 57487 260127 -97965
637i7965J05730m4432k78782l84296j45905J1097J78872J0272L57449J82931N72732
$$ -97965 7765 -36667 -315449 -699745 -845650 -834553 -655681 -645409 -287960 -105029 467703
626D67703J37852m69321n46406L26780R81030j60142k79376N51775k26014m36726
$$ 467703 605555 136234 -410172 -83392 897638 737496 458120 1009895 783881 347155
616C47155l79940j64309m93833K27008M31203k82478l48121o8956L02611l40438
$$ 347155 -32785 -197094 -690927 -463919 -32716 -315194 -663315 -732271 -429660 -770098
606g70098O38988N08809m4607o6696l03600j5133K14571M87022l85217m30478
$$ -770098 -131110 377699 333092 266396 -37204 -52337 162234 649256 264039 -166439
596a66439Q9014q298k94569J68442P377j19194N96463Q2762k69450O6971k67849
$$ -166439 -77425 -85723 -380292 -211850 -204473 -323667 272796 355558 86108 153079 -114770
585a14770J43296K7931n6589j81665J47793L77303j087047L58178j4065M61365
$$ -114770 28526 56457 -132 -181797 -34004 343299 -743748 -385570 -399635 61730
575F1730J73238J41796k00115o89271m6028K88417j28525k22774M7430K03441
$$ 61730 234968 376764 176649 -512622 -558650 -270233 -398758 -621532 -574102 -370661
565c70661m4857L23533m23791O70330m60487M4214j54491m27430J28289J00660
$$ -370661 -415518 -91985 -515776 154554 -305933 -261719 -416210 -843640 -715351 -614691
555f14691k23309N9659K41630r9357J50463M6577L75030k32526p7966l2503j59709
$$ -614691 -838000 -778341 -536711 -636068 -485605 -439028 -63998 -296524 -374490 -406993 -566702
544e66702J16444R7471K02398j18033n68646L5171K19869K21413O89357P5120
$$ -566702 -450258 -352787 -150389 -268422 -837068 -801897 -582028 -360615 328742 403862
534D03862m87580o26782J6871l01621M04438P92240J14697k26743k60526J96105
$$ 403862 -83718 -710500 -693629 -995250 -590812 201428 316125 89382 -171144 24961
524B4961q3935o02007O56288K25991k53102l92623k42078M27714m19284J90418
$$ 24961 -58974 -660981 -4693 221298 -31804 -424427 -666505 -238791 -658075 -467657
514d67657j16911K21829j94069J58669J76882k71308l61449N63851J36460l51236
$$ -467657 -584568 -362739 -556808 -398139 -221257 -492565 -854014 -290163 -153703 -504939
504e04939K44463L3907l22023J0668O4382J19567p00139K34417q0438J87443J80306
$$ -504939 -260476 -226569 -548592 -537924 -473542 -353975 -1054114 -819697 -900135 -712692 -532386
493e32386q9794Q5297K60339N57335r1636J65538J33489j46714p99618k87452
$$ -532386 -622180 -536883 -276544 280791 189155 354693 488182 341468 -458150 -745602
483g45602M38766n1793L20288L59436o44462N9401o8126L92518k48036j81498
$$ -745602 -306836 -358629 -38341 321095 -323367 -263966 -332092 60426 -187610 -369108
473c69108p3450J45595q6243p7927L25738N82741K58052o31107m4784m10140K40987
$$ -369108 -442558 -296963 -383206 -461133 -135395 447346 705398 74291 29507 -380633 -139646
462a39646j79938l01280j95607n6715P2710j32399K85294N36232m21802K7621
$$ -139646 -319584 -620864 -816471 -873186 -800476 -932875 -647581 -111349 -533151 -505530
452e05530K77561N18332j03228j80861k51290J4811Q4874K007l78210p5779K74268
$$ -505530 -227969 290363 187135 6274 -245016 -230205 -145331 -143324 -521534 -597313 -323045
441c23045n08310j16765J73867Q96699L40834N7182J72303k90068m6043J14350
$$ -323045 -831355 -948120 -774253 122446 463280 520462 692765 402697 356654 471004
431D71004n31955o56888K31392k80851M14405j61640k02669N22317l64309K07551
$$ 471004 -60951 -717839 -486447 -767298 -352893 -514533 -717202 -194885 -559194 -351643
421c51643N19458k6986p39220K12935M32766N1804K95797K4135j059642K36256
$$ -351643 167815 140829 -598391 -385456 47310 99114 394911 419046 -640596 -404340
411d04340N56611k99603j07504k4984n5513j14661O95368l19081r7272m59N2262
$$ -404340 152271 -147332 -254836 -279820 -335333 -449994 245374 -73707 -170979 -171438 -119176
400a19176j40791M1811L34197k48318R2205k89869k41822j76539Q5756N86051
$$ -119176 -259967 -218156 116041 -132277 -40072 -329941 -571763 -748302 -662546 -76495
390g6495j78920n1759L61458j2764j45810r677l35797m25567O1531N90437K18999
$$ -76495 -255415 -307174 54284 41520 -104290 -113967 -449764 -875331 -813800 -223363 -4364
379d364J29452K5929K75706J23771k22747J92436k91981J12087l32695M4437k780
$$ -4364 125088 151017 426723 550494 327747 520183 228202 340289 7594 52031 49251
368D9251j39849M47280p52606m21795L63383n1464O13167q4194j91601k42071
$$ 49251 -90598 356682 -395924 -817719 -454336 -505800 107367 23173 -168428 -410499
358d10499j70777N95815R06797n55692l52761Q7205j15226J56283R641K26472
$$ -410499 -581276 14539 921336 365644 12883 100088 -15138 141145 150786 377258
348C77258q7824r31689J60307K8165P76193o23260m5964K76927K04123K60321
$$ 377258 289434 -642255 -481948 -453783 322410 -300850 -346814 -69887 134236 394557
338C94557l35912l26115K22413J50866p13913K43204N03107j11015j92484k87238
$$ 394557 58645 -267470 -45057 105809 -608104 -364900 138207 27192 -165292 -452530
328d52530k44868L19051l42196J79335K03364L4867j43191J80062L93748L04142
$$ -452530 -697398 -378347 -720543 -541208 -337844 -302977 -446168 -266106 127642 431784
318D31784m45459K18718L1683j87912k88686n3648L59213k3910q44443j7149K68925
$$ 431784 -13675 205043 236726 48814 -239872 -293520 65693 41783 -802660 -819809 -550884
307e50884J11923M32358k59477J76680j464Q3723L42531K56261j61326l35823
$$ -550884 -438961 -6603 -266080 -89400 -90864 -7141 335390 591651 430325 94502
297I4502j16605N60251m86047n03153J00997l96564M97179M54343j6624k24104
$$ 94502 -22103 538148 52101 -451052 -350055 -746619 -249440 204903 188279 -35825
287c5825K23549l37760J81354k4081k15202l72745l5745l6959j35144J46911N86052
$$ -35825 187724 -150036 31318 7237 -207965 -580710 -616455 -653414 -788558 -641647 -55595
276e5595m16101P6944n1909L95118k89889o0980K98841j27730j92863l07733N23037
$$ -55595 -471696 -394752 -446661 -51543 -341432 -402412 -103571 -231301 -424164 -731897 -208860
265b08860p6115l91147J20551N97752l46454o1098o50124L49264N35209j31964
$$ -208860 -284975 -676122 -555571 42181 -304273 -365371 -1015495 -666231 -131022 -262986
255b62986p21591K81039N20482L68007o86371J14137l85791k58372R07677L14768
$$ -262986 -984577 -703538 -183056 184951 -501420 -387283 -773074 -1031446 -123769 190999
245A90999J98899m23827l84513J39169j78279l85334P03973J30733k10169m0647
$$ 190999 389898 -33929 -418442 -279273 -457552 -842886 -138913 -8180 -218349 -258996
235b58996J90714K85787l68675j76146M50124L2239k92029m01349o4196k07149
$$ -258996 -68282 217505 -151170 -327316 122808 155047 -136982 -538331 -602527 -809676
225h09676K60819j34979Q4894N77359N33517j98133q78853J51629L11059n8926
$$ -809676 -548857 -683836 -598942 -21583 511934 313801 -565052 -413423 -102364 -161290
215a61290l7245K28952l08584J54809K7208K9012k97534L83074K79658p6378o1637
$$ -161290 -198535 30417 -278167 -123358 -96150 -67138 -364672 18402 298060 221682 160045
204A60045l95871Q85572R8024m82433j62154l99675J74351N75544q6094n20395
$$ 160045 -235826 649746 747770 265337 103183 -296492 -122141 453403 367309 -153086
194a53086M65769k4246p81931K76912N1732K43226J65795k73704j57805M18654
$$ -153086 312683 288437 -493494 -216582 -164850 78376 244171 -29533 -187338 231316
184B31316k58654J62633Q5919j24904J44096p8486k49350l08924O1319J95520
$$ 231316 -27338 135295 221214 96310 240406 161920 -87430 -396354 -335035 -139515
174a39515k82884m04661O7441Q59242k29364m33356L33739L90071K15931k01189
$$ -139515 -422399 -827060 -759619 99623 -129741 -563097 -229358 160713 376644 175455
164A75455j12032p43991L6915K92764M1429j89366j91018m41326N29305M54405
$$ 175455 63423 -680568 -643653 -350889 -309460 -498826 -689844 -1131170 -601865 -147460
154a47460m78870L15694P80080j85262q17028K9423N68817O47974k84497r10101
$$ -147460 -626330 -310636 469444 284182 -532846 -503423 65394 713368 428871 -481230
144d81230j0925K24439j69739K13060k9401k98518j50926N681J39341K81450J04171
$$ -481230 -492155 -267716 -437455 -224395 -253796 -552314 -703240 -697559 -558218 -276768 -172597
133a72597K09553m36311k52156L52120L30202k36247K03184J80385R1890m24282
$$ -172597 36956 -399355 -651511 -299391 30811 -205436 -2252 178133 270023 -154259
123a54259o70176j09780m4326N97682k34495P7549J70281Q9511Q6625K73340K19276
$$ -154259 -824435 -934215 -978541 -380859 -615354 -537805 -367524 -278013 -191388 81952 301228
112C01228m38220r9943L94441q2528N0995J61638k83602l09980O47265l58807
$$ 301228 -136992 -236935 157506 74978 125973 287611 4009 -305971 341294 -17513
102a7513j26685n5488r7422J71364J99894l00446m32442R0382K64405L7108n1060
$$ -17513 -144198 -199686 -297108 -125744 74150 -226296 -658738 -568356 -303951 -266843 -317903
91c17903j41472n7391N42041J54922k92478n24785j82931O74242K47251n56606
$$ -317903 -459375 -516766 25275 180197 -112281 -637066 -819997 -145755 101496 -455110
81d55110L48484J07744N838j51774L0489J3865n0817l82246J03806K44878j11472
$$ -455110 -106626 1118 6956 -144818 -114329 -100464 -151281 -533527 -429721 -184843 -296315
70b96315J6393L0479j03585L2566j5662J1285n0958l39410k92303J32254O40198
$$ -296315 -279922 -249443 -353028 -320462 -336124 -324839 -375797 -715207 -1007510 -875256 -235058
59b35058k50476J94491m04959K50017J16781k23806K15888Q8548K38000L48658
$$ -235058 -485534 -291043 -696002 -445985 -329204 -553010 -337122 -248574 -10574 338084
49C38084m13923m50600L48869N25577k94762l87515M76888k74236o13427j06059
$$ 338084 -75839 -526439 -177570 348007 53245 -334270 142618 -131618 -745045 -851104
39h51104L58999L9017M79778n31348J61311O0165k37284J7711K79876q416L61598
$$ -851104 -492105 -453088 26690 -504658 -343347 -283182 -520466 -502755 -222879 -231295 130303
28A30303j1660j28514P5463j07395J64151k62823O13549o2720m32332L9784j4596
$$ 130303 118643 -9871 65592 -41803 122348 -140475 473074 410354 -21978 17806 3210
17C210n49796k40241M06540l56740J75056J17509K9849K61521K4598k53831k56500
$$ 3210 -546586 -786827 -380287 -737027 -561971 -444462 -414613 -153092 -128494 -382325 -638825
6f38825L9236K93886K17779O3250Q7660l77267
$$ -638825 -599589 -305703 -87924 -24674 62986 -314281
0c14281
$$ -314281
$$ Imaginary data points
##PAGE= N=2
##DATA TABLE= (X++(I..I)), XYDATA
16383f686888o6360j68987K18592L32159L51254M78949m39935j56419J07108J17378
$$ -6686888 -6753248 -6922235 -6703643 -6371484 -6020230 -5541281 -5981216 -6137635 -6030527 -5913149
16373e913149K41247J34775l301O7466K37403R6541R6010L06787L2698l41598
$$ -5913149 -5671902 -5537127 -5540428 -5472962 -5235559 -5139018 -5043008 -4736221 -4703523 -5045121
16363e045121J68404L22090J36683j27177J77515L22292L51574k23998k226j28210
$$ -5045121 -4876717 -4554627 -4417944 -4545121 -4367606 -4045314 -3693740 -3917738 -3919964 -4048174
16353d048174L04800o7952j22110K71642n0923K17453j03714k47140O04130Q10939
$$ -4048174 -3743374 -3811326 -3933436 -3661794 -3712717 -3495264 -3598978 -3846118 -3241988 -2431049
16343b431049q9074k72374L94562k9016Q130K17166M33617K66878o95699Q4356
$$ -2431049 -2520123 -2792497 -2397935 -2426951 -2418821 -2201655 -1768038 -1501160 -2196859 -2112503
16333b112503O7492j32972m28436K75708M18024K30761j5340P6919j36093p5676
$$ -2112503 -2045011 -2177983 -2606419 -2330711 -1912687 -1681926 -1697266 -1620347 -1756440 -1832116
$$ [...]
##END NTUPLES=NMR SPECTRUM
##END=
