##TITLE=1H_CA-8852-2
 CDCl3, 8 sc, 
 12.05.2021
##JCAMPDX= 6.0         $$ Bruker NMR JCAMP-DX V2.0
##DATA TYPE= NMR SPECTRUM
##DATA CLASS= NTUPLES
##ORIGIN= UXNMR, Bruker Analytische Messtechnik GmbH
##OWNER= root
$$ XWIN-NMR		Version 3.5
$$ Wed May 12 11:53:11 2021 Russian Standard Time (UT+4h)  she@DPX200
##.OBSERVE FREQUENCY= 200.131506
##.OBSERVE NUCLEUS= ^1H
##.ACQUISITION MODE= SIMULTANEOUS
##.ACQUISITION SCHEME= undefined
##.AVERAGES= 8
##.DIGITISER RES= 18
##SPECTROMETER/DATA SYSTEM= spect
##.PULSE SEQUENCE= zg30
##.SOLVENT NAME= CDCl3
##.SHIFT REFERENCE= (INTERNAL, CDCl3, 0, 15.974)
##AUDIT TRAIL= $$ (NUMBER, WHEN, WHO, WHERE, WHAT)
$$ ##TITLE= Audit trail, XWIN-NMR		Version 3.5
$$ ##JCAMPDX= 5.01
$$ ##ORIGIN= Bruker BioSpin GmbH
$$ ##OWNER= she
$$ F:/spectra/data/she/nmr/H-F/1/pdata/1/auditp.txt
$$ ##AUDIT TRAIL=  $$ (NUMBER, WHEN, WHO, WHERE, WHAT)
(   1,<2021-05-12 11:51:54.75 +0400>,<she>,<DPX200>,
      <created by zg, POWCHK disabled, PULCHK disabled
       configuration hash MD5:
       00 E9 B6 7A A2 85 ED C7 34 08 36 98 17 FE 4E 26
       data hash MD5: 16K
       8A 0E 6A 76 A8 94 09 7A 38 D8 0F F3 AE 18 8C E6>)
(   2,<2021-05-12 11:51:57.20 +0400>,<she>,<DPX200>,
      <Start of raw data processing
       efp BC_mod = 2 LB = 0.24 FT_mod = 6 PKNL = 1 PHC0 = -11129.34 PHC1 = 11.201 SI = 16K 
       data hash MD5: 16K
       6A 75 12 16 A3 07 A5 78 84 A4 92 88 1C 5C FB E5>)
(   3,<2021-05-12 11:52:16.54 +0400>,<she>,<DPX200>,
      <pk PHC0 = 0.5187333 PHC1 = 0.2 
       data hash MD5: 16K
       54 4A ED C6 99 52 79 9D BF 7B ED 49 85 73 10 1F>)
(   4,<2021-05-12 11:52:20.04 +0400>,<she>,<DPX200>,
      <abs ABSG = 5 
       data hash MD5: 16K
       47 48 B7 DC 6B 7F 40 90 5E C1 DF A8 A0 FA C1 81>)
$$ ##END=
$$ 
$$ hash MD5
$$ 7C C7 E2 CE 59 E6 43 23 A4 77 FF 24 A9 3E 86 D5
##$RELAX= 
##$RELAX= 
##$RELAX= 
##$RELAX= 
##$RELAX= 
##$RELAX= 
$$ Bruker specific parameters
$$ --------------------------
##$DU= <F:/spectra>
##$EXPNO= 1
##$NAME= <H-F>
##$PROCNO= 1
##$TYPE= <nmr>
##$USER= <she>
##$AMP= (0..31)
100 100 100 100 100 100 100 100 100 100 100 100 100 100 100 100 100 100 
100 100 100 100 100 100 100 100 100 100 100 100 100 100 
##$AQSEQ= 0
##$AQ_mod= 1
##$AUNM= <au_zg>
##$AUTOPOS= <>
##$BF1= 200.13
##$BF2= 200.13
##$BF3= 200.13
##$BF4= 200.13
##$BF5= 200.13
##$BF6= 200.13
##$BF7= 200.13
##$BF8= 200.13
##$BYTORDA= 1
##$CFDGTYP= 0
##$CFRGTYP= 5
##$CHEMSTR= <none>
##$CNST= (0..31)
1 1 145 1 1 1 1 1 1 1 1 1 1 1 1 1 1 1 1 1 1 1 1 1 1 1 1 1 1 1 1 1 
##$CPDPRG= <>
##$CPDPRG1= <>
##$CPDPRG2= <>
##$CPDPRG3= <>
##$CPDPRG4= <mlev>
##$CPDPRG5= <mlev>
##$CPDPRG6= <mlev>
##$CPDPRG7= <mlev>
##$CPDPRG8= <mlev>
##$CPDPRGB= <>
##$CPDPRGT= <>
##$D= (0..31)
0 1.2 0 0 0 0 0 0 0 0.06 0 0.03 0 0 0 0 0.0002 0 0 0 0 0 0 0 0 0 0 0 0 
0 0 0 
##$DATE= 1620805914
##$DBL= (0..7)
120 120 120 120 120 120 120 120 
##$DBP= (0..7)
150 150 150 150 150 150 150 150 
##$DBP07= 0
##$DBPNAM0= <>
##$DBPNAM1= <>
##$DBPNAM2= <>
##$DBPNAM3= <>
##$DBPNAM4= <>
$$ [...]
##$SUBNAM3= <"">
##$SUBNAM4= <"">
##$SUBNAM5= <"">
##$SUBNAM6= <"">
##$SUBNAM7= <"">
##$SUBNAM8= <"">
##$SUBNAM9= <"">
##$SW= 16.9725357007746
##$SWIBOX= (0..15)
0 0 2 0 0 0 0 0 0 0 0 0 0 0 0 0 
##$SW_h= 3396.73913043478
##$TD= 16384
##$TD0= 1
##$TE= 0
##$TE2= 300
##$TE3= 300
##$TEG= 300
##$TL= (0..7)
0 120 120 120 120 120 120 120 
##$TP= (0..7)
150 150 150 150 150 150 150 150 
##$TP07= 0
##$TPNAME0= <>
##$TPNAME1= <>
##$TPNAME2= <>
##$TPNAME3= <>
##$TPNAME4= <>
##$TPNAME5= <>
##$TPNAME6= <>
##$TPNAME7= <>
##$TPOAL= (0..7)
0.5 0.5 0.5 0.5 0.5 0.5 0.5 0.5 
##$TPOFFS= (0..7)
0 0 0 0 0 0 0 0 
##$TUNHIN= 0
##$TUNHOUT= 0
##$TUNXOUT= 0
##$USERA1= <user>
##$USERA2= <user>
##$USERA3= <user>
##$USERA4= <user>
##$USERA5= <user>
##$V9= 5
##$VALIST= <valist>
##$VCLIST= <CCCCCCCCCCCCCCC>
##$VD= 0
##$VDLIST= <DDDDDDDDDDDDDDD>
##$VPLIST= <PPPPPPPPPPPPPPP>
##$VTLIST= <TTTTTTTTTTTTTTT>
##$WBST= 1024
##$WBSW= 4
##$XGAIN= (0..3)
0 0 0 0 
##$XL= 0
##$YL= 0
##$YMAX_a= 410687
##$YMIN_a= -476844
##$ZGOPTNS= <>
##$ZL1= 120
##$ZL2= 120
##$ZL3= 120
##$ZL4= 120
##$ABSF1= 15.97403
##$ABSF2= -0.9986324
##$ABSG= 5
##$ABSL= 3
##$ALPHA= 0
##$AQORDER= 0
##$ASSFAC= 0
##$ASSFACI= 0
##$ASSFACX= 0
##$ASSWID= 0
##$AUNMP= <proc_1d>
##$AZFE= 0.1
##$AZFW= 0.1
##$BCFW= 0
##$BC_mod= 2
##$BYTORDP= 0
##$COROFFS= 0
##$CY= -3
##$DATMOD= 1
##$DC= 0
##$DFILT= <>
##$DTYPP= 0
##$F1P= 0
##$F2P= 0
##$FCOR= 1
##$FTSIZE= 16384
##$FT_mod= 6
##$GAMMA= 0
##$GB= 0
##$INTBC= 1
##$INTSCL= 1.334414e-10
##$ISEN= 128
##$LB= 0.24
##$LEV0= 0
##$LPBIN= 0
##$MAXI= 10000
##$MC2= 0
##$MEAN= 0
##$ME_mod= 0
##$MI= 1.114404
##$NCOEF= 0
##$NC_proc= -7
##$NLEV= 6
##$NOISF1= 3.799351
##$NOISF2= 2.8
##$NSP= 0
##$NTH_PI= 0
##$NZP= 0
##$OFFSET= 15.97403
##$PC= 1
##$PHC0= -11128.82
##$PHC1= 11.401
##$PH_mod= 1
##$PKNL= yes
##$PPARMOD= 0
##$PSCAL= 0
##$PSIGN= 0
##$REVERSE= no
##$SF= 200.13000748777
##$SI= 16384
##$SIGF1= 3
##$SIGF2= 2
##$SINO= 5.538805
##$SIOLD= 16384
##$SREGLST= <1H.CDCl3>
##$SSB= 0
##$STSI= 16384
##$STSR= 0
##$SW_p= 3396.73913043479
##$SYMM= 0
##$S_DEV= 0
##$TDeff= 16384
##$TDoff= 0
##$TI= <>
##$TILT= no
##$TM1= 0
##$TM2= 0
##$TOPLEV= 0
##$USERP1= <user>
##$USERP2= <user>
##$USERP3= <user>
##$USERP4= <user>
##$USERP5= <user>
##$WDW= 1
##$XDIM= 16384
##$YMAX_p= 420252113
##$YMIN_p= -603159
$$ End of Bruker specific parameters
$$ ---------------------------------
##NTUPLES= NMR SPECTRUM
##VAR_NAME=  FREQUENCY,     SPECTRUM/REAL,   SPECTRUM/IMAG
##SYMBOL=    X,             R,               I
##VAR_TYPE=  INDEPENDENT,   DEPENDENT,       DEPENDENT
##VAR_FORM=  AFFN,          ASDF,            ASDF
##VAR_DIM=   16384,         16384,           16384
##UNITS=     HZ,            ARBITRARY UNITS, ARBITRARY UNITS
##FACTOR=    0.207333158178282, 1,           1
##FIRST=     3196.88265165332, 0,            0
##LAST=      -199.856478781473, 0,           0
##MIN=       -199.856478781473, -603159,     0
##MAX=       3196.88265165332, 420252113,    0
$$ Real data points
##PAGE= N=1
##DATA TABLE= (X++(R..R)), XYDATA
$$ [...]
4926E363356j25751P0234K38933J27059J5745m2812k9521L5146m9618J95058M9656
4915E847485M3137N5782J51607j3893K8447J08402L2120J87738N6369P1943K64701
4904F833838J44729J13151J57507J15553J44100K20847J50633K11278J24076O7996
4894H283708K27733J06535L99570K12926L2160L7724K74625P1598J59705O8057
4884I874341J94023P9623J11421P5741j11986J44951K91138N9864N9140P5674
4874A0853930O598Q465k5526J53920K14938K2404J75783l9855J06787K20102N2453
4863A1749999K67893L59850K14765K57794L00970N6917J32833P1762J64021L0507
4853A3607311J74468O6126J09442J90067k4157l5608K00990J70973J96626J00162
$$ plain form
4926 5363356 5237605 5307839 5546772 5673831 5689576 5646764 5617243 5652389 5602771 5797829 5847485
4915 5847485 5890622 5946404 6098011 6084118 6112565 6220967 6253087 6440825 6497194 6569137 6833838
4904 6833838 6978567 7091718 7249225 7364778 7508878 7729725 7880358 8091636 8215712 8283708
4894 8283708 8511441 8617976 9017546 9230472 9262632 9300356 9574981 9646579 9806284 9874341
4884 9874341 10068364 10147987 10259408 10335149 10223163 10368114 10659252 10719116 10778256 10853930
4874 10853930 10860528 10868993 10843467 10997387 11212325 11234729 11410512 11370657 11477444 11697546 11749999
4863 11749999 12017892 12377742 12592507 12850301 13151271 13208188 13341021 13412783 13576804 13607311
4853 13607311 13781779 13847905 13957347 14147414 14123257 14087649 14288639 14459612 14656238 14756400
4843A4756400m9959L4552N3441L3585J18278l7391J94877J50331J63293J50797
4833A5568204N7804O6648K00771J97568K03967K61438J46054M07626K66603N20153
4823A7896836N78316M28385M93953L55324M43356N51043P81388P25660O39554
4814B2893815O76314O90531Q63882P64607R18040R18700O55850N72038K49348
4805B9203125J72557J94671k31076l78927m82395p45504p92886n91078l41609
4796B6006878p40811p59238n52572m00529r7722o4039j96243Q734P8692O7552
4786B3350702R0056J90164P9694J02794K90333M74717M04341M99188M33037N70611
4776B6485637O90000N74246O19125Q95293J024608R04135J240855J077772J098275
$$ plain form
4843 14756400 14706441 14740993 14794434 14828019 14946297 14908906 15103783 15254114 15417407 15568204
4833 15568204 15626008 15692656 15893427 16090995 16294962 16556400 16702454 17110080 17376683 17896836
4823 17896836 18475152 18903537 19397490 19752814 20196170 20747213 21528601 22254261 22893815
4814 22893815 23570129 24260660 25124542 25889149 26807189 27725889 28381739 28953777 29203125
4805 29203125 29375682 29570353 29339277 28960350 28477955 27732451 26939565 26348487 26006878
4796 26006878 25266067 24506829 23954257 23553728 23456006 23391967 23195724 23204458 23283150 23350702
4786 23350702 23440758 23630922 23710616 23813410 24103743 24578460 24982801 25481989 25915026 26485637
4776 26485637 27175637 27749883 28369008 29264301 30288909 31193044 32433899 33511671 34609946
4767C4609946J262361J429362J605702J824760J845726K062030K104714J954747
4759D8699348K007687J643317J548960J319651P35340M35696L6037k91662q79594
4750E5254780j020692j103371j303265j121401j181832j036375j108695r76352
4742D6402797q28385j024106q15202q08881p13981o09561l37312k18432j69318
4733D0877619l5270J2075K47163K01773L61052M60557N88081P94682Q52118P25914
4723D5085764Q48082R66649R05327R15828Q66924Q15166O37181O37672O59221
4714E2337814O99924P33065M91243L28748L1603j49490j1544o03007p71239q85720
4704E2201397j136307j356812j283438j104866j026834r56900q89784q42087o48044
$$ plain form
4767 34609946 35872307 37301669 38907371 40732131 42577857 44639887 46744601 48699348
4759 48699348 50707035 52350352 53899312 55218963 55954303 56389999 56426036 56134374 55254780
4750 55254780 54234088 53130717 51827452 50706051 49524219 48487844 47379149 46402797
4742 46402797 45574412 44550306 43735104 42926223 42212242 41602681 41265369 41046937 40877619
4733 40877619 40842349 40854424 41101587 41303360 41664412 42124969 42713050 43507732 44359850 45085764
4723 45085764 45933846 46900495 47805822 48721650 49588574 50403740 51040921 51678593 52337814
4714 52337814 53037738 53770803 54262046 54590794 54622397 54472907 54461363 53858356 53087117 52201397
4704 52201397 51065090 49708278 48424840 47319974 46293140 45336240 44446456 43604369 42956325
4695D2956325m40442l73824j89548l21809O1799K42052M68795O74911P06784P81587
4685D4566630R87235J143816J217128J365957J630207K004437J946168K104806
4677E6966384K335183K280541K086554K301623J907866J840821J346843P81833
4669G1847648J25361n56559r79924j618352j894653j943777k210862k314457j953306
4660E8501119j815454j687765j422609j524812j190458q02418q46829l55429k10647
4651D8644698q0739k0158J08228K07892J39831L57557M89856O82078P60615O58280
4641E1948138Q31539P46873Q77119O95172O10742R09461R28758P38496J030571
4632E9316869J089635J185078J227246J282391J453938J420358J115478J173621
$$ plain form
4695 42956325 42515883 42142059 41952511 41630702 41692501 41934553 42403348 43078259 43785043 44566630
4685 44566630 45553865 46697681 47914809 49280766 50910973 52915410 54861578 56966384
4677 56966384 59301567 61582108 63668662 65970285 67878151 69718972 71065815 71847648
4669 71847648 71973009 71416450 70436526 68818174 66923521 64979744 62768882 60454425 58501119
4660 58501119 56685665 54997900 53575291 52050479 50860021 50057603 49210774 48855345 48644698
4651 48644698 48563959 48543801 48652029 48859921 48999752 49357309 49847165 50529243 51289858 51948138
4641 51948138 52779677 53526550 54403669 55098841 55709583 56619044 57547802 58286298 59316869
4632 59316869 60406504 61591582 62818828 64101219 65555157 66975515 68090993 69264614
4624F9264614Q93290O92474N95910M71115L5565j858R8615J74584J57712k6933
4614G2355088J35392j9519j93548k94035n47635r95601j187959j338134j477896
4605F6436153j627160j893661j740733j889535k100477j965120k014945j776347
4597E1428175j492910j601378j628417j239463j339460j389490j251825j139655
4589D0345577j156384j039763j188397j087735j086051r81908q79650r24240q94366
4580C1107083o71047o82793o59143p73973l54099m88424o01900m44013k53748
4571B6177943j69317m10240l20307k30823n07197m68799l41081k81042l02626
4562B3146511n28019n01516k66395k56938k96491l99456m18935l32284l18260
$$ plain form
4624 69264614 70157904 70850378 71446288 71917403 71952968 71951110 72049725 72224309 72382021 72355088
4614 72355088 72490480 72470961 72277413 71983378 71435743 70440142 69252183 67914049 66436153
4605 66436153 64808993 62915332 61174599 59285064 57184587 55219467 53204522 51428175
4597 51428175 49935265 48333887 46705470 45466007 44126547 42737057 41485232 40345577
4589 40345577 39189193 38149430 36961033 35873298 34787247 33805339 32925689 32001449 31107083
4580 31107083 30436036 29753243 29094100 28320127 27966028 27477604 26875704 26431691 26177943
4571 26177943 26008626 25598386 25278079 25047256 24540059 24071260 23730179 23449137 23146511
4562 23146511 22618492 22116976 21850581 21593643 21297152 20897696 20478761 20146477 19828217
4553A9828217k02873k93545k97337k58769k06961m63925l57146l00972k88611
4544A7158078j59278k65949k98029j48844m02469k74141j63270j69295k08427
4535A5068376j88115j75225j03252o9008k8344k13884k36274r0336o5360j44119
4525A3754459j74469k38019j5736L941r1198l0410M0610N805J0394q1496O295
4514A3190176O3793q547q8080j46263O9465J15366k67045j61972J94492J30210
4504A3091595J02139m0764m1401j3532L2480O7132q2J43369J71938J74602J96894
4493A3884370J62287J5591N2597K40785M8531J69282K80012J99378J61898J13187
4483A5327918J53851J30270L11390R6807K15187K24605J00102J5054J84975J84981
$$ plain form
4553 19828217 19625344 19331799 19034462 18775693 18568732 18104807 17747661 17446689 17158078
4544 17158078 16998800 16732851 16434822 16285978 15883509 15609368 15446098 15276803 15068376
4535 15068376 14880261 14705036 14601784 14532776 14504432 14290548 14054274 13963938 13898578 13754459
4525 13754459 13579990 13341971 13326235 13330176 13238978 13208568 13249178 13254983 13265377 13183881 13190176
4514 13190176 13253969 13245422 13157342 13011079 13080544 13195910 12928865 12766893 12961385 13091595
4504 13091595 13193734 13152970 13111569 13098037 13130517 13197649 13197567 13340936 13512874 13687476 13884370
4493 13884370 14046657 14062248 14114845 14355630 14404161 14573443 14853455 15052833 15214731 15327918
4483 15327918 15481769 15612039 15923429 16020236 16235423 16460028 16560130 16575184 16760159 16945140
4473A6945140M2103K57031n4272q2018n1642K00891O6227q2439m5357k2798k27425
4462A6945441l0694K12258Q153n750J1207r6043j00420L0147J10181J50216j3162
4451A7221534K2612R8286P9609O0489k8210K18330j54532k14863j59444R2307
4441A7236118K60282R9177N2420R6460Q4462J26872Q8973K96816L20785K29465
4431A8891830K32177L58212K68943K12268K48878K69738N08963O39464N18329
4422B2148802M32713N26759N09067P55035Q12899Q67667R27918Q44497Q36996
4413B8662353J086593J020815J116467J087319Q68318J022716Q96934Q81425Q09595
4404C7452535O63175L65566J32260p3370k50133l36771m99510m63000m89872n35397
$$ plain form
4473 16945140 16987243 17244274 17190002 17107984 17056342 17257233 17323460 17241021 17195664 17172866 16945441
4462 16945441 16914747 17127005 17135158 17129408 17140615 17044572 16944152 16974299 17084480 17234696 17221534
4451 17221534 17244146 17342432 17422041 17482530 17454320 17672650 17518118 17303255 17143811 17236118
4441 17236118 17496400 17595577 17647997 17744457 17828919 17955791 18044764 18341580 18662365 18891830
4431 18891830 19124007 19482219 19751162 19963430 20212308 20482046 20991009 21630473 22148802
4422 22148802 22581515 23108274 23617341 24372376 25185275 26052942 26980860 27825357 28662353
4413 28662353 29748946 30769761 31886228 32973547 33841865 34864581 35761515 36642940 37452535
4404 37452535 38115710 38481276 38613536 38540166 38290033 37953262 37453752 36990752 36500880 35965483
4394C5965483m61428n98540l87278j85068k41354j6466j80462K26525K96356K87442
4384C4705210L88764O05607O73886P84623Q01066J028826J290849J292642J541144
4375D3112617J626797J733980J794019K068227K209260K389700K454785K617406
4367F0006791K633461K558004K655384K435200J994442J668923J352064J212749
4359G6517018Q58635M77944K44621k7523j34953m5452L88357P27658Q77381J209258
4349H1092944J447599J795985K074131K132769K336844K291315K263013K169631
4341I7604231J878095J317916O40009K57271k83610j055376j353629j897920k165159
4332I4941828k210230k251903k296303k331155k062432j562068j391509j174996
$$ plain form
4394 35965483 35504055 34905515 34518237 34333169 34091815 34075349 33894887 34121412 34417768 34705210
4384 34705210 35093974 35699581 36373467 37158090 37959156 38987982 40278831 41571473 43112617
4375 43112617 44739414 46473394 48267413 50335640 52544900 54934600 57389385 60006791
4367 60006791 62640252 65198256 67853640 70288840 72283282 73952205 75304269 76517018
4359 76517018 77375653 77853597 78098218 78070695 77935742 77890290 78278647 79006305 79883686 81092944
4349 81092944 82540543 84336528 86410659 88543428 90880272 93171587 95434600 97604231
4341 97604231 99482326 100800242 101440251 101697522 101413912 100358536 99004907 97106987 94941828
4332 94941828 92731598 90479695 88183392 85852237 83789805 82227737 80836228 79661232
4324G9661232o34466j42725N4515L25453P39500R64867J171143J695418J838429
4315H5673366J646236J724659J564090J254169R82449M66239K9612l82997j248461
4306I1709362j734461j940370k506211l063989l303658l450733l522924l557760
4298F8629256l384158l213829l260445k958222k832476k610658k432121k304473
4290D5632874j910257k024210j695157j380581j551446j216422j022677j157413
4282C3674711j063411q63177p32056p21111r41127q42184m93433n30208o48886
4273B6839118p30780m92812m15066m24899m10153k43395j56820k13164k49823
4264B3502206j43270k19759m33257J52422J91490K21461J47447J50657L16618
$$ plain form
4324 79661232 79026766 78884041 78938556 79264009 80003509 80968376 82139519 83834937 85673366
4315 85673366 87319602 89044261 90608351 91862520 92844969 93311208 93340820 92957823 91709362
4306 91709362 89974901 88034531 85528320 82464331 79160673 75709940 72187016 68629256
4298 68629256 65245098 62031269 58770824 55812602 52980126 50369468 47937347 45632874
4290 45632874 43722617 41698407 40003250 38622669 37071223 35854801 34832124 33674711
4282 33674711 32611300 31748123 31016067 30294956 29353829 28511645 28018212 27488004 26839118
4273 26839118 26108338 25615526 25200460 24775561 24365408 24122013 23965193 23752029 23502206
4264 23502206 23358936 23139177 22705920 22858342 23049832 23271293 23418740 23569397 23886015
4255B3886015K51332L47247L88851M48367O03933N73638M06591M38270K66516
4246B7610760K13610L31881k33009k88075l38158m17677m04993n16973q08664
4237B5148702q64415p74344p63948q49135q62234q81368q31274n07445o52338
4228A8162201p54667n43219m51105m54686m80192n47827m5198l05774l93051l42841
4218A3843641k39391m14709j8666k67674j71356j43330p1452l37247j15643k5709
4208A2038464k55966k72574o8207k01871l1060j1289j49181j0563j05144l17769
4198A0614840m7904J40663j10330q3372j21801O7999l6846j16900l8416l6016
4188A0231917j82557K01147Q0575N6797j8197j71295k24260l8222r7791p7531
$$ plain form
4255 23886015 24137347 24484594 24873445 25321812 25925745 26499383 26905974 27344244 27610760
4246 27610760 27824370 28156251 27923242 27635167 27297009 26879332 26474339 25957366 25148702
4237 25148702 24284287 23509943 22745995 21896860 21034626 20153258 19321984 18814539 18162201
4228 18162201 17407534 16864315 16413210 15958524 15478332 14930505 14885307 14579533 14186482 13843641
4218 13843641 13604250 13189541 13170875 12903201 12731845 12588515 12517063 12179816 12064173 12038464
4208 12038464 11782498 11509924 11441717 11239846 11208786 11197497 11048316 11037753 10932609 10614840
4198 10614840 10566936 10707599 10597269 10513897 10392096 10460095 10423249 10306349 10267933 10231917
4188 10231917 10049360 10250507 10331082 10387879 10369682 10198387 9974127 9935905 9838114 9760583
4178I760583m7591o6034J9408J07519k3026n6829j41674j0981J4134k2843R7901
4167I630567J32837l8266M9508m6643p7360M5065Q0244J36616J49709O4316Q7719
4156A0214312J74823P4638J37913J72066J92604J85731J70122J64688L10687K98817
4146A2096401P9885M4826K47133L00213n4669j85136J42189K59476j0140N2119
4136A2972297o6171j26704l8136p4547l1646P8460m2638l9254J8665K20L8666
4125A2689212r476L5975J74533J50398K91951K21992J25726O86L95642N79138
4115A4655777L60855P3566L08351J19789q9394Q6882P8955m4473j3997j13325
4105A5422986p5240r2901k93260l21010l23182m73211m01190l86190m29781k54355
$$ plain form
4178 9760583 9712992 9646958 9666366 9773885 9750859 9694030 9552356 9541375 9555509 9532666 9630567
4167 9630567 9763404 9725138 9774646 9728003 9650643 9695708 9775952 9912568 10062277 10126593 10214312
4156 10214312 10389135 10463773 10601686 10773752 10966356 11152087 11322209 11486897 11797584 12096401
4146 12096401 12176286 12221112 12468245 12768458 12713789 12528653 12670842 12930318 12920178 12972297
4136 12972297 12906126 12779422 12741286 12666739 12635093 12713553 12670915 12631661 12650326 12650546 12689212
4125 12689212 12679736 12715711 12890244 13040642 13332593 13554585 13680311 13680997 14076639 14655777
4115 14655777 15016632 15090198 15398549 15518338 15428944 15515826 15594781 15550308 15536311 15422986
4105 15422986 15347746 15254845 14961585 14640575 14317393 13844182 13442992 13056802 12627021 12372666
4095A2372666l13371k10682o0270j1197j43972j88618o0199J1371q1138M9331
4085A1363921J24661O2882J0750J14751Q518n9325q6303J0427O21j09980J32915
4074A1573838M8791m8063k32535l10864j99126k65328m48279l31045n3837k89414
4064I444138k73544j67471j34429k97872j76767j56221n1409P2201n3743k57167
4054G947716J24399j35601k12797j87392J45432N430M7223r4625j9934j8442m9917
4043G551492r1777o151P442M0955Q2151j13653o7310m3865J28565k61028Q744
4032G235565J39953J6005j56149J1144M0999j37020l3865J45940N0404N0480K4011
4021G387467k5525O9249k09709j13351J47796j9495N8303m6181j24855m0121J60491
$$ plain form
4095 12372666 12059295 11848613 11788343 11777146 11633174 11444556 11384357 11395728 11314590 11363921
4085 11363921 11488582 11551464 11562214 11676965 11685483 11626158 11539855 11550282 11550903 11440923 11573838
4074 11573838 11622629 11574566 11342031 11031167 10832041 10566713 10118434 9787389 9733552 9444138
4064 9444138 9170594 9003123 8868694 8570822 8394055 8237834 8186425 8258626 8204883 7947716
4054 7947716 8072115 7936514 7723717 7536325 7681757 7687187 7734410 7639785 7619851 7601409 7551492
4043 7551492 7459715 7453564 7461006 7501961 7584112 7470459 7403149 7359284 7487849 7226821 7235565
4032 7235565 7375518 7391523 7235374 7246518 7287517 7150497 7116632 7262572 7312976 7363456 7387467
4021 7387467 7361942 7431191 7221482 7108131 7255927 7236432 7294735 7248554 7123699 7083578 7244069
4010G244069j03345L9868j19303o6811J84941k42958m9617O6307N5326j00891
4000F907586P0655m523N1784m116r5884L0375K6365P2143k9143J16518J23431
3989G265191j95731l9065j41482k1532L0795O4796M1561K04211j01779k03131
3979F903834q5302J15971J05206j17577Q7680j11256J58243q77o8895j16444J79985
3968G050568J04728q9262p7162j4879J70139K9882k35588n7236P9874J14886R9640
3957G175590J8177L6349J489j39501J46148J7125n8066P5721m7372l6620J05075
3946G294115L0052n2098p8830q4940O9947P8144L1213J25225J05572O5326M0782
3935G624508Q5570K4599M6960k007k6275Q5886l4906L3720L8115J2019L3819L9083
$$ plain form
4010 7244069 7140724 7180592 7061289 6994478 7179419 6936461 6886844 6953151 7008477 6907586
4000 6907586 6978241 6973718 7025502 7021386 6925502 6955877 6982242 7054385 7025242 7141760 7265191
3989 7265191 7069460 7030395 6888913 6867381 6898176 6962972 7004533 7208744 7106965 6903834
3979 6903834 6818532 6934503 7039709 6922132 7009812 6898556 7056799 7055922 6987027 6870583 7050568
3968 7050568 7155296 7066034 6988872 6973993 7144132 7174014 6938426 6881190 6961064 7075950 7175590
3957 7175590 7193767 7230116 7231605 7092104 7238252 7255377 7197311 7273032 7225660 7189040 7294115
3946 7294115 7324167 7272069 7193239 7108299 7178246 7256390 7287603 7412828 7518400 7583726 7624508
3935 7624508 7710078 7734677 7781637 7779630 7753355 7839241 7804335 7838055 7876170 7888189 7922008 7961091
3923G961091k525O8313J79450J10753J4019R023l6505n889o0898K434N5474L9562
3911H334302K00144R5518J31998J34495K13430j11522R4139K72321J7648J22267
3901I504740L18032K79301J29313K35957K81483L71390K60861M67878M08159L30671
3891A2587785J56184j271q2691k4064N8821k2722O7517N605j17860j17980O2871
3880A2572195n7479p073n768j22280L30J41778P8459J78075J55327Q8660J04058
3869A3126282L42036K99019M47310K16715K82483L34408L7551K03047J48823J08410
3859A5546084N8968J93752j43768r4349k9147j09935j85982k5791r9247j85540
3849A4925045k55092k29638k76033k86493k16657k54590q9467n1136l01036p7813
$$ plain form
3923 7961091 7958566 8026879 8206329 8317082 8331101 8340124 8303619 8297730 8236832 8239266 8294740 8334302
3911 8334302 8534446 8629964 8761962 8896457 9109887 8998365 9092504 9364825 9382473 9504740
3901 9504740 9822772 10102073 10231386 10467343 10748826 11120216 11381077 11848955 12257114 12587785
3891 12587785 12743969 12742698 12660007 12635943 12694764 12672042 12739559 12745164 12627304 12509324 12572195
3880 12572195 12514716 12507643 12501875 12379595 12379925 12521703 12600162 12778237 12933564 13022224 13126282
3869 13126282 13468318 13767337 14214647 14431362 14713845 15048253 15085804 15288851 15437674 15546084
3859 15546084 15605052 15798804 15655036 15560687 15531540 15421605 15235623 15209832 15110585 14925045
3849 14925045 14669953 14440315 14164282 13877789 13661132 13406542 13317075 13265939 12964903 12887090
3839A2887090M7091Q1507R0427p0735m0300O5862K2764J35193J7955K35741K29854
3828A3702449J85062J01223K7022m9846j41116J90r3729K0418q5225j31226k66944
3817A3268278j26946j59777k23677j60790j17089M347J3152j646j72592p9346
3807A2243914j48251L2384o723J6261J96634K1079K44579J69741K6128J10587
3797A2906333K17559n4979l1191K85238K36522J29665K40179J75905J73503J69156
3787A4447890K13064L64393K82949L64816L76112L47655M29589M26302M11793
3778A7664563L58071L75688P06858P24486O05413Q23461R07732J102553J143719
3769B4412544J011298J448763J532050J893875K225561K490020L472982M074736
$$ plain form
3839 12887090 12934181 13015688 13106115 13035380 12995080 13060942 13083706 13218899 13236854 13472595 13702449
3828 13702449 13887511 13988734 14015756 13965910 13824794 13824984 13731255 13751673 13666448 13535222 13268278
3817 13268278 13141332 12981555 12757878 12597088 12479999 12484346 12497498 12495852 12323260 12243914
3807 12243914 12095663 12128047 12121324 12137585 12334219 12355298 12599877 12769618 12795746 12906333
3797 12906333 13123892 13068913 13037722 13322960 13559482 13689147 13929326 14105231 14278734 14447890
3787 14447890 14660954 15025347 15308296 15673112 16049224 16396879 16826468 17252770 17664563
3778 17664563 18022634 18398322 19105180 19829666 20435079 21258540 22166272 23268825 24412544
3769 24412544 25423842 26872605 28404655 30298530 32524091 35014111 38487093 42561829
3761D2561829M412872M693413M264323L290332K091187J081369m14311k240968
3753E9740046l523725m760654n245290m632969l553519k430484j817512j225590
3745C2550303j041151j092757q79700p70499l89996n86895m37399l99559m67649
3736B6484698j75662J01340m6294j03201k37457j1917R0023J04811J32167K80428
3726B6618936K16197K14661M80239L96228M58498L44363L38408M13559L79874
3717B9860963L90812L09554M18726N75373M23287M65564N28388N07861O01232
3708C4081760L95192K94221N53278O57295P90794Q71804R60498J031793J357320
3699D0993955J484105J705664K324336K823309L697797M199172M251433M059231
$$ plain form
3761 42561829 46974701 51668114 55932437 59222769 61313956 62395325 61981014 59740046
3753 59740046 56216321 51455667 46210377 41577408 38023889 35593405 33775893 32550303
3745 32550303 31509152 30416395 29536695 28766196 28376200 27789305 27351906 26952347 26484698
3736 26484698 26309036 26410376 26364082 26260881 26023424 26011507 26101530 26206341 26338508 26618936
3726 26618936 26835133 27049794 27530033 27926261 28384759 28729122 29067530 29481089 29860963
3717 29860963 30251775 30561329 30980055 31555428 31978715 32444279 32972667 33480528 34081760
3708 34081760 34476952 34771173 35324451 35981746 36772540 37644344 38604842 39636635 40993955
3699 40993955 42478060 44183724 46508060 49331369 53029166 57228338 61479771 65539002
3691F5539002L234564K329678K044689M19844k148693l092355l302986m171270
3683F0852473m646172l824909k850535k122279j632933j290806j112524q85165
3675D2487150q23366o05122m72909l80689j74691l16237k39680O1863k83687q5282
3665C9167350O5471J30207k8607M35J07996J56533Q9482j16957M8269p3242P4168
3654C9621105K56272J73364J89420J15927Q7748L93118O66885M67617O85960R14822
3644D3572238Q04788Q13361O42493P60460R33111Q50457P73555O80041O83367
3635E0513871M96405K59425J65739r8607k10245m09144l79092o11952o70393q37427
3625D8218580o75260p31766o28513n76971o64507n08653n89542m04247j57441
$$ plain form
3691 65539002 68773566 71103244 73147933 73567777 71419084 68326729 65023743 60852473
3683 60852473 56206301 52381392 49530857 47408578 45775645 44484839 43372315 42487150
3675 42487150 41663784 41058662 40585753 40205064 40030373 39714136 39474456 39536319 39252632 39167350
3665 39167350 39232821 39363028 39334421 39334856 39442852 39599385 39688867 39571910 39620179 39546937 39621105
3654 39621105 39877377 40050741 40240161 40356088 40443836 40836954 41503839 41971456 42657416 43572238
3644 43572238 44377026 45190387 45832880 46593340 47526451 48376908 49150463 49830504 50513871
3635 50513871 51010276 51269701 51435440 51336833 51126588 50717444 50338352 49726400 49056007 48218580
3625 48218580 47543320 46811554 46183041 45606070 44941563 44432910 43843368 43439121 43281680
3616D3281680k18771j15507j9817L1909J04343M30989K21021K48793L05377J40565
3606D4410582M08931K68413J64227K16096K69340Q2636M2673L9775k24163p3001
3596D5605509j33580l88077j58123k30115J7223k2388k8900k7580j6701K8898
3586D4646166L71442J81190L62661M56126M52574O08592O44278O49933O04092
3577D8977054P69481O54062P76503R86440Q95078Q24312J015130P99216Q16881
3568E6514157J056894J082466J022546P99999J081800J068391J159827J057999
3560F4844079J034990J092865J065321J049151J174995J199595J022772J196064
3552G3679832J018488J035087J189804J024675R85998J026003J120737J056145
$$ plain form
3616 43281680 43062909 42947402 42927585 42959494 43063837 43494826 43715847 43964640 44270017 44410582
3606 44410582 44819513 45087926 45252153 45468249 45737589 45820225 45862898 45902673 45678510 45605509
3596 45605509 45471929 45083852 44925729 44695614 44712837 44690449 44661549 44633969 44617268 44646166
3586 44646166 45017608 45198798 45561459 46017585 46470159 47078751 47723029 48372962 48977054
3577 48977054 49746535 50400597 51177100 52163540 53058618 53882930 54898060 55697276 56514157
3568 56514157 57571051 58653517 59676063 60476062 61557862 62626253 63786080 64844079
3560 64844079 65879069 66971934 68037255 69086406 70261401 71460996 72483768 73679832
3552 73679832 74698320 75733407 76923211 77947886 78933884 79959887 81080624 82136769
3544H2136769J135859J197925R10345R53190Q67468N52450M74974M00758L31722
3535H8961460M57911N54795R04530J257163J195415J658305K057781J933131J976730
3526A00957221J644269J386780J113333N23998j27485m53103r67754j037368j343756
3517A01696135j695923j834067j901553j824065j929915j838114j550178j584595
3509H7537725j388154j243394j311227j053225r06356r80854r30902r28830q85880
3500G7908903q55632o61981o72364l63487l94073k89597j24614K47525L55866
3491G5150546L76858P57146P51236P99587Q85185J103176R25440N78939O56637
3482H1984750O44411M85871M64597L76256L20134M91174L73377L44554M73789
$$ plain form
3544 82136769 83272628 84470553 85380898 86334088 87201556 87754006 88228980 88629738 88961460
3535 88961460 89419371 89974166 90878696 92135859 93331274 94989579 97047360 98980491 100957221
3526 100957221 102601490 103988270 105101603 105625601 105498116 105045013 104077259 103039891 101696135
3517 101696135 100000212 98166145 96264592 94440527 92510612 90672498 89122320 87537725
3509 87537725 86149571 84906177 83594950 82541725 81635369 80654515 79723613 78794783 77908903
3500 77908903 77053271 76391290 75718926 75355439 74961366 74671769 74547155 74794680 75150546
3491 75150546 75527404 76284550 77035786 77835373 78720558 79823734 80749174 81328113 81984750
3482 81984750 82629161 83115032 83579629 83955885 84276019 84767193 85140570 85485124 85958913
3473H5958913N94400M41577P2844r017p1009k36592n24616m95439p72249m99417
3463H4459395n82327k63383k15813r4010J07959L95969N39756P80362J043965
3454H6171873R38643J177117J484681J151854J185546J312266J016016J211405
3446I5649401P69540O92816Q12782R58251J029037J230803J192403J573947J656523
3437A05565503J974844K260290K165358K432508K343071K253860K056479J903219
3429A22955132J592666J239736Q73582Q17895R81420R09470N15531P67437M47177
3420A31100046J88607j06210j41528o52949j208332j290209j733091k058307j943930
3411A22154097j860988j869755j701135j508666j059555o75088k18065p1055J29425
$$ plain form
3473 85958913 86553313 86994890 87067734 87058717 86987708 86751116 86226500 85731061 84958812 84459395
3463 84459395 83877068 83613685 83397872 83303862 83411821 83807790 84347546 85127908 86171873
3454 86171873 87110516 88287633 89772314 90924168 92109714 93421980 94437996 95649401
3446 95649401 96418941 97111757 97924539 98882790 99911827 101142630 102335033 103908980 105565503
3437 105565503 107540347 109800637 111965995 114398503 116741574 118995434 121051913 122955132
3429 122955132 124547798 125787534 126661116 127479011 128460431 129369901 129885432 130652869 131100046
3420 131100046 131288653 131182443 131040915 130387966 129179634 127889425 126156334 124098027 122154097
3411 122154097 120293109 118423354 116722219 115213553 114153998 113478910 113260845 113189790 113319215
3402A13319215L38126N75682O28979O97413P16509O95439K51038j47862o1097
3393A17013442k20635p38940j025418j181277j410856j425792j428573j477556
3385A08104395j321727j029727r29696n98469k40784J14800M10882N00061P63662
3376A05773397Q23932J054680R81618R94251Q53124Q79070N82112K81865p2700
3367A12151349l31170m57050m13815p84943p05623m32950p53016n15465l21974
3358A07435343l44392n15199k53631l62137l64693k70202l44254l63013k91451
3349A04326371j05094K01119L86858P03302Q92670J196777J231610J622535J789417
3340A12245565J829323K400397K704774L251028L820957M437352M522757M255680
$$ plain form
3402 113319215 113657341 114233023 114862002 115559415 116275924 116971363 117222401 117074539 117013442
3393 117013442 116792807 116053867 115028449 113847172 112436316 111010524 109581951 108104395
3385 108104395 106782668 105752941 104823245 104224776 103983992 104098792 104509674 105009735 105773397
3376 105773397 106597329 107652009 108633627 109627878 110481002 111360072 111942184 112224049 112151349
3367 112151349 111820179 111363129 110949314 110164371 109458748 109025798 108272782 107757317 107435343
3358 107435343 107090951 106575752 106322121 105959984 105595291 105325089 104980835 104617822 104326371
3349 104326371 104221277 104422396 104809254 105512556 106405226 107602003 108833613 110456148 112245565
3340 112245565 114074888 116475285 119180059 122431087 126252044 130689396 135212153 139467833
3332A39467833L116428J521513J36805j373264l004064n005002o743060p531116
3324A20586073p208820o305143n364778m390538l858931l359118k657351k445975
3316H4995419k075303j759869j656228j576772j598752j603669j428919j405645
3308G1890262j260859j196043j094037j110287j067336p15736q78899q05103o02671
3299F3159291j059083j104039r12118q39640j024803j095164q87795r25186q68307
3290E4443156p58978p80846o84573o86392m47987n09020o92791n88033n12453
3281D8782083n10152m08276l25213m34247m51019m02978j69721l62336j09183
3272D5608958k47674k55067k1288r7758J9009l5289n6252J23391J38228K21010
$$ plain form
3332 139467833 142584261 144105774 144242579 142869315 139865251 134860249 128117189 120586073
3324 120586073 113377253 107072110 101707332 97316794 93457863 90098745 87441394 84995419
3316 84995419 82920116 81160247 79504019 77927247 76328495 74724826 73295907 71890262
3308 71890262 70629403 69433360 68339323 67229036 66161700 65445964 64567065 63761962 63159291
3299 63159291 62100208 60996169 60084051 59244411 58219608 57124444 56236649 55311463 54443156
3290 54443156 53684178 52903332 52218759 51532367 51084380 50575360 49882569 49294536 48782083
3281 48782083 48271931 47863655 47538442 47104195 46653176 46250198 46080477 45718141 45608958
3272 45608958 45361284 45106217 45084929 44987171 45006180 44970891 44914639 45038030 45176258 45397268
3262D5397268K96438J8016J68437N24499M07916K73220M74864N49937N71901Q51648
3252D9534144N84779O65238O56380Q20509Q57806R18379Q63843J000301J165018
3243E7066397J414356J537691J341152J411769J734135K040728K031843K275541
3235G0853612K394221K639908K961240L249227L230536L634587L895853M207753
3227I7066937M732305N357106N827996O179790O811251P552518Q476174R406919
3219A51410996J0458601J1698198J2875627J4460641J5826871J7253119J8108932
3212B52092985J7655447J6264695J3489359R211934M456510p37384o009798j1349820
3204B95073928j5984906j8818472j9845369j9321579j7750763j6016350j4129107
$$ plain form
3262 45397268 45693706 45711722 45880159 46404658 46812574 47085794 47560658 48110595 48682496 49534144
3252 49534144 50118923 50784161 51440541 52261050 53118856 54037235 54901078 55901379 57066397
3243 57066397 58480753 60018444 61359596 62771365 64505500 66546228 68578071 70853612
3235 70853612 73247833 75887741 78848981 82098208 85328744 88963331 92859184 97066937
3227 97066937 101799242 107156348 112984344 119164134 125975385 133527903 142004077 151410996
3219 151410996 161869597 173567795 186443422 200904063 216730934 233984053 252092985
3212 252092985 269748432 286013127 299502486 308714420 313170930 312433546 306423748 295073928
3204 295073928 279089022 260270550 240425181 221103602 203352839 187336489 173207382
3197A73207382j2454056j1287673j0035394r024401p861714p170661o617590n756751
3189A02999142n381815m836575m402702l973861l704732l275447l096641k789228
3181G1538141k362131k211280k037964j893208j714008j659831j557123j317184
3173E6785412j252709j386382j014289r78649r08007r10782r53066j021650j033370
3164D7326508j007957j071457j208128j115129j123176q22529o97563q14137p06311
3155C8760121n30290n78281l29859m86118k92725l48579k76316k34112k23638
3146C5460203k99800j41708J11457R6195K34756L01586L29100K06070J55453L79394
3136C6832706K09709N345N5176j81873l13027m65846o54887q39685p12970q97473
$$ plain form
3197 173207382 160753326 149465653 139430259 130405858 122544144 115373483 108755893 102999142
3189 102999142 97617327 92780752 88378050 84404189 80699457 77424010 74327369 71538141
3181 71538141 69176010 66964730 64926766 63033558 61319550 59659719 58102596 56785412
3173 56785412 55532703 54146321 53132032 52153383 51245376 50334594 49381528 48359878 47326508
3164 47326508 46318551 45247094 44038966 42923837 41800661 40978132 40280569 39466432 38760121
3155 38760121 38229831 37651550 37321691 36835573 36542848 36194269 35917953 35683841 35460203
3146 35460203 35160403 35018695 35130152 35226347 35461103 35762689 36091789 36297859 36453312 36832706
3136 36832706 37042415 37047760 37102936 36921063 36608036 36142190 35487303 34647618 33934648 33037175
3126C3037175q99159j119486q49900j037366j208422p30431p62796r42530p12092
3117B4774993p51937p11263n22525l89650m06349k81675k49353m09306l88349
3108B0664586k09855k70118l02087j86420k58751j22324Q396q7072K2345j64320
3098A9094380j181p6759l34917k0636k9274Q075K8837k90730r7239K9847J41082
3087A8451485q6077K4525R257M7663K58453J98095Q6944L05641O5185J00937m700
3076A9457408k14831m05459m80733k93361m27529j95092m04736l17594k95014
3067A6423059k32566m06667l63991k13534j35924l65317q7287j20820j67423l0248
3057A4299282k7321j41011p9754j90229j02592J0134l4833r7581J74138q6339
$$ plain form
3126 33037175 32138016 31018530 30168630 29131264 27922842 27192411 26429615 25487085 24774993
3117 24774993 24023056 23311793 22789268 22399618 21993269 21711594 21462241 21052935 20664586
3108 20664586 20454731 20184613 19882526 19696106 19437355 19315031 19323427 19236355 19258700 19094380
3098 19094380 19093199 19016440 18681523 18660887 18631613 18639688 18668525 18377795 18280556 18310403 18451485
3087 18451485 18365408 18389933 18399190 18446853 18705306 18903401 18990345 19295986 19361171 19462108 19457408
3076 19457408 19242577 18837118 18356385 18063024 17635495 17440403 17035667 16718073 16423059
3067 16423059 16190493 15783826 15419835 15206301 15070377 14705060 14617773 14496953 14329530 14299282
3057 14299282 14271961 14130950 14051196 13860967 13758375 13768509 13733676 13636095 13810233 13723894
3047A3723894J57822J17528j80885K3117N3704J532Q0921K76274j0031r2575m8840
3036A4102461j04406j08343R0670q2911j45283j44886j36690j09240K7513p3917
3026A3314968n4422M6056L1889j9152J11553K38520n886k5302j5898J69028J091
3015A3792445L4782J49925j63069R1767P3951K39450L21889K63385K14037J75895
3005A5194457K09448K93957J92076K64869K06014L43177L25347L16302K17739
2996A7563386K47391J02329o0079L5547k37270k59739k36553k95222k92858k90579
2986A6276353l34252q8054j09205k07931j09116J09495n2962k9135k70363J94162
2976A5378992j4172j5354J50653L6055Q2972K5320N6784R6667K38950K30443J35344
$$ plain form
3047 13723894 13881716 13999244 13818359 13841476 13895180 13896712 13977633 14253907 14243876 14151301 14102461
3036 14102461 13998055 13889712 13980382 13897471 13752188 13607302 13470612 13361372 13388885 13314968
3026 13314968 13260546 13306602 13338491 13319339 13430892 13669412 13663526 13638224 13622326 13791354 13792445
3015 13792445 13827227 13977152 13814083 13905850 13979801 14219251 14541140 14804525 15018562 15194457
3005 15194457 15403905 15697862 15889938 16154807 16360821 16703998 17029345 17345647 17563386
2996 17563386 17810777 17913106 17853027 17888574 17651304 17391565 17155012 16859790 16566932 16276353
2986 16276353 15942101 15854047 15744842 15536911 15427795 15537290 15484328 15455193 15184830 15378992
2976 15378992 15364820 15349466 15500119 15536174 15619146 15644466 15701250 15797917 16036867 16267310 16402654
2965A6402654k5378R1104K24521L01517Q2958J16540K23839J42076K01444M13831
2955A8175106M40330M13271K01557L06502M29257L98362J82229M94497M94651
2946B1535762M27675M69296M68930O66158M94695N27932O56983L40147O92593
2937B6280171Q21563N22260O86002O21002Q26823R14695Q07432Q92728R33427
2928C3306103R43431R36732J075808R49056J213289J055933J023600J099733J223934
2919D2827619J273380J140990J244712J213873J425087J542482J481578J401732
2911E3551453J584231J642584J780936J572650J624658J732797J966010J999394
2903F7454713J998360K081808K168347K188942K296470K232182K446174K613683
$$ plain form
2965 16402654 16377276 16468380 16692901 16994418 17077376 17193916 17417755 17559831 17761275 18175106
2955 18175106 18615436 19028707 19230264 19536766 19966023 20364385 20546614 21041111 21535762
2946 21535762 21963437 22432733 22901663 23567821 24062516 24590448 25247431 25587578 26280171
2937 26280171 27101734 27623994 28309996 28930998 29757821 30672516 31479948 32372676 33306103
2928 33306103 34249534 35186266 36262074 37211130 38424419 39480352 40503952 41603685 42827619
2919 42827619 44100999 45241989 46486701 47700574 49125661 50668143 52149721 53551453
2911 53551453 55135684 56778268 58559204 60131854 61756512 63489309 65455319 67454713
2903 67454713 69453073 71534881 73703228 75892170 78188640 80420822 82866996 85480679
2895H5480679K603203K672366K770355K964522L079039L002265L226876L213417
2887A09012722L157234L366438L327186L329553L373613L400732L489084L410641
2879A35867203L366279L538611L325114L329517L325323L366868L005540L120713
2871A62245168K693996K695920K542604K244108K244065K017673J937337J745549
2863A80366420J462430J269589R14029O29425L08756J25563q4568m95624p03249
2854A83792771j230811j413091j729734j908983k124352k228031k257137k602375
2846A68298257k899377k808238l052702l369137l607004l705270l772557l882689
2838A41201283l789909m044753m032952m071047m168111m082490l959567l734805
$$ plain form
2895 85480679 88083882 90756248 93526603 96491125 99570164 102572429 105799305 109012722
2887 109012722 112169956 115536394 118863580 122193133 125566746 128967478 132456562 135867203
2879 135867203 139233482 142772093 146097207 149426724 152752047 156118915 159124455 162245168
2871 162245168 164939164 167635084 170177688 172421796 174665861 176683534 178620871 180366420
2863 180366420 181828850 183098439 184012468 184641893 184950649 185076212 184991644 184496020 183792771
2854 183792771 182561960 181148869 179419135 177510152 175385800 173157769 170900632 168298257
2846 168298257 165398880 162590642 159537940 156168803 152561799 148856529 145083972 141201283
2838 141201283 137411374 133366621 129333669 125262622 121094511 117012021 113052454 109317649
2830A09317649l917521l839379l716233l685007l664003l472233l432703l354429
2822H0236141l253361l267164l085210k806953k604823k606298k641973k289810
2814E7680549k178383k109857k241132k011695j671080j933423j673245j530734
2806D2331000j667393j250474j238589j316984j156386j058214j265937j036493
2798C2340530r54844q92357o66878q27593r03350q62503p03561n07176n86493
2789B5435775p72398o27715m10292o25818n55667m24100m40535l75717l30828
2780B0872705m06884m46559n22930m65486j98616k62607j76601l32340j32818
2771A7927864k13613k74572k84061k09212l64014j28939J605j83392m01078j80786
$$ plain form
2830 109317649 105400128 101560749 97844516 94159509 90495506 87023273 83590570 80236141
2822 80236141 76982780 73715616 70630406 67823453 65218630 62612332 59970359 57680549
2814 57680549 55502166 53392309 51151177 49139482 47468402 45534979 43861734 42331000
2806 42331000 40663607 39413133 38174544 36857560 35701174 34642960 33377023 32340530
2798 32340530 31385686 30493329 29826451 28998858 28095508 27233005 26529444 26022268 25435775
2789 25435775 24663377 24035662 23625370 22999552 22443885 22019785 21579250 21203533 20872705
2780 20872705 20465821 20019262 19496332 19030846 18832230 18569623 18393022 18060682 17927864
2771 17927864 17714251 17439679 17155618 16946406 16582392 16453453 16455058 16271666 15870588 15689802
2761A5689802k53188j71163l08729j97301m1802j56646j13534j95300j30571o0930
2751A4060638k40190l65287j56452L1576o6992p6577j83055j44482k16062j27225
2741A2515892r2476j8616j91627n1567N0516k40315p2928q4432l378Q226k81460
2730A1537835k05597Q6915Q060j61747j80713m0306r0816j05669N8266p8791l04975
2719A0522462j77514L6415m3512n7627l6611j93253j17812l8181J04496j07301
2709I891562K8939j82635m3481k11351r2785J06858M1122N0159j12837j24613
2699I350938R2695j77457J15007m0565k0217j11210r3297N2815j37772L2571J29960
2688I193468n217l5193J60856J17442k3657j41195n4533L0306P6188l3794l2155
$$ plain form
2761 15689802 15436614 15265451 14956722 14759421 14717619 14560973 14447439 14252139 14121568 14060638
2751 14060638 13820448 13455161 13298709 13330285 13263293 13186716 13003661 12859179 12643117 12515892
2741 12515892 12423416 12404800 12213173 12161606 12212122 11971807 11898879 11814447 11811069 11819295 11537835
2730 11537835 11332238 11419153 11427213 11265466 11084753 11044447 10953631 10847962 10906228 10827437 10522462
2719 10522462 10344948 10381363 10337851 10280224 10243613 10050360 9932548 9894367 9998863 9891562
2709 9891562 9920501 9737866 9694385 9483034 9390249 9497107 9538229 9588388 9475551 9350938
2699 9350938 9443633 9266176 9381183 9340618 9320401 9209191 9115894 9168709 9030937 9063508 9193468
2688 9193468 9188251 9153058 9313914 9431356 9407699 9266504 9211971 9242277 9318465 9284671 9252516
2677I252516J24223J0485L0688J41045R7634j5016o5735Q853N9271J29540j02198
2666I671306m7878J67685M2438J11183J05258p2368J03868m564J63557Q8097m6161
2655A0282421p429J24909J03428j3113J58465L0573J784l5290J57633J18073k9138
2644A0892316J73830L5989p0076L9408J68821P229J52731J44596l0629O1314K54126
2633A1829655J43872J16638Q9093M21954J90067P7857L19955J95542l1794K43708
2623A3596547K93282J84463J99384J31310J68083K09142O8735L56700L66045J63763
2613A5737454J71357Q8389K42048K60589K25120J98446K51327L17211L24162J22470
2603A7938573L05923J62558K06198K01903J78444K56052L62456M44972L14783
$$ plain form
2677 9252516 9376739 9387224 9417912 9558957 9656591 9641575 9575840 9584693 9643964 9773504 9671306
2666 9671306 9623428 9791113 9833551 9944734 10049992 9977624 10081492 10076928 10240485 10328582 10282421
2655 10282421 10274992 10399901 10503329 10490216 10648681 10679254 10681038 10645748 10803381 10921454 10892316
2644 10892316 11066146 11102135 11032059 11071467 11240288 11247517 11400248 11544844 11514215 11575529 11829655
2633 11829655 11973527 12090165 12179258 12601212 12791279 12869136 13189091 13384633 13352839 13596547
2623 13596547 13889829 14074292 14273676 14404986 14573069 14782211 14850946 15207646 15573691 15737454
2613 15737454 15908811 15997200 16239248 16499837 16724957 16923403 17174730 17491941 17816103 17938573
2603 17938573 18244496 18407054 18613252 18815155 18993599 19249651 19612107 20057079 20371862
2594B0371862R7538L41141L69464K97627M42476L75542M59962L70541L19232N27508
2584B3972893O26870O00970M80178N17060M93360O70552O36912P74564Q64664
2575B9638023P69707P54875Q64877R46527J024601J054483J103212R74930J095524
2566C8226759J306829J230626J376141J483869J539869J676983J573698J663833
2558E0078607J934096J795143J825342K072310K055925K059404J990234J975765
2550F5786826J944154J815772K088229J726866J747932J700376J712673J736350
2542H0259178J555049J373852J369920J450151J152070J047048Q11944N81835
2534H9601047Q36201M93251N43938K47216J67487k7936q590J34693J34824J20953
$$ plain form
2594 20371862 20469400 20810541 21180005 21477632 21920108 22295650 22755612 23126153 23445385 23972893
2584 23972893 24599763 25200733 25680911 26197971 26691331 27361883 27998795 28773359 29638023
2575 29638023 30407730 31162605 32027482 32974009 33998610 35053093 36156305 37131235 38226759
2566 38226759 39533588 40764214 42140355 43624224 45164093 46841076 48414774 50078607
2558 50078607 52012703 53807846 55633188 57705498 59761423 61820827 63811061 65786826
2550 65786826 67730980 69546752 71634981 73361847 75109779 76810155 78522828 80259178
2542 80259178 81814227 83188079 84557999 86008150 87160220 88207268 89019212 89601047
2534 89601047 90437248 90930499 91474437 91721653 91889140 91861204 91852614 91987307 92122131 92243084
2524I2243084P6315Q8426K15895P2968K99076N34349M36891M57206O33548Q10479
2514I5868237O75403J047625J304435J512280J695977K070810K250420K459140
2506A08884327K491230K995602L398531L560010L796251M027464M364581M712276
2498A38230272M792272N161415N299574N287128N464205N549292N462967N414769
2490A80661894N152373N166520N089649M926401M749456M583970M291880M170117
2482B18792260L954299L652776L170951K840252K533518J831762J487710R45925
2474B39209453M62859n9763n59335q58564j027563j396738j599418j699917j553010
2465B30918004j774013j730568j792993j671742j435904j551772j452060j299981
$$ plain form
2524 92243084 92319399 92407825 92623720 92696688 92995764 93530113 93967004 94424210 95057758 95868237
2514 95868237 96543640 97591265 98895700 100407980 102103957 104174767 106425187 108884327
2506 108884327 111375557 114371159 117769690 121329700 125125951 129153415 133517996 138230272
2498 138230272 143022544 148183959 153483533 158770661 164234866 169784158 175247125 180661894
2490 180661894 185814267 190980787 196070436 200996837 205746293 210330263 214622143 218792260
2482 218792260 222746559 226399335 229570286 232410538 234944056 236775818 238263528 239209453
2474 239209453 239672312 239612549 239053214 238194650 237167087 235770349 234170931 232471014 230918004
2465 230918004 229143991 227413423 225620430 223948688 222512784 220961012 219508952 218208971
2457B18208971j110996o51777l72564q4995K82023M03124O83696R61612J296561
2448B19615655J383864J554362J751687J961401J833265J955167J874398J971869
2440B33901668J699046J573128J453549J617228J491889J178708P80240N74067
2432B44269523J38934l46820n85476j090949j606100k053001k448399l016564
2424B33261148l326513l472414l792732m221182m224898m240502m449026m485761
2416B01048120m495569m614317m436650m535416m571013m314070m377252m335217
2408A65368616m191556m077128l662654l674810l342927k899538k469834k265967
2400A38784202j836031j555767j138478r03253p69610j03998m6608L0058L53044
$$ plain form
2457 218208971 217097975 216446198 216073634 215988639 216270662 216673786 217357482 218319094 219615655
2448 219615655 220999519 222553881 224305568 226266969 228100234 230055401 231929799 233901668
2440 233901668 235600714 237173842 238627391 240244619 241736508 242915216 243695456 244269523
2432 244269523 244408457 244061637 243476161 242385212 240779112 238726111 236277712 233261148
2424 233261148 229934635 226462221 222669489 218448307 214223409 209982907 205533881 201048120
2416 201048120 196552551 191938234 187501584 182966168 178395155 174081085 169703833 165368616
2408 165368616 161177060 157099932 153437278 149762468 146419541 143520003 141050169 138784202
2400 138784202 136948171 135392404 134253926 133350673 132581063 132477065 132430457 132460515 132813559
2391A32813559N79360O46481N12267P08373P61586P61313P66885O97045O91932
2382A38938801O74413O51760O59502N31985L62206O36698L47886L70056K05196
2373A43378503j30487k09485l31693m50687n79436q94610j158109j055007j062286
2364A37506703j090658j285553j149675r58306r32651j213153j033022q99581
2356A28944104p25331q13125o75248n73091n94189k50491j36293p3586J97869
2347A25300619L86301P43363J064517J311186J482360J978465K459353K823715
2339A37549879L214831L600571M026026M580577M984756N547434N644164O128086
2331A75276324O628320P186596P498543P848569Q581421R365493R724408J0220180
$$ plain form
2391 132813559 133392919 134039400 134551667 135260040 136021626 136782939 137549824 138246869 138938801
2382 138938801 139613214 140264974 140924476 141456461 141818667 142455365 142803251 143173307 143378503
2373 143378503 143248016 143038531 142706838 142256151 141676715 140782105 139623996 138568989 137506703
2364 137506703 136416045 135130492 133980817 133022511 132089860 130876707 129843685 128944104
2356 128944104 128218773 127405648 126730400 126157309 125563120 125312629 125176336 125102750 125300619
2347 125300619 125686920 126430283 127494800 128805986 130288346 132266811 134726164 137549879
2339 137549879 140764710 144365281 148391307 152971884 157956640 163504074 169148238 175276324
2331 175276324 181904644 189091240 196589783 204438352 213019773 222385266 232109674 242329854
2323B42329854J1132035J1759992J2537404J3219010J3743980J3765350J3831206
2316C32318831J3652884J2990879J2366711J1110529R700317Q487938O980703
2309D07608792N321626L762295K426704J069943O2753j106860k104372l001209
2301D14039672m002070n015826o112004p172689q142576r697767j0837621j1852156
2293C51206963j2891958j3528272j4109337j4549654j4464654j4315952j3900606
2286B53446530j3651701j2839415j2171214j1485977j0518751r804383r201333
2279A73773756q325866p681942p013578o658202o003802n700392n275361m591950
2271A22522663m260993m136354l640137l366829l114072k990958k532852k181738
$$ plain form
2323 242329854 253461889 265221881 277759285 290978295 304722275 318487625 332318831
2316 332318831 345971715 358962594 371329305 382439834 392140151 400628089 407608792
2309 407608792 412930418 416692713 419119417 420189360 420252113 419145253 417040881 414039672
2301 414039672 410037602 405021776 398909772 391737083 383594507 373896740 363059119 351206963
2293 351206963 338315005 324786733 310677396 296127742 281663088 267347136 253446530
2286 253446530 239794829 226955414 214784200 203298223 192779472 182975089 173773756
2279 173773756 165447890 157765948 150752370 144094168 138090366 132389974 127114613 122522663
2271 122522663 118261670 114125316 110485179 107118350 104004278 101013320 98480468 96298730
2263I6298730k255452k054905j997999j505964j592041j517156j651484j425366
2255H2298363j330298j365523j003349j187495j224269j166836j198817j266267
2247G2555509j178930j206324j086336j149413j330103j177465j266262j174670
2239F2986006j353286j271922j247855j357190j407926j354940j145325j307455
2231E2540107j543941j551042j336128j394670j467519j389505j440166j446559
2223D0970577j273185j066978j181411j113979r31620j092465q19955q76933q42527
2214C1771524p90256p58660q76257n72697q15061n94321o30054n45671l03362
2205B5885185n65722n97018n64555m89947l02234k93260m74228l09766l12817
$$ plain form
2263 96298730 94043278 91988373 89990374 88484410 86892369 85375213 83723729 82298363
2255 82298363 80968065 79602542 78599193 77411698 76187429 75020593 73821776 72555509
2247 72555509 71376579 70170255 69083919 67934506 66604403 65426938 64160676 62986006
2239 62986006 61632720 60360798 59112943 57755753 56347827 54992887 53847562 52540107
2231 52540107 50996166 49445124 48108996 46714326 45246807 43857302 42417136 40970577
2223 40970577 39697392 38630414 37449003 36335024 35403404 34310939 33490984 32614051 31771524
2214 31771524 30981268 30222608 29346351 28773654 27958593 27364272 26734218 26188547 25885185
2205 25885185 25319463 24722445 24157890 23667943 23365709 23072449 22598221 22288455 21975638
2196B1975638k08071m69358l35023n26667k68504k95560j54458k22396k43821
2187A9251780k22794l95097k34560j81053k00672k4573k31957k95906j75242r6261
2177A7193665k56030j98822k70024q1385j68049j77920l19917l4407k24604j95463
2167A5267044j82863j86189j15057k87137n8374j11870j49638j78577j63613k48593
2157A3585133j34925q0787k17036r9756L2039O6793j27610R459k7180n7981j24300
2146A2823849N1866j79563k64397K52997j20487O0493k8636j2799p6040j95915
2136A2311368k26340k40734k22206j78605j77168j21467j07092k90097k43369
2127A0504290J0453n4833k85641j72517M4694P8275k44181j37338j12692k65866
$$ plain form
2196 21975638 21767567 21298209 20963186 20436519 20168015 19872455 19717997 19495601 19251780
2187 19251780 19028986 18633889 18399329 18218276 18017604 17993031 17761074 17465168 17289926 17193665
2177 17193665 16937635 16738813 16468789 16387404 16219355 16041435 15721518 15687111 15462507 15267044
2167 15267044 15084181 14897992 14782935 14495798 14437424 14325554 14175916 13997339 13833726 13585133
2157 13585133 13450208 13369421 13152385 13052629 13084668 13151461 13023851 13033310 13006130 12948149 12823849
2146 12823849 12875715 12696152 12431755 12684752 12564265 12624758 12596122 12583323 12507283 12311368
2136 12311368 12085028 11844294 11622088 11443483 11266315 11144848 11037756 10747659 10504290
2127 10504290 10514743 10459910 10174269 10001752 10046446 10124721 9880540 9743202 9630510 9364644
2117I364644j65851J4807j07625q3691j49958o0466J7038K4377k89747o8156J03200
2106H598572q1140m0505j35064k14053j28418L0215j61865j66343j25737j75945
2096G399717k83799K5533j27466k66977l1490o1888j42701O3729k15439j1352
2086F347867J4496p5174j38171j1594M0245q005J4991Q8594k45384Q8816J62345
2075F279026K3017o3346P1431J77232N8949j25553l7603j52858j2483k8015j44134
2064F045663l07321k50271j54628P3329j68581k33115j9955n3154j9981j61992
2054D749994m1840k2070j2339j08349J11416o2014j23483o9529j38008M0444K5301
2043D349523L6307L914l6056J20409P1132m7502R1380j49782K3376Q2706O3931
$$ plain form
2117 9364644 9198793 9213600 9105975 9022284 8872326 8811860 8828898 8853275 8563528 8495372 8598572
2106 8598572 8517432 8476927 8341863 8127810 7999392 8029607 7867742 7701399 7575662 7399717
2096 7399717 7115918 7141451 7013985 6747008 6715518 6653630 6510929 6574658 6359219 6347867
2086 6347867 6362363 6287189 6149018 6137424 6177669 6169664 6184655 6273249 6027865 6116681 6279026
2075 6279026 6302043 6238697 6310128 6487360 6546309 6420756 6383153 6230295 6217812 6189797 6045663
2064 6045663 5738342 5488071 5333443 5406772 5238191 5005076 4985121 4931967 4911986 4749994
2054 4749994 4708154 4686084 4673745 4565396 4676812 4614798 4491315 4421786 4283778 4324222 4349523
2043 4349523 4385830 4389744 4353688 4474097 4545229 4497727 4589107 4439325 4462701 4545407 4609338
2032D609338Q986o7826p765j909j88139k48760q1329P4239K07358m5432k984j8040
2020D237737L962n5144J83743j28496Q822O1075O9076J09503N6008q3182m2224
2009D420880P1126m8335N3817J73729J03184j3332n2969m9318o8378J62270o9505
1998D683169Q4183Q8645p1465O6690l5219j38439k73123q3770O6939q2803j8681
1987D286126j94871q9831o5794j03753Q7485p2240k26544j85081J229J12181k18302
1976C330605m3463j6828k02619p0881J2545j89816q8661j04517K17285j58715
1966B684935j64941J23355M9741p6553M8069j9088q817K8518L4485j08989o4875
1955B525840j79528l0571J0604q371k21899k5440K04572l8618r1194p4568j3412
$$ plain form
2032 4609338 4618324 4550498 4542733 4540824 4352685 4103925 4022596 4096835 4304193 4258761 4255777 4237737
2020 4237737 4241699 4186555 4370298 4241802 4250624 4311699 4380775 4490278 4546286 4463104 4420880
2009 4420880 4492006 4443671 4497488 4671217 4774401 4761069 4708100 4658782 4590404 4752674 4683169
1998 4683169 4767352 4855997 4784532 4851222 4816003 4677564 4404441 4320671 4387610 4304807 4286126
1987 4286126 4091255 4001424 3935630 3831877 3919362 3847122 3620578 3435497 3436726 3548907 3330605
1976 3330605 3287142 3270314 3067695 2996814 3009359 2819543 2730882 2626365 2843650 2684935
1966 2684935 2519994 2643349 2693090 2616537 2664606 2645518 2636701 2665219 2699704 2590715 2525840
1955 2525840 2346312 2315741 2326345 2317974 2096075 2070635 2275207 2236589 2145395 2070827 2057415
1944B057415K1667J12011n5113M6736j44002M5417O1324o9034k5172P416r0532
1933A968133J22021o5049l08m8282J25701o8736r94p1754N8513P819J14849k28159
1921A913754j30434O8269J02922p2731O2614r5989j97823R780J61576o4441N8843
1910A816340k5849o1385J15953q6951l1880o9194J35311J15555p1807o9790o5262
1899A701041j78870J25723P2823M6154O6847O7524n362j1680R1428j69110R2466
1888A898984K7464j19625Q612j80984L5045j8922p4286J93977N5886k7340j12996
1877A685815k07089R7812P0015L2940J1641l3645j03794N2716n6194j8677j83725
1866A347815J24878O6893j55407J38387p2747J56468N9636j61893L7119k63203
$$ plain form
1944 2057415 2079082 2191093 2135980 2182716 2038714 2084131 2145455 2076421 2051249 2058665 1968133
1933 1968133 2090154 2025105 2024797 1976515 2102216 2033480 2032486 1960732 2019245 2027064 2141913 1913754
1921 1913754 1783320 1851589 1954511 1881780 1944394 1848405 1650582 1660362 1821938 1757497 1816340
1910 1816340 1790491 1729106 1845059 1758108 1726228 1657034 1792345 1907900 1836093 1766303 1701041
1899 1701041 1522171 1647894 1720717 1766871 1833718 1901242 1895880 1884200 1975628 1806518 1898984
1888 1898984 1926448 1806823 1815435 1634451 1669496 1650574 1576288 1770265 1826151 1798811 1685815
1877 1685815 1478726 1576538 1646553 1679493 1691134 1657489 1553695 1606411 1550217 1531540 1347815
1866 1347815 1472693 1539586 1384179 1522566 1449819 1606287 1665923 1504030 1541149 1277946
1856A277946l9613L04649J22506k1608N1465J64623n6864j32382J241L4182l990
1845A702155j61651Q971o826m618k5953P7499l5593r2039j51576k8265P3004P5096
1833A430204K1042j62236R0500p4314N1288j28258l0394J85951J23156q8557m7530
1822A370852n9517n4855J52737K6840k8061J7967j48764Q1461J07833K2541j31579
1811A357455O5649q6607p5084J01000q5532J95306k7970j48169r4336k0736o8710
1800A112266Q3688l111L7517J10146k1204j6287J99956K6057j3796j1752k21798
1789A281682j9511J94612n5507k13070k9120K80492M0760J25591P1563j07079
1779A570413j09175j21021J02926Q1237m2524j04061k25443J29974Q5501l3167
$$ plain form
1856 1277946 1238333 1542982 1665488 1643880 1695345 1859968 1803104 1670722 1671963 1706145 1702155
1845 1702155 1540504 1549475 1542649 1538031 1512078 1589577 1553984 1461945 1310369 1282104 1355108 1430204
1833 1430204 1451246 1289010 1379510 1305196 1356484 1228226 1197832 1383783 1506939 1418382 1370852
1822 1370852 1311335 1256480 1409217 1436057 1407996 1425963 1277199 1358660 1466493 1489034 1357455
1811 1357455 1423104 1336497 1261413 1362413 1276881 1472187 1444217 1296048 1201712 1180976 1112266
1800 1112266 1195954 1192843 1230360 1340506 1319302 1303015 1502971 1529028 1515232 1503480 1281682
1789 1281682 1262171 1456783 1401276 1188206 1159086 1439578 1480338 1605929 1677492 1570413
1779 1570413 1461238 1340217 1443143 1524380 1481856 1377795 1152352 1282326 1367827 1334660
1769A334660J66459o2055j18906j12870j99763J4687Q9347P0000J02741J2343
1759A296643J16341n131o1915n3726J59809j54163j51947K839N2115N9251m0750
1748A219366n3468J52085j04150P798M7657j5143p199q8725R5051L3675P6089
1737A363036j0412k08594l28365Q051J47907Q9377k2988P9091k36917O4362R4807
1726A039355o1916J33662j08188P5242k43641K898M0938j10543O3210Q7497M129
1715I22643J13709J1982j16951L6029n4310L3415k1851n1202j13528j601L0855
1704G89190r3726n6098J03818JJ7476n4387N4305M9504J3099o6842j46515J47549
1692G57374L6841N2139n1390o7726k7387o1290k3016j85519M4097K30642j03604
$$ plain form
1769 1334660 1501119 1439064 1320158 1207288 1007525 1022212 1111559 1181559 1284300 1296643
1759 1296643 1412984 1407853 1345938 1292212 1452021 1297858 1145911 1148750 1200865 1260116 1219366
1748 1219366 1165898 1317983 1213833 1221631 1269288 1254145 1246946 1158221 1253272 1286947 1363036
1737 1363036 1352624 1144030 815665 823716 971623 1061000 1038012 1117103 880186 944548 1039355
1726 1039355 977439 1111101 1002913 1078155 834514 837412 878350 767807 831017 918514 922643
1715 922643 1036352 1048334 931383 967412 913102 946517 924666 873464 759936 758335 789190
1704 789190 695464 639366 743184 743185 760661 706274 760579 810083 823182 756340 609825 757374
1692 757374 794215 846354 794964 727238 699851 638561 615545 430026 474123 704765 601161
1681F01161J03630M4321k2448k60J04927r4619q7049Q7821j23492o1130M8197
1670F01059o019j21880J1911P4393M8830J9322O9980j93438l0518P7473J37193
1659F88306k0956j45631N2423M3482j22504M52M8387L9367M8459j71091l1113
1648D29581M0762p9084N3030o5151L4353R1201o5520q8902n9209K2962K11606
1637E25629Q4265n0779K8862j29839K4745r1911O1309k0666L5734K8107j02074
1626C93382j1527J6837J54312r5025O5808K4529m9089o8243N7068O7532j01016
1615D54568j9889O5465O875j33869J46888O5507m1181j88509N6703J34524p3230
1604D73852j95686L1212J86670P4089j90594o1414R8625M0270j43570K9166N5225
$$ plain form
1681 601161 704791 749112 726664 726404 831331 736712 649663 737484 613992 552862 601059
1670 601059 595040 473160 485071 559464 608294 627616 697596 504158 473640 551113 688306
1659 688306 667350 521719 574142 617624 495120 495572 543959 583326 631785 460694 429581
1648 429581 470343 391259 444289 379138 413491 504692 439172 350270 291061 314023 525629
1637 525629 609894 559115 587977 458138 482883 390972 452281 431615 467349 495456 393382
1626 393382 381855 398692 553004 457979 523787 548316 499227 430984 488052 555584 454568
1615 454568 434679 500144 507019 373150 520038 585545 544364 355855 412558 547082 473852
1604 473852 278166 309378 496048 570137 379543 318129 416754 457024 313454 342620 397845
1593C97845k4039J9207N7939k067j59329j66113O4842J32388j9609R873l9579
1582B71358O9415k4488n0029q4721J64596j32841K5148K4740J1084N7169m6332
1571B85099j4813J29238K5426M2229O6840j96100j28792J01423M6855P8624r1171
1560C44858l7378J11677M1123O3922m8588n1335j08408l6842q0859p2927k1478
1549A03765J11953J16658K2405k2765k01199N4446K57226j35716Q3004m9684j97450
1538A42643j7358Q171R3308J02992j5721j59000m8687J38000J16533J6901j90490
1527A87292l2477Q1776P4594R1790k2738J2034M659m1076J6515j81628k36256
1516d5515R7507J06540K8271Q7470M2389J7395j20334J680N3604J31686l2966
$$ plain form
1593 397845 373806 393013 450952 448885 289556 123443 188285 320673 301064 310937 271358
1582 271358 340773 316285 266256 181535 346131 213290 238438 263178 274262 331431 285099
1571 285099 270286 399524 424950 467179 534019 337919 209127 310550 357405 436029 344858
1560 344858 307480 419157 460280 524202 475614 424279 315871 279029 198170 125243 103765
1549 103765 215718 332376 354781 332016 130817 185263 442489 306773 389777 340093 142643
1538 142643 125285 133456 226764 329756 314035 155035 106348 244348 360881 377782 187292
1527 187292 154815 236591 311185 402975 380237 392271 396930 355854 372369 190741 -45515
1516 -45515 51992 158532 186803 274273 316662 334057 213723 215403 269007 400693 367727
1505C67727J4520K9520p5460r3020O6589K1164l3932Q0155q6489Q5140L8182m7184
1493C66912l5662l7948j77090J8198J02932R5979J21053O5551J4281O164j28029
1482D12341M0926j5427o2937n2924l7853q3425M8348m471j05430o692P681J01379
1470B41516R4972N4370q6542Q3023l7036k63341q9167K17017m8186L5396J10239
1459C12261j01859n7810L3410M4109R2324k883j83596j33170J29478J57125K502
1448B91891K5222j00643J28374n0647j03157j10824J14675j958j32789j33588
1438g3444J58679J05069p0957j65830r7090K06642K03629O2663j68407o8811P3387
1427A65530J56739j16415m9674O5217j46812j5191K69314o8073r3704j18636J30249
$$ plain form
1505 367727 382247 411767 336307 243287 309876 331040 297108 377263 290774 375914 414096 366912
1493 366912 331250 293302 116212 134410 237342 333321 454374 519925 534206 540370 412341
1482 412341 453267 437840 374903 321979 284126 200701 249049 244578 139148 132456 140137 241516
1470 241516 336488 390858 304316 387339 350303 86962 -2205 214812 166626 202022 312261
1459 312261 210402 152592 186002 230111 322435 319552 135956 2786 132264 289389 291891
1448 291891 317113 216470 344844 294197 191040 80216 194891 192933 60144 -73444
1438 -73444 85235 190304 119347 -46483 -143573 63069 266698 329361 160954 92143 165530
1427 165530 322269 205854 156180 221397 74585 59394 328708 260635 166931 48295 178544
1416A78544J74545q2734j7009K8196O4224k7617L1145k2290N2860q9096j54924
1405A35844m4028J61360K77187q3186j59286j30791J86835N9120m5814l2589j37100
1394A87552l5516p4704Q9966n3967Q7481P2002K7444p8361K5563P6844p2559m7521
1382B04224j66497P3559q2484m2020r4724O1312l4031J5028J74832P5086P1312
1371B55597m2143J00617j9290j32102j09592P2957R4611j31450n1744k4502m2497
1360b9538j04584M2858O7135M348o57J00545J65842q2085J9412p6483r1498P2728
1348H8023r901J40319j33612J3956R9285o355J01231m8556p0197K5949J51497
1337C51639l0466r9727J0819o9883K5863j16401O9113O9599j55460l7413N5595
$$ plain form
1416 178544 353089 270355 253346 281542 345766 318149 349294 327004 379864 290768 135844
1405 135844 91816 253176 530363 447177 287891 157100 343935 403055 357241 324652 187552
1394 187552 152036 77332 167298 113331 200812 272814 300258 221897 247460 324304 251745 204224
1382 204224 37727 111286 28802 -13218 -107942 -46630 -80661 -65633 109199 184285 255597
1371 255597 213454 314071 294781 162679 53087 126044 220655 89205 37461 12959 -29538
1360 -29538 -134122 -91264 -24129 -19781 -20438 80107 245949 163864 183276 106793 15295 88023
1348 88023 78122 218441 84829 98785 198070 191715 292946 244390 174193 200142 351639
1337 351639 321173 221446 232265 162382 188245 71844 140957 210556 55096 17683 73278
1326G3278J01925m8757k35622J8334R2783k5642O6546L7616J15j27521q2924J18343
1314a1526R8617j03393j78751m3155J14018O3100j77629P9409O4684j27584N4331
1303a67879K26001j31842k05106N0824M1264Q1942k7276J60672L7983M0095j58994
1292e2316p62J40026k5017q9881J61862O2409p5140n7014M9727J17995j2594L8390
1280B57685j29367k02866P5112O3611M7577J12471K7826k13285J01476P6943J3594
1269B30777o7127o1618J36342j46376j35861r6924O9697n0507o1426J83238M0550
1258D0765r597O1562j00074j8748O8130m4304J6887K4949j41201Q174M1602N6314
1246D459l7526K3888M4336n638J8586N2457k9894j74069N5263L4857J26740N1099
$$ plain form
1326 73278 175203 126446 -109176 -90842 1941 -23701 42845 80461 80576 -46945 -129869 -11526
1314 -11526 87091 -16302 -195053 -238208 -124190 -61090 -238719 -159310 -94626 -222210 -167879
1303 -167879 58122 -73720 -278826 -228002 -186738 -104796 -132072 28600 66583 106678 -52316
1292 -52316 -53078 86948 61931 -27950 133912 196321 121181 64167 113894 231889 219295 257685
1280 257685 128318 -74548 564 64175 111752 224223 252049 38764 140240 217183 230777
1269 230777 163650 102032 238374 91998 -43863 -140787 -71090 -121597 -183023 215 40765
1258 40765 31168 92730 -7344 -26092 42038 -2266 14621 39570 -101631 -93457 -51855 4459
1246 4459 -33067 -9179 35157 29519 48105 100562 70668 -103401 -48138 -13281 113459 164558
1234A64558q3425n4640j0013J31254M2923j11936m3361p6160J39654J01403J61255
1223C61512k04332r408J97871L4600j17273j70720L2121J17600m2130j79762p4479
1212e4400j5129R1784J38999n3534j39387J9792j02849p0615J24349j0325j4288
1201h5603j6323N958R4529L8415k9375q6858R9020k9878j12617R4241J17722j04235
1189a5004J20937r388J11523j46746M5169l2559m8832P4728J60316L4326j20525
1178A73945k75918J21972J79465o9129j21581M7999j28218j27247J73419J38044
1168A12751O7188r6886j55164j0384J05479n4717Q1817m1761O7016k663N2811
1157A25487q619j96321n191O6271n9411r3940K9333M6262j1127n1111J19626M5902
$$ plain form
1234 164558 81133 26493 16480 147734 190657 78721 35360 -40800 98854 200257 361512
1223 361512 157180 147772 345643 380243 262970 92250 124371 241971 199841 20079 -54400
1212 -54400 -69529 22255 161254 107720 -31667 -11875 -114724 -185339 -60990 -71315 -85603
1201 -85603 -101926 -95968 -1439 36976 7601 -79257 19763 -10115 -122732 -28491 89231 -15004
1189 -15004 105933 96545 208068 61322 106491 73932 25100 99828 260144 294470 173945
1178 173945 -101973 19999 199464 130335 8754 56753 -71465 -198712 -25293 112751
1168 112751 179939 83053 -72111 -82495 22984 -31733 50084 8323 75339 72676 125487
1157 125487 116868 -79453 -84644 -18373 -77784 -171724 -142391 -96129 -107256 -158367 -38741 7161
1145G161p2492J69977n7164n8838P6841J13140j29325N5028M3561q0696j04874
1134c7681O7265o1500J9177O6476M5892K4185n9186N2444M4183q0928n436N5544
1122A30435m4506P9717L9540p365M546J04397n4847j00177P4403K5767L0074N300
1110B87284r5121l6996K0020j6007l3894P9956J38377j6698r8753j01271j77867
1099e0970q4232P5477J02751Q8190J16534l02341J5720P0207N7870n3419j11363
1088g5576J05478J30341p5460j01060N8527o9375R1281p178N5663L2370q7237
1077E7774j1213M3950R2554o7294n911N8063O4814m3070l7269K4565O3589p7l0508
1064B09967M962r9110M789L0481J91108Q9311j26787j27350l6817J41923l212
$$ plain form
1145 7161 -65331 104646 47482 -11356 65485 178625 49300 104328 147889 67193 -37681
1134 -37681 29584 -31916 -12739 53737 99629 123814 64628 117072 161255 80327 74891 130435
1122 130435 85929 165646 205186 197821 202367 306764 251917 151740 226143 251910 281984 287284
1110 287284 192163 155167 175187 159180 125286 205242 343619 326921 228168 126897 -50970
1099 -50970 -135202 -59725 43026 131216 247750 -54591 -38871 31336 89206 35787 -75576
1088 -75576 29902 160243 84783 -16277 42250 -27125 64156 56978 112641 145011 57774
1077 57774 46561 90511 183065 115771 109860 167923 232737 189667 152398 176963 240552 240475 209967
1064 209967 214929 115819 120608 151089 342197 431508 304721 177371 140554 282477 279265
1053B79265k35523o1640R1806K66185m7732O9052o4530o5449K541o6899M0637
1042B07713J38275j01059j64924p790J88245J08936O5010K3176j79271o9195J2
1031B09128J07021p1499P9870K3255J37103M1478j29014N7802J00066M2008L375
1020F00593N322J57365j22212L0953O785N9993J69924P74l0037r1989J08318m0444
1008H55345p5761J45105J27380J88132R4294n5568p3697m5290J21473P6104R6879
997A454396l1911j3577K6854p0967k00796L0491M7125J98561o6342R6798K1680
986A492312J4624K6895n0152j7763K39749L7031j26926J00589o2540J35214J45104
975A934137J01786J65049L5523Q8112R7720N7810K13810J4616o0324K59672K27945
$$ plain form
1053 279265 43742 -17898 73908 340093 292361 361413 296883 231434 233975 167076 207713
1042 207713 345988 244929 80005 72215 260460 369396 434406 457582 278311 209116 209128
1031 209128 316149 244650 324520 347775 484878 526356 397342 455144 555210 597218 600593
1020 600593 605915 763280 641068 672021 678806 738799 908723 909497 879460 787471 895789 855345
1008 855345 779584 924689 1052069 1240201 1334495 1278927 1205230 1159940 1281413 1357517 1454396
997 1454396 1422485 1408908 1435762 1364795 1163999 1194490 1241615 1440176 1373834 1470632 1492312
986 1492312 1506936 1533831 1483679 1465916 1705665 1742696 1615770 1716359 1653819 1789033 1934137
975 1934137 2035923 2200972 2236495 2324607 2422327 2480137 2693947 2708563 2648239 2907911 3135856
964C135856J5100J51095K91251K34818q136J24612J63743J95449J26199L82160
954D812147K45036L30244M38836M26276L95356N04768M91977N94374P02075P68581
944I709670P81272P31711N49235J055620J366987J501628J778418K229485K940335
935B2644361L931909M179368M687175L714428J627801k05743R0000J70434l979432
926C6860301o336289n469861l710421k654982k194586j770165j383704j015128
918A2325165r41474q04260o66126o99340l58093n66101n68504n90822n58822m91006
908F080617m02057j97265l90753l75703j05315k91213j60126j44251j35028j59270
898C719636j62806l0439p9913m0478k79045k46384p9357j60019j74879j16307
$$ plain form
964 3135856 3150956 3302051 3593302 3828120 3819984 3944596 4108339 4303788 4429987 4812147
954 4812147 5057183 5387427 5826263 6252539 6647895 7152663 7644640 8239014 8941089 9709670
944 9709670 10490942 11222653 11771888 12827508 14194495 15696123 17474541 19704026 22644361
935 22644361 26576270 30755638 35442813 39157241 40785042 40579299 40669299 40839733 36860301
926 36860301 30524012 25054151 21343730 18688748 16494162 14723997 13340293 12325165
918 12325165 11383691 10579431 9913305 9213965 8855872 8289771 7721267 7130445 6571623 6080617
908 6080617 5678560 5481295 5090542 4714839 4609524 4318311 4158185 4013934 3878906 3719636
898 3719636 3556830 3526391 3446478 3406000 3126955 2880571 2801214 2641195 2466316 2350009
888B350009k3374r7430j25481j16948p4640j03409O1009J01007j76763k52760
878A541220R912N7369p2003q5826p2702l7537J47746j13618j43340p8363p8836
867A074022N8279p2464j6215L037M4145j08170J1204r9499L4048R0874J45572
856A164833m200k63782m6616J0310J5310R1922P8367k3504k54964n4877m8128
845F64671N4548J85706k13218o8994q1466j07515r2453N3870m8195n3486Q7321
834C80789J3711j56321M6465n3808J37676J41089j62178o7974R3566J25034n4494
823D43555K9263J3119k0137K8384m0711o267N5589m8123p1758j0032j71733j76230
811B4919J96332R8192J7920J6907n0940m0515J25834o4403n3101p4737l9923K5066
$$ plain form
888 2350009 2326635 2229205 2103724 1986776 1912136 1808727 1869736 1970743 1793980 1541220
878 1541220 1551132 1608501 1536498 1450672 1377970 1340433 1488179 1374561 1231221 1152858 1074022
867 1074022 1132301 1059837 1043622 1046659 1090804 982634 993838 894339 928387 1019261 1164833
856 1164833 1160633 896851 850235 860545 875855 967777 1046144 1022640 767676 712799 664671
845 664671 719219 904925 691707 622713 541247 433732 341279 395149 346954 293468 380789
834 380789 394500 238179 284644 230836 368512 509601 347423 279449 373015 498049 443555
823 443555 472818 485937 465800 494184 453473 447206 502795 454672 382914 372882 201149 24919
811 24919 221251 319443 337363 354270 303330 262815 388649 324246 271145 196408 156485 181551
799A81551k475K1652p4596J07420K89Q5824r971p2701n9798R089q7442j5563M554
786H7833L4486R5534P7192L223j0244N1905j2949J8375j38168l0431r7572l6421
774D2763M189l2651n3554Q3111k0593J5778J5712n2120j44781j00320O5267L0423
762a46776Q4560J68471r7127l3472J05292N56O3615q791L7979N2273p1519q2236
750G2825j9760j36218O6087J53246L6088m0547M6961o7671m5540q3706p9083N0038
738d7280q1771J40326k7224m661N4319j12157j9582r433M1994j903J34753l4444
726C2937r8460K20343j13841j83774J4756k6017P5043o2389k6104J27414n3697
715i3789j61812j4731J48700J67442K1487K7820k8502q1528K8160n996k10455
$$ plain form
799 181551 179076 200728 126132 233552 233841 319665 309694 236993 177195 186284 98842 83279 87833
786 87833 122319 217853 295045 298268 288024 339929 326980 345355 207187 176756 79184 42763
774 42763 46952 14301 -39253 43858 23265 39043 54755 2635 -142146 -242466 -177199 -146776
762 -146776 -62216 106255 9128 -24344 80948 81504 145119 136328 174307 226580 155061 72825
750 72825 53065 -83153 -17066 136180 172268 131721 178682 111011 65471 -18235 -97318 -47280
738 -47280 -129051 11275 -15949 -20610 33709 -78448 -98030 -107463 -65469 -67372 67381 32937
726 32937 -65523 154820 40979 -142795 -128039 -154056 -79013 -141402 -167506 -40092 -93789
715 -93789 -255601 -270332 -121632 45810 67297 95117 66615 -14913 13247 7251 -203204
704b03204M5611J83740P1375j09545K8056m2542j1140j10231q6136J2376k3525
693b45165J89844r3642L7265J157r4817L2691K8233o2119p6776M5454j8306L2081
681b24100J69584j28813M3348L8888L713q6746P3870k718l1259J708l2298L8881
669a35942m3446j11757R8675p9654N7793M4660k2752n8849j05261L36494j06706
658a26745n5964J87667m3280j6484m3579n1062O631L3364Q0202R264k5676J7582
646b8080p128m4543Q3418r5315j45247J47563J68146J1235o4278q3172N3629M2399
634C8627r8535K05m2376o110J25415o3772j5233L4985j22928Q97L3782k3081m847
621a42971n7969J61780l400k9528l5286N6786K6560j90912r9518m0930J21218
$$ plain form
704 -203204 -157593 26147 97522 -12023 16033 -26509 -37649 -147880 -234016 -221640 -245165
693 -245165 -55321 -148963 -111698 -110541 -205358 -172667 -144434 -206553 -283329 -237875 -256181 -224100
681 -224100 -54516 -183329 -139981 -101093 -97380 -184126 -110256 -112974 -144233 -142525 -174823 -135942
669 -135942 -179388 -291145 -192470 -272124 -214331 -169671 -192423 -251272 -356533 -20039 -126745
658 -126745 -182709 4958 -38322 -54806 -98385 -149447 -142816 -109452 -29250 -19986 -45662 -28080
646 -28080 -35208 -79751 3667 -91648 -236895 -89332 78814 90049 25771 -57401 -3772 38627
634 38627 -59908 -59703 -102079 -108189 17226 -46546 -61779 -26794 -149722 -148825 -115043 -138124 -142971
621 -142971 -200940 -39160 -42560 -72088 -107374 -50588 -24028 -214940 -314458 -355388 -234170
610b34170J10880p404p0874O2113J09524j16753Q5683R6570J01915j01476N2282
599H8290R525Q0298R7868m7373o2991j56864r9832j88190R6654J25773L9049j17489
587a35282O4262r1005p9164J80753j29102M3991l5955j72950J86428j86814l8432
576c93270o3148l7680J60646j18862J71708N1028O3645o8095j03340K6110J47193
565a64065M4194K2033p0397p866J06038j7059j3873m1576k5496l5736K19o4553
553b68137j01358L4784J72554q986j45324n3532j76635P6005K24461M7905l6804
542b35067K8640k4767o6923K5714O1202N2772j94224J53834J65034k4934R4696
531C5977K5649q1878r8640M0883p781j04688J01007l4603r2205N7807p9186j89314
$$ plain form
610 -234170 -123290 -130694 -201568 -139455 -29931 -146684 -61001 35569 137484 36008 88290
599 88290 97815 178113 275981 228608 165617 8753 -91079 -279269 -182615 -56842 -17793 -135282
587 -135282 -71020 -162025 -241189 -60436 -189538 -145547 -181502 -354452 -168024 -354838 -393270
576 -393270 -456418 -494098 -333452 -452314 -280606 -229578 -165933 -234028 -337368 -311258 -164065
565 -164065 -119871 -97838 -168235 -176101 -70063 -87122 -100995 -142571 -168067 -203803 -203584 -268137
553 -268137 -369495 -334711 -162157 -171143 -316467 -369999 -546634 -470629 -246168 -198263 -235067
542 -235067 -206427 -231194 -298117 -272403 -211201 -158429 -352653 -198819 -33785 -58719 35977
531 35977 61626 -20252 -118892 -78009 -85790 -190478 -89471 -124074 -216279 -158472 -237658 -426972
519d26972Q1677N6225m1698j73851L722J19048J42278L8346o4913k15543j21478
508f03159J11667J53384R8070p3167j02344L3972R3527O8726j41555k8991Q5967
497c03903n6840J79988J30518j21425m6943J45871k6608O721J25524j35164p92
486a03053l3410p2144Q4428k2601J83475j38232q4016J30257j86219j6438J74964
475h2989j2028L5278Q229o8107o2194q5267N0187O3632j6890k3537J39087j16068
463a70667r7557K5913M5997J08542m5838m2512Q2731J29877j42609j56235q1577
452c43935J00155K8295J4076o776m6873J31636j87976p5128o001J60249l0937
441b63215o8205J06103j24085J25728M7054O0572O6581j27886j83294R7463j25267
$$ plain form
519 -426972 -345295 -289070 -330768 -504619 -500897 -381849 -239571 -201225 -266138 -481681 -603159
508 -603159 -491492 -338108 -240038 -313205 -415549 -381577 -288050 -219324 -360879 -389870 -303903
497 -303903 -360743 -180755 -50237 -171662 -218605 -72734 -99342 -92621 32903 -102261 -103053
486 -103053 -136463 -208607 -124179 -146780 36695 -101537 -185553 -55296 -241515 -257953 -82989
475 -82989 -95017 -59739 -51510 -119617 -181811 -267078 -216891 -153259 -170149 -193686 -54599 -170667
463 -170667 -268224 -242311 -196314 -87772 -133610 -176122 -93391 36486 -106123 -262358 -343935
452 -343935 -243780 -215485 -201409 -208185 -255058 -123422 -311398 -386526 -392527 -232278 -263215
441 -263215 -331420 -225317 -349402 -223674 -176620 -116048 -49467 -177353 -360647 -263184 -388451
430c88451J4172K66323m3878l5398l5005j6640J11757K172n6275M75n2522j4476
418b47746L0437l551m2318M5571O7437r179j02415k66066J91997J29482j0183
407b16534O673k62163l3374J42606N8433k822J12643l4764o6121J25477m9977
396b19923j01995o7699L5266K4523J67255J44867j19352j02746l4240P1152K39733
385C6841r8837j66797Q4672J5635J06047j40412R4345o4174k9289J38220k1627
374d5376j75635j36188J36214J65972j88553j12733k78925R2954J01118N36L2086
363d08530K8810O7957r7053O130p8931P9848J07039j53884l7183R858L4462L3791
351d07686r6027Q6625K7551R2142r7714J7105R496K42467K8240K9397j43973L3636
$$ plain form
430 -388451 -374279 -107956 -151834 -187232 -222237 -238877 -127120 -124948 -181223 -180748 -233270 -247746
418 -247746 -217309 -220860 -263178 -217607 -150170 -159349 -261764 -527830 -335833 -206351 -216534
407 -216534 -209861 -472024 -505398 -362792 -304359 -307181 -194538 -229302 -295423 -169946 -219923
396 -219923 -321918 -389617 -354351 -329828 -162573 -17706 -137058 -239804 -274044 -202892 36841
385 36841 -61996 -228793 -144121 -128486 -22439 -162851 -68506 -132680 -161969 -23749 -45376
374 -45376 -221011 -357199 -220985 -55013 -243566 -356299 -635224 -542270 -441152 -440616 -408530
363 -408530 -379720 -311763 -408816 -402686 -481617 -401769 -294730 -448614 -485797 -475939 -441477 -407686
351 -407686 -503713 -417088 -389537 -297395 -395109 -378004 -368508 -126041 -97801 -68404 -212377 -178741
339a78741J65098j1611j49118J1918J1742o6749o4639O931O7769K6774K702j69672
327c47596N4693p3903r7962o0441P3220R0023n3588Q8991j68012J15225L14797
316f4553o7934j8021p2066L261l7876K7265j6540j9689J9667j2287K9948m310
304b33135n7052r0836K2777K4730l5909K8238r5229J04556m2108j48292N8303
293d63957j11943J38181J06998P717J72458p8406j66089j33753J29165M5102m6181
282d00708k8220J2092j6520K2800o8042J40851j6989j3017Q8519P8822l9540J83605
270e6347j23779j56015J40581q7421q857m7110K8593J9413j15429p5355K7452
259d54274j20667P870K3805p9810L1576J12284M3465N7057j04302J08574q4310
$$ plain form
339 -178741 -13643 -25254 -174372 -162454 -150712 -217461 -282100 -275169 -207400 -180626 -177924 -347596
327 -347596 -292903 -366806 -464768 -525209 -451989 -361966 -415554 -326563 -494575 -379350 -64553
316 -64553 -132487 -150508 -222574 -219313 -257189 -229924 -246464 -266153 -246486 -258773 -228825 -233135
304 -233135 -290187 -381023 -358246 -333516 -369425 -341187 -436416 -331860 -373968 -522260 -463957
293 -463957 -575900 -437719 -330721 -323004 -150546 -228952 -395041 -528794 -399629 -354527 -400708
282 -400708 -428928 -416836 -433356 -410556 -478598 -337747 -354736 -367753 -279234 -200412 -239952 -56347
270 -56347 -180126 -336141 -195560 -282981 -291838 -338948 -310355 -290942 -406371 -481726 -454274
259 -454274 -574941 -567071 -543266 -623076 -591500 -479216 -435751 -378694 -482996 -374422 -458732
248d58732K8816J3957O4793l5262m6289J60138N4870j82627o3447Q9251k5307
237c99839j6719n3947p528K08835n7048J41551n4493k9126O6910k17812M6482
226c72734R0619M1044K5809j50805r0105O1361Q5958K5473m9209q743l6201j58580
214e36113M3016k8218j04925L8940J27204Q6840m9550J83004j2352j03894K1840
203c34208M4320o1585k5724R6300l4648j92774Q7167J26434k2646j40695R7916
192c60143K4590j45182j25357K21287L6458j29055j10862K4520K8217J32772j10256
181e13011L1190j06808l3530J03627J72164J12678k36948k12081M7476j5319J98647
170d51915K9568k2060J49256l7932k6578r04N2366M817r4049p1915K27327r5687
$$ plain form
248 -458732 -429916 -415959 -351166 -386428 -432717 -272579 -217709 -400336 -463783 -374532 -399839
237 -399839 -416558 -470505 -478033 -269198 -326246 -184695 -239188 -268314 -201404 -419216 -372734
226 -372734 -282115 -241071 -215262 -366067 -456172 -394811 -308853 -283380 -332589 -341332 -377533 -536113
214 -536113 -493097 -521315 -626240 -587300 -460096 -373256 -422806 -239802 -252154 -356048 -334208
203 -334208 -289888 -351473 -377197 -280897 -315545 -508319 -421152 -294718 -317364 -458059 -360143
192 -360143 -335553 -480735 -606092 -384805 -348347 -477402 -588264 -563744 -535527 -402755 -513011
181 -513011 -481821 -588629 -622159 -518532 -346368 -233690 -470638 -682719 -635243 -650562 -451915
170 -451915 -422347 -444407 -295151 -333083 -359661 -360565 -308199 -303382 -397431 -469346 -242019 -337706
158c37706M953o2669r2248K6943J3893J541N459l9099j96401k6253j1584J06879
146f06292J6081m9475J96823p7975J5442o8563o2146l6874K05391m9701Q4859
135d32430j8813o2127L3445o6224K4810o7943l7360J36170J1060j7083q2530K08568
123c70457K4653l7007j45739Q7796Q5236r2211J90893j38601R22j5482J5808J2097
111c82092l1638k1470m2278j44619R9354O5943O0892n8318M5081J29074r0168
100c70239j22766K3192k754k0966K8599n3167j3942l5487J43566j03575L3577
89d93962J2016J01262o8718j34094J4362k901J04353m9784j00228l9962R1540
78e66116q864J19450o6145o9902P466k1573Q9587J8539j19468O3636L2748M3159
$$ plain form
158 -337706 -332753 -395422 -487670 -460727 -446834 -445293 -439834 -478933 -675334 -701587 -713171 -606292
146 -606292 -590211 -639686 -442863 -520838 -505396 -573959 -636105 -672979 -467588 -517289 -432430
135 -432430 -451243 -513370 -479925 -546149 -521339 -589282 -626642 -490472 -479412 -496495 -579025 -370457
123 -370457 -345804 -382811 -528550 -440754 -355518 -447729 -256836 -395437 -394515 -409997 -394189 -382092
111 -382092 -413730 -435200 -477478 -622097 -522743 -456800 -395908 -454226 -409145 -280071 -370239
100 -370239 -493005 -469813 -472567 -493533 -464934 -518101 -532043 -567530 -423964 -527539 -493962
89 -493962 -481946 -380684 -449402 -583496 -569134 -572035 -467682 -517466 -617694 -657656 -566116
78 -566116 -574980 -455530 -521675 -591577 -584111 -605684 -516097 -497558 -617026 -553390 -520642 -477483
66d77483M9135q4266K8566N946L6287n4177N3276j01065l5730M3464m5184n1579
54f32810l4100m428J36229M2492m7855N6909n0401Q7509O2648p2124m1293Q2334
42d14890m3636j42894m5355J14883j24466o3824L1509O6403k8604m137L9654m5956
30f61313O0796N8276o0541K1578p6387p0393k7843P8008J04165K5124o9372n987
18f23889O9122n6087j6263j8370j7127R1384J08272N0885j15557l3080K6951Q2810
6d50949m8433m2657Q484M1460r037j18824
0f19956
$$ plain form
66 -477483 -428348 -512614 -484048 -478102 -441815 -495992 -442716 -543781 -579511 -536047 -581231 -632810
54 -632810 -666910 -671338 -535109 -492617 -540472 -483563 -533964 -446455 -383807 -455931 -497224 -414890
42 -414890 -458526 -601420 -646775 -531892 -656358 -720182 -688673 -622270 -650874 -655011 -615357 -661313
30 -661313 -600517 -542241 -602782 -581204 -657591 -727984 -755827 -677819 -573654 -548530 -617902 -623889
18 -623889 -554767 -610854 -627117 -645487 -662614 -571230 -462958 -412073 -527630 -560710 -533759 -450949
6 -450949 -499382 -542039 -533555 -492095 -501132 -619956
0 -619956
$$ Imaginary data points
##PAGE= N=2
##DATA TABLE= (X++(I..I)), XYDATA
16383f664951K89027J49031M4775o1336N2426R1323K2582N5208J05961j34209
16373f050163N6950J92441P0173J28037R1188R4526J78279J40722M1905l9915
16363e095857o2017K034J8432Q9496N6757J39215J16751Q8072J00158L3373N5659
16352d457927N8774J03075J9429M2655O2787J65909J15294J86241r327J27478
16342c585612n32N1684K06150Q2662Q8037k5733J88460N6510R8524n4075N5746
16331b838179P2737J31282K0816M5282N502l7103J17435J67007K6758M5406P745
16320b235312J30300J30405q9404O0362Q4018Q2405J01752J58523P2234R3589
16310a411128O047P3473P2250R7232Q3317K1600O1650l3856o8613L0515R4787
$$ plain form
16383 -6664951 -6375924 -6226893 -6182118 -6243454 -6191028 -6099705 -6077123 -6021915 -5915954 -6050163
16373 -6050163 -5993213 -5800772 -5730599 -5602562 -5511374 -5416848 -5238569 -5097847 -5055942 -5095857
16363 -5095857 -5157874 -5155840 -5137408 -5047912 -4991155 -4851940 -4735189 -4647117 -4546959 -4513586 -4457927
16352 -4457927 -4399153 -4296078 -4276649 -4233994 -4171207 -4005298 -3890004 -3703763 -3713090 -3585612
16342 -3585612 -3586144 -3534460 -3328310 -3245648 -3157611 -3183344 -2994884 -2938374 -2839850 -2893925 -2838179
16331 -2838179 -2765442 -2634160 -2613344 -2568062 -2562560 -2599663 -2482228 -2315221 -2288463 -2243057 -2235312
16320 -2235312 -2105012 -1974607 -2064011 -2003649 -1919631 -1837226 -1735474 -1576951 -1504717 -1411128
16310 -1411128 -1405081 -1331608 -1259358 -1162126 -1078809 -1057209 -995559 -1029415 -1098028 -1067513 -972726
16299i72726J67264J14098Q6780O4755o0345M0917J40841R4098k5200J97030J08796
16288d3692k982N8117p778Q4664n6758R3511j3898P1526K24861n8724M0198J65290
16276E54335K2072j9249P6460J17208J8584j7057Q2099J59512P2083m0572M14
16265A025889R7857P8437J5290R3755q5468m9832J52800j2346Q1651R8794N0599
16254A547426m3804q840J41359J905J13530L9226M6536M6003M7753J9889j1270
16243A939713K47055q9560j54149M0969J75598K18962M7804m7694J02370Q7675
16233B568743J3749n3028j65550R8607J46279J01504j0065r8538J96896Q8200
16223B886797j6147Q9793o3177Q2263Q4709j4617m5292J6278o4635J53307J86237
$$ plain form
16299 -972726 -805462 -691364 -604584 -539829 -600174 -559257 -418416 -324318 -349518 -152488 -43692
16288 -43692 -46674 11443 3665 88329 31571 125082 111184 182710 407571 348847 389045 554335
16276 554335 576407 557158 633618 750826 769410 752353 834452 993964 1066047 1025475 1025889
16265 1025889 1123746 1202183 1217473 1311228 1225760 1175928 1328728 1316382 1398033 1496827 1547426
16254 1547426 1503622 1494782 1636141 1638046 1751576 1790802 1837338 1883341 1931094 1950983 1939713
16243 1939713 2186768 2097208 1943059 1984028 2159626 2378588 2426392 2378698 2481068 2568743
16233 2568743 2582492 2529464 2363914 2462521 2608800 2710304 2700239 2601701 2798597 2886797
16223 2886797 2870650 2960443 2897266 2979529 3064238 3049621 3004329 3020607 2955972 3109279 3295516
16212C295516n5502l1282R9724R7820p7743K6601j00287r4185Q8148J969K8158
16201C278937J01583P9772K1280R3132o5242o4607l8931J40845J64069K7772j71078
16190C567532j61668j2774J48353J68412L6248N7334Q1976l3377J5909J9423n8589
16179C828779O9956J7943J19430J14506K0466J4783M6242N9518p5189R5691n6519
16168D255606j58358P2503J25820k8270r3152M2302J40023P007j3482J35127j7239
16157D467887j13822P0402k4965J09482j107o7874o6740M6225L0155K2727m5167
16146D427203L9860M9927p6071K19685k14253j59602K64441K2213o3133J05073
16136D615343q7253o8932N5165K30845j337r5168k6888N9230J6104O0394L3793
$$ plain form
16212 3295516 3240014 3208732 3308456 3406276 3328533 3355134 3254847 3160662 3248810 3250779 3278937
16201 3278937 3380520 3460292 3481572 3574704 3509462 3444855 3405924 3546769 3710838 3738610 3567532
16190 3567532 3405864 3393090 3541443 3709855 3746103 3803437 3885413 3852036 3867945 3887368 3828779
16179 3828779 3898735 3916678 4036108 4150614 4171080 4185863 4232105 4291623 4216434 4312125 4255606
16168 4255606 4097248 4169751 4295571 4267301 4174149 4216451 4356474 4363481 4349999 4485126 4467887
16157 4467887 4354065 4424467 4399502 4508984 4507877 4440003 4373263 4419488 4449643 4472370 4427203
16146 4427203 4467063 4516990 4440919 4660604 4446351 4286749 4551190 4573403 4510270 4615343
16136 4615343 4528090 4459158 4514323 4745168 4743831 4648663 4621775 4681005 4697109 4757503 4791296
16125D791296Q6859p0397j10143J57519J15216p8821k5784o2548J62237K9325
16115D994759p6739O7721N8462l0739K8787m6405n9579j26414K3207L4147L6249
16104D903456j7501K4789L4530p7092j04150J53857J42410q1660k17098J8626
16094D780167L6949j37892K34995J97881j34626j65054P2543K8472m4097J170
16084D870508O7128n1814p3187o5643J48832j1283r986J3356K1128m6249O8598
16073D931388K5793o355P0492N441R3081n3207M7948K1646j50813m1937o3470
16062D880007O0128J35825j09803r6153J31808N1157j8825m4720J24325J49247
16052E262996r5882n9124M7826j03333J12343j05569J40549J22554q9009j89228
$$ plain form
16125 4791296 4878155 4807758 4697615 4855134 4970350 4891529 4865745 4803197 4965434 4994759
16115 4994759 4918020 4985741 5044203 5013464 5042251 4995846 4936267 4809853 4833060 4867207 4903456
16104 4903456 4885955 4910744 4945274 4868182 4764032 4917889 5060299 4978639 4761541 4780167
16094 4780167 4817116 4679224 4914219 5112100 4977474 4812420 4884963 4913435 4869338 4870508
16084 4870508 4937636 4885822 4812635 4746992 4895824 4884541 4874555 4887911 4909039 4862790 4931388
16073 4931388 4957181 4950826 5021318 5026759 5119840 5066633 5114581 5136227 4985414 4943477 4880007
16062 4880007 4940135 5075960 4966157 4870004 5001812 5052969 5034144 4989424 5113749 5262996
16052 5262996 5167114 5107990 5155816 5052483 5164826 5059257 5199806 5322360 5233351 5044123
16042E044123p1698J83134j31222l3884K6243p6971K34052O6731j54193j12137
16032D974178m5989J01256M1878J23378M4460q5154n2691Q0303k4303R536P2946
16021E239798M314q5071r4986o4678J89706k3033j27369J79256l1345o495j48604
16010E031493n6426j3143Q4408K8208o9596L8629m6403J90982j69215P1557J33036
15999E223530Q5834P6687M8366q5533j85768j61085K08035q4072q4919J35388
15989E176463j6973J0373j23249N2175o2002l1759j54573o768M6409K6876M5044
15978D962016J38505R920k4402l3099j31163K4165M9024J42573k1661r108K2520
15967E129290j01097Q5582n0360Q965o4589m8688Q6792Q1177L2398p1035p1993
$$ plain form
16042 5044123 4972425 5155559 5024337 4990453 5016696 4939725 5173777 5240508 5086315 4974178
16032 4974178 4928189 5029445 5071323 5194701 5239161 5154007 5101316 5181619 5157316 5166852 5239798
16021 5239798 5244112 5159041 5064055 4999377 5189083 5166050 5038681 5217937 5186592 5180097 5031493
16010 5031493 4975067 4961924 5046332 5074540 5004944 5043573 4997170 5188152 5018937 5090494 5223530
15999 5223530 5309364 5386051 5434417 5348884 5163116 5002031 5210066 5125994 5041075 5176463
15989 5176463 5159490 5169863 5046614 5098789 5036787 5005028 4850455 4843687 4890096 4916972 4962016
15978 4962016 5100521 5110441 5086039 5052940 4921777 4945942 4994966 5137539 5115878 5106770 5129290
15967 5129290 5028193 5113775 5063415 5072380 5007791 4959103 5045895 5127072 5159470 5088435 5016442
15956E016442J24534P5124Q2253K4541r1577o6453j10855o9829O545J70635R2522
15945E253882j26170m0248N8843R6447r5024n4543j9340j05684R1252k9469P4011
15934E103957J45427l9824J313L0873N036J02923j61014j63512K02245p5105J38947
15923E291266j0592m4790j3223j83958k2523O2707J54069q3616J4411J23650j29029
15912E158372j10450R3799J51977Q0627l7582n1126O0673P476r4828K2218j18004
15901E163152L2409k6650J69750l8423k20658j0600K02004o4096L8125N0300p2535
15890E222778n6573J3135P0825o975o0464r855j1068l1125L6417P7707J88298
15879E433100l8410J3108j03849p5077p0858P3700N5753l0179K3659j34065N0535
$$ plain form
15956 5016442 5140976 5216100 5298353 5322894 5231317 5164864 5054009 4984180 4990725 5161360 5253882
15945 5253882 5127712 5087464 5146307 5242754 5147730 5093187 5073847 4968163 5059415 5029946 5103957
15934 5103957 5249384 5209560 5210873 5241746 5246782 5349705 5188691 5025179 5227424 5152319 5291266
15923 5291266 5280674 5235884 5222661 5038703 5016180 5078887 5232956 5149340 5163751 5287401 5158372
15912 5158372 5047922 5141721 5293698 5374325 5336743 5285617 5346290 5353766 5258938 5281156 5163152
15901 5163152 5195561 5168911 5338661 5300238 5079580 5068980 5270984 5206888 5245013 5295313 5222778
15890 5222778 5166205 5179340 5250165 5243190 5182726 5172871 5161803 5130678 5167095 5244802 5433100
15879 5433100 5394690 5407798 5303949 5228872 5158014 5231714 5287467 5257288 5280947 5146882 5197417
15868E197417j4393q1284n1810P7697N8800M9264K9273R5753j23499j3192l9951
15857E184075P6329N8598N2165j43413j87826J11994M3053J25931P247O1966m3524
15846E346595J50467j94261N0688P9347j86853K7664L9965q7411P6942p2154o1563
15835E169426q0648K2144J74036K63067l9167j36232k2435j6092l0502j19336
15825E184261R1342L4446M9925J78920j30288k17238J07538j07443n254R7910
15815E284119o6373j31143J60125q8585J3015J5222r9887m0769J88688J95939
15805E430351n4193j55422j23388K5929O7678m546l4825J64025O0639j6266j01834
15794E258148n0810L9992J88531J23149j76237j58944J13369k9411n3932O3492
$$ plain form
15868 5197417 5183024 5101740 5049930 5127627 5186427 5235691 5264964 5360717 5237218 5224026 5184075
15857 5184075 5260404 5319002 5371167 5227754 5039928 5151922 5194975 5320906 5328153 5390119 5346595
15846 5346595 5497062 5302801 5353489 5432836 5245983 5273647 5313612 5226201 5303143 5230989 5169426
15835 5169426 5088778 5110922 5284958 5548025 5508858 5372626 5350191 5334099 5303597 5184261
15825 5184261 5275603 5310049 5359974 5538894 5408606 5191368 5298906 5191463 5186209 5284119
15815 5284119 5217746 5086603 5246728 5158143 5171158 5186380 5086493 5045724 5234412 5430351
15805 5430351 5376158 5220736 5097348 5123277 5190955 5186409 5151584 5315609 5376248 5359982 5258148
15794 5258148 5207338 5247330 5435861 5559010 5382773 5223829 5337198 5307787 5253855 5317347
15784E317347k31117p4313J39095p9452m4771L5951J01898J72118L0172j54582
15774E212346R0933j30933J47031j6508j50655M4880O0176q7446J15972q2718
15764E203078q1316J79121j10170K5532q716p5306j9180Q0078O0938K8028k06257
15753E075830N5650Q6161J20003p2181l1820P3201o1273o6069j60570K88593R1300
15742E398825m3653r4935k0510J7962n6559K3845j17280L5862J65781J87064P1623
15731E568025j14932j88824Q6780M5601k3871O7442j1497j4241L0294k18289l4608
15720E191880R25q0309M3660Q1358j3826l3225J0275J5517o7212Q323M5198j7848
15708E184716K2325q2550J65265R1537j81575j6823M0035P1749o2831p6542Q2091
$$ plain form
15784 5317347 5086230 5011917 5151012 5071560 5026789 5062740 5164638 5336756 5366928 5212346
15774 5212346 5303279 5172346 5319377 5302869 5152214 5197094 5257270 5169824 5285796 5203078
15764 5203078 5121762 5300883 5190713 5216245 5207529 5132223 5113043 5193121 5254059 5282087 5075830
15753 5075830 5131480 5217641 5337644 5265463 5233643 5306844 5245571 5179502 5018932 5307525 5398825
15742 5398825 5355172 5260237 5239727 5257689 5201130 5224975 5107695 5143557 5309338 5496402 5568025
15731 5568025 5453093 5264269 5351049 5396650 5372779 5440221 5428724 5414483 5444777 5226488 5191880
15720 5191880 5192805 5112496 5156156 5237514 5223688 5190463 5200738 5216255 5149043 5157366 5202564 5184716
15708 5184716 5207041 5124491 5289756 5381293 5199718 5182895 5222930 5294679 5231848 5155306 5237397
15697E237397J1982m4841L7872J08455m7974L2171J7681o7143J17427j50721O4163
15686E316469Q3663j08321P753J8617N720K5630P5949j5263k16826l0997Q3738
15675E246132m9133O6060n6678J34557Q4980j27796L7117K4248J11890N4736j49376
15664E376737r8771O3219j6542j7375K6996p0503j00734j06713r145K27935P0579
15653E345683j52484r590Q2987J60078M8306j71768R405J18123j22328Q5652o9805
15642E324259j10539j5894L892P2909j0611J0171J20234J09699n6447J8000J145
$$ plain form
15697 5237397 5249379 5204538 5242410 5350865 5302891 5335062 5352743 5285600 5403027 5252306 5316469
15686 5316469 5400132 5291811 5299564 5318181 5323901 5349531 5425480 5410217 5193391 5162394 5246132
15675 5246132 5196999 5263059 5206381 5340938 5425918 5298122 5335239 5359487 5471377 5526113 5376737
15664 5376737 5277966 5341185 5324643 5307268 5334264 5263761 5163027 5056314 5047169 5275104 5345683
15653 5345683 5193199 5183609 5266596 5426674 5474980 5303212 5312617 5430740 5308412 5394064 5324259
15642 5324259 5213720 5197826 5201718 5274627 5264016 5274187 5394421 5504120 5447673 5465673 5466818
$$ [...]
##END NTUPLES=NMR SPECTRUM
##END=
