##TITLE=1H_CA-8852-1
 DMSO, 8 sc, 
 12.05.2021
##JCAMPDX= 6.0         $$ Bruker NMR JCAMP-DX V2.0
##DATA TYPE= NMR SPECTRUM
##DATA CLASS= NTUPLES
##ORIGIN= UXNMR, Bruker Analytische Messtechnik GmbH
##OWNER= root
$$ XWIN-NMR		Version 3.5
$$ Wed May 12 10:08:52 2021 Russian Standard Time (UT+4h)  she@DPX200
##.OBSERVE FREQUENCY= 200.131506
##.OBSERVE NUCLEUS= ^1H
##.ACQUISITION MODE= SIMULTANEOUS
##.ACQUISITION SCHEME= undefined
##.AVERAGES= 8
##.DIGITISER RES= 18
##SPECTROMETER/DATA SYSTEM= spect
##.PULSE SEQUENCE= zg30
##.SOLVENT NAME= CDCl3
##.SHIFT REFERENCE= (INTERNAL, CDCl3, 0, 15.9927)
##AUDIT TRAIL= $$ (NUMBER, WHEN, WHO, WHERE, WHAT)
$$ ##TITLE= Audit trail, XWIN-NMR		Version 3.5
$$ ##JCAMPDX= 5.01
$$ ##ORIGIN= Bruker BioSpin GmbH
$$ ##OWNER= she
$$ F:/spectra/data/she/nmr/H-F/1/pdata/1/auditp.txt
$$ ##AUDIT TRAIL=  $$ (NUMBER, WHEN, WHO, WHERE, WHAT)
(   1,<2021-05-12 10:07:44.43 +0400>,<she>,<DPX200>,
      <created by zg, POWCHK disabled, PULCHK disabled
       configuration hash MD5:
       00 E9 B6 7A A2 85 ED C7 34 08 36 98 17 FE 4E 26
       data hash MD5: 16K
       9E 40 28 B6 E1 34 1C 3E DC 6C 55 E8 36 9F 6F 93>)
(   2,<2021-05-12 10:07:46.68 +0400>,<she>,<DPX200>,
      <Start of raw data processing
       efp BC_mod = 2 LB = 0.24 FT_mod = 6 PKNL = 1 PHC0 = -11135.95 PHC1 = 13.801 SI = 16K 
       data hash MD5: 16K
       47 ED 6A 5A 4A F2 43 CF 6D 94 24 E5 6B EA B1 7D>)
(   3,<2021-05-12 10:08:11.65 +0400>,<she>,<DPX200>,
      <pk PHC0 = 2.183688 PHC1 = -1 
       data hash MD5: 16K
       C6 6D 14 E5 09 D3 03 C7 0B C4 9D 80 93 EB 2E F6>)
(   4,<2021-05-12 10:08:15.09 +0400>,<she>,<DPX200>,
      <abs ABSG = 5 
       data hash MD5: 16K
       DA D9 BD F0 B8 79 22 F5 8A 00 CE EA DD 96 CF 9E>)
$$ ##END=
$$ 
$$ hash MD5
$$ 3D 3C F0 EE 1D EC 40 6D DA 09 71 24 A8 8D 3D 67
##$RELAX= 
##$RELAX= 
##$RELAX= 
##$RELAX= 
##$RELAX= 
##$RELAX= 
$$ Bruker specific parameters
$$ --------------------------
##$DU= <F:/spectra>
##$EXPNO= 1
##$NAME= <H-F>
##$PROCNO= 1
##$TYPE= <nmr>
##$USER= <she>
##$AMP= (0..31)
100 100 100 100 100 100 100 100 100 100 100 100 100 100 100 100 100 100 
100 100 100 100 100 100 100 100 100 100 100 100 100 100 
##$AQSEQ= 0
##$AQ_mod= 1
##$AUNM= <au_zg>
##$AUTOPOS= <>
##$BF1= 200.13
##$BF2= 200.13
##$BF3= 200.13
##$BF4= 200.13
##$BF5= 200.13
##$BF6= 200.13
##$BF7= 200.13
##$BF8= 200.13
##$BYTORDA= 1
##$CFDGTYP= 0
##$CFRGTYP= 5
##$CHEMSTR= <none>
##$CNST= (0..31)
1 1 145 1 1 1 1 1 1 1 1 1 1 1 1 1 1 1 1 1 1 1 1 1 1 1 1 1 1 1 1 1 
##$CPDPRG= <>
##$CPDPRG1= <>
##$CPDPRG2= <>
##$CPDPRG3= <>
##$CPDPRG4= <mlev>
##$CPDPRG5= <mlev>
##$CPDPRG6= <mlev>
##$CPDPRG7= <mlev>
##$CPDPRG8= <mlev>
##$CPDPRGB= <>
##$CPDPRGT= <>
##$D= (0..31)
0 1.2 0 0 0 0 0 0 0 0.06 0 0.03 0 0 0 0 0.0002 0 0 0 0 0 0 0 0 0 0 0 0 
0 0 0 
##$DATE= 1620799663
##$DBL= (0..7)
120 120 120 120 120 120 120 120 
##$DBP= (0..7)
150 150 150 150 150 150 150 150 
##$DBP07= 0
##$DBPNAM0= <>
##$DBPNAM1= <>
##$DBPNAM2= <>
##$DBPNAM3= <>
##$DBPNAM4= <>
##$DBPNAM5= <>
$$ [...]
##$SUBNAM3= <"">
##$SUBNAM4= <"">
##$SUBNAM5= <"">
##$SUBNAM6= <"">
##$SUBNAM7= <"">
##$SUBNAM8= <"">
##$SUBNAM9= <"">
##$SW= 16.9725357007746
##$SWIBOX= (0..15)
0 0 2 0 0 0 0 0 0 0 0 0 0 0 0 0 
##$SW_h= 3396.73913043478
##$TD= 16384
##$TD0= 1
##$TE= 0
##$TE2= 300
##$TE3= 300
##$TEG= 300
##$TL= (0..7)
0 120 120 120 120 120 120 120 
##$TP= (0..7)
150 150 150 150 150 150 150 150 
##$TP07= 0
##$TPNAME0= <>
##$TPNAME1= <>
##$TPNAME2= <>
##$TPNAME3= <>
##$TPNAME4= <>
##$TPNAME5= <>
##$TPNAME6= <>
##$TPNAME7= <>
##$TPOAL= (0..7)
0.5 0.5 0.5 0.5 0.5 0.5 0.5 0.5 
##$TPOFFS= (0..7)
0 0 0 0 0 0 0 0 
##$TUNHIN= 0
##$TUNHOUT= 0
##$TUNXOUT= 0
##$USERA1= <user>
##$USERA2= <user>
##$USERA3= <user>
##$USERA4= <user>
##$USERA5= <user>
##$V9= 5
##$VALIST= <valist>
##$VCLIST= <CCCCCCCCCCCCCCC>
##$VD= 0
##$VDLIST= <DDDDDDDDDDDDDDD>
##$VPLIST= <PPPPPPPPPPPPPPP>
##$VTLIST= <TTTTTTTTTTTTTTT>
##$WBST= 1024
##$WBSW= 4
##$XGAIN= (0..3)
0 0 0 0 
##$XL= 0
##$YL= 0
##$YMAX_a= 691835
##$YMIN_a= -686535
##$ZGOPTNS= <>
##$ZL1= 120
##$ZL2= 120
##$ZL3= 120
##$ZL4= 120
##$ABSF1= 15.99268
##$ABSF2= -0.9799843
##$ABSG= 5
##$ABSL= 3
##$ALPHA= 0
##$AQORDER= 0
##$ASSFAC= 0
##$ASSFACI= 0
##$ASSFACX= 0
##$ASSWID= 0
##$AUNMP= <proc_1d>
##$AZFE= 0.1
##$AZFW= 0.1
##$BCFW= 0
##$BC_mod= 2
##$BYTORDP= 0
##$COROFFS= 0
##$CY= -3
##$DATMOD= 1
##$DC= 0
##$DFILT= <>
##$DTYPP= 0
##$F1P= 0
##$F2P= 0
##$FCOR= 1
##$FTSIZE= 16384
##$FT_mod= 6
##$GAMMA= 0
##$GB= 0
##$INTBC= 1
##$INTSCL= 1.334414e-10
##$ISEN= 128
##$LB= 0.24
##$LEV0= 0
##$LPBIN= 0
##$MAXI= 10000
##$MC2= 0
##$MEAN= 0
##$ME_mod= 0
##$MI= 1.114404
##$NCOEF= 0
##$NC_proc= -6
##$NLEV= 6
##$NOISF1= 3.799351
##$NOISF2= 2.8
##$NSP= 0
##$NTH_PI= 0
##$NZP= 0
##$OFFSET= 15.99268
##$PC= 1
##$PHC0= -11133.77
##$PHC1= 12.801
##$PH_mod= 1
##$PKNL= yes
##$PPARMOD= 0
##$PSCAL= 0
##$PSIGN= 0
##$REVERSE= no
##$SF= 200.130003755146
##$SI= 16384
##$SIGF1= 3
##$SIGF2= 2
##$SINO= 5.538805
##$SIOLD= 16384
##$SREGLST= <1H.CDCl3>
##$SSB= 0
##$STSI= 16384
##$STSR= 0
##$SW_p= 3396.73913043479
##$SYMM= 0
##$S_DEV= 0
##$TDeff= 16384
##$TDoff= 0
##$TI= <>
##$TILT= no
##$TM1= 0
##$TM2= 0
##$TOPLEV= 0
##$USERP1= <user>
##$USERP2= <user>
##$USERP3= <user>
##$USERP4= <user>
##$USERP5= <user>
##$WDW= 1
##$XDIM= 16384
##$YMAX_p= 408284275
##$YMIN_p= -269339
$$ End of Bruker specific parameters
$$ ---------------------------------
##NTUPLES= NMR SPECTRUM
##VAR_NAME=  FREQUENCY,     SPECTRUM/REAL,   SPECTRUM/IMAG
##SYMBOL=    X,             R,               I
##VAR_TYPE=  INDEPENDENT,   DEPENDENT,       DEPENDENT
##VAR_FORM=  AFFN,          ASDF,            ASDF
##VAR_DIM=   16384,         16384,           16384
##UNITS=     HZ,            ARBITRARY UNITS, ARBITRARY UNITS
##FACTOR=    0.207333158178282, 1,           1
##FIRST=     3200.61502759177, 0,            0
##LAST=      -196.124102843017, 0,           0
##MIN=       -196.124102843017, -269339,     0
##MAX=       3200.61502759177, 408284275,    0
$$ Real data points
##PAGE= N=1
##DATA TABLE= (X++(R..R)), XYDATA
$$ [...]
9824 -52408 -8460 -93590 -156489 -80524 -53704 -125474 -74463 -19400 -91569 -38988 -51310 -43810
9812 -43810 -48175 -48623 -29910 -62908 40275 13512 -63982 -35150 16254 48655 9979 -37189
9800 -37189 -10977 -11938 -86973 -121316 -153185 -141525 -79009 -54030 -84884 -115036 -147272 -150290
9788 -150290 -119982 -108082 -165315 -134401 -109897 -142547 -145168 -77829 -113572 -162041 -105137 10224
9776 10224 -68494 -89967 -57921 -60780 -93776 -49427 -110518 -108921 -68254 -15743 -83325 -172251
9764 -172251 -134281 -118869 -45780 -48160 -90411 -138918 -158829 -59850 16871 -103701 -96909 -85879
9752 -85879 -117639 -123742 -103590 -195538 -112545 -101082 -157386 -127482 -179145 -181358 -145372 -49390
9740 -49390 -44007 -94927 -34320 -78539 -120787 -85471 -72961 -136193 -83771 -81339 -1020 -33551
9728 -33551 -35879 -55866 -115325 -151902 -48335 -37972 -56570 -32785 -65932 -90963 -31002 -98037
9716 -98037 -59344 -51915 -111553 -151160 -149521 -63191 -54665 -5844 -94388 -116803 -83664 -56508
9704 -56508 -107811 -71024 -31422 -145760 -132860 -108070 -63221 -37394 -110209 -52276 -6204 14251
9692 14251 -102423 -51494 -84497 -91181 -27609 -34655 -166543 -113397 -34280 -67618 -121446 -2811
9680 -2811 -33272 -53531 -40302 -46665 -84225 -85041 -137 -55596 18037 7222 -98758 -79670
9668 -79670 -75096 -75574 -93130 -138296 -38752 -118410 -177344 -99221 4660 -69972 -95331 -85821
9656 -85821 -166596 -77698 -47661 -81378 -134393 -75620 -135422 -161359 -60878 -47064 -67892 -13180
9644 -13180 -87102 -121028 -76714 -78410 -55645 -98135 -63046 -7349 -3048 1988 -105502 -126477
9632 -126477 -44819 1655 9018 31244 34092 47870 -16762 -43903 76094 -2824 -58578 5071
9620 5071 -30289 -73937 -74293 -101691 -122078 -82002 -46289 -30528 1760 3052 -85602 -41410 51405
9607 51405 13809 -6851 -20557 21072 -19161 -10906 -1461 -49661 -34654 320 16724 27162
9595 27162 -56139 -39891 -104557 -128366 -42114 -95001 -158124 -167757 -174878 -118885 -94077 -26233
9583 -26233 -44329 -34511 76355 10492 -26517 31559 53292 38715 -7085 32333 -31085 -27942
9571 -27942 -9592 54395 77 -1141 51124 6533 -4784 -3941 22427 29339 12551 42478 21252
9558 21252 50031 108900 39057 25072 20670 11403 -16444 -5098 -41831 -14230 -9454 66604
9546 66604 32530 -8036 35967 74910 36735 1968 -11610 -45338 -8725 -2054 -30784 -39683
9534 -39683 24988 -13770 -67366 -65606 -59081 -58261 5697 27636 -9479 27626 91714 10723 -66391
9521 -66391 -21868 29189 -79772 12201 63240 -8893 6908 -61257 -59791 -32314 -10058 -47030
9509 -47030 -45836 6642 52200 9009 27920 66972 151045 99745 14701 33945 28552 33229
9497 33229 3428 -13147 -53420 -19844 -6369 -41093 -25360 -6536 9183 54311 94566 31081
9485 31081 -13502 7741 9181 -33305 -15070 -46844 39414 106160 105313 55693 -27250 -56817
9473 -56817 -103091 -13293 42394 -40457 -75794 -16516 66305 6082 -61378 -9811 -48748 -39928
9461 -39928 68341 142912 112267 -7791 -38094 58 10643 -3982 -71742 -122210 -14145
9450 -14145 20422 43097 16342 33616 34666 17793 54421 30807 32014 35457 61878 114928
9438 114928 51490 35702 58842 28719 46569 4638 29645 64000 32894 58233 -39293 63
9426 63 78773 139144 142584 97888 79432 91041 96747 42054 26741 24670 41478 64093 76796
9413 76796 27829 71248 79577 27438 50549 148337 122742 108209 37779 159674 163947 99072
9401 99072 145454 250254 228027 165947 129282 74631 49106 118770 91177 49802 55852 77984
9389 77984 118213 113954 154175 79791 62489 52993 -36426 -21257 17424 93094 127436 85893
9377 85893 166067 115197 42015 70508 118925 143042 88826 108230 119115 108301 161684 77636
9365 77636 46136 73287 47186 -57740 -26898 101022 45710 -31700 36080 98633 62336
9354 62336 63643 127520 87051 77325 35467 66658 36025 108566 77612 90282 181752 150931
9342 150931 48577 852 78712 131342 140957 139616 204831 94685 39733 91267 125856 105782
9330 105782 159611 178052 57575 75105 153395 150958 158366 84584 70541 67134 142301 102852
9318 102852 88203 164214 63320 21109 42990 135570 137752 108605 195913 160567 156782 74914
9306 74914 67732 120075 109601 159113 130437 119858 161587 147019 194624 161839 191620 184128
9294 184128 138873 136138 177539 170634 180979 120172 127025 123241 75143 158554 211416 223197
9282 223197 178515 188385 142760 145605 126665 140265 232704 247322 171318 169234 221255 249120
9270 249120 197475 231456 272482 225312 166376 173796 134801 218791 198343 140977 262018 342348
9258 342348 299027 246911 210329 216096 229888 246157 255859 237623 198651 244644 267513 219557
9246 219557 265951 323104 307312 219306 224595 242315 249332 284403 295879 255881 260858 245677
9234 245677 238795 286764 311948 241269 254973 342211 310896 262236 281796 367890 376072 291536
9222 291536 331196 372853 321744 338249 318599 339753 331925 339624 311812 262414 300511 328111
9210 328111 290640 347386 349945 272054 283709 260492 236792 288711 271530 292050 230579 203570
9198 203570 264658 285751 321942 309739 240877 311690 350350 301485 317536 384486 403671 295051
9186 295051 415615 371335 312765 244781 353241 330353 289626 361933 286365 249829 252954
9175 252954 267161 312865 309901 349622 358533 248485 330002 357815 224416 230205 321101 230901
9163 230901 126037 257835 291729 293026 331106 260374 208271 263064 301193 224995 223835 320860
9151 320860 271846 270180 319654 258326 263692 309335 356722 321225 289368 339442 349752 319138
9139 319138 272464 290680 299764 264326 295828 223810 219279 178423 235792 263449 246067 295178
9127 295178 288342 274316 233348 220814 343332 388060 387895 325818 409524 349317 311751 398069
9115 398069 421964 465372 469964 419643 402302 393659 390901 379581 375825 504594 593609 542483
9103 542483 479736 507359 484922 527558 574096 547396 543273 585611 588036 521915 634251 636542
9091 636542 604516 685745 671361 645360 644925 678110 732815 715504 700476 893678 918949 903554
9079 903554 852445 901646 849797 892613 973125 964760 975482 942847 976283 1030559 1100000 1114917
9067 1114917 1114737 1180340 1257855 1276179 1349173 1352530 1347962 1363553 1366631 1446101 1465683 1408061
9055 1408061 1470809 1521315 1502868 1545666 1604347 1622328 1654766 1720885 1701037 1683484 1643217
9044 1643217 1617051 1650276 1673168 1663209 1719989 1658679 1672640 1689461 1714036 1636603 1617542 1629838
9032 1629838 1573489 1590831 1590982 1511412 1509572 1470379 1467802 1488885 1457735 1354536 1246065 1270845
9020 1270845 1287692 1298905 1285180 1265254 1178220 1153880 1115078 1123169 1084841 1067412 1105653 1005140
9008 1005140 952028 935789 951103 963161 960815 866185 797340 762473 818149 851108 833737 878871
8996 878871 804426 752846 749521 765367 678014 655154 706929 767223 729841 698294 568050 597058
8984 597058 718887 717254 661727 621448 640390 606975 574225 573568 600698 563777 604753 606311
8972 606311 493323 549456 584134 534024 594251 643282 548846 559724 473192 544353 638291
8961 638291 638112 566089 521880 563100 645995 523393 504046 435073 428130 467762 480569 423557
8949 423557 445773 530234 546331 586415 566488 495441 508970 527295 469300 434633 398029 375736
8937 375736 395303 456135 450927 445071 415471 467929 480309 520123 470603 398131 395015 438070
8925 438070 425961 472262 447340 478359 519974 520399 499515 491278 537171 494227 491844 553129
8913 553129 608346 632886 593545 491156 472784 551085 472499 460837 476329 512473 486810
8902 486810 581548 648161 502622 519782 486451 513336 603554 640503 588555 610352 647239
8891 647239 649098 643261 651120 687939 653952 612603 569123 635265 611885 744853 736079 692679
8879 692679 699053 726292 625665 680185 821778 707226 661711 731286 673956 687328 695699
8868 695699 693958 741669 760264 792902 626711 600120 725587 798347 800708 752730 747967 728232
8856 728232 848628 923116 853135 818497 850673 779942 783102 821162 811760 821910 825640 822361
8844 822361 784509 810785 953086 952345 921380 860993 812569 823895 836973 901906 947363 861432
8832 861432 885600 952059 902317 868006 864896 817092 805187 917313 952298 918370 954383 976368
8820 976368 864239 877503 856195 857816 802812 863009 879698 838876 809141 864937 750686
8809 750686 775002 779657 797512 843844 951190 888668 848097 888701 778070 819115 730896
8798 730896 716861 749507 808482 805884 791989 765860 742637 797327 782782 785801 798420 840079
8786 840079 885481 921004 794195 709956 722472 749152 777401 754118 638299 643608 669379
8775 669379 680545 566698 623134 725190 737161 759480 680169 711995 608624 576496 642978
8764 642978 661918 701544 742223 739492 682900 643033 670564 614933 608780 729633 766241 685199
8752 685199 647317 665970 606528 688606 742271 728210 655156 667321 687782 645501 731162 760893
8740 760893 736350 771816 791941 692311 773658 820470 749872 674025 674903 707432 711875 745323
8728 745323 817993 852566 793996 790531 734260 713660 802794 855706 809656 844361 894028 742417
8716 742417 763486 879248 823295 807979 827963 814875 882655 888224 963140 887851 857893 896320
8704 896320 940037 888056 915636 933428 889232 886221 937927 913318 894244 955570 953889 872615
8692 872615 1000299 1033310 951044 1005775 1066119 951301 884462 969645 967190 999841 1107734
8681 1107734 1140299 1107702 1138187 1171960 1135095 1155299 1248509 1152939 1085713 1256875 1349589
8670 1349589 1249242 1326923 1360200 1346161 1381074 1333999 1311546 1359294 1398085 1506692 1491786
8659 1491786 1565956 1585575 1514971 1505236 1647278 1666144 1654509 1781277 1916126 1892202 1869191
8648 1869191 1912395 1804389 1828190 1912520 1929388 2021961 2098392 2192827 2174167 2265624 2376378
8637 2376378 2374775 2375978 2478679 2587578 2584387 2630364 2696442 2791951 2885172 3090329 3151514
8626 3151514 3212043 3347196 3292713 3334349 3473415 3578178 3681681 3756349 3873936 3924336
8616 3924336 4061466 4210730 4283511 4389701 4503777 4642268 4681665 4863556 5066897 5038224
8606 5038224 5141009 5298754 5258829 5273025 5406061 5433613 5281074 5344451 5574664 5487598
8596 5487598 5530966 5523096 5508623 5486270 5434144 5305588 5197798 5126496 5025243 4946282 4755865
8585 4755865 4682607 4596713 4414312 4374879 4269893 4149458 4083532 3923650 3789747 3706952
8575 3706952 3705075 3660425 3488548 3391684 3413591 3322417 3197210 3157157 3037003 2948984 2908085
8564 2908085 2848530 2801731 2770348 2673480 2624504 2585369 2500163 2507467 2515123 2542349 2499387 2439856
8552 2439856 2348737 2342923 2373802 2351170 2219318 2194551 2132905 2050275 1993891 2022652 1987801
8541 1987801 1965660 1966725 1973420 1949709 1876550 1829964 1840782 1743710 1694115 1698196 1715556 1757138
8529 1757138 1668476 1653583 1576688 1600055 1563408 1533732 1515397 1488650 1556589 1563507 1533302 1537217
8517 1537217 1501975 1543227 1543182 1456517 1476260 1492804 1356166 1238587 1252148 1294985 1286458 1285195
8505 1285195 1269300 1303797 1290092 1251437 1183760 1214627 1225297 1242145 1251539 1213974 1259096 1152405
8493 1152405 1082467 1162604 1278743 1191720 1066323 1120363 1117070 1073735 1034378 966428 1032850
8482 1032850 1051046 1031851 984780 1027044 1022668 1016518 1021692 1033488 963349 946317 891526 961933
8470 961933 1062120 1043958 1011830 967116 1016497 1023719 1114920 1059317 988046 962588 941643 907176
8458 907176 937512 912550 977475 1002627 962773 923147 921168 961891 956621 913727 869226 903678
8446 903678 901276 930428 921401 969673 1091153 1039055 973512 988700 958031 945664 905079 896825
8434 896825 894646 937057 913372 960684 950231 921166 935877 875820 928245 924968 869078 857064
8422 857064 849126 835947 871338 901492 921046 856082 949085 935280 872015 847860 863068 895454
8410 895454 922975 944161 977542 901309 840710 843987 890788 849100 912502 978444 892599 923114
8398 923114 882037 894386 993735 959912 955486 999476 961604 992083 875983 840125 856340 891260
8386 891260 940368 949616 966051 971939 1030555 1111394 1080750 1051732 1003878 954658 956952 1010128
8374 1010128 1010348 944579 992250 941437 959420 993420 967470 991982 948392 951820 946127 975466
8362 975466 1065156 1020285 976415 1008570 1028421 1118440 1110251 992071 1004297 1015635 1034482 1036945
8350 1036945 958323 1044802 1134015 1100558 1092790 1112566 1088407 1195067 1183302 1205556 1178347
8339 1178347 1178184 1267857 1151665 1033470 1059269 1079670 1136244 1191247 1198713 1198722 1165927 1195442
8327 1195442 1225126 1254622 1262707 1229189 1158726 1150842 1166304 1278649 1264704 1286638 1293646 1278353
8315 1278353 1356278 1356877 1295687 1301342 1367747 1355130 1331689 1379669 1352979 1356883 1378028 1347787
8303 1347787 1442099 1384070 1315757 1338390 1385048 1390279 1333167 1341771 1409608 1421330 1480034 1466583
8291 1466583 1537499 1528152 1448994 1543249 1598562 1619091 1555751 1539588 1555635 1529806 1634385
8280 1634385 1610438 1611873 1632088 1626086 1671868 1625483 1649715 1733552 1775042 1651031 1713569 1722467
8268 1722467 1683320 1750105 1788902 1825829 1827116 1818841 1790675 1797516 1754086 1758056 1897828 1929097
8256 1929097 1881922 1823397 1871878 1870493 1859575 1906963 1929230 1997041 2031072 1969614 1956142 2041226
8244 2041226 2077233 2052624 2132040 2123580 2149420 2288235 2191391 2099517 2060758 2042405 2152298
8233 2152298 2258624 2286295 2264390 2263690 2249961 2215559 2332426 2425937 2453934 2414614 2324976
8222 2324976 2359283 2395312 2423868 2478081 2429937 2424894 2482631 2448417 2507698 2557062 2590962 2558476
8210 2558476 2642222 2739190 2765756 2756468 2769803 2719752 2706427 2772206 2801336 2864303 2978389
8199 2978389 3009987 2994603 3082515 3091978 2925962 2829509 2724290 2703725 2953762 3029282 3218659
8188 3218659 3108945 3132656 3214006 3195311 3258490 3319956 3273772 3211042 3290279 3448204 3397519
8177 3397519 3345045 3453006 3441229 3389922 3442646 3524178 3614690 3595708 3650045 3761509 3844995
8166 3844995 3982129 3953185 3891750 3902020 3991368 4079894 4093304 4144003 4205749 4210056 4314359
8155 4314359 4383013 4424456 4506478 4618542 4613209 4711520 4841317 4853674 4878337 5055500 5186387
8144 5186387 5204767 5275974 5470537 5460350 5506514 5671122 5821286 5921106 6036257 6147640
8134 6147640 6322187 6427128 6550392 6624867 6730619 6878121 6991344 7113936 7225763 7375790
8124 7375790 7497194 7644489 7789594 7913124 8008397 8115037 8175116 8268851 8448699 8628502
8114 8628502 8659401 8754639 8868584 8943257 9028996 9104145 9094890 9248032 9441248 9431487 9476000
8103 9476000 9589977 9622665 9757993 9861904 9965254 9996897 9994600 10063754 10072959 10075042 10139743
8092 10139743 10248749 10278263 10316137 10472596 10471860 10423634 10559516 10572922 10560683 10608603 10617898
8081 10617898 10550512 10577503 10652591 10629877 10629784 10675944 10725256 10676455 10641573 10674560 10665089 10672707
8069 10672707 10670112 10603969 10534225 10524363 10540597 10451932 10395067 10343593 10307600 10204489 10187331
8058 10187331 10166947 9977670 9872169 9780295 9652660 9675839 9613655 9373837 9274786 9222650
8048 9222650 9147723 9047075 8933468 8717040 8600129 8524194 8395065 8196620 8075377 7996985
8038 7996985 7773650 7735649 7674433 7620880 7488850 7337149 7279481 7086879 7015128 6872358
8028 6872358 6684548 6585576 6529700 6496857 6342530 6192010 6155599 6019779 5835743 5775826
8018 5775826 5750722 5697206 5614640 5603604 5498205 5461193 5414743 5383172 5268123 5137160 5138176
8007 5138176 5132054 5153684 5070882 5030583 5004203 4937447 4832020 4831050 4847810 4849940 4779736 4760895
7995 4760895 4682227 4583834 4533931 4556606 4641277 4548434 4514251 4580126 4538497 4476229 4576175
7984 4576175 4582507 4463090 4435875 4472930 4495591 4540384 4639369 4589992 4540797 4536488 4572839 4598783
7972 4598783 4640756 4680726 4570270 4652585 4625257 4676006 4691524 4736232 4721260 4679448 4753916
7961 4753916 4757181 4710241 4733454 4821833 4895065 4899510 4904932 4958868 5003935 5022518 4982276 4941143
7949 4941143 5003514 5009059 5012984 5071317 4987874 5016359 5055323 5131702 5067455 5060782 5044010 5049261
7937 5049261 5119055 5073941 5111196 5209168 5213502 5184280 5162200 5198483 5200701 5288404 5309099 5255931
7925 5255931 5367467 5387013 5405062 5409517 5441834 5552629 5497968 5417845 5438116 5424957 5475276
7914 5475276 5508277 5417170 5415311 5450786 5444681 5415545 5436781 5419829 5474326 5485042 5423007 5352580
7902 5352580 5342859 5376554 5384477 5362619 5336544 5247283 5217122 5226091 5235713 5230793 5200403 5219734
7890 5219734 5200474 5176874 5115153 5078250 5079297 5066035 4957834 4893031 4848847 4951609 4974558
7879 4974558 4899355 4875490 4869981 4822992 4870710 4955305 4992853 4978604 4886903 4923240 4978314 4924019
7867 4924019 4884787 4925043 4950686 4914315 4919640 4991652 4991942 4995575 5051973 5131115 5139574 5176783
7855 5176783 5208383 5131812 5168188 5201310 5180446 5202260 5288564 5315986 5378262 5454597 5463150 5557016
7843 5557016 5577511 5580833 5593876 5641425 5776727 5749677 5777482 5880433 5963964 5953861 6133876
7832 6133876 6270709 6284343 6455734 6594313 6573558 6621235 6890915 6986917 7081661 7192242
7822 7192242 7385152 7529388 7598814 7662598 7778989 8012361 8208043 8337195 8492103 8643081
7812 8643081 8828921 9032955 9221803 9401978 9567738 9746320 9929373 10038167 10152992 10370161
7802 10370161 10600455 10641685 10753822 10922044 10979040 11113370 11201922 11308288 11393814 11479467
7792 11479467 11478161 11537860 11687591 11716816 11765825 11784846 11767471 11669120 11571279 11624484 11681012
7781 11681012 11675444 11618459 11573348 11561062 11522031 11590103 11644335 11598528 11635057 11688072 11655059
7770 11655059 11684136 11754150 11707232 11753962 11807660 11833473 11894490 11870379 11878762 11958791 12023186
7759 12023186 12149726 12156542 12070530 11990233 12039583 12102755 12167984 12146664 12105030 12052583 11996767
7748 11996767 11913843 11870217 11845460 11733703 11714061 11689454 11587295 11441759 11327316 11190508
7738 11190508 11052115 10895111 10832481 10652283 10461677 10409587 10238152 10087367 9839896 9646508
7728 9646508 9478955 9344888 9173548 9039968 8945976 8869110 8679287 8514837 8445394 8276294
7718 8276294 8194178 8095433 7900377 7730024 7626559 7508517 7402618 7347877 7299065 7129299
7708 7129299 6982632 6950780 6927385 6718944 6599764 6520957 6484809 6443242 6396418 6311409 6237329
7697 6237329 6203971 6111019 6078503 6068289 5947848 5795436 5782523 5792239 5638221 5485765 5426618
7686 5426618 5372090 5344145 5272786 5228069 5274627 5237277 5249673 5284714 5272743 5089024 5118163
7675 5118163 5066099 5067389 5087700 5013683 5044269 5030904 4963988 5019271 5064213 4994539 4937101 4894268
7663 4894268 4903166 4886420 4942492 4953867 4992271 5007428 4990533 4943300 5026132 5085251 4991656 4949564
7651 4949564 5035861 5080335 5056268 5125928 5176479 5237355 5296260 5311482 5284755 5365208 5434256
7640 5434256 5502070 5574093 5572801 5613241 5703858 5827789 5795108 5851855 5909916 5986875 6101593
7629 6101593 6186699 6253646 6357800 6442090 6497748 6573653 6688287 6822270 6926231 7048924
7619 7048924 7175917 7245729 7210540 7389835 7543831 7557195 7665220 7789519 7819037 7844630
7609 7844630 8025610 8104760 8060334 8055220 8228323 8278946 8299594 8374694 8417469 8485208 8485162 8574796
7597 8574796 8574805 8626433 8703101 8719856 8736756 8808379 8957657 8952283 9017724 9188518 9246609 9225999
7585 9225999 9230847 9357492 9463809 9565063 9700843 9739888 9771446 9881150 10050590 10121668
7575 10121668 10233029 10335099 10406877 10454301 10513519 10579068 10703421 10804153 10824873 10922078
7565 10922078 10924790 11009628 11110871 11079764 11084254 10939725 10920284 10944528 10950492 10914012 10868755
7554 10868755 10812291 10706517 10574694 10458846 10369910 10283918 10183761 10060718 9962354 9832400
7544 9832400 9813658 9730916 9711902 9663218 9605617 9548993 9514724 9396968 9366585 9355078 9247683
7533 9247683 9263405 9174443 9141067 9031922 8988822 8941343 8937946 8905590 8806203 8715021 8735517
7522 8735517 8702149 8616299 8599299 8579003 8454012 8368805 8386940 8323836 8231055 8135018 7999441
7511 7999441 7825623 7711957 7643313 7621569 7449988 7254066 7151625 6954461 6827593 6712361
7501 6712361 6505746 6441858 6352286 6166542 6037159 6053013 5869510 5732909 5653588 5575331
7491 5575331 5429365 5324851 5247542 5163249 5070064 4955212 4919449 4853585 4768798 4715308 4648263
7480 4648263 4576205 4503847 4418327 4260219 4275816 4281693 4231865 4096091 3963745 3911712 3848918
7469 3848918 3836122 3756179 3666021 3629814 3512271 3451911 3452136 3423938 3316110 3176275 3210887
7458 3210887 3167248 3040675 2880059 2853510 2911235 2886171 2803309 2778422 2729610 2636783 2579148
7447 2579148 2554334 2528605 2415432 2495821 2500092 2419343 2261296 2184166 2211834 2199955 2222038
7436 2222038 2170154 2140874 2104942 2022276 1979820 1950051 1903621 1911025 1925625 1891159 1743656
7425 1743656 1744279 1749617 1696234 1681921 1800255 1699931 1658897 1682172 1586032 1573395 1611971 1567807
7413 1567807 1474422 1426782 1401446 1423002 1385457 1484510 1440227 1379181 1400515 1362966 1319237
7402 1319237 1351744 1337839 1298999 1309763 1350284 1274243 1287305 1327378 1249059 1217959 1240249
7391 1240249 1289162 1275655 1224304 1114668 1092389 1106811 1157168 1181918 1160429 1234510 1153345
7380 1153345 1007287 1082921 1088426 1093724 1057895 1060634 1019849 993629 1046589 1081484 1076828 1051625
7368 1051625 1029380 990279 980559 1011030 983049 914842 966566 927194 870296 838469 750552 767274
7356 767274 874102 953778 919730 975211 1011199 963143 829826 787233 826001 867659 879018
7345 879018 946773 887431 851961 869213 832873 710636 709132 794384 784611 775342 770731 750798
7333 750798 660105 691116 724912 712455 710140 745054 788704 777732 703252 650957 655217 715823
7321 715823 717100 663530 586361 690843 701734 575388 634743 671721 611700 612043 603352 641445
7309 641445 609087 654656 654693 615440 591129 634534 617157 692807 652648 511673 563407 623336
7297 623336 596276 567407 571098 562899 549929 540297 563657 541819 584879 576925 606850 531573
7285 531573 579052 528552 445948 542770 477825 512162 542732 544465 492719 387994 442162 454594
7273 454594 513418 518131 406844 358365 432149 445812 510724 474442 438074 459864 407635 434570
7261 434570 481562 509568 465289 382479 336674 401466 305134 324185 376977 381228 473882 447468
7249 447468 511601 434558 377446 391968 411373 382102 350336 356880 385747 409540 411571 319692
7237 319692 317945 355019 327306 419074 426647 368937 280896 336596 341213 317938 344325 432880
7225 432880 403671 384657 394194 295897 278514 358704 326254 294388 336573 293791 303552 362681
7213 362681 325446 342160 279451 326234 361573 320366 325149 242425 242878 219825 313059 375886
7201 375886 220726 245089 282113 299900 302083 408987 307338 326873 376646 287567 312524
7190 312524 315331 300721 355446 329908 346212 360369 460169 488719 437273 386943 325453 419674
7178 419674 365625 313000 292907 310058 329642 343100 273442 240694 285932 223260 230279 349315
7166 349315 369060 311392 255988 232538 256147 326186 315070 247096 167229 203135 206462 221652
7154 221652 250176 260007 254617 323728 310019 299248 351548 410771 379404 241754 309449 407938
7142 407938 446601 385728 303087 416290 380640 360745 404659 392037 372949 321842 261507
7131 261507 325406 362993 390948 363705 343529 308429 301735 227421 208652 267504 236908 219693
7119 219693 291065 218230 277752 301160 328726 249916 251761 266692 194689 182034 119264 145920
7107 145920 176964 296700 289072 282694 292903 322230 288835 293991 342718 268210 165869 182582
7095 182582 231606 213362 253487 256221 201619 235682 308238 288580 234438 319239 306500 261232
7083 261232 275641 217966 182772 180197 240518 261550 188255 199398 228220 201794 185195 237431
7071 237431 191464 160382 165530 233081 214167 174900 215781 135598 160606 241811 214816 167091
7059 167091 203108 276400 196644 182928 158487 130106 120730 101780 100597 271896 292733 242893
7047 242893 197218 124760 126448 203809 196909 204741 192414 114758 60935 170558 156792 80840
7035 80840 137260 151614 177052 74492 101289 127073 230180 248309 129764 114964 120587
7024 120587 107757 201146 226672 235639 188524 162459 195049 157036 169709 174599 182294 73907
7012 73907 125351 157314 116788 236516 224136 105509 105684 163077 165555 151287 159148 101624
7000 101624 41830 72453 69809 98447 131406 64756 100714 151884 150599 200593 210027 111614
6988 111614 43033 126843 132477 138269 241633 193355 110761 162678 153768 164496 209181 191274
6976 191274 197723 175211 213251 268306 199364 179091 186724 125083 100305 118803 152789 87946
6964 87946 61391 89710 130827 114552 94258 102220 79192 100724 98700 123749 10114 -17689
6952 -17689 52030 55253 101675 61597 108433 112487 169539 177821 165142 140092 97669 55289
6940 55289 119688 203484 168707 188475 157288 86280 114333 235030 201025 234023 262391 247777
6928 247777 125348 180100 219216 168234 191167 132625 162430 192699 188772 119705 154463 175340
6916 175340 150849 104644 153838 154963 87710 104349 130895 206396 149132 208072 155432 162551
6904 162551 250754 258070 212551 188642 175228 189573 192789 241801 184055 144751 203692 224651
6892 224651 175544 154497 159478 186487 201511 250181 260825 179211 129233 217693 173753 68574
6880 68574 169151 161591 66427 57096 124529 167967 131189 115377 126877 57930 89269 102145
6868 102145 101695 165907 164058 119792 70795 129131 96945 120699 186830 142252 102584 102536 127518
6855 127518 185775 199637 153398 202140 175267 86997 134621 126817 64219 143813 183846 131231
6843 131231 136012 179363 150184 100713 17869 -21320 8905 42487 137584 140487 107944 132781
6831 132781 107578 106476 99267 41064 7658 92919 110685 136933 158664 171317 116861 181848
6819 181848 159117 100063 114188 64282 69764 110125 117114 78445 79238 141634 102308 62622
6807 62622 45647 103671 105536 139976 122253 79029 23203 87452 154058 142410 82631 74584
6795 74584 62899 100508 167216 157838 106329 204275 155213 129338 165872 196315 241646 150758
6783 150758 225980 252552 195349 66182 82325 194874 152653 140179 159983 159230 254753 164999
6771 164999 67707 86441 156963 259197 313511 282689 219452 113806 77881 118378 157150
6760 157150 177985 239659 225915 213903 236039 203866 145513 208626 247428 187393 235849 278395
6748 278395 172762 182933 208881 197883 133591 179123 183199 101226 83050 181556 234129 246436
6736 246436 299471 324162 327060 299542 269963 246055 215786 230512 251809 278159 255265 253999
6724 253999 258873 294052 315331 285983 330389 321312 328143 247986 330336 279149 292621 359587
6712 359587 337042 264517 298806 344716 258533 308397 394864 341042 282882 379161 416454 381074
6700 381074 418709 493420 429600 353924 362949 390174 392803 411119 391536 405042 419228 433751
6688 433751 393959 410873 480649 450966 448401 508109 595904 517164 422407 464939 494500 470249
6676 470249 377436 406412 471002 508320 540563 471270 436542 435406 345027 302263 443676 413489
6664 413489 400715 414538 422980 408763 399216 376154 433927 461571 403472 411640 425705 531847
6652 531847 440092 367160 389148 409013 378091 373076 402551 422556 490625 520033 434032 402577
6640 402577 385987 420276 366850 333991 354534 289635 277560 398183 397981 376231 445567 431151
6628 431151 375852 328221 373904 418896 375183 496055 544616 495177 448693 477237 421950
6617 421950 391326 487711 507389 406372 364216 415632 419624 409579 425877 472995 467606 481900
6605 481900 537960 515300 589416 552142 500303 513967 491937 445348 421785 457237 489479 433820
6593 433820 415769 505412 543665 493313 517936 537184 510145 508554 507967 531383 465542 466855
6581 466855 427831 569808 591221 567125 490103 483159 485374 427855 456914 445523 385886 405186
6569 405186 376284 426159 437403 449428 417510 340254 362740 467170 382144 464125 537486
6558 537486 522817 422837 437254 431273 333575 443263 506075 464910 453504 395756 380073 356030
6546 356030 336379 452041 464131 427321 404657 386141 373083 325959 358487 344795 363423
6535 363423 471978 475958 387297 360582 363118 368912 342567 362289 423053 325569 348022 360726
6523 360726 311506 411371 405737 399277 402915 306896 347580 322727 369493 343171 375420 418997
6511 418997 376863 358204 404363 376434 364866 382302 377573 423181 414990 361105 366751 344145
6499 344145 334085 235972 306143 328746 290783 354452 371827 423394 431755 382735 369519 409317
6487 409317 352079 288667 264065 258687 329455 378879 351470 353092 342339 349656 349401 366978 374700
6474 374700 317708 439327 469278 360697 318586 298834 386983 402231 382714 356955 338768
6463 338768 393411 331942 377044 329544 301642 259604 277787 345902 443163 441381 404323 422913
6451 422913 335060 335445 391049 395262 429587 485533 467138 441218 404594 344354 353679 434616
6439 434616 463881 397359 337915 412376 433725 421730 425769 449157 509924 555517 539583 504305
6427 504305 494281 487700 462979 430689 513248 480019 486678 545181 561035 582233 656823 621407
6415 621407 464266 439595 436547 466618 482958 569752 533035 467992 538963 503135 499501 574499
6403 574499 576235 540631 522414 607988 594647 526630 571783 484761 442792 509903 622590 654526
6391 654526 654953 687803 738395 710906 580220 571904 567890 615680 614003 602777 580464 665691
6379 665691 764129 679791 630466 680318 641937 642885 695314 635234 655523 765055 731923 720327
6367 720327 753638 747613 645323 690842 813848 773588 726411 778162 780394 703498 750434 766455
6355 766455 694978 749693 790433 754290 801047 790043 763190 748643 695644 796167 737777
6344 737777 720624 725444 664094 698707 700039 679203 674287 704273 697714 635544 670528 739872
6332 739872 732693 642595 678738 748725 769733 792347 798411 751676 702478 794582 806858 755140
6320 755140 752923 741754 703786 719550 819983 763544 693373 677940 711159 739641 743134 749170
6308 749170 757402 730303 778066 715956 716545 684825 679939 713666 803642 771657 727109 726088 704173
6295 704173 778093 696726 693531 612091 615621 630317 661982 659692 668375 636433 636782 687741 644350
6282 644350 677302 733120 705029 715284 565778 617648 610026 547814 561265 598230 600436 618045
6270 618045 716529 766984 667922 503138 469889 554630 640399 708305 710563 690459 700427 644933
6258 644933 633882 738030 707234 619434 556002 616615 631679 625375 678104 670124 642206 708087
6246 708087 651700 645698 644948 665716 703245 643700 641515 681595 748219 738845 701223 742943 760788
6233 760788 695253 697217 713432 701709 697863 769877 680088 689069 766683 709618 611990 708599
6221 708599 675920 600203 600226 558944 556796 624788 624782 616701 594140 700243 778742 685066 631782
6208 631782 638741 656185 732917 777657 796431 804406 697751 713880 776919 760870 802794 843007
6196 843007 749547 718682 680369 642905 706326 738118 686176 753414 782744 716615 757860 820688
6184 820688 765286 740088 801171 815323 728481 760334 837261 808653 834902 860532 817138 829043
6172 829043 808751 731314 693766 743374 836872 823734 807418 780718 782866 809959 807923 840431
6160 840431 855032 875805 850422 788184 800203 826241 854525 848353 854034 932551 910023 847046
6148 847046 847135 880306 899362 950329 991657 935426 947793 903174 837042 889542 963016 1001196
6136 1001196 914671 946190 1011997 1044737 1047298 1079622 1122801 1125424 1160979 1198723 1152901 1055376
6124 1055376 1048857 1100494 1133590 1093371 1105138 1097755 1179938 1180108 1128375 1127353 1122810 1158056 1250684
6111 1250684 1256482 1233554 1254341 1315982 1275158 1268587 1179834 1207733 1264840 1265563 1271843 1217875
6099 1217875 1262099 1307693 1317716 1284587 1319966 1389841 1321661 1203725 1228787 1294312 1224801
6088 1224801 1212807 1196958 1201523 1218060 1148260 1185607 1230137 1147883 1122149 1186390 1122069 1142756
6076 1142756 1201574 1248405 1203512 1082789 1114740 1186087 1145699 1076406 1092569 1136449 1079673
6065 1079673 1095597 1088746 999636 1003225 974437 994244 1040589 1060481 1019956 1052871 1025684 957199
6053 957199 1015737 1117768 1105756 948999 936946 1013978 968963 920104 1050173 968370 867728
6042 867728 943482 902331 922550 981052 992564 1016935 928724 888874 942607 908339 875461 823189
6030 823189 823732 932499 942735 927965 925415 973215 913845 923284 966185 985888 965086 924341
6018 924341 982122 951390 871738 889549 876241 890015 960136 962592 900480 943485 851577 785318
6006 785318 841729 914213 955795 942106 908325 968308 917427 764521 809332 884244 869225
5995 869225 904057 1004311 959349 909861 907821 918443 899998 935477 905969 903327 954171 971672
5983 971672 933716 894984 912656 819694 832284 892014 819173 879507 901863 893042 911374 914334
5971 914334 850933 868229 861976 868431 922682 885786 886507 924682 882577 792707 828873 847949
5959 847949 880945 900557 890761 937174 914945 829814 845468 869615 835889 873330 902425 938319
5947 938319 913748 943572 1025362 928213 963237 1001995 933361 923510 932608 1019341 1040222 943193
5935 943193 934737 869572 936267 1015303 959652 936501 901356 922723 920756 874462 993961 1010648
5923 1010648 976211 999893 961478 909893 920230 905848 850987 859611 975910 1016726 1022577 1005683
5911 1005683 1074682 1041141 974398 997099 1006471 1054954 1051945 1004416 986204 1035330 1025256 988820
5899 988820 938275 1003359 931736 946028 1002840 1038837 1071426 1111822 1061835 962634 1024707 997535
5887 997535 933728 1090233 1137612 1136746 1125903 1133971 1083248 1038213 1050093 1119236 1132581 1028542
5875 1028542 1078477 1074485 1075971 1008287 1071236 1154963 1192028 1145341 1077705 1084982 1088137 1137420
5863 1137420 1103753 1129702 1117260 1128605 1022461 1086374 1168045 1173744 1116009 1100618 1045783
5852 1045783 1075854 1114183 1160593 1102341 1025493 1079532 1082750 1051139 1121301 1137374 1107954 1108510
5840 1108510 1123805 1144532 1230886 1227689 1127669 1238663 1274709 1213296 1162723 1174868 1161596
5829 1161596 1114835 1169994 1211475 1169927 1201727 1204037 1213922 1182678 1173501 1228004 1179644 1132925
5817 1132925 1212421 1265360 1309776 1294211 1222073 1262148 1293543 1289426 1293248 1270273 1193064 1140704
5805 1140704 1214136 1287105 1350490 1225792 1242075 1280722 1266725 1223805 1270841 1211558 1216071
5794 1216071 1256514 1225153 1202943 1300836 1340140 1286871 1326967 1369639 1300382 1243250 1286492
5783 1286492 1281082 1227358 1285459 1248610 1207593 1208962 1309862 1311639 1256753 1293636 1257642 1312822
5771 1312822 1252284 1201700 1280957 1275586 1339744 1387971 1367284 1359917 1346641 1318398 1268394 1308070
5759 1308070 1362154 1296616 1355356 1349063 1288554 1324612 1347575 1393932 1391193 1306286 1292123 1392158
5747 1392158 1484805 1450135 1432118 1467681 1425791 1323271 1363879 1336634 1337436 1335338 1329009 1391291
5735 1391291 1363480 1391794 1427627 1474289 1394317 1465439 1395514 1412996 1477223 1418461 1451346
5724 1451346 1496419 1477805 1435420 1427707 1466427 1481655 1477925 1448345 1573015 1595326 1520993 1441835
5712 1441835 1498729 1415904 1412606 1422762 1471724 1563534 1543534 1529022 1484781 1489357 1516563 1567221
5700 1567221 1521043 1556816 1577583 1554759 1575519 1562788 1632592 1651771 1662678 1683289 1601945
5689 1601945 1602416 1643690 1643769 1676658 1700256 1715749 1660187 1699120 1723360 1713494 1734424 1696850 1704098
5676 1704098 1719189 1779710 1653032 1606884 1681595 1692738 1687217 1679664 1682536 1753440 1776947 1710181
5664 1710181 1718176 1709567 1703263 1665938 1715578 1742289 1792657 1791444 1723859 1762954 1865484 1920550
5652 1920550 1847465 1784667 1736784 1804768 1830725 1821589 1866543 1871994 1846142 1836992 1796560 1904792
5640 1904792 1807394 1800007 1862049 1814948 1835832 1827047 1781835 1822163 1881029 1868941 1876380 1876870
5628 1876870 1871103 1872400 1938514 1924599 1882718 1919777 1922762 1889991 1943932 1977852 1945808 1955983
5616 1955983 1998402 2039424 1964329 1918439 1990101 1941093 2018813 2033099 2001112 2062365 2081335
5605 2081335 1990237 2019968 1988048 2004974 1994186 1979213 1969036 2009952 1981255 1995084 2073100
5594 2073100 2029945 2058634 2090572 2103806 2012246 2120473 2184264 2108327 2001178 2013408 1966667
5583 1966667 1995631 2041464 2066117 2035122 2129192 2087400 2012588 2129903 2131396 2141297 2139187 2100155
5571 2100155 2025919 2094742 2123059 2093328 2123844 2089693 2047123 2094680 2159166 2157239 2104959 2138100
5559 2138100 2170332 2197027 2190996 2175984 2132885 2044980 2093203 2191250 2193916 2164496 2183651 2173459
5547 2173459 2167318 2156306 2208178 2222682 2177149 2202452 2210923 2202108 2282690 2345222 2338849 2245204
5535 2245204 2209485 2185538 2188296 2159477 2224586 2258148 2239779 2256824 2241189 2268589 2266848 2294110
5523 2294110 2299505 2298505 2278911 2258108 2243220 2278601 2331044 2364982 2366304 2391958 2391168 2345730
5511 2345730 2318330 2365850 2467588 2453444 2316272 2321864 2343147 2329262 2385254 2423294 2470742
5500 2470742 2458521 2471122 2425597 2370438 2383337 2435615 2476065 2475846 2450987 2484700 2507919 2444895
5488 2444895 2400254 2452969 2513883 2556722 2541390 2514683 2520208 2545670 2555578 2652509 2515686 2548229
5476 2548229 2543457 2510240 2630319 2597415 2518105 2499581 2541637 2526043 2626705 2627604 2574425 2625881
5464 2625881 2669861 2653629 2756147 2695381 2670346 2682858 2717680 2668388 2664094 2715916 2720188 2744574
5452 2744574 2838449 2890092 2878803 2780581 2822617 2849066 2909783 2815023 2905620 3027363 2949037
5441 2949037 2850468 2860451 2869050 2833966 2835502 2815218 2875871 2931023 2971323 3085382 3094243 2980532
5429 2980532 2895112 2862436 2948766 3057208 2985428 3005140 3121397 3024013 3111868 3135501 3139518
5418 3139518 3116484 3116387 3137415 3049291 3057327 3013210 3038402 3089115 3126556 3021387 2968163 3054631
5406 3054631 3055851 3032877 3046720 3207397 3147464 3042894 3006878 3024562 3024008 3154100 3138038
5395 3138038 3077111 3088312 3081417 3100682 3151989 3187438 3168509 3157240 3224031 3226371 3162785 3197892
5383 3197892 3175801 3101172 3106057 3155297 3211761 3181305 3227962 3202908 3203887 3183578 3234924 3226269
5371 3226269 3185797 3210230 3190448 3177998 3251073 3210222 3172016 3333883 3374549 3315903 3249791
5360 3249791 3340906 3348262 3376391 3345047 3281523 3306913 3386071 3350502 3283401 3322755 3411783 3369172
5348 3369172 3339878 3345680 3261176 3240963 3359745 3339294 3319332 3416271 3472399 3416436 3342409
5337 3342409 3440423 3458594 3433968 3398280 3389807 3355505 3384305 3457806 3442089 3364640 3390103 3475453
5325 3475453 3447407 3465132 3486361 3498049 3544107 3577473 3592060 3572770 3563256 3588863 3553217 3551245
5313 3551245 3600891 3594064 3532408 3504234 3559735 3557864 3553560 3553715 3456717 3553094 3551874 3512656 3583185
5300 3583185 3546768 3541721 3531577 3613843 3674099 3686855 3602984 3574045 3575413 3636857 3746427 3752642
5288 3752642 3692790 3692352 3795108 3791659 3738776 3716160 3677816 3672200 3727442 3680048 3728041 3842681
5276 3842681 3849500 3845886 3795849 3789104 3766192 3827806 3839083 3885434 3890614 3840873 3888088 3802652
5264 3802652 3860082 3910679 3920339 3923296 3905191 3949679 4006234 3962283 3995191 4007830 4006958 4102998
5252 4102998 4140625 4102119 4026239 4044777 4044441 3978814 4028231 4060306 4121497 4107420 4077308 4137566
5240 4137566 4140149 4098052 4140263 4196467 4187958 4187927 4232339 4288730 4275459 4221731 4283204 4363849
5228 4363849 4379112 4423796 4359322 4337112 4291221 4347765 4425316 4342542 4323128 4401641 4381337
5217 4381337 4359915 4361960 4493072 4533996 4541221 4494970 4526574 4595302 4522993 4561959 4605082 4573471
5205 4573471 4502614 4548698 4637767 4592967 4693352 4642179 4650651 4737903 4685029 4676424 4671322 4711974
5193 4711974 4675893 4677606 4652875 4735617 4759091 4851449 4853635 4918077 4845057 4889999 4978222 4959224
5181 4959224 4882488 5004407 5023080 5016484 5054637 5008806 5090964 5050392 4974304 5007274 5138935
5170 5138935 5090491 5115787 5128383 5126006 5240461 5213962 5196108 5288238 5289577 5318198 5359267 5396877
5158 5396877 5336779 5297172 5326569 5359109 5396558 5422871 5407807 5401199 5470533 5538483 5531634 5602749
5146 5602749 5630026 5592108 5604799 5615391 5641720 5676925 5744194 5808860 5867161 5834263 5784149
5135 5784149 5950035 5936702 5930849 5959830 6039861 6079795 6102691 6137978 6146279 6097804 6116397 6164853
5123 6164853 6162003 6203914 6263190 6261712 6303913 6370064 6334070 6349709 6491635 6536506 6563517 6522393
5111 6522393 6510173 6600458 6574004 6582698 6642780 6700990 6744296 6820791 6785101 6803025 6839757 6865960
5099 6865960 6841571 6904784 6889314 6935189 7008926 7009408 7002209 6952746 7017921 7112933 7141384 7152575
5087 7152575 7218288 7252881 7220566 7279604 7314347 7447355 7478088 7448557 7376014 7359262 7509467
5076 7509467 7546356 7485684 7521058 7556023 7616403 7691968 7725603 7782614 7806917 7780300 7856150
5065 7856150 7995323 7942535 7985848 7984974 7995440 8100485 8156302 8194722 8306026 8303259 8342369
5054 8342369 8380068 8385801 8448053 8486920 8566253 8605751 8650333 8700351 8711956 8838828 8937195
5043 8937195 9025549 9031929 9004263 9041652 9099449 9163937 9207158 9298448 9367788 9381242 9500296
5032 9500296 9550481 9623119 9653474 9721097 9870369 9801860 9803811 9942825 9936296 10043671 10148128
5021 10148128 10200295 10290066 10264063 10349142 10372290 10431927 10495659 10666223 10803323 10820722 10878326
5010 10878326 10954539 11063366 11225664 11291622 11392490 11429510 11495573 11711574 11784210 11832833
5000 11832833 11972339 12059016 12076957 12198192 12268815 12478916 12583635 12711438 12819579 12824603
4990 12824603 12972724 13039839 13143774 13219100 13423197 13569728 13703443 13821016 13872207 13884466
4980 13884466 14044724 14159312 14191972 14271975 14332872 14446764 14557148 14588113 14663132 14742734
4970 14742734 14865875 14893430 14964134 15030299 14951413 15024418 15106913 15156367 15215657 15195805 15201845
4959 15201845 15318616 15426940 15504136 15513675 15597399 15595415 15648373 15691051 15817140 15877843 15856910
4948 15856910 15849524 15839849 15921450 16021075 16002066 16152931 16295918 16311574 16388870 16517044 16657630
4937 16657630 16758775 16849808 16883719 16941299 17077157 17183029 17352200 17415143 17525545 17666605
4927 17666605 17846490 17887548 17937702 18107735 18200149 18371235 18452511 18558526 18719774 18753483
4917 18753483 18798598 19021643 19096661 19143729 19249249 19328052 19415712 19443396 19435136 19551496 19607345
4906 19607345 19642489 19659841 19631004 19656469 19715280 19718156 19700865 19681308 19767106 19701310 19635733
4895 19635733 19645698 19658703 19627356 19580170 19532597 19454764 19421804 19337090 19265774 19208755 19115218
4884 19115218 19095110 19005928 18917305 18708914 18655703 18693438 18623230 18543878 18436475 18311884 18280459
4873 18280459 18176295 18116628 18107312 18037576 17941414 17940198 17978482 17912211 17900177 17839574 17782633
4862 17782633 17758390 17780989 17778624 17758254 17748241 17686676 17681382 17698208 17667957 17744098 17664264 17649796
4850 17649796 17696961 17705067 17644785 17662657 17700924 17679365 17726058 17797819 17746417 17806368 17855182
4839 17855182 17799746 17905318 17969507 17961724 17994702 18053106 18119587 18176935 18225912 18216166 18258595
4828 18258595 18313134 18349770 18408616 18433363 18466165 18573413 18597877 18646429 18885063 18992132 18960780
4817 18960780 19018815 19098044 19167930 19238926 19399725 19471641 19559458 19678210 19852925 19875323 19971025
4806 19971025 20003832 20096593 20255489 20344209 20421931 20490637 20649892 20768261 20817465 20904117 21138981
4795 21138981 21243869 21337613 21477549 21642349 21756464 21951254 22080033 22246913 22448455 22544284
4785 22544284 22774155 22923300 23105872 23313091 23389983 23464658 23633435 23851270 24066942 24263767
4775 24263767 24430268 24549404 24760600 24997298 25160356 25386835 25649028 25839827 26006139
4766 26006139 26311153 26443203 26578092 26809554 27079444 27306528 27557369 27786018 27905506
4757 27905506 28025774 28257323 28450289 28662391 28967272 29171913 29301803 29495753 29744415
4748 29744415 29992339 30109291 30263766 30486518 30670707 30947562 31115034 31254475 31502145
4739 31502145 31716049 31846602 32057925 32355725 32453537 32655420 32926433 33179824 33412606 33593783
4729 33593783 33892441 34130447 34283019 34515931 34709179 34900557 35184571 35319784 35475939
4720 35475939 35719671 35941525 36066045 36292069 36552036 36644234 36878364 37148014 37374989 37535614
4710 37535614 37837808 37987617 38126764 38284176 38466755 38662296 38814252 39056763 39181974
4701 39181974 39309205 39540285 39815755 40061306 40158901 40366313 40629802 40754350 40926255 41136827
4691 41136827 41388798 41671349 41870983 42022301 42296502 42642775 42896300 43110557 43347388
4682 43347388 43602105 43829869 44064643 44371264 44616841 44923958 45320249 45625912 45861103
4673 45861103 46206737 46501447 46773233 47158515 47533850 47809647 48157239 48491254 48759213
4664 48759213 49100832 49441289 49845631 50229886 50612395 51043663 51434361 51846577 52297582
4655 52297582 52587883 52915218 53338799 53818377 54273982 54669629 55179256 55543547 55973533
4646 55973533 56401769 56806782 57310721 57799971 58150002 58567327 59098141 59626764 60052960
4637 60052960 60549426 60983414 61442312 61922860 62460663 63031766 63581054 64096839 64694395
4628 64694395 65223884 65765335 66347095 66955351 67564356 68154971 68820694 69521730 70259375
4619 70259375 70893767 71430319 72105956 72929130 73701616 74374056 75161929 75985372 76699483
4610 76699483 77540714 78366010 79160248 79951626 80871094 81699106 82488633 83457609 84474676
4601 84474676 85319073 86282518 87375329 88284698 89272186 90298912 91424262 92520429 93674733
4592 93674733 94790883 95877626 96999394 98154130 99331031 100549330 101798467 103079189
4584 103079189 104270756 105627009 107027611 108280036 109636229 110982465 112484236 113897250
4576 113897250 115447313 116977130 118444578 120016336 121651880 123195867 124907096 126694734
4568 126694734 128347394 130081044 131933377 133725878 135641653 137560496 139530798 141511974
4560 141511974 143574692 145672543 147761518 149935457 152164356 154370615 156678252 159072201
4552 159072201 161557820 163952107 166403952 169056410 171707889 174383338 177041641 179779170
4544 179779170 182617959 185575598 188605574 191584857 194663368 197840091 201141379 204353274
4536 204353274 207721661 211339905 214747731 218280446 221928739 225626912 229393403 233315628
4528 233315628 237195828 241080307 245181297 249304639 253493937 257799310 262109994 266523472
4520 266523472 270978962 275558140 280165745 284815774 289508219 294152029 298857732 303677334
4512 303677334 308511267 313329606 318207450 323077528 327855853 332582824 337327606 342084240
4504 342084240 346798364 351435136 355947311 360306186 364654122 368917681 372988032 376876278
4496 376876278 380670041 384351781 387722527 390850028 393830994 396546348 398955151 401155399
4488 401155399 403009437 404623828 405994925 407028503 407755973 408154203 408284275 408170927 407579792
4479 407579792 406674803 405598844 404225337 402389974 400344575 398064394 395473365 392647485
4471 392647485 389650872 386487333 382993707 379243576 375438292 371413140 367199977 362881983
4463 362881983 358646669 354159073 349490048 344846573 340086276 335244837 330484063 325665422
4455 325665422 320781804 315961416 311105389 306282705 301480151 296688518 291894202 287195796
4447 287195796 282574360 277943152 273194837 268732849 264361859 259921352 255546628 251254970
4439 251254970 247001156 242806433 238797614 234789873 230700330 226895682 223064580 219237389
4431 219237389 215581852 211968277 208377844 204851896 201415986 198112099 194785374 191540581
4423 191540581 188426491 185332522 182257486 179342799 176311414 173361470 170656939 167914275
4415 167914275 165099521 162525769 160024959 157387629 154908979 152433881 150022261 147685135
4407 147685135 145401055 143166019 140931162 138766822 136597981 134539580 132548159 130541560
4399 130541560 128579505 126663913 124821870 123013843 121298065 119593812 117895666 116217789
4391 116217789 114487191 112894526 111261031 109748723 108191104 106659804 105182245 103878881
4383 103878881 102564442 101083107 99771405 98427447 97196534 95911212 94711660 93481396
4375 93481396 92209456 90990349 89845122 88810577 87648918 86484548 85491532 84534337
4367 84534337 83534205 82448483 81403861 80519747 79586884 78593561 77750431 76850362 75982083
4358 75982083 75203546 74377116 73496312 72718391 72020885 71272630 70526603 69843230 69316922
4349 69316922 68625492 67841817 67275085 66667737 66090942 65504695 64977265 64428750 63915126
4340 63915126 63396308 62845123 62409043 62021863 61505457 61081486 60725205 60325632 59911508
4331 59911508 59604300 59285915 58958041 58627687 58417762 58159287 57939430 57729105 57470502
4322 57470502 57282934 57090032 56922438 56770023 56675245 56609897 56470359 56441154 56470529 56457581
4312 56457581 56514165 56494033 56477561 56471054 56487907 56614162 56655657 56758870 56872427 57023680 57188533
4301 57188533 57395135 57551628 57564132 57744666 57846152 58043659 58201787 58290147 58352617 58490848
4291 58490848 58559349 58606559 58696566 58695235 58644103 58618626 58468251 58331915 58177040 57972213 57661890
4280 57661890 57337385 57010763 56615415 56198026 55667031 55120666 54626018 54018544 53376203
4271 53376203 52816684 52211496 51576158 50809539 50151645 49409785 48719107 48052909 47308273
4262 47308273 46567451 45871419 45105216 44408087 43791202 43150075 42539800 41799428 41193695
4253 41193695 40552537 39985766 39371286 38774168 38266423 37756891 37168902 36626202 36043144
4244 36043144 35632422 35187605 34750301 34349617 33874160 33376771 32960914 32543202 32169628
4235 32169628 31727003 31264164 30915618 30577734 30194235 29936853 29560784 29238271 28931149
4226 28931149 28598961 28282320 27944403 27736270 27467867 27074487 26716253 26486501 26276559
4217 26276559 26046335 25787908 25477688 25139257 24908245 24724790 24492800 24217236 24079664
4208 24079664 23826835 23631824 23409945 23228076 23010743 22838254 22596054 22418175 22164491
4199 22164491 21980256 21826543 21639023 21443220 21175630 21000989 20830758 20685483 20559053
4190 20559053 20370499 20281153 20179454 19993887 19720623 19540127 19460657 19334999 19232224 19113809
4180 19113809 18961008 18905657 18711150 18560029 18416267 18208324 18170170 18044525 17957777 17820473
4170 17820473 17730069 17754764 17681035 17536353 17362813 17234948 17135207 17063668 16955595 16810372
4160 16810372 16838065 16733196 16533301 16318923 16187431 16201110 16182468 16129574 16094341 15971701
4150 15971701 15892778 15837994 15725954 15597479 15525811 15438364 15461821 15404180 15238619 15219910 15130736
4139 15130736 15119147 15089408 15058619 15077228 14994250 14863864 14781401 14646884 14574878 14540026 14530395
4128 14530395 14432209 14420436 14387672 14339617 14297882 14177436 14135927 14120510 14143474 14078104 14083365
4117 14083365 14091362 14010762 13955760 13959752 13911273 13819130 13778831 13701736 13714468 13746309 13732397 13702117
4105 13702117 13628477 13533851 13520260 13499162 13467242 13466257 13445152 13451053 13456209 13376909 13317587 13405763
4093 13405763 13383423 13322599 13287361 13248440 13346255 13352234 13286281 13287117 13201858 13253876 13200885 13153004
4081 13153004 13136949 13098891 13110137 13075760 13178624 13126302 13109734 13072489 12977079 12977626 13071560
4070 13071560 13062081 13000395 13002020 13136168 13162293 13089289 13057427 12989440 12966827 12964769 12978148 12925264
4058 12925264 12866366 12897575 12900389 12862281 12889079 12873150 12792307 12793083 12760103 12756826 12780976 12803509
4046 12803509 12747989 12642246 12708663 12646671 12634645 12602744 12563376 12570041 12658639 12577778 12543298
4035 12543298 12467398 12464923 12420798 12278993 12277076 12304309 12338328 12354607 12300229 12263998 12097719
4024 12097719 12051738 12106284 12082676 11985454 11994327 12011395 11931139 11969441 11883919 11809376 11764175
4013 11764175 11734566 11722958 11676738 11565857 11506346 11480848 11458644 11418057 11358790 11342403 11312675
4002 11312675 11153089 11108802 11091267 11049579 10979909 10931646 10831599 10701754 10627421 10563165 10613239
3991 10613239 10492136 10387622 10347546 10310502 10238089 10103372 10079450 10106636 10026180 9967274 9845457
3980 9845457 9834598 9845804 9803809 9718701 9700535 9605059 9566197 9632905 9560468 9551769 9480802 9468958
3968 9468958 9464613 9357105 9332376 9340860 9337582 9322820 9164567 9164886 9176691 9174719 9156886 9061160
3956 9061160 9014957 8957466 8977880 8950053 8951193 8967497 9003691 9084525 8960526 8845333 8882354
3945 8882354 8909816 8755956 8772730 8764969 8817843 8886439 8878286 8752090 8736102 8817492 8790346
3934 8790346 8755319 8715056 8685200 8669015 8706027 8673166 8634301 8640249 8635477 8646963 8683040 8685396
3922 8685396 8707155 8665826 8678594 8674467 8681076 8734101 8630826 8657196 8693687 8709097 8698867 8688403
3910 8688403 8718344 8778909 8729477 8778205 8824294 8802672 8814546 8855042 8847198 8929110 8970080 8932108
3898 8932108 8945254 8992099 9048740 9116683 9013046 9082539 9187710 9145525 9141777 9156631 9284667
3887 9284667 9282613 9354197 9404173 9394913 9512143 9600383 9581900 9627983 9688488 9737990 9737507 9813680
3875 9813680 9833686 9845784 9924841 9963765 10031603 10116843 10186243 10197305 10225663 10313166 10349633
3864 10349633 10387871 10436773 10473022 10530395 10626551 10730235 10790734 10749319 10786057 10904609 10981635
3853 10981635 10944160 11042349 11132601 11147669 11164526 11188501 11204187 11305838 11437726 11462610 11418868
3842 11418868 11617036 11670472 11675464 11672272 11727239 11834801 11799662 11832450 11913968 11948505 11943265
3831 11943265 11997835 11988242 12011721 12058054 12091993 12098322 12224644 12317413 12306778 12244990 12339669
3820 12339669 12401995 12399867 12436476 12429954 12500875 12506433 12544834 12606709 12649851 12719170 12752168 12827594
3808 12827594 12861334 12823349 12931186 12933724 12962677 13044828 13082430 13169370 13160193 13177828 13316922
3797 13316922 13319969 13401442 13498878 13546990 13633432 13633461 13759018 13908705 13865750 14013403 14173638
3786 14173638 14233437 14310498 14314204 14375383 14447371 14583570 14804606 14805962 14931681 15056432 15178740
3775 15178740 15295081 15381500 15521928 15592720 15772927 15919871 16056739 16244917 16478254 16549423
3765 16549423 16744074 16997749 17142942 17252232 17469844 17704261 17909578 18108842 18301527
3756 18301527 18592125 18907884 19132967 19408912 19690557 19966464 20283814 20540629 20839158
3747 20839158 21247248 21546220 21969522 22413620 22783025 23183400 23634678 24093967 24431942
3738 24431942 24892750 25482274 25924176 26409683 27092549 27577031 28002023 28590716 29039459
3729 29039459 29523780 30029608 30507695 30987854 31507727 31966694 32357013 32642610 32977561
3720 32977561 33341463 33573347 33727227 33916931 33990718 33988906 34004796 33995468 33896855 33735850 33525036
3709 33525036 33258168 33042046 32861860 32663161 32393826 32240513 32042118 31811037 31563954
3700 31563954 31406262 31256911 31146429 31065964 30951399 30754491 30664942 30653224 30573903 30442850
3690 30442850 30353322 30286411 30257650 30165367 30154522 30196261 30043450 29967899 29953547 29970404 29966363
3679 29966363 29911074 29848460 29826286 29844789 29846318 29840615 29849328 29775064 29743829 29763546 29784098 29807462
3667 29807462 29797525 29841896 29894491 29890479 29851617 29793630 29804415 29837227 29838713 29796184 29829121 29737198
3655 29737198 29702580 29716484 29727157 29676648 29657755 29594811 29505081 29630242 29646800 29553587 29476338
3644 29476338 29451141 29407295 29387146 29383216 29438961 29424313 29433202 29473011 29482858 29470431 29443957 29423757
3632 29423757 29386541 29414893 29423454 29421824 29572820 29625893 29644542 29640315 29675851 29733065 29708993 29788010
3620 29788010 29919101 29939612 30137879 30243237 30249915 30384468 30420349 30572192 30746337 30931599
3610 30931599 31094947 31226780 31411250 31598297 31764660 32028048 32295831 32467332 32673703
3601 32673703 33011789 33301970 33548653 33980858 34305888 34684359 35162222 35518363 35842462
3592 35842462 36289303 36875851 37303933 37701022 38264633 38738569 39129462 39752314 40317741
3583 40317741 40822002 41405068 41920264 42293858 42685117 43346394 43884390 44265247 44668995
3574 44668995 45093270 45219702 45461883 45883776 46026300 46116976 46201212 46351550 46333499 46310235
3564 46310235 46333084 46176305 46013891 45870276 45769486 45596943 45465407 45291381 45027553 44922660
3554 44922660 44740266 44507408 44388741 44355711 44203039 43989919 43862618 43732554 43462591 43298823
3544 43298823 43233594 43133819 42991541 42845218 42649874 42383759 42318868 42208935 41986480 41789205
3534 41789205 41647553 41434229 41276248 41123869 40946606 40525526 40353669 40289687 40030118 39795266
3524 39795266 39591343 39236143 38975817 38867788 38617298 38351131 38101051 37812614 37483296
3515 37483296 37192121 36948036 36544683 36297198 36073662 35767159 35567428 35321434 35057286
3506 35057286 34772472 34627019 34348634 34087488 33815803 33590451 33281785 32987400 32813325
3497 32813325 32596177 32370262 32207996 31999621 31783384 31627738 31514328 31209917 30997327
3488 30997327 30855557 30717114 30563590 30455429 30366400 30136579 30054033 29989878 29899775 29823135
3478 29823135 29731428 29620915 29555784 29647430 29612658 29532116 29575787 29561168 29414662 29438873 29535223
3467 29535223 29557641 29466004 29570176 29742758 29758593 29890768 30018780 30098858 30201171 30303406
3457 30303406 30437525 30533372 30738138 30907600 30971715 31140489 31372512 31642268 31873781 32073557
3447 32073557 32327310 32508342 32815154 33153271 33436498 33718559 34054040 34502915 34870174
3438 34870174 35278617 35647138 36068417 36583944 37098204 37519377 37999290 38635578 39185445
3429 39185445 39619096 40216537 40758182 41336196 41932864 42662905 43350564 44035660 44686015
3420 44686015 45373021 46153512 46960904 47729630 48486965 49299811 50108565 50925337 51750311
3411 51750311 52542793 53384000 54061348 54788815 55586543 56281060 57021808 57714711 58301195
3402 58301195 58780766 59343224 59789466 60206630 60682404 61071207 61233828 61339384 61429937 61468878
3392 61468878 61431462 61380653 61233033 61067233 60826117 60610919 60395349 60187865 59847673 59523367
3382 59523367 59277996 59075914 58791810 58477749 58190699 57955725 57744298 57529279 57334994
3373 57334994 57139887 56835356 56582191 56356556 55964675 55669783 55344569 54962981 54644589
3364 54644589 54295360 53884165 53392824 52903290 52451838 51886515 51350173 50868184 50292425
3355 50292425 49700457 49167455 48498496 47926892 47360799 46678748 46030972 45494639 44864635
3346 44864635 44288833 43583683 42922783 42411561 41819932 41100375 40507486 39956149 39392792
3337 39392792 38826050 38313099 37786014 37294530 36694076 36211095 35800500 35358049 34973952
3328 34973952 34652012 34329171 33829615 33464909 33229117 32878243 32554962 32321269 32102087
3319 32102087 31837263 31602848 31496510 31328872 31180191 31060166 30875296 30750684 30565354
3310 30565354 30501097 30463408 30384434 30414770 30291952 30265858 30301538 30191220 30168629 30240268 30291927
3299 30291927 30425242 30488516 30643207 30682137 30701064 30824897 30942605 31063461 31258999 31455138
3289 31455138 31592517 31878838 32194983 32384178 32653004 32989687 33247650 33541149 33936696
3280 33936696 34325612 34689600 35052252 35540939 36067630 36581030 37034811 37458093 38009558
3271 38009558 38659007 39238975 39812022 40545633 41270902 41983455 42795000 43531957 44256466
3262 44256466 44905618 45663232 46480392 47229014 47953099 48729961 49405637 50169391 50846552
3253 50846552 51447227 51995763 52561284 53105524 53499681 53913286 54113780 54322985 54445012
3244 54445012 54367515 54281746 54073932 53924507 53636219 53225619 52824614 52156763 51488915 50684123
3234 50684123 49933640 49079639 48208365 47430093 46580653 45692609 44766667 43837284 42834104
3225 42834104 42004928 41304956 40462737 39609206 38783728 38052850 37273107 36516550 35876051
3216 35876051 35153400 34456300 33854987 33127855 32431190 31801667 31276586 30680674 30155755
3207 30155755 29669606 29050619 28591836 28012887 27487278 26969777 26559117 26087865 25620296
3198 25620296 25233370 24793753 24389021 24068494 23700005 23320031 23043456 22733806 22377961
3189 22377961 22030712 21725617 21362189 21019185 20763222 20520625 20175845 19870630 19684409
3180 19684409 19439833 19154214 18926251 18654145 18454490 18290629 18022287 17858813 17653933
3171 17653933 17356164 17176091 17056920 16846344 16632029 16515407 16437730 16193464 16076490 15919159
3161 15919159 15753698 15594057 15334238 15235843 15159350 15017204 14914499 14804508 14751526 14595971
3151 14595971 14460781 14329796 14214789 14164709 14002640 13933465 13923998 13841590 13746446 13689222 13526568
3140 13526568 13511105 13455126 13398262 13277162 13191439 13117069 13119166 13092194 12948439 12812189 12742674
3129 12742674 12601729 12531669 12463565 12378332 12371335 12303705 12186789 11984006 11937217 11925523 11900842
3118 11900842 11847157 11770392 11689467 11602605 11596829 11482212 11503773 11396022 11311686 11194640 11124392
3107 11124392 11042377 10944374 10911447 10930997 10942301 10867394 10908421 10850376 10787006 10820751 10745174
3096 10745174 10649725 10599106 10634206 10556374 10455903 10427389 10385942 10321938 10287463 10289190 10247520
3085 10247520 10244557 10260881 10341222 10296635 10305563 10369597 10371075 10331711 10335792 10303412 10341902 10374178
3073 10374178 10326279 10349139 10395863 10311702 10308096 10346369 10295439 10298403 10399722 10395901 10373418 10416062
3061 10416062 10458342 10489985 10455933 10463041 10416447 10439403 10450666 10352959 10378105 10437007 10452500
3050 10452500 10397646 10308622 10389194 10389257 10333182 10388064 10395049 10433951 10413644 10440887 10427562 10386641
3038 10386641 10334698 10260511 10312022 10379447 10419628 10474082 10450913 10445365 10473465 10416206 10429603
3027 10429603 10518197 10513225 10532786 10544269 10572304 10572274 10567283 10623800 10608432 10664956 10765186 10663489
3015 10663489 10697629 10712910 10765062 10870480 10876150 10831611 10846046 10954812 10979114 10911133 10835495
3004 10835495 10807640 10826807 10859125 10934561 10884831 10860297 10814516 10789144 10753593 10714271 10790078
2993 10790078 10819977 10735085 10684698 10818596 10811105 10690191 10695750 10633746 10697669 10690490 10648547
2982 10648547 10640016 10678428 10719107 10656792 10645549 10703433 10697090 10725525 10730453 10663372 10699236 10796695
2970 10796695 10777089 10719144 10747931 10817245 10873295 10914184 11030647 10972308 10949907 11083390 11189492
2959 11189492 11188801 11238724 11376078 11414993 11401989 11513966 11571477 11617981 11747796 11869735 11991348
2948 11991348 12058541 12105932 12258977 12377155 12598257 12652142 12761070 12815407 12956209 13071039
2938 13071039 13317943 13462649 13604167 13667455 13835557 14075242 14267897 14440376 14721693 14844240
2928 14844240 14964989 15226020 15422675 15659589 15963918 16169290 16324713 16658939 16961369
2919 16961369 17236881 17559529 17975661 18168126 18503644 18917757 19244870 19498400 19847624
2910 19847624 20297520 20678430 21042515 21428895 21829970 22353252 22768355 23234657 23667168
2901 23667168 24195946 24732087 25130827 25641327 26261058 26723765 27206201 27837703 28432522
2892 28432522 28882577 29437963 30051524 30637079 31240375 31872753 32467688 33016900 33644220
2883 33644220 34284922 34826877 35393295 35950762 36509802 37175721 37741340 38223938 38786086
2874 38786086 39289921 39867667 40309707 40770202 41299352 41640104 42029787 42419429 42794987
2865 42794987 43134171 43509445 43735863 43967506 44182149 44405802 44539171 44615838 44689823 44718852
2855 44718852 44713888 44761445 44734583 44603129 44511578 44397847 44208980 43948608 43619527 43453455
2845 43453455 43189778 42904508 42558078 42169838 41787401 41301505 40815736 40414592 40026868
2836 40026868 39519390 38993230 38567314 38088679 37623635 37094638 36495265 35998384 35477530
2827 35477530 34924566 34322604 33782293 33270829 32778480 32210628 31651400 31155058 30584729
2818 30584729 30101047 29647841 29076486 28583155 28185090 27639075 27154761 26702167 26201019
2809 26201019 25799831 25336447 25002471 24508704 24047674 23631715 23326688 22892443 22477373
2800 22477373 22049314 21670093 21380005 21019856 20626256 20385910 20126587 19762098 19418771
2791 19418771 19171323 18875821 18585865 18289670 18009543 17787217 17573829 17327547 17041782
2782 17041782 16814263 16546561 16363381 16153284 15912999 15779028 15553023 15359456 15200481
2773 15200481 15029080 14872266 14696410 14530632 14357409 14260501 14094559 13891977 13765463 13646256
2763 13646256 13493164 13349759 13219083 13135348 12995357 12838159 12746335 12646214 12470005 12433181
2753 12433181 12351568 12149406 12120917 12102420 11921171 11843997 11741683 11631834 11576454 11477447
2743 11477447 11415683 11383287 11410091 11331925 11199469 11164621 11120370 11114258 10983487 10921464 10826774
2732 10826774 10701053 10723156 10723807 10670227 10581417 10546965 10457674 10400316 10355412 10326204 10296352
2721 10296352 10262246 10343084 10334348 10277894 10302826 10162444 10111285 10078358 10015317 10075296 10064526
2710 10064526 10034961 9914848 9887540 9863220 9828002 9806639 9851017 9825973 9813424 9834422 9903281
2699 9903281 9782616 9788675 9843198 9789315 9820740 9806805 9724553 9744363 9826560 9794925 9820126
2688 9820126 9860978 9896411 9923416 9896924 9950830 10010184 10032327 10051092 10048167 10059780 10162122
2677 10162122 10223065 10199330 10167121 10163334 10251825 10258210 10257166 10293958 10381445 10478166 10541580 10620242
2665 10620242 10607174 10542662 10624015 10673611 10768631 10827689 10829852 10933421 10997806 10988728 10991346 11055333
2653 11055333 11179777 11178925 11191119 11202267 11194259 11272479 11267390 11362946 11331967 11391011 11463551 11490081
2641 11490081 11543660 11648280 11734110 11764296 11814901 11861527 11867772 11937682 12032946 12089439 12198010
2630 12198010 12226529 12343704 12415396 12420395 12464353 12580047 12696517 12838175 12928645 12957361 13029537
2619 13029537 13108774 13163024 13296218 13380216 13374049 13491164 13622495 13666312 13801665 13903333
2609 13903333 13984695 14137333 14250233 14286287 14404347 14406183 14480218 14681945 14796075 14980373
2599 14980373 15060634 15062332 15155097 15380529 15501845 15597955 15767065 15798796 15920686 16041920
2589 16041920 16229502 16362793 16459990 16662779 16842974 17056716 17244529 17309975 17390043 17543403
2579 17543403 17839325 18019948 18209552 18406400 18563666 18759490 18954301 19142399 19358399
2570 19358399 19629382 19891449 20042880 20242738 20555456 20842542 21001763 21301154 21646898
2561 21646898 21935756 22235590 22548810 22874410 23157382 23484166 23849739 24085830 24414617
2552 24414617 24828614 25144468 25458869 25871184 26381216 26779345 27221253 27637973 28041259
2543 28041259 28439854 28923708 29311777 29824807 30398680 30821354 31327837 31864681 32295918
2534 32295918 32749536 33325908 33891897 34407655 34906037 35488901 36053370 36650529 37252800
2525 37252800 37854183 38407994 38941740 39564021 40197819 40858110 41451685 42106729 42731038
2516 42731038 43373717 44120593 44724426 45460766 46215563 47010943 47755016 48406460 49218457
2507 49218457 49940821 50773935 51680383 52556620 53392297 54244854 55183292 56125301 57085923
2498 57085923 58007663 58962586 60117517 61223060 62361851 63416175 64600497 65750074
2490 65750074 66994913 68281533 69602776 70905191 72215856 73673556 75116695 76502934
2482 76502934 78018978 79626932 81143595 82621040 84198006 85845788 87471495 89218978
2474 89218978 90862203 92515469 94283272 96094196 97742351 99466781 101314240 103114691
2466 103114691 104934745 106617422 108321899 110091133 111806835 113541618 115357920 117029520
2458 117029520 118643217 120248896 121881164 123409699 124937931 126434564 127822645 129126253
2450 129126253 130401106 131572866 132654086 133687492 134616335 135493206 136256948 136899065 137444829
2441 137444829 137934991 138183404 138378205 138440842 138456462 138236002 137998778 137645909 137090492 136487746
2431 136487746 135798052 134981852 134029697 133121951 132060357 130817095 129582015 128324261 126834317
2422 126834317 125386182 123855278 122247110 120615684 118933422 117317569 115584643 113887548
2414 113887548 112235178 110463823 108687669 106992649 105212047 103433498 101773258 100177554
2406 100177554 98609226 97043913 95387129 93800429 92223420 90690455 89302685 87774867
2398 87774867 86239288 84868089 83474370 82199824 80892967 79542769 78246853 76972830
2390 76972830 75894658 74765587 73557422 72428233 71312560 70327067 69311770 68236430
2382 68236430 67196158 66288786 65294928 64353255 63398465 62514008 61596007 60780808 59982048
2373 59982048 59066569 58195105 57366476 56598207 55707408 54975233 54224991 53473082 52681296
2364 52681296 51905034 51319996 50616001 49972581 49325256 48639615 48025761 47386994 46675410
2355 46675410 46006286 45434585 44884455 44351761 43839887 43247654 42724684 42308156 41842082
2346 41842082 41253666 40782403 40374713 39941906 39576276 39148129 38737103 38291516 37947119
2337 37947119 37579657 37284697 36899611 36531289 36203865 35792337 35461355 35263986 34905366
2328 34905366 34564497 34234374 33908847 33506436 33202817 32972990 32578869 32233858 31940222
2319 31940222 31608093 31238103 30934860 30538822 30240686 29886677 29498726 29090421 28696757
2310 28696757 28251493 27874331 27505060 27090791 26670193 26290325 25925326 25446780 24998632
2301 24998632 24545391 24200264 23763522 23391333 22960738 22500628 22122930 21758521 21418073
2292 21418073 20997934 20600439 20271262 19916962 19631195 19418287 19073127 18712503 18380836
2283 18380836 18078870 17910550 17627932 17319420 17043260 16769009 16514352 16310738 16090017
2274 16090017 15800244 15589240 15460748 15185663 14905819 14688040 14516359 14338385 14119080
2265 14119080 13840509 13655370 13498949 13323860 13123355 12938355 12857907 12671540 12452325 12282811
2255 12282811 12064580 11868942 11769005 11667825 11508259 11370337 11303848 11157125 11047485 10903618
2245 10903618 10757465 10630643 10481990 10386269 10247282 10101595 10005265 9855666 9707661 9639960
2235 9639960 9546580 9489963 9364449 9196080 9121407 9004572 9010327 8898240 8817605 8699134 8605600
2224 8605600 8478433 8386463 8391939 8268977 8122334 8128731 8025768 7922832 7916826 7824272 7761214
2213 7761214 7778628 7742107 7596141 7427675 7394808 7350550 7242334 7258788 7198517 7114722 7082332
2202 7082332 7024545 6989909 6966125 6909271 6832976 6754544 6824941 6751431 6580354 6455426 6510328
2191 6510328 6480132 6435943 6387807 6386855 6300426 6247242 6255107 6279877 6188083 6179576 6177159 6111586
2179 6111586 6069156 6031105 6005262 5994540 5983037 5869457 5805993 5825623 5856597 5741885 5712987
2168 5712987 5669827 5622079 5593160 5602557 5574941 5549966 5622959 5562737 5413286 5504256 5466684
2157 5466684 5376235 5363693 5401979 5327297 5258568 5237085 5208189 5153063 5178976 5217311 5205039
2146 5205039 5201562 5164263 5140246 5130085 5106439 5085392 5019426 4968723 5005074 5039474 4951009 4904020
2134 4904020 4836313 4806583 4862912 4921573 4882213 4802034 4786430 4808427 4748027 4676768 4680034 4625301
2122 4625301 4628187 4595129 4525402 4495261 4485417 4450232 4382556 4387879 4386263 4428944 4387226 4378156
2110 4378156 4265254 4161929 4230443 4195739 4216010 4250716 4190464 4092183 4055222 4032024 3917757
2099 3917757 3899860 3935608 3936591 3906726 3865130 3795137 3685155 3725279 3695159 3622382 3590228 3630944
2087 3630944 3583050 3566790 3525389 3547657 3498060 3545679 3562648 3490093 3437381 3419673 3387115
2076 3387115 3367173 3308940 3305966 3236009 3260325 3298472 3213780 3180635 3126504 3052117 3024476 3034537
2064 3034537 3086649 3090919 3138624 3206007 3101560 3102588 3054438 3017477 3034734 2974085 2886702 2847224
2052 2847224 2878238 2908621 2764455 2738281 2807557 2803834 2792709 2746971 2689446 2694406 2698923 2647601
2040 2647601 2637919 2592357 2606498 2603823 2559953 2615196 2619456 2645748 2611593 2572691 2503935 2381652
2028 2381652 2435571 2412438 2421109 2470193 2454536 2445321 2445963 2464843 2484549 2417141 2326948 2255962
2016 2255962 2361630 2343128 2321895 2363057 2288906 2366218 2395901 2411677 2395545 2359773 2274936
2005 2274936 2202144 2146243 2096382 2054605 2134198 2197618 2210969 2174154 2153551 2188484 2233936
1994 2233936 2182376 2141213 2123614 2105541 2077264 2059492 2086538 2125083 2039962 2055297 2020528
1983 2020528 2021862 2049076 2069388 2072835 2049080 2028790 1952306 1855289 1897600 1842462 1903846 1945176
1971 1945176 1856306 1949761 1894982 1827154 1812732 1793025 1799642 1832364 1783220 1845531 1741923
1960 1741923 1688149 1794297 1886830 1893868 1894497 1825541 1782820 1799818 1788082 1739406 1759455 1754617
1948 1754617 1719098 1713903 1692999 1671086 1656546 1619156 1622390 1727863 1738923 1710448 1712625 1667748
1936 1667748 1630640 1550313 1555681 1616875 1651841 1638134 1671300 1630602 1636398 1616192 1564034 1605342
1924 1605342 1616414 1650301 1630974 1565193 1523715 1559246 1548536 1500441 1536362 1560359 1494312
1913 1494312 1470717 1480634 1482099 1555182 1537723 1440326 1504035 1550704 1454492 1441821 1481753 1469812
1901 1469812 1500352 1377206 1418025 1482879 1503872 1448348 1424900 1409365 1418117 1406429 1421583
1890 1421583 1425483 1377784 1421882 1478386 1464724 1339889 1317392 1394645 1395930 1416694 1367027 1309991
1878 1309991 1345571 1366799 1396535 1376577 1408261 1397519 1334597 1358469 1397274 1373214 1278535
1867 1278535 1248288 1304448 1389992 1434431 1386257 1353685 1347488 1282168 1311757 1403628 1387218 1388954
1855 1388954 1356703 1349537 1386799 1357769 1301601 1352032 1366984 1313407 1305493 1423382 1409116 1402971
1843 1402971 1456219 1362353 1283093 1392813 1367608 1355631 1293194 1234191 1260285 1302024 1385937
1832 1385937 1456176 1365838 1313335 1416120 1366307 1330902 1251786 1326476 1376530 1361465 1379919
1821 1379919 1376033 1406512 1440324 1440888 1371717 1392237 1321482 1370910 1389027 1414768 1358666 1374000
1809 1374000 1422254 1357151 1380523 1368386 1362173 1400118 1402338 1454726 1427936 1397852 1444102 1357716
1797 1357716 1353529 1430693 1381297 1351126 1436031 1473512 1437449 1356146 1390435 1433932 1495678 1508285
1785 1508285 1500139 1520176 1605348 1545043 1457682 1398307 1408996 1417627 1485860 1486929 1439711 1432785
1773 1432785 1560975 1588918 1539853 1632886 1674340 1611846 1574803 1554254 1586646 1610667 1619789
1762 1619789 1507134 1536277 1581374 1564704 1571174 1601222 1679018 1641465 1597323 1563555 1640218
1751 1640218 1647644 1626496 1573030 1546346 1560624 1569813 1517292 1507125 1499913 1432901 1386215 1488143
1739 1488143 1435841 1419657 1503702 1456957 1395357 1451126 1459274 1322310 1336445 1383479 1401319
1728 1401319 1341594 1411588 1377235 1310522 1299087 1300313 1223401 1230471 1364244 1322124 1284333 1215486
1716 1215486 1231756 1196322 1102148 1148850 1186033 1176953 1173492 1167997 1081733 1033339 1099491 1014359
1704 1014359 1081021 1102555 1038175 1078965 1085949 1041390 956361 1025132 1039649 885165 886385 888596
1692 888596 943018 952345 878215 840871 807131 884521 1012510 967673 911990 903622 880263 896208
1680 896208 874540 868958 824298 834721 911643 778541 844198 878611 796170 811368 823063 784687
1668 784687 808829 786441 821280 790661 690406 720685 777557 835831 816854 807785 813252 784546
1656 784546 781474 765017 702864 762075 691375 717617 705628 729636 742889 787751 767931 695152
1644 695152 723792 790410 706919 731788 728618 642634 621329 610921 644930 668132 725393 725718
1632 725718 680711 681940 672085 661344 585919 535818 651115 598782 541510 563231 553945 566586
1620 566586 615148 613250 558204 585654 648260 584868 523039 612318 654010 539515 514113 581952
1608 581952 529016 480213 592224 571372 476113 468258 528617 544018 554862 506398 510051 553133
1596 553133 521427 548318 478700 481627 519271 476511 581978 552791 545457 545375 552387 483853 449998
1583 449998 469182 482938 545397 602651 536133 458288 483957 523902 507006 521271 543256 465356
1571 465356 385157 417536 455044 489186 527092 531609 560622 416728 444073 543892 548506 510860
1559 510860 584943 446310 416200 413163 360895 307650 364074 333544 323504 358974 368556 329839
1547 329839 352303 430713 397590 392201 468700 484345 337962 328438 369872 406991 415777 408040
1535 408040 349953 369672 373071 392809 410214 450166 370052 336498 309175 376288 318289 319057
1523 319057 412336 309059 313270 435090 468139 348015 299742 280259 236979 228897 307419
1512 307419 274202 289040 320940 268505 310695 385588 394226 394171 427194 394043 365518 399616
1500 399616 408921 386891 281430 312468 336416 234017 288012 339653 271192 252367 277687
1489 277687 323176 262496 346078 427252 365578 357045 347648 298064 172429 305980 371631 269774
1477 269774 338152 337358 289963 308541 343874 314766 380976 421083 261412 226966 237285 241367
1465 241367 297927 341049 347834 302117 190327 289872 378158 404348 393396 358459 291609 315562
1453 315562 319533 242964 242610 337502 362751 345314 324789 350748 356855 333647 338802 333250 314047
1440 314047 289966 222221 173979 290482 260801 252896 268146 227875 272428 334374 322050 252457
1428 252457 268907 386371 301622 239238 296181 272071 197852 158065 182895 200107 226802
1417 226802 336466 293175 256258 363856 342444 335164 396873 427547 351670 280956 333246
1406 333246 342772 297682 347006 269559 169094 206938 231099 224272 296409 319170 265191 230069
1394 230069 298660 337375 245152 232016 208522 237053 192024 220013 248441 296484 300547 322539
1382 322539 340764 316036 276037 235436 320903 371431 307481 168571 192077 341185 343314
1371 343314 320577 284507 203776 278818 314169 251791 287497 298441 209176 249574 225095 224073
1359 224073 184927 119377 169705 139165 198156 202385 240997 250677 230338 261440 265530 215762
1347 215762 183816 220051 204600 160180 108047 152077 163730 194727 239721 314523 299466 198340
1335 198340 192669 268414 210322 246073 247281 245955 362076 311077 262593 262803 296550 275405
1323 275405 229388 165920 98299 211214 224147 196876 219412 232389 157753 149043 189032 195754
1311 195754 242648 212761 208838 213962 235537 227030 221938 247398 296634 247331 224787 206004
1299 206004 198451 164655 199675 198404 255954 216020 208460 247327 269799 277224 174003 143543
1287 143543 155161 168215 174077 188965 171588 222689 229068 150155 246217 221621 210774 197363
1275 197363 98542 138852 98821 119041 153583 167612 179358 197373 264286 205688 206855 122250
1263 122250 46960 109158 144597 183265 167574 215428 232033 237493 189819 134883 173330 212702
1251 212702 216650 257423 203047 145713 192377 197794 107944 97226 153709 100165 -1125 86355
1239 86355 95481 82005 221239 237894 171450 142207 23331 35065 92537 190916 173711 104134
1227 104134 56906 96104 58621 118368 202329 144176 108765 196481 132838 43658 208723
1216 208723 200080 54487 106083 194159 95661 127740 170538 183154 44348 34546 56025 26324
1204 26324 81849 26565 39621 104259 196097 176322 186301 171513 175252 83451 122520 207735
1192 207735 138992 93084 38710 122596 71211 103459 40341 9134 4557 55231 116771 85430
1180 85430 191189 131099 76977 97940 92651 78218 171428 196610 157946 221845 185605 183190
1168 183190 194396 214603 89625 40239 102371 170559 178914 229315 210487 160127 151759 129678
1156 129678 78502 87729 80707 101073 163964 107922 105381 118493 127638 169022 212621 184610
1144 184610 146469 150809 81442 79750 131608 58251 31807 88530 93928 71694 -5563 88327
1132 88327 168842 58834 51887 52846 69272 97666 93978 165211 206684 136985 139302 168616 150534
1119 150534 110249 164651 162918 95619 44216 32891 90238 95364 119734 63192 44384 25442
1107 25442 19153 13408 22500 53898 96673 51400 70852 99337 44369 80040 111680 58648
1095 58648 87799 110823 123117 124699 176236 95975 85886 67834 -2738 42427 143410 148204
1083 148204 1437 -64612 3240 95942 91560 53910 77672 106202 27892 47028 38931 69230
1071 69230 84499 92638 32196 114700 -12419 -131464 -34031 71989 3366 87094 122180
1060 122180 58982 43775 38948 7933 62740 154355 147765 49943 32013 36306 27815 20965 53942
1047 53942 -29306 -4210 123116 134314 60729 -19283 14916 48747 -3199 3740 66517 58828
1035 58828 34207 94670 63329 75099 109192 43956 51761 132403 150433 57805 168320 85622
1023 85622 41051 29886 -41840 -24549 16035 -57254 -99831 -27132 107551 86466 45805 37824
1011 37824 22081 77223 39433 94228 138051 125528 102685 138814 121343 93891 90538 96415
999 96415 186348 132971 110987 12274 95088 136741 86884 107793 154127 84176 16672 10580
987 10580 38296 109067 145712 133663 61432 90358 74305 68723 85313 68853 141253 127533
975 127533 35050 49496 127518 105248 105689 128428 86260 9759 44640 78263 66605 24365
963 24365 55232 111307 130073 10327 -36434 -44273 -43165 27306 73254 17848 58306 114086
951 114086 -23941 22579 124330 43036 44753 73364 94909 104672 54305 85036 34301 9493
939 9493 12214 -6158 59794 111490 -11460 -1087 3596 37180 25317 -1592 6894 4895 -15719
926 -15719 30405 106876 65293 84432 71868 -28510 2266 60959 25476 -96608 -43022 20973
914 20973 38562 59393 113579 137067 94330 98895 87038 73582 45386 59049 40345 18458
902 18458 71974 68579 12174 -29193 -6725 19546 20039 -1455 24543 22255 30443 89820 53096
889 53096 3996 20445 -1735 51846 30645 47030 10434 15797 75738 3245 -35660 -69995
877 -69995 -105207 -92909 6202 12628 -55118 -98396 -22026 51985 113949 46785 84558 95571
865 95571 109182 75764 -49826 10115 18275 15775 64128 60065 -23471 3852 94384 -11484
853 -11484 -65529 -131867 -50323 -11811 -30906 -9313 -56572 -28971 -44568 6591 5450 -58835
841 -58835 -95469 -87583 28719 117524 139236 66782 -15191 -21330 -108532 -130462 -2237 -24935
829 -24935 -24964 30319 -26111 4434 10849 36735 -66013 -67259 21442 -10807 40029 67670 22734
816 22734 50832 26175 -50994 -66196 -70763 -4792 96308 59396 -24995 4812 -61068 -20667
804 -20667 22026 30717 15742 -7879 -716 -15116 -57025 -8351 5719 -17015 -36149 31858
792 31858 155120 91999 81632 55499 -42935 -146660 -97424 -71259 -103060 -20186 68037 8721
780 8721 -95267 -58358 -8672 -26551 -8456 -16559 -24458 -47487 -39004 53593 25213 17296 36488
767 36488 66171 23528 40682 76528 35202 20791 32390 24365 37116 71255 13921 -7350
755 -7350 -23911 -70711 -56925 -23989 -65293 -14010 15505 56528 12759 31370 6847 -17663
743 -17663 10810 48631 55695 -36397 -84349 -54775 17623 12824 -69298 -145436 -113701 -54582
731 -54582 -4844 -28319 -12977 -98308 -113864 -38901 -28580 -71212 -28099 23655 -56462 -64345
719 -64345 -62171 -122551 -126375 -7466 -27190 -141203 -50636 -15698 -91503 -31939 14175 1066
707 1066 -65048 2737 -8138 -28370 -75284 -37900 -46463 -100119 -2628 19824 -52290 -104795
695 -104795 -25085 -7469 -70204 -41870 -106298 -177225 -32891 3194 38067 -11525 -36175 -19235
683 -19235 -28934 -12266 -41437 -36926 -31751 -23514 -40034 -9248 -3107 -77052 -103898 -37481 -7743
670 -7743 -119022 -94085 -101030 -72082 -57808 20246 4105 -69303 -42492 -32855 -41112 -72093 -68081
657 -68081 -81578 -31276 -5244 -67858 -37160 -92213 -208350 -141950 -53577 -86886 -60153 -65777
645 -65777 -57147 -69124 -91948 -1406 -24821 -64160 -27789 -26042 -151177 -212401 -133098 -149823
633 -149823 -109527 -115018 -169270 -106971 -132704 -108270 -69608 40643 91965 18391 -6380 113252
621 113252 63650 -35011 -35816 -37815 -77369 -138131 -137313 -142388 -81452 -134793 -227916 -134885 -107740
608 -107740 -75521 -10825 -42446 -86065 -201974 -208109 -99306 -64072 -47013 -91022 -71095 -121149
596 -121149 -110195 -66427 -189885 -168552 -126789 -103201 -98413 -53359 -47669 -48406 -92479 -217524
584 -217524 -210661 -110037 -71786 -108402 -135652 -67416 -75193 -118436 -135570 -121927 -67860 -61235
572 -61235 -79853 -36752 -36881 -96271 -153586 -165177 -94667 -97228 -83061 -179332 -120058 -100816 -133196
559 -133196 -170508 -148496 -116036 -70296 -57452 -103297 -103221 -73939 -36625 33872 -14220 -132031
547 -132031 -168398 -152013 -113466 -62060 -54514 -49861 -29836 -61593 -58681 -40807 4193 -36255
535 -36255 -84576 -131053 -74993 -45319 -28943 -34502 -51618 -51829 -40684 -24149 -149233 -199120
523 -199120 -164516 -115950 -55509 27249 -29552 -104080 -105395 -110183 -95846 -39307 -87103 -124240
511 -124240 -99986 -134227 -87080 -127687 -103277 -232008 -257295 -85601 -36348 -96032 -68974
500 -68974 -50232 -66506 -107635 -86410 -105405 -79826 -37633 -94297 -96073 -140492 -94932 -52670
488 -52670 -41189 -58866 -109794 -109323 -135996 -90424 -150492 -145702 -69548 -67886 -116333 -69031 -101192
475 -101192 -80332 -40059 -69327 -72152 560 46787 -61013 -25039 -38579 -24596 -14544 -41732
463 -41732 -92874 -181638 -80156 -34684 -107551 -137375 -163166 -177715 -158350 -72953 -127556 -112770
451 -112770 -203113 -149139 -97126 -61343 -38543 -26942 -65062 -112526 -70562 -109306 -108319 -69940
439 -69940 -93650 -138102 -131312 -92620 -110684 -152802 -151998 -116091 -36823 -67630 -86282 -55103 -78207
426 -78207 -133178 -136621 -232543 -210618 -151507 -128666 -129382 -118959 -135037 -75771 -119950 -170334 -78641
413 -78641 -63939 -132115 -77513 -100594 -160676 -179031 -92957 -30606 -68359 -36429 -162931 -177075
401 -177075 -99987 -48210 -107095 -86942 -122523 -159842 -119680 -99507 -101054 -82909 -54499 -14681
389 -14681 -117817 -108630 -86322 -130106 -29800 4291 -16578 -100437 -186296 -108571 -60674 -76641
377 -76641 -107888 -174517 -159068 -129527 -156140 -206315 -105790 -113087 -192215 -114614 -83788 -89915
365 -89915 -112507 -10578 -48691 -147250 -55517 -30286 -105162 -123387 -117466 -220003 -158044 -70311
353 -70311 -110241 -121284 -30474 31955 -30608 -73529 -77971 -148955 -124610 24839 -95829 -147253
341 -147253 -148229 -199363 -162498 -154031 -180480 -208403 -104768 -61850 -10567 -75480 -64479 -58389
329 -58389 -116202 -160357 -186155 -177009 -190728 -93259 -88388 -116945 -107252 -54314 -65371 -40954 16522
316 16522 -81477 -194944 -132081 -76670 -95084 -87830 -148468 -244899 -200309 -112125 -114347 -149354
304 -149354 -78994 -71181 -137297 -120826 -180607 -207910 -190434 -160460 -187504 -170590 -72665 -121027
292 -121027 -157384 -132505 -197688 -214300 -228123 -111745 -20509 -78306 -167805 -196190 -229328 -124318
280 -124318 -73615 -97065 -144436 -153222 -158701 -177771 -181562 -128179 -132453 -152963 -194804 -178031 -178927
267 -178927 -198606 -189069 -158791 -189282 -182397 -56591 -96215 -112767 -67869 -112586 -70307 -80418
255 -80418 -174622 -164155 -122537 -150055 -203998 -171219 -222712 -163512 -68403 -114282 -147705 -136849
243 -136849 -187345 -158103 -132299 -85590 -117119 -130841 -123703 -209726 -231275 -107059 -100077 -87709
231 -87709 -172131 -144901 -78393 -72833 -124397 -127401 -111766 -89342 -123760 -186831 -148942 -84861
219 -84861 -115220 -152398 -127219 -193065 -195057 -117548 -144327 -177451 -148143 -109740 -195035 -101167
207 -101167 -53755 -49807 -149923 -141683 -89730 -204768 -232162 -185139 -97467 -97209 -73582 -69495
195 -69495 -159587 -161010 -159925 -187871 -188527 -215279 -153204 -137617 -104027 -176861 -250759 -298550 -210145
182 -210145 -151269 -174204 -198471 -137989 -126584 -126443 -191656 -217771 -201713 -144810 -171705 -204190
170 -204190 -133160 -227982 -195454 -124914 -221291 -226015 -183790 -123684 -164244 -202344 -160793 -129541
158 -129541 -195720 -177221 -199021 -183968 -153006 -115660 -99294 -181272 -140945 -144329 -177631 -136587
146 -136587 -112475 -149337 -167963 -159049 -168845 -181222 -162513 -183178 -180052 -149891 -94845 -110476
134 -110476 -144690 -171534 -202761 -243368 -246466 -221057 -220513 -85593 -112668 -219078 -273413 -258283
122 -258283 -264835 -208898 -225426 -222485 -223034 -190833 -148455 -201870 -210041 -196673 -222438 -229722 -130586
109 -130586 -181254 -186593 -145897 -159740 -202740 -208479 -158776 -113872 -157150 -219458 -198410 -156047
97 -156047 -157859 -136605 -106497 -118551 -165285 -220740 -202098 -175591 -185308 -160954 -157594 -179874 -271120
84 -271120 -237990 -223569 -220001 -141920 -154105 -224226 -223727 -199214 -204763 -258102 -188320 -193810 -186363
71 -186363 -103563 -153189 -187725 -228163 -157981 -129621 -92383 -202155 -290122 -167991 -251821 -285323
59 -285323 -244119 -233171 -260384 -225931 -190272 -228142 -188139 -122219 -204515 -205136 -242155 -236423 -243820
46 -243820 -245909 -221094 -185351 -151278 -132236 -198439 -176461 -208844 -222920 -178591 -175581 -168694 -211084
33 -211084 -179098 -169913 -155713 -218948 -213154 -211775 -184156 -217081 -184998 -168815 -189365 -192016 -182471
20 -182471 -227481 -213780 -187239 -200655 -211929 -214091 -151383 -145884 -176852 -227862 -264711 -247890
8 -247890 -238935 -295250 -258296 -197569 -176316 -175053 -239946 -271441
0 -271441
$$ Imaginary data points
##PAGE= N=2
##DATA TABLE= (X++(I..I)), XYDATA
16383 -3875159 -3873835 -3819107 -3749891 -3715914 -3645920 -3581596 -3505452 -3490111 -3456220 -3348290 -3395330
16372 -3395330 -3358024 -3207019 -3134327 -3158965 -3134204 -3035635 -2974531 -2902022 -2833703 -2803780 -2781930
16361 -2781930 -2740852 -2683016 -2673116 -2616168 -2517191 -2489372 -2494237 -2415933 -2354551 -2296229 -2224885 -2203198
16349 -2203198 -2162879 -2116043 -2067930 -2020007 -1995536 -1935902 -1882489 -1842279 -1770240 -1758862 -1766695
16338 -1766695 -1704001 -1597609 -1569209 -1526821 -1442786 -1392799 -1357469 -1363772 -1328042 -1289615 -1237138
16327 -1237138 -1121882 -1068140 -1027332 -946117 -936978 -917652 -869907 -840784 -789470 -760478 -752779
16316 -752779 -721621 -688749 -592916 -557729 -618878 -586527 -533070 -491413 -420498 -296444 -309892
16305 -309892 -272616 -167479 -116001 -125718 -72625 -78835 -13800 29584 38 30503 98105 164072
16293 164072 226659 314682 250461 253030 259130 343563 424967 427667 437349 543185 636598 636009
16281 636009 621726 690239 762043 773492 821105 898249 877199 926380 937186 918864 964019
16270 964019 1035035 1071794 1059634 1132278 1163462 1266311 1253987 1283205 1254407 1285306 1281437
16259 1281437 1406368 1440668 1436764 1446685 1472557 1518252 1549051 1559836 1561796 1620459 1660896 1663138
16247 1663138 1721723 1761054 1756488 1805972 1835933 1866512 1919773 1941120 1944723 1992106 1980477 2064717
16235 2064717 2091881 2034810 2064424 2110094 2136181 2146889 2145918 2156641 2200527 2238074 2288534 2328184
16223 2328184 2315277 2410331 2336745 2342936 2383830 2405259 2474473 2436362 2481854 2548406 2563689
16212 2563689 2538535 2514297 2530310 2522968 2585536 2627692 2697527 2664243 2643094 2703463 2722767
16201 2722767 2728205 2794579 2792752 2807373 2892733 2896372 2902809 2918799 2949337 2976242 3007494 3027078
16189 3027078 3020774 3049084 3028562 2950000 2935521 2981663 3012844 3029230 3043355 3091595 3022382
16178 3022382 3032909 3149867 3129114 3105253 3172831 3151187 3275254 3343735 3307729 3208879 3224776
16167 3224776 3281091 3277339 3350144 3385887 3379123 3319185 3363695 3390987 3403796 3386055 3418551 3375003
16155 3375003 3346089 3367733 3363995 3337835 3338592 3358539 3293788 3340622 3408599 3397708 3396561 3466506
16143 3466506 3469488 3448991 3548383 3598081 3504576 3491374 3505897 3505544 3580096 3586265 3548504 3542631
16131 3542631 3562683 3550375 3536904 3520415 3546459 3585585 3602122 3496691 3561187 3663648 3660087
16120 3660087 3689910 3659842 3582028 3601414 3638865 3717473 3718229 3627201 3622350 3771314 3709306 3659864
16108 3659864 3735990 3680354 3717990 3695154 3656657 3642800 3606111 3633792 3681205 3683253 3642781
16097 3642781 3704334 3760305 3762681 3733039 3837011 3766611 3678296 3754449 3679257 3715255 3836302
16086 3836302 3849144 3762281 3796427 3764284 3753563 3790835 3812377 3779326 3773806 3906321 3848023
16075 3848023 3752193 3798654 3787416 3806641 3778412 3775890 3786522 3823643 3854329 3791725 3748421
16064 3748421 3771457 3821075 3858318 3907954 3970443 3930586 3827081 3857425 3799571 3676462 3732556
16053 3732556 3757796 3750677 3821434 3876778 3861261 3796363 3766065 3787642 3787591 3848584 3880351 3862544
16041 3862544 3865195 3827361 3865768 3890780 3867425 3880533 3773061 3762183 3728850 3781110 3841242
16030 3841242 3850869 3889296 3810878 3832557 3836537 3813229 3859903 3949646 3946329 3911185 3927623 3816635
16018 3816635 3812018 3938090 3928862 3836079 3846704 3894239 3810753 3830374 3864546 3852469 3872700
16007 3872700 3931880 3803951 3783950 3852863 3900671 3861745 3882197 3923188 3893586 3857849 3866789
15996 3866789 3854561 3804581 3869867 3869167 3861469 3829643 3766934 3830655 3755046 3864787 3933585 3805165
15984 3805165 3896913 3932125 3856198 3877424 3940648 3818045 3791674 3894069 3908094 3888818 3902891
15973 3902891 3909190 3924890 3934549 3938113 3878219 3818964 3881114 3884352 3872106 3906493 3924940 3867244
15961 3867244 3915268 3962627 3953990 3858754 3873342 3944800 3872984 3885731 3853424 3796608 3826659
15950 3826659 3842936 3813612 3799946 3882098 3898198 3835859 3896147 3910107 3891569 3846213 3913606
15939 3913606 3859382 3850501 3888925 3858476 3764531 3850586 3893859 3865247 3859776 3931088 3983651 3870004
15927 3870004 3878368 3873720 3826341 3916059 3984358 3913635 3857299 3973311 3864818 3791771 3902211
15916 3902211 3832672 3876378 3937492 3949639 3903959 3865854 3931125 3951666 3901210 3968322 3933858
15905 3933858 3871635 3881909 3913335 3871189 3801205 3762344 3713002 3762562 3774495 3827687 3895807
15894 3895807 3940375 3976282 3929744 3916254 3971255 3934634 3998430 4056848 4084849 4031753 4037583
15883 4037583 4002634 3878508 3817499 3893672 3872578 3910518 3936267 3862609 3934619 3957929 3889884
15872 3889884 3918829 3921938 3939506 3929801 3947310 3933938 3931940 4001179 3978390 3934718 3912810 3946165
15860 3946165 4020473 4037169 3853438 3901365 3911845 3895836 3955925 3990601 3884358 3866907 3851763
15849 3851763 3923203 3933636 3975927 3976218 3940877 3929886 4015830 4031802 4011310 4022481 3963297 3954073
15837 3954073 3904467 3945412 3905281 3874262 3916889 3877941 3801534 3857122 3970730 3928550 3973899
15826 3973899 4042419 4007890 3947713 4067166 4014331 3955547 3995163 3960494 3948080 3938636 3944627
$$ [...]
##END NTUPLES=NMR SPECTRUM
##END=
