##TITLE=1H_CA-8850-4
 CDCl3
 8 sc, 
 11.03.2022
##JCAMPDX= 6.0         $$ Bruker NMR JCAMP-DX V2.0
##DATA TYPE= NMR SPECTRUM
##DATA CLASS= NTUPLES
##ORIGIN= UXNMR, Bruker Analytische Messtechnik GmbH
##OWNER= root
$$ XWIN-NMR		Version 3.5
$$ Fri Mar 11 11:13:48 2022 Russian Standard Time (UT+4h)  she@DPX200
##.OBSERVE FREQUENCY= 200.131346
##.OBSERVE NUCLEUS= ^1H
##.ACQUISITION MODE= SIMULTANEOUS
##.ACQUISITION SCHEME= undefined
##.AVERAGES= 8
##.DIGITISER RES= 18
##SPECTROMETER/DATA SYSTEM= spect
##.PULSE SEQUENCE= zg30
##.SOLVENT NAME= CDCl3
##.SHIFT REFERENCE= (INTERNAL, CDCl3, 0, 15.6995)
##AUDIT TRAIL= $$ (NUMBER, WHEN, WHO, WHERE, WHAT)
$$ ##TITLE= Audit trail, XWIN-NMR		Version 3.5
$$ ##JCAMPDX= 5.01
$$ ##ORIGIN= Bruker BioSpin GmbH
$$ ##OWNER= she
$$ F:/spectra/data/she/nmr/H-F/1/pdata/1/auditp.txt
$$ ##AUDIT TRAIL=  $$ (NUMBER, WHEN, WHO, WHERE, WHAT)
(   1,<2022-03-11 11:12:52.28 +0400>,<she>,<DPX200>,
      <created by zg, POWCHK disabled, PULCHK disabled
       configuration hash MD5:
       00 E9 B6 7A A2 85 ED C7 34 08 36 98 17 FE 4E 26
       data hash MD5: 16K
       56 EB A7 FF DA C2 91 FE B5 6F D3 AC 44 0F 1C 30>)
(   2,<2022-03-11 11:12:54.79 +0400>,<she>,<DPX200>,
      <Start of raw data processing
       efp BC_mod = 2 LB = 0.24 FT_mod = 6 PKNL = 1 PHC0 = -16586.91 PHC1 = 9.60078 SI = 16K 
       data hash MD5: 16K
       5F C7 86 BE B3 1F F7 BA FD 81 C3 AB E0 A9 7A EE>)
(   3,<2022-03-11 11:13:06.59 +0400>,<she>,<DPX200>,
      <pk PHC0 = 1.416681 PHC1 = -1.2 
       data hash MD5: 16K
       9A 2D 4F BA F2 7F 41 BF 59 CC 57 46 92 F3 F2 69>)
(   4,<2022-03-11 11:13:09.51 +0400>,<she>,<DPX200>,
      <abs ABSG = 5 
       data hash MD5: 16K
       28 34 49 57 7B A8 D0 61 E1 EB C8 31 5F 2B 2C 18>)
$$ ##END=
$$ 
$$ hash MD5
$$ A9 29 03 8C 5E 73 4C E9 61 74 48 41 E6 B9 AF 98
##$RELAX= 
##$RELAX= 
##$RELAX= 
##$RELAX= 
##$RELAX= 
##$RELAX= 
$$ Bruker specific parameters
$$ --------------------------
##$DU= <F:/spectra>
##$EXPNO= 1
##$NAME= <H-F>
##$PROCNO= 1
##$TYPE= <nmr>
##$USER= <she>
##$AMP= (0..31)
100 100 100 100 100 100 100 100 100 100 100 100 100 100 100 100 100 100 
100 100 100 100 100 100 100 100 100 100 100 100 100 100 
##$AQSEQ= 0
##$AQ_mod= 1
##$AUNM= <au_zg>
##$AUTOPOS= <>
##$BF1= 200.13
##$BF2= 200.13
##$BF3= 200.13
##$BF4= 200.13
##$BF5= 200.13
##$BF6= 200.13
##$BF7= 200.13
##$BF8= 200.13
##$BYTORDA= 1
##$CFDGTYP= 0
##$CFRGTYP= 5
##$CHEMSTR= <none>
##$CNST= (0..31)
1 1 145 1 1 1 1 1 1 1 1 1 1 1 1 1 1 1 1 1 1 1 1 1 1 1 1 1 1 1 1 1 
##$CPDPRG= <>
##$CPDPRG1= <>
##$CPDPRG2= <>
##$CPDPRG3= <>
##$CPDPRG4= <mlev>
##$CPDPRG5= <mlev>
##$CPDPRG6= <mlev>
##$CPDPRG7= <mlev>
##$CPDPRG8= <mlev>
##$CPDPRGB= <>
##$CPDPRGT= <>
##$D= (0..31)
0 1.2 0 0 0 0 0 0 0 0.06 0 0.03 0 0 0 0 0.0002 0 0 0 0 0 0 0 0 0 0 0 0 
0 0 0 
##$DATE= 1646982771
##$DBL= (0..7)
120 120 120 120 120 120 120 120 
##$DBP= (0..7)
150 150 150 150 150 150 150 150 
##$DBP07= 0
##$DBPNAM0= <>
##$DBPNAM1= <>
##$DBPNAM2= <>
##$DBPNAM3= <>
##$DBPNAM4= <>
$$ [...]
##$SUBNAM2= <"">
##$SUBNAM3= <"">
##$SUBNAM4= <"">
##$SUBNAM5= <"">
##$SUBNAM6= <"">
##$SUBNAM7= <"">
##$SUBNAM8= <"">
##$SUBNAM9= <"">
##$SW= 18.0517287032376
##$SWIBOX= (0..15)
0 0 2 0 0 0 0 0 0 0 0 0 0 0 0 0 
##$SW_h= 3612.71676300578
##$TD= 16384
##$TD0= 1
##$TE= 0
##$TE2= 300
##$TE3= 300
##$TEG= 300
##$TL= (0..7)
0 120 120 120 120 120 120 120 
##$TP= (0..7)
150 150 150 150 150 150 150 150 
##$TP07= 0
##$TPNAME0= <>
##$TPNAME1= <>
##$TPNAME2= <>
##$TPNAME3= <>
##$TPNAME4= <>
##$TPNAME5= <>
##$TPNAME6= <>
##$TPNAME7= <>
##$TPOAL= (0..7)
0.5 0.5 0.5 0.5 0.5 0.5 0.5 0.5 
##$TPOFFS= (0..7)
0 0 0 0 0 0 0 0 
##$TUNHIN= 0
##$TUNHOUT= 0
##$TUNXOUT= 0
##$USERA1= <user>
##$USERA2= <user>
##$USERA3= <user>
##$USERA4= <user>
##$USERA5= <user>
##$V9= 5
##$VALIST= <valist>
##$VCLIST= <CCCCCCCCCCCCCCC>
##$VD= 0
##$VDLIST= <DDDDDDDDDDDDDDD>
##$VPLIST= <PPPPPPPPPPPPPPP>
##$VTLIST= <TTTTTTTTTTTTTTT>
##$WBST= 1024
##$WBSW= 4
##$XGAIN= (0..3)
0 0 0 0 
##$XL= 0
##$YL= 0
##$YMAX_a= 114346
##$YMIN_a= -127220
##$ZGOPTNS= <>
##$ZL1= 120
##$ZL2= 120
##$ZL3= 120
##$ZL4= 120
##$ABSF1= 15.76562
##$ABSF2= -2.286231
##$ABSG= 5
##$ABSL= 3
##$ALPHA= 0
##$AQORDER= 0
##$ASSFAC= 0
##$ASSFACI= 0
##$ASSFACX= 0
##$ASSWID= 0
##$AUNMP= <proc_1d>
##$AZFE= 0.1
##$AZFW= 0.1
##$BCFW= 0
##$BC_mod= 2
##$BYTORDP= 0
##$COROFFS= 0
##$CY= -3
##$DATMOD= 1
##$DC= 0
##$DFILT= <>
##$DTYPP= 0
##$F1P= 0
##$F2P= 0
##$FCOR= 1
##$FTSIZE= 16384
##$FT_mod= 6
##$GAMMA= 0
##$GB= 0
##$INTBC= 1
##$INTSCL= 0
##$ISEN= 128
##$LB= 0.24
##$LEV0= 0
##$LPBIN= 0
##$MAXI= 10000
##$MC2= 0
##$MEAN= 0
##$ME_mod= 0
##$MI= 1.114404
##$NCOEF= 0
##$NC_proc= -7
##$NLEV= 6
##$NOISF1= 3.799351
##$NOISF2= 2.8
##$NSP= 0
##$NTH_PI= 0
##$NZP= 0
##$OFFSET= 15.69951
##$PC= 1
##$PHC0= -16585.49
##$PHC1= 8.40078
##$PH_mod= 1
##$PKNL= yes
##$PPARMOD= 0
##$PSCAL= 0
##$PSIGN= 0
##$REVERSE= no
##$SF= 200.130010414241
##$SI= 16384
##$SIGF1= 3
##$SIGF2= 2
##$SINO= 5.538805
##$SIOLD= 16384
##$SREGLST= <1H.CDCl3>
##$SSB= 0
##$STSI= 16384
##$STSR= 0
##$SW_p= 3612.71676300578
##$SYMM= 0
##$S_DEV= 0
##$TDeff= 16384
##$TDoff= 0
##$TI= <>
##$TILT= no
##$TM1= 0
##$TM2= 0
##$TOPLEV= 0
##$USERP1= <user>
##$USERP2= <user>
##$USERP3= <user>
##$USERP4= <user>
##$USERP5= <user>
##$WDW= 1
##$XDIM= 16384
##$YMAX_p= 364404944
##$YMIN_p= -543560
$$ End of Bruker specific parameters
$$ ---------------------------------
##NTUPLES= NMR SPECTRUM
##VAR_NAME=  FREQUENCY,     SPECTRUM/REAL,   SPECTRUM/IMAG
##SYMBOL=    X,             R,               I
##VAR_TYPE=  INDEPENDENT,   DEPENDENT,       DEPENDENT
##VAR_FORM=  AFFN,          ASDF,            ASDF
##VAR_DIM=   16384,         16384,           16384
##UNITS=     HZ,            ARBITRARY UNITS, ARBITRARY UNITS
##FACTOR=    0.220516191357247, 1,           1
##FIRST=     3141.94302388246, 0,            0
##LAST=      -470.773739123316, 0,           0
##MIN=       -470.773739123316, -543560,     0
##MAX=       3141.94302388246, 364404944,    0
$$ Real data points
##PAGE= N=1
##DATA TABLE= (X++(R..R)), XYDATA
$$ [...]
$$ plain form
7568 14748 -4198 89553 48737 -195749 -162209 -63738 1089 -22673 23848 -104687 -169264
7557 -169264 -117757 -56351 66807 134049 210467 88141 -101009 36950 129505 -19978 -71661
7546 -71661 -127174 -45515 -156847 -126937 -130199 -229287 -116445 11943 103282 34117 -15657
7535 -15657 -121005 -88869 -212083 -205979 -102088 -104210 12510 -140487 -166261 -125813 -114208
7524 -114208 -178154 -48989 -125089 -122738 -55322 -89245 -112100 -96078 -110119 136186 5785
7513 5785 66717 28376 -148006 -228699 -204699 -208351 -265689 -83011 24562 130920 220289
7502 220289 -29780 -227293 -219885 -214451 -101598 -131469 -42763 8073 -45961 -23575 -11564
7491 -11564 -40761 -41886 1589 46068 7178 -57903 -151951 -30074 83694 -300772 -362835
$$ packed form
7568A4748j8946R3751m0816k44486L3540R8471O4827k3762M6521j28535o4577
7557a69264N1507O1406J23158O7242P6418j22326j89150J37959R2555j49483n1683
7546g1661n5513Q1659j11332K9910l262r9088J12842J28388R1339o9165m9774
7535a5657j05348L2136j23214O104J03891k122J16720j52997k5774M0448J1605
7524a14208o3946J29165p6100K351O7416l3923k2855J6022j4041K46305j30401
7513E785O0932l8341j76382q0693K4000l652n7338J82678J07573J06358Q9369
7502B20289k50069j97513P408N434J12853k9871Q8706N0836n4034K2386J2011
7491a1564k9197j125M3475M4479l8890o5081r4048J21877J13768l84466o2063
$$ plain form
7480 -362835 -203303 -185081 -171980 -283171 -123886 -129005 114496 121797 89798 -55775 28880
7469 28880 18129 -80513 71156 90423 4382 -77955 -154872 -180278 -154905 -88917 -48490 -101791
7457 -101791 -61996 -90642 -215888 -263936 -33682 43665 -67009 -161816 8513 24805 24466
7446 24466 -78355 -67508 -101474 2644 -36146 -153918 -123465 -5779 73773 -50036 -155042
7435 -155042 -9442 -7741 -75940 -267758 -106679 -32060 18550 89383 194510 244957 -53214
7424 -53214 -36422 -60243 -14754 -294875 -176296 -170575 -221374 4027 38509 -313476 -287285
7413 -287285 -438324 -200784 -133087 -214243 -24223 36097 -148902 -40546 93306 102906 -133640
7402 -133640 -364962 -287849 -184145 -104718 -97241 93410 30388 -3912 -97609 -207325 1365
$$ packed form
7480c62835J59532J8222J3101j11191J59285n119K43501P301l1999j45573Q4655
7469B8880j0751r8642J51669J9267q6041q2337p6917k5406K5373O5988M0427n3301
7457a01791L9795k8646j25246m8048K30254P7347j10674r4807J70329J6292l39
7446B4466j02821J0847l3966J04118l8790j17772L0453J17686P9552j23809j05006
7435a55042J45600J701o8199j91818J61079P4619N0610P0833J05127N0447k98171
7424e3214J6792k3821M5489k80121J18579N721n0799K25401L4482l51985K6191
7413b87285j51039K37540O7697q1156J90020O0320j84999J08356J33852R600k36546
7402a33640k31322P7113J03704P9427P477J90651o3022l4300r3697j09716K08690
$$ plain form
7391 1365 -136037 -201515 -78900 -150150 -84857 -252719 -89742 -12502 -159949 -166330 -152697
7380 -152697 -281593 -162833 100831 128476 -51135 -261698 -186762 -36223 -7585 -132533
7370 -132533 -5621 21302 -53504 76664 66424 -72270 -57616 97037 81458 -94763 -134865
7359 -134865 -107901 -39965 -101788 -106421 -150837 -102511 -35600 -77992 56415 44990 47971 -12934
7347 -12934 -113706 -219170 -194547 -122134 -63557 -164622 -132626 -191674 -213139 -126038 -117626
7336 -117626 -110366 -40783 -108792 -106024 -173248 -203887 -137508 -119417 -269749 -236575 -112601 40813
7324 40813 222024 154148 -52845 -175218 -112069 -114335 -240352 -253692 -121002 -209389 -228314
7313 -228314 -168941 14785 15832 -17755 -18111 -94117 -165757 -395133 -278141 -198676 -113214 -26751
$$ packed form
7391A365j37402o5478J22615p1250O5293j67862J62977P7240j47447o381J3633
7380a52697j28896J18760K63664K7645j79611k10563P4936J50539K8638j24948
7370a32533J26912K6923p4806J30168j0240j38694J4654J54653j5579j76221m0102
7359a34865K6964O7936o1823m633m4416M8326O6911m2392J34407j1425K981o0905
7347a2934j00772j05464K4623P2413N8577j01065L1996n9048k1465Q7101Q412
7336a17626P260O9583o8009K768o7224l0639O6379J8091j50332L3174J23974J53414
7324D0813J81211o7876k06993j22373O3149k266j26017j3340J32690q8387j8925
7313b28314N9373J83726J047l3587l56p6006p1640k29376J16992P9465Q5462Q6463
$$ plain form
7301 -26751 -5973 5580 -99311 -108220 -260105 -243147 -186847 -70440 -60327 4897 58979
7290 58979 23141 -198865 -311740 -158193 -161821 26155 29523 27980 9494 -103270 -147737
7279 -147737 -25525 -109344 -208290 -62173 101217 128756 200026 251587 165590 191416 199791
7268 199791 96245 -154149 -100537 -51905 -170322 1057 25351 -137678 -237515 -186355 -364535
7257 -364535 -270663 -116859 -79616 -15791 73357 44331 -141368 18935 18971 -133985 -116520
7246 -116520 -68048 -141217 54800 130160 76221 -30236 -122923 -77170 -9505 -6276 9685
7235 9685 -83681 -102020 -71803 -100209 -69085 90077 117431 185555 24325 -155642 -228511
7224 -228511 -67745 -151513 -167250 -275742 -212508 -38469 -232135 -56343 -166123 -198247
$$ packed form
7301b6751K0778J1553j04891q909j51885J6958N6300J16407J0113O5224N4082
7290E8979l5838k22006j12875J53547l628J87976L368j543j8486j12764m4467
7279a47737J22212q3819r8946J46117J63390K7539P1270N1561q5997K5826Q375
7268A99791j03546k50394N3612M8632j18417J71379K4294j63029r9837N1160j78180
7257c64535R3872J53804L7243O3825Q9148k9026j85699J60303L6j52956J7465
7246a16520M8472p3169J96017P5360n3939j06457r2687M5753O7665L229J5961
7235I685r3366j8339L0217k8406L1124J59162K7354O8124j61230j79967p2869
7224b28511J60766q3768j5737j08492O3234J74039j93666J75792j09780l2124
$$ plain form
7214 -198247 -185637 -245864 -226461 -277748 -28533 65187 50372 -1276 -229605 -148793 -209492
7203 -209492 -100792 -152598 -277348 -172681 -222133 -74061 12986 7670 106104 202349 32114
7192 32114 101697 121222 48084 172387 60432 112481 -65835 -147022 -130036 -37721 -176323
7181 -176323 -3660 95504 -66432 32454 294240 184416 35614 -118579 -108590 22236
7171 22236 28845 96877 170586 15101 53341 201509 -17756 -244935 -73570 36935 82055
7160 82055 174176 75170 49001 -45526 -57408 -7342 31086 -142750 -46248 -49490 -82896 -97784
7148 -97784 45833 -10897 -152483 -250865 61037 -127949 -265858 -160699 -219319 -94634
7138 -94634 174169 117524 -3958 195163 20608 -192308 -100532 103488 -97331 -246870
$$ packed form
7214a98247J2610o0227J9403n1287K49215R3720j4815n1648k28329Q0812o0699
7203b09492J08700n1806j24750J04667m9452J48072Q7047n316R8434R6245j70235
7192C2114O9583J9525p3138J24303j11955N2049j78316q1187J6986R2315j38602
7181a76323J72663R9164j61936R8886K61786j09824j48802j54193R989J30826
7171B2236O609O8032P3709j55485L8240J48168k19265k27179J71365J10505M5120
7160H2055R2121r9006k6169r4527j1882N0066L8428j73836R6502l242l3406j4888
7148i7784J43617n6730j41586r8382L11902j88986j37909J05159n8620J24685
7138i4634K68803n6645j21482J99121j74555k12916R1776K04020k00819j49539
$$ plain form
7128 -246870 -47244 -70441 -59811 -56102 -61230 23162 7407 -124217 -325365 -81751 -64962
7117 -64962 -202777 -222409 -185886 -85656 -133442 -83795 -64310 -118009 -319690 -105386 -30289
7106 -30289 68636 13310 -167275 -94625 15060 123867 57689 31918 83748 146614 -64186
7095 -64186 -173568 54244 88554 -6300 101303 177412 -124083 -172928 -48705 -106990 -10210
7084 -10210 57380 -183056 -180957 92681 85075 165458 38312 -50511 -176199 -167604 -240899 -81844
7072 -81844 -59864 -23167 183406 105535 63764 -267757 -336490 -83391 -69625 3156 -98740
7061 -98740 45346 -2545 77795 53315 53227 17445 71341 -10425 11183 95690 90117 142816
7049 142816 -47826 7071 38639 65996 -157646 -222769 -120441 -72764 19553 -51520 -86077
$$ packed form
7128b46870J99626k3197J0630L709n128Q4392j5755j31624k01148K43614J6789
7117f4962j37815j9632L6523J00230m7786M9647J9485n3699k01681K14304P5097
7106c0289R8925n5326j80585P2650J09685J08807o6178k5771N1830O2866k10800
7095f4186j09382K27812L4310r4854J07603P6109l01495m8845J24223n8285R6780
7084a0210O7590k40436K099K73638p606Q0383j27146q8823j25688Q595p3295J59055
7072h1844K1980L6697K06573p7871m1771l31521o8733K53099J3766P2781j01896
7061i8740J44086m7891Q0340k4480q8l5782N3896q1766K1608Q4507n573N2699
7049A42816j90642N4897L1568K7357k23642o5123J02328M7677R2317p1073l4557
$$ plain form
7038 -86077 -44530 -160008 -177522 -170756 -254615 -48065 23589 -124490 -210275 -3419 165756
7027 165756 71171 99575 79298 -33199 -192884 -131384 -104262 -180856 -314056 -240881 -76068
7016 -76068 51523 -150613 -21760 142811 -137293 -301385 -271761 -322694 -310478 -161084
7006 -161084 -156987 -151788 -79504 -3262 -174551 -204382 -274589 -238759 -66244 60946 83813
6995 83813 -129161 -271851 -310065 -378980 -272583 -72058 48509 -58403 -31240 -148274
6985 -148274 -222828 -208409 -368946 -363948 -198134 -149707 -371305 -214388 -174494 -131701 -17722
6974 -17722 26373 -52698 -28138 -55775 -24414 94123 153022 156563 111836 -11255 30662 -49754
6962 -49754 -108315 -272030 -169535 -145073 -207494 -275992 -17206 -117016 -188395 -128861 -170462
$$ packed form
7038h6077M1547j15478j7514O766q3859K06550P1654j48079q5785K06856J69175
7027A65756r4585K8404k0277j12497j59685O1500K7122p6594j33200P3175J64813
7016g6068J27591k02136J28853J64571k80104j64092K9624n0933J2216J49394
7006a61084M097N199P2284P6242j71289k9831p0207L5830J72515J27190K2867
6995H3813k12974j42690l8214o8915J06397K00525J20567j06912K7163j17034
6985a48274p4554J4419j60537M998J65814M8427k21598J56917L9894M2793J13979
6974a7722M4095p9071K4560k7637L1361J18537N8899L541m4727j23091M1917q0416
6962d9754n8561j63715J02495K4462o2421o8498K58786r9810p1379N9534m1601
$$ plain form
6951 -170462 -98172 -127717 -111396 -146547 -156610 -128631 -257771 -116688 115098 -109422 46043
6940 46043 -105375 -243725 -249576 -322960 -226832 -1334 30647 95458 -132434 -134133 -83926
6929 -83926 -144192 -224571 17508 -75093 -71150 -35828 -39405 42157 53366 -86313 -173229 -241285
6917 -241285 -157973 4644 -13133 -170670 -190422 -13916 -92701 -27548 -128627 -101620 12385
6906 12385 161653 85775 -29434 -90420 879 -10867 54436 -198691 -104380 -67409 127036
6895 127036 235988 -21256 130365 169773 46745 12980 34779 82562 215950 40197
6885 40197 -104740 -50484 19008 -121507 -98882 -230372 -322347 -33247 100645 -94126 -107681
6874 -107681 -98656 -52756 -74932 -220130 -295665 -328570 -199335 -59514 7893 -18071 -195676
$$ packed form
6951a70462P2290k9545J6321l5151j0063K7979j29140J41083K31786k24520J55465
6940D6043j51418j38350n851p3384R6128K25498L1981O4811k27892j699N0207
6929h3926o0266q0379K42079r2601L943L5322l577Q1562J1209j39679q6916o8056
6917b41285Q3312J62617j7777j57537j9752J76506p8785O5153j01079K7007J14005
6906A2385J49268p5878j15209o0986R1299j1746O5303k53127R4311L6971J94445
6895A27036J08952k57244J51621L9408j23028l3765K1799M7783J33388j75753
6885D0197j44937N4256O9492j40515K2625j31490r1975K89100J33892j94771j3555
6874a07681R025M5900k2176j45198p5535l2905J29235J39821O7407k5964j77605
$$ plain form
6863 -195676 -180987 -75752 -202897 -284037 -364836 -174903 -15243 -111240 -271261 -207298 -112896
6852 -112896 -150618 -101830 21429 3668 -12185 -23640 -223044 -196183 -51515 35706 -89307
6841 -89307 -5390 -106613 -95851 -147919 -60884 -209663 57844 143727 -122687 -8990 -205188
6830 -205188 -265062 -44053 -109651 -153126 -106241 -161423 38064 -41305 -140247 32023 -53469
6819 -53469 -56535 23660 171537 13721 -112386 12296 -112665 86683 65088 150692 78909
6808 78909 -32754 -35638 -26637 -37888 -124940 16204 -6129 -72679 -80730 -137268 -176318 -223122
6796 -223122 -162375 -235941 -62874 -196880 -91998 13431 -76851 -148217 -167021 -258249 8007
6785 8007 247575 116120 -52168 -94277 18304 88940 68862 -139489 -158613 -116003 -36001
$$ packed form
6863a95676J4689J05235j27145q1140q0799J89933J59660r5997j60021O3963R4402
6852a12896l7722M8788J23259j7761j5853j1455j99404K6861J44668Q7221j25013
6841h9307Q3917j01223J0762n2068Q7035j48779K67507Q5883k66414J13697j96198
6830b05188n9874K21009o5598m3475M6885n5182J99487p9369r8942J72270q5492
6819e3469l066Q0195J47877j57816j26107J24682j24961J99348k1595Q5604p1783
6808G8909j11663k884R001j1251q7052J41144k2333o6550q051n6538l9050m6804
6796b23122O0747p3566J73067j34006J04882J05429r0282p1366j8804r1228K66256
6785H007K39568j31455j68288m2109J12581P0636k0078k08351j9124M2610Q0002
$$ plain form
6774 -36001 -65484 30333 85519 46013 -110141 -22833 -251027 -168996 -197305 -291934 -121709
6763 -121709 -147204 -1242 107230 181671 -48825 45319 65072 -29954 97408 254574 172238
6752 172238 -58932 7219 33242 62107 43990 -160970 39137 151668 65841 63142 1345
6741 1345 -40184 40905 -148710 -167953 -46629 -1656 -93306 -236279 -351967 -64486 -143216
6730 -143216 -83774 -90581 -207589 -207289 -123376 -16418 -96264 -22824 -42220 -16094 -242949 -229906
6718 -229906 -185517 -228740 -322171 -255682 -29869 62642 154072 188301 -46382 -150003 -242199
6707 -242199 -126669 -360834 -405338 -109196 -81443 -238972 -195582 -70596 -108645 -220826
6697 -220826 -130878 -132400 -107142 -5999 -115779 4122 204378 -22833 38842 -102534 -185782
$$ packed form
6774c6001k9483R5817N5186l9506j56154Q7308k28194Q2031k8309r4629J70225
6763a21709k5495J45962J08472P4441k30496R4144J9753r5026J27362J57166q2336
6752A72238k31170O6151K6023K8865j8117k04960K00107J12531q5827k699o1797
6741A345m1529Q1089j89615j9243J21324M4973r1650j42973j15688K87481p8730
6730a43216N9442o807j17008L00Q3913J06958p9846P3440j9396K6126k26855J3043
6718b29906M4389m3223r3431O6489K25813R2511R1430L4229k34683j03621r2196
6707b42199J15530k34165m4504K96142K7753j57529M3390J24986l8049j12181
6697b20826Q9948j522K5258J01143j09780J19901K00256k27211O1675j41376q3248
$$ plain form
6686 -185782 20983 55482 83742 -87558 -82926 31488 130751 14556 -64085 -220326 -300839
6675 -300839 -112718 -126764 96442 53568 -25819 -205804 46818 121901 164653 230258 -29942
6664 -29942 -273527 -276216 -176803 -192111 -22663 -26180 -25786 -71490 -74327 -226356 -238697 -118414
6652 -118414 37215 -139905 -124549 -17990 -94188 -112562 -91168 46851 -183867 -372458
6642 -372458 -212914 -252397 -77379 18530 24159 -57553 -12686 -83745 -104772 9451 -49590
6631 -49590 -18101 -141494 -39581 108311 -14610 -23096 88 -127023 -81206 -76002 -102872
6620 -102872 -72907 4202 42152 -45336 121302 152909 119832 21690 -75055 51178 28811
6609 28811 -20424 -137647 -72866 -134957 -110558 -108094 -25022 42963 8592 29925 23759 218688
$$ packed form
6686a85782K06765L4499K8260j71300M632J14414R9263j16195p8641j56241q0513
6675c00839J88121j4046K23206m2874p9387j79985K52622P5083M2752O5605k60200
6664b9942k43585k689R9413j5308J69448l517L94m5704k837j52029j2341J20283
6652a18414J55629j77120J5356J06559p6198j8374K1394J38019k30718j88591
6642c72458J59544l9483J75018R5909N629q1712M4867p1059k1027J14223n9041
6631d9590L1489j23393J01913J47892j22921q486K3184j27111M5817N204k6870
6620a02872K9965P7109L7950q7488J66638L1607l3077r8142r6745J26233k2367
6609B8811m9235j17223O4781o2091K4399K464Q3072O7985l4371K1333o166J94929
$$ plain form
6597 218688 270228 180645 -21027 -160833 -239586 -120360 -241504 -267836 -126190 -368857
6587 -368857 -185243 -16628 -291415 -66509 -105028 -16021 -85693 -123471 -152953 -121184 -229671
6576 -229671 -185180 -168994 45361 11371 43428 12217 108611 98699 182613 7053 -3820
6565 -3820 132077 135349 113386 95594 27485 -188467 -63964 -180671 -124921 -122702 -17695
6554 -17695 -77888 -24459 -147782 15600 -133661 25353 100215 285626 240788 -216678 -249124
6543 -249124 -73320 -128583 -53771 -110912 -128730 -124621 -162742 -209193 -294625 -203199 -232044 -213276
6531 -213276 -241318 -200381 -126030 -85337 -106872 -124959 -36339 -112866 -174245 -73649 -43159
6520 -43159 36577 103222 80705 160392 57539 -115133 -148861 -23060 -234903 -141571 -30891
$$ packed form
6597B18688N1540q9583k01672j39806p8753J19226j21144k6332J41646k42667
6587c68857J83614J68615k74787K24906l8519Q9007o9672l7778k9482L1769j08487
6576b29671M4491J6186K14355l3990L2057l1211R6394r912Q3914j75560j0873
6565c820J35897L272k1963j7792o8109k15952J24503j16707N5750K219J05007
6554a7695o0193N3429j23323J63382j49261J59014P4862J85411m4838m57466l2446
6543b49124J75804n5263P4812n7141j7818M109l8121m6451q5432R1426k8845J8768
6531b13276k8042M0937P4351M0693k1535j8087Q8620p6527o1379J00596L0490
6520d3159P9736O6645k2517P9687j02853j72672l3728J25801k11843R3332J10680
$$ plain form
6509 -30891 111732 67551 -97451 -45025 -65938 21267 88490 54981 -69514 5040 111307
6498 111307 246520 452240 296558 22161 -170039 -53141 65471 150399 165796 75702
6488 75702 39325 53627 122455 199972 28548 -114247 -104818 -19694 -33330 -141880 13482
6477 13482 125134 -16498 -130083 -96568 12977 16698 -7189 -183729 -139394 -123606 -141159
6466 -141159 49468 -10142 -95311 -184514 60413 264566 244952 9956 -137333 -173561 -182529
6455 -182529 -310958 -131844 -79846 -113200 -134812 -10527 25944 -38467 -97694 -48397 -81953
6444 -81953 -169132 48594 -65612 -295981 -76911 31275 112242 73248 -17195 -859 90131
6433 90131 -120731 -149719 -95415 -19119 186862 308814 122436 -36309 -91525 -88371 -37789
$$ packed form
6509c0891J42623m4181j65002N2426k0913Q7205O7223l3509j24495P4554J06267
6498A11307J35213K05720j55682k74397j92200J16898J18612Q4928J5397r0094
6488G5702l6377J4302O8828P7517j71424j42795R429Q5124j3636j08550J55362
6477A3482J11652j41632j13585L3515J09545L721k3887j76540M4335J5788j7553
6466a41159J90627n9610q5169q9203K44927K04153j9614k34996j47289l6228q968
6455a82529j28429J79114N1998l3354k1612J24285L6471o4411n9227M9297l3556
6444h1953q7179K17726j14206k30369K19070J08186Q0967l8994r0443J6336R0990
6433I0131k10862k8988N4304P6296K05981J21952j86378j58745n5216L154N0582
$$ plain form
6422 -37789 21552 -174632 -278035 -34438 52513 -111626 -273744 -268059 37115 144692 81382
6411 81382 51748 -91895 -335460 -427096 -139323 -248271 -136074 -65684 -180257 -149585 -139293
6400 -139293 -171384 4536 155769 130149 109832 156695 -190051 -138558 -72090 32561 171684
6389 171684 119893 223458 20529 -12886 118391 182114 95050 -76996 -57989 -54812 -104494
6378 -104494 119012 121702 -23017 -64076 -84683 -63367 -12918 -25072 159996 72452 59193
6367 59193 49653 -136266 -253405 -213559 -201681 -164003 6596 27521 -208689 -327538 -159194
6356 -159194 -162884 179814 68137 -44662 -75036 -49054 147100 71428 -59803 56216 -57268
6345 -57268 -283727 -61122 36138 56858 -172214 -187566 -85937 -180129 -154919 -25993 31611
$$ packed form
6422c7789N9341j96184j03403K43597Q6951j64139j62118N685L05174J07577o3310
6411H1382k9634j43643k43565r1636K87773j08948J12197P0390j14573L0672J0292
6400a39293l2091J75920J51233k5620k0317M6863l46746N1493O6468J04651J39123
6389A71684n1791J03565k02929l3415J31277O3723q7064j72046J9007L177m9682
6378a04494K23506K690j44719m1059k0607K1316N0449j2154J85068q7544j3259
6367E9193r540j85919j17139L9846J1878L7678J70599K0925k36210j18849J68344
6356a59194l690L42698j11677j12799l0374K5982J96154p5672j31231J16019j13484
6345e7268k26459K22605R7260K0720k29072j5352J01629r4192K5210J28926N7604
$$ plain form
6334 31611 -86721 -39631 -89240 -41499 -148253 -6755 -40251 -144800 -48143 -15233 258117
6323 258117 73069 65319 -117595 -122247 1433 -105243 40249 -33611 9827 54490 138570
6312 138570 -75193 -139630 -35586 -40428 -76926 -33139 -140852 -170151 -123209 -232093 -23662
6301 -23662 -13555 -83633 -54412 17837 -85244 -108917 -53563 -190722 -72711 20252 35160
6290 35160 -124527 -143466 -123004 -44876 25831 -120438 -197827 -217996 -110745 -46619 -112797
6279 -112797 -165670 78137 268774 236579 111672 20477 -148700 -83938 175772 -119085
6269 -119085 8509 137906 25611 27234 96295 106969 25140 -45522 -26890 54726 194762
6258 194762 104906 26483 37045 28819 11018 30727 29156 112088 240484 -23134 15030 -66365
$$ packed form
6334C1611j18332M7090m9609M7741j06754J41498l3496j04549R6657L2910K73350
6323B58117j85048p750j82914m652J23680j06676J45492p3860M3438M4663Q4080
6312A38570k13763o4437J04044m842l6498M3787j07713k9299M6942j08884K08431
6301b3662J0107p0078K9221P2249j03081k3673N5354j37159J18011R2963J4908
6290C5160j59687j8939K0462P8128P0707j46269p7389k0169J07251O4126o6178
6279a12797n2873K43807J90637l2195j24907r1195j69177O4762K59710k94857
6269a19085J27594J29397j12295J623O9061J0674q1829p0662J8632Q1616J40036
6258A94762q9856p8423J0562q226j7801J9709j571Q2932J28396k63618L8164q1395
$$ plain form
6246 -66365 20533 25818 -37393 -72442 -154964 -158167 -224254 -177353 -163654 -237506 -67355 68037
6234 68037 -102594 -306284 -298894 -233157 -125648 -198704 -307853 -288317 -159190 -136683 -169060
6223 -169060 -216677 -64414 -44799 63927 -14742 83441 111360 181687 348383 83697 -36487
6212 -36487 -13730 247353 397359 285944 182333 10439 -36780 45740 74051 159934 199262
6201 199262 207358 13471 -63844 131433 88296 101054 234231 119792 -76925 -74811 -83879
6190 -83879 13230 -64884 -46304 110971 155794 221262 157246 19757 -26987 108240 -49477
6179 -49477 -101396 -4872 188226 212119 17980 -69735 119883 235393 67398 73879 214379
6168 214379 219298 253333 152166 -24384 -110888 -20070 44974 8682 24763 106059 264984
$$ packed form
6246f6365Q6898N285o3211l5049q2522l203o6087M6901J3699p3852J70151J35392
6234F8037j70631k03690P390O5737J07509p3056j09149J9536J29127K2507l2377
6223a69060m7617J52263J9615J08726p8669R8183K7919P0327J66696k64686j20184
6212c6487K2757K61083J50006j11415j03611j71894m7219Q2520K8311Q5883L9328
6201A99262Q096j93887p7315J95277m3137J2758J33177j14439j96717K114r068
6190h3879R7109p8114J8580J57275M4823O5468o4016j37489m6744J35227j57717
6179d9477n1919R6524J93098K3893j94139q7715J89618J15510j67995O481J40500
6168B14379M919L4035j01167j76550q6504R0818O5044l6292J6081Q1296J58925
$$ plain form
6157 264984 127476 -130840 -41035 13642 -55295 -88643 -170224 -76133 -51393 -112197 -156786
6146 -156786 -175041 20910 -91151 -101607 -54982 11827 -116171 17421 265714 87456
6136 87456 8117 -115497 -59662 -21321 -51328 -167355 -144294 67637 -105328 -43931 17160
6125 17160 65841 -76099 -134109 -85628 -222416 -267748 58313 19668 -138788 -134246 -345628
6114 -345628 -152404 -297345 -206469 7122 -20844 95664 272131 184058 175262 206019 104528
6103 104528 -6352 183 162483 169048 -108924 -92547 133117 169965 122580 74168 97441
6092 97441 -55299 -105209 -11079 89442 83162 -60301 -33568 -47354 -35835 -23392 23964
6081 23964 207584 80447 -142147 98573 -20495 -97668 36062 108323 132891 283089
$$ packed form
6157B64984j37508k58316Q9805N4677o8937l3348q1581R4091K4740o0804m4589
6146a56786j8255J95951j12061j0456M6625O6809j27998J33592K48293j78258
6136H7456p9339j23614N5835L8341l0007j16027K3061K11931j72965O1397O1091
6125A7160M8681j41940n8010M8481j36788m5332L26061l8645j58456M542k11382
6114c45628J93224j44941R0876K13591k7966J16508J76467q8073q796L0757j01491
6103A04528j10880O535J62300O565k77972J6377K25664L6848m7385m8412K3273
6092I7441j52740m9910R4130J00521o280j43463K6733j3786J1519J2443M7356
6081B3964J83620j27137k22594K40720j19068p7173J33730P2261K4568J50198
$$ plain form
6071 283089 65420 -32760 156760 -17987 -72734 85961 -3840 164025 187904 14763
6061 14763 20266 -78059 14060 58656 45303 37636 94619 8580 16460 39456 126239 152146
6049 152146 231276 56556 38094 -24425 -53800 -110441 -75166 55872 152515 61953 -120525
6038 -120525 -117471 68761 144692 224689 45619 58994 -117614 -26354 120824 86783 375917
6027 375917 200221 218577 297027 203795 128839 260250 262824 149012 287365 9339 110596
6016 110596 185634 83970 2153 -34630 -44737 -287566 -41385 159474 217835 260659 330096
6005 330096 21724 31259 126351 103636 194379 296911 385648 290134 267027 201724 217393
5994 217393 -25380 -87475 173510 244228 256981 143145 54722 132499 228093 181433 22501
$$ packed form
6071B83089k17669r8180J89520j74747n4747J58695q9801J67865K3879j73141
6061A4763N503r8325R2119M4596j3353p667N6983q6039P880K2996Q6783K5907
6049A52146P9130j74720j8462o2519k9375n6641L5275J31038R6643r0562j82478
6038a20525L054J86232P5931P9997j79070J3375j76608R1260J47178l4041K89134
6027C75917j75696J8356P8450r3232p4956J31411K574j13812J38353k78026J01257
6016A10596P5038j01664q1817l6783j0107k42829K46181K00859N8361M2824O9437
6005C30096l08372R535R5092k2715R0743J02532Q8737r5514k3107o5303J5669
5994B17393k42773o2095K60985P0718J2753j13836q8423P7777R5594m6660j58932
$$ plain form
5983 22501 -26366 170305 -19654 -42187 43103 32781 132882 297240 98308 16222 -45026
5972 -45026 -81870 27518 102785 870 127189 157864 181445 167184 41155 104261 -25095
5961 -25095 -221538 -55672 -79115 3600 26336 48760 279946 98750 -11812 -58635 134267
5950 134267 61693 14451 -13617 53135 166118 126543 232083 -16534 -169898 18790 128338
5939 128338 21094 17272 1820 123593 193215 145252 112572 134664 180934 73502 -39439
5928 -39439 -37935 -66284 -217415 -145629 95509 27324 29628 54437 128488 324453 194393
5917 194393 125238 25975 53987 61955 41955 118392 123456 185843 176205 271295 206044 74546
5905 74546 193759 45744 245249 387719 203720 279438 292539 220320 264168 184313 208472
$$ packed form
5983B2501m8867J96671j89959k2533Q5290j0322J00101J64358j98932q2086o1248
5972d5026l6844J09388P5267j01915J26319L0675K3581j4261j26029O3106j29356
5961b5095j96443J65866k3443Q2715K2736K2424K31186j81196j10562m6823J92902
5950A34267p2574m7242k8068O6752J12983l9575J05540k48617j53364J88688J09548
5939A28338j07244l822j5452J21773O9622m7963l2680K2092M6270j07432j12941
5928c9439J504k8349j51131P1786K41138o8185K304K4809P4051J95965j30060
5917A94393o9155r9263K8012P968k0000P6437N064O2387r638R5090o5251j31498
5905G4546J19213j48015J99505J42470j83999P5718J3101p2219M3848p9855K4159
$$ plain form
5894 208472 160985 142053 136414 331558 276876 -59222 115028 208207 169833 294 96544
5883 96544 280464 306659 186787 103870 109930 -28038 124589 56521 220020 379138 286242
5872 286242 32264 23182 -145284 -178398 -191965 -119283 158056 289045 292596 226591 218201
5861 218201 367421 306148 227477 335727 57022 8631 55107 259749 135766 97175 159505
5850 159505 248501 528737 397555 290330 195884 159605 299085 79492 -92782 216407
5840 216407 289718 199130 345927 366718 190523 145372 33852 101114 107398 -3625 -8021
5829 -8021 222506 387138 313408 176462 89608 214145 86563 54945 260799 197210 201591
5818 201591 372509 373133 338101 296206 252350 202278 255815 263816 204662 291071 329008 307945
$$ packed form
5894B08472m7487j8932n639J95144n4682l36098J74250R3179l8374j69539R6250
5883I6544J83920K6195j19872q2917O060j37968J52627o8068J63499J59118r2896
5872B86242k53978r082j68466l3114j3567P2682K77339J30989L551o6005q390
5861B18201J49220o1273p8671J08250k78705m8391M6476K04642j23983l8591O2330
5850A59505Q8996K80236j31182j07225r4446l6279J39480k19593j72274L09189
5840B16407P3311r0588J46797K0791j76195m5151j11520O7262O284j11023m396
5829h021K30527J64632p3730j36946q6854J24537j27582l1618K05854o3589M381
5818B01591J70918O24l5032m1895m3856n0072N3537Q001n9154Q6409L7937k1063
$$ plain form
5806 307945 246304 291778 631118 440809 352731 322327 331783 465780 374846 204700 281682
5795 281682 554169 470655 400989 287259 171573 99062 164956 426734 534694 590840 377851
5784 377851 244317 306091 249130 252875 124882 87442 170166 336396 340993 153124 337550
5773 337550 339825 -17825 192121 121876 -34263 130282 168804 171226 354800 258137 169422
5762 169422 514710 542883 360230 505166 615282 555579 695493 613898 587468 399068
5752 399068 344881 362495 321327 289897 278180 411705 345663 380019 540369 451903 197206
5741 197206 280199 553561 489111 425936 532062 517672 651500 825652 777311 782936 818223
5730 818223 852729 1000835 1050993 1050927 981645 906764 1009720 819654 837111 958554 999185
$$ packed form
5806C07945o1641M5474L39340j90309q8078l0404R456J33997r0934j70146P6982
5795B81682K72487q3514o9666j13730j15686p2511O5894K61778J07960N6146k12989
5784C77851j33534O1774n6961L745j27993l7440Q2724J66230M597j87869J84426
5773C37550K275l57650K09946p0245j56139J64545L8522K422J83574r6663q8715
5762A69422L45288K8173j82653J44936J10116n9703J39914q1595k6430j88400
5752C99068n4187J7614m1168l1430j1717J33525o6042L4356J60350q8466k54697
5741A97206Q2993K73362o4450o3175J06126j4390J33828J74152m8341N625L5287
5730H18223L4506J48106N0158o6o9282p4881J02956j90066J7457J21443M0631
$$ plain form
5719 999185 999735 964417 876592 844282 846138 792904 660171 759717 748319 603969 580881 798169
5707 798169 677871 544783 604590 485034 391613 673929 477640 378082 445651 432647 411839
5696 411839 365240 503779 745676 556338 656287 600490 446792 409330 421910 545260 515978
5685 515978 704409 737790 533203 521750 819350 619397 557876 462770 315160 360728 528247
5674 528247 568226 741868 755514 593859 562524 828205 591773 674278 641684 631449 513249
5663 513249 504293 451335 518522 643787 848476 757633 639914 648652 624371 623794 554930 626408
5651 626408 389027 403197 453395 400602 472965 562584 465310 610044 357910 441862 668757
5640 668757 755052 943206 808154 910018 914353 848195 779236 947852 826317 874954 1094397
$$ packed form
5719I99185N50l5318q7825l2310J856n3234j32733R9546j1398j44350k3088K17288
5707G98169j20298j33088N9807j19556r3421K82316j96289r9558O7569j3004k0808
5696D11839m6599J38539K41897j89338R9949n5797j53698l7462J2580J23350k9282
5685E15978J88431L3381k04587j1453K97600j99953o1521r5106j47610M5568J67519
5674E28247L9979J73642J3646j61655l1335K65681k36432Q2505l2594j0235j18200
5663E13249q956n2958O7187J25265K04689r0843j17719Q738k4281n77o8864P1478
5651F26408k37381J4170N0198n2793P2363Q9619r7274J44734k52134Q3952K26895
5640F68757Q6295J88154j35052J01864M335o6158o8959J68616j21535M8637K19443
$$ plain form
5629 1094397 821816 628474 660606 750195 837652 801985 896838 893876 1001742 964883 807582
5618 807582 856228 956395 939462 998358 1118146 1073672 999425 1097111 886700 987494 1256743
5607 1256743 1141475 1189183 1217642 1068950 1047785 1151868 864852 804000 991124 1114809
5597 1114809 1238124 1368144 1383845 1296700 1378610 1266982 1154555 1216013 1452255 1343007
5587 1343007 1172345 1136304 1055682 1261891 1359540 1404491 1341330 1317287 1249397 1276434 1396777
5576 1396777 1432039 1428880 1373888 1361898 1526650 1533387 1702151 1634727 1694750 1661188 1608399
5565 1608399 1610494 1675102 1596861 1677910 1707741 1659576 1874645 1820409 1789892 1973826 2102179
5554 2102179 2125838 1994901 2106369 2155562 2133760 2209428 2367437 2199696 2326411 2263110
$$ packed form
5629A094397k72581j93342L2132Q9589Q7457l5667R4853k962J07866l6859j57301
5618H07582M8646J00167j6933N8896J19788m4474p4247R7686k10411J00794K69249
5607A256743j15268M7708K8459j48692k1165J04083k87016o0852J87124J23685
5597A114809J23315J30020J5701q7145Q1910j11628j12427O1458K36242j09248
5587A343007j70662l6041q0622K06209R7649M4951o3161k4043o7890K7037J20343
5576A396777L5262l159n4992j1990J64752O737J68764o7424O0023l3562n2789
5565A608399K095O4608p8241Q1049K9831m8165K15069n4236l0517J83934J28353
5554B102179K3659j30937J11468M9193k1802P5668J58009j67741J26715o3301
$$ plain form
5544 2263110 2232803 2368876 2214667 2342951 2668683 2729187 2628559 2719159 2657956 2643441
5534 2643441 2686124 2886240 2882825 2853258 2997498 3128402 3243199 3361648 3436823 3588367
5524 3588367 3613277 3468637 3599383 3660428 3713479 3731335 3818098 3991757 4192752 3979732
5514 3979732 4111317 4227547 4305134 4498861 4516049 4720430 4860108 5097702 5120071 5360005
5504 5360005 5748004 5957733 5953079 6038175 6367406 6583202 6783696 7049845 7209972 7392300
5494 7392300 7713488 8046832 8335096 8428527 8547981 8562781 8668828 8962546 8979692 9210175
5484 9210175 9495021 9694041 9907345 10013096 10168638 10686191 11099965 11384088 11555768 11905251
5474 11905251 12151493 12549669 13045572 13579650 13976879 14208307 14634186 15201603 15750681
$$ packed form
5544B263110l0307J36073j54209J28284L25732O0504j00628R0600o1203j4515
5534B643441M2683K00116l415k9567J44240J30904J14797J18449P5175J51544
5524C588367K4910j44640J30746O1045N3051J7856Q6763J73659K00995k13020
5514C979732J31585J16230P7587J93727J7188K04381J39678K37594K2369K39934
5504E360005L87999K09729m654Q5096L29231K15796K00494K66149J60127J82328
5494G392300L21188L33344K88264R3431J19454J4800J06047K93718J7146K30483
5484I210175K84846J99020K13304J05751J55542N17553M13774K84123J71680L49483
5474A1905251K46242L98176M95903N34078L97229K31428M25879N67417N49078
$$ plain form
5465 15750681 16392833 16974749 17798603 18439349 19157624 19862693 20568815 21109577 21657676
5456 21657676 22373872 23249170 24189896 25108291 26122153 26932072 28133887 29410540 30760930
5447 30760930 32434475 33920103 35663906 37804822 40035145 42546222 45368058 48653224
5439 48653224 52396804 56646753 61630165 67808639 74332115 81548864 89577577 98272236
5431 98272236 107484663 116869673 125795839 134032683 141580287 148715045 155624262 162330123
5423 162330123 167824529 170439622 168965694 163826543 156457255 147844061 139547114 131153501
5415 131153501 122801081 113992446 104354695 94453291 85038363 76391898 68466421 61740830
5407 61740830 56153400 51236110 47122404 43472933 40269293 37397412 34615919 32498237
$$ packed form
5465A5750681O42152N81916Q23854O40746P18275P05069P06122N40762N48099
5456B1657676P16196Q75298R40726R18395J013862Q09919J201815J276653J350390
5447C0760930J673545J485628J743803K140916K230323K511077K821836L285166
5439D8653224L743580M249949M983412O178474O523476P216749Q028713Q694659
5431I8272236R212427R385010Q926166Q236844P547604P134758O909217O705861
5423A62330123N494406K615093j473928n139151p369288q613194q296947q393613
5415A31153501q352420q808635r637751r901404r414928q646465p925477o725591
5407F1740830n587430m917290m113706l649471l203640k871881k781493k117682
$$ plain form
5399 32498237 30435536 28638605 27121857 25702035 24455097 23174839 22220360 21281457
5391 21281457 20449066 19626902 18772601 17783005 17141188 16713764 16215599 15655771 15194152
5382 15194152 14540138 13949949 13634771 13130710 12743876 12440323 12060298 11624951 11256198
5373 11256198 10940860 10589440 10202276 9883228 9590835 9263950 8923441 8642051 8616635 8455444
5363 8455444 8239746 8067200 7754773 7643094 7408997 7036886 6873015 6689159 6352340 6316772
5353 6316772 6234217 6282236 5937139 5812221 5810310 5702642 5569242 5481625 5445533 5368345 4948587
5342 4948587 5067295 5093240 4857681 4743039 4607006 4455238 4449984 4548319 4442077 4260249
5332 4260249 4085800 4075057 4058173 3962006 3792869 3788072 3695632 3620823 3622777 3519006 3503207
$$ packed form
5399C2498237k062701j796931j516748j419822j246938j280258r54479r38903
5391B1281457q32391q22164q54301r89596o41817m27424m98165n59828m61619
5382A5194152o54014n90189l15178n04061l86834l03553l80025m35347l68753
5373A1256198l15338l51420l87164l19048k92393l26885l40509k81390k5416j61191
5363H455444k15698j72546l12427j11679k34097l72111j63871j83856l36819l5568
5353F316772q2555M8019l45097j24918j911j07668j33400q7617l6092p7188m19758
5342D948587J18708K5945k35559j14642j36033j51768n254R8335j06242j81828
5332D260249j74449j0743j6884r6167j69137m797r2440p4809J954j03771j5799
$$ plain form
5321 3503207 3530576 3395028 3196507 3109259 3084205 2942643 2954684 2770710 2918723 2961741
5311 2961741 2690876 2669990 2639483 2769963 2751181 2633899 2454490 2354029 2513582 2439561
5301 2439561 2406001 2338290 2258079 2212185 2141100 2062634 2035875 2221565 2225373 2285873 2132345
5290 2132345 2138190 2241247 2257746 2215637 2131661 2000020 1919732 1840698 1664511 1670804 1845967
5279 1845967 1799537 1625478 1780236 1586534 1612802 1850096 1652164 1552363 1607936 1650263
5269 1650263 1661060 1642742 1573594 1429200 1341205 1459517 1649880 1505093 1447646 1605351
5259 1605351 1512737 1548175 1399573 1285477 1285257 1327252 1383612 1186552 1163792 1075526 1127271
5248 1127271 1169685 1327399 1124030 1129107 1343100 1232865 917822 991678 1056325 1165904
$$ packed form
5321C503207K7369j35548j98521q7248k5054j41562J2041j83974J48013M3018
5311B961741k70865k0886l0507J30480j8782j17282j79409j00461J59553p4021
5301B439561l3560o7711q0211m5894p1085p8466k6759J85690L808O0500j53528
5290B132345N845J03057J6499m2109q3976j31641q0288p9034j76187O293J75163
5279A845967m6430j74059J54758j93702K6268K37294j97932r9801N5573M2327
5269A650263J0797j8318o9148j44394q7995J18312J90363j44787n7447J57705
5259A605351r2614L5438j48602j14096k20M1995N6360j97060k2760q8266N1745
5248A127271M2414J57714k03369N077K13993j10235l15043P3856O4647J09579
$$ plain form
5238 1165904 1133782 1172533 1320271 1218351 1302679 1228386 1322862 1295977 1060124 1015533 1183354
5227 1183354 1128237 1092715 1076987 1078656 1071308 1066250 1071907 955119 934568 956607 1136528 1092679
5215 1092679 1198664 1159945 1012775 909323 1037840 1121440 1047671 823251 822596 869138 1002980
5204 1002980 1023337 914634 1049622 1189311 1151399 1020334 863927 686637 818305 810679
5194 810679 861657 788359 725659 778432 968659 946253 930520 705322 691639 781985 645505
5183 645505 657168 692582 650308 634823 678356 989523 927018 698817 814507 736858 740627
5172 740627 676237 529627 526948 587908 709701 833161 709909 618307 601242 647875 549530
5161 549530 605088 733601 684372 699172 697127 721760 819542 789821 713059 642532 593360 692033
$$ packed form
5238A165904l2122L8751J47738j01920Q4328p4293R4476k6885k35853m4591J67821
5227A183354n5117l5522j5728J669p348n058N657j16788k0551K2039J79921m3849
5215A092679J05985l8719j47170j03452J28517Q3600p3769k24420o55M6542J33842
5204A002980K0357j08703J34988J39689l7912j31065j56407j77290J31668p626
5194H10679N0978p3298o2700N2773J90227k2406j5733k25198j3683R0346j36480
5183F45505J1663L5414m2274j5485M3533L11167o2505k28201J15690p7649L769
5172G40627o4390j46610k679O0960J21793J23460j23252r1602j7065M6633r8345
5161E49530N5558J28513m9229J4800k045K4633R7782k9721p6762p0527m9172R8673
$$ plain form
5149 692033 707423 624123 814651 973229 864026 632600 688220 752505 506476 566752 761325
5138 761325 842449 800225 848492 875963 1097634 968420 939805 957088 794908 890138 1029977
5127 1029977 898741 914362 859387 1059618 839925 860063 991427 1174556 1227884 1289906
5117 1289906 1596637 1339820 1147295 1205787 1132316 1354432 1268168 1023919 1170242 1249799
5107 1249799 1255587 1149435 1146929 985158 937366 948126 1066339 736307 862589 914651 573024
5096 573024 470392 540747 425071 539856 624750 819801 834467 667525 679169 707536 865145
5085 865145 891712 592157 553400 570375 730796 887998 724193 905305 784988 320522
5075 320522 505087 657543 723855 547652 479942 409717 531630 814673 635819 507531
$$ packed form
5149F92033J5390q3300J90528J58578j09203k31426N5620O4285k46029O0276J94573
5138G61325Q1124m2224M8267K7471K21671j29214k8615J7283j62180R5230J39839
5127A029977j31236J5621n4975K00231k19693K0138J31364J83129N3328O2022
5117A289906L06731k56817j92525N8492p3471K22116q6264k44249J46323P9557
5107A249799N788j06152k506j61771m7792J0760J18213l30032J26282N2062l41627
5096E73024j02632P0355j15676J14785Q4894J95051J4666j66942J1644K8367J57609
5085H65145K6567k99555l8757J6975J60421J57202j63805J81112j20317m64466
5075C20522J84565J52456O6312j76203o7710p0225J21913K83043j78854j28288
$$ plain form
5065 507531 451006 620196 558632 567269 374089 461694 536302 413715 504685 760238 677957
5054 677957 667354 568048 510116 511114 519351 521209 724244 672532 490232 552412 514262 454489
5042 454489 583183 660377 420774 552701 563692 717266 647633 532295 620184 651876 603506
5031 603506 644672 823862 743325 720073 694806 674441 776719 656747 607873 465959 536909
5020 536909 590815 543754 328614 262068 312675 464021 421286 404273 552487 493588 652309
5009 652309 573215 599198 451454 351995 411018 444854 477747 406558 546625 619602 548065
4998 548065 666749 540652 398869 518525 544522 571941 432719 571032 769078 770599
4988 770599 609483 749994 665473 667568 920106 983198 920792 974126 1130828 942289 828573
$$ packed form
5065E07531n6525J69190o1564Q637j93180Q7605P4608j22587R0970K55553q2281
5054F77957j0603r9306n7932R98Q237J858K03035n1712j82300O2180l8150n9773
5042D54489J28694P7194k39603J31927J0991J53574o9633j15338Q7889L1692m8370
5031F03506M1166J79190q0537k3252k5267k0365J02278j19972m8874j41914P0950
5020E36909N3906m7061k15140o6546N0607J51346m2735j7013J48214n8899J58721
5009F52309p9094K5983j47744r9459N9023L3836L2893p1189J40067P2977p1537
4998E48065J18684j26097j41783J19656K5997K7419j39222J38313J98046J521
4988G70599j61116J40511q4521K095K52538O3092o2406N3334J56702j88539j13716
$$ plain form
4977 828573 873740 881315 809414 852170 871650 977658 932113 869237 937291 873395 747467
4966 747467 836387 1014348 1018920 879393 846274 987785 1124188 956892 869097 940795 1185647
4955 1185647 1280257 1220213 1186517 1282581 1222609 1060597 1047415 1108339 1057582 964325 955491
4944 955491 974791 861399 705336 770281 1008014 904789 905884 920896 1176947 1230452 988010
4933 988010 1100088 942741 915145 901566 826187 894642 1038866 993813 1064245 1148393 1105503
4922 1105503 1179155 1044937 903334 1067649 888994 962978 1102778 939090 955390 1184449
4912 1184449 1237808 1067718 1019534 1055511 956838 1109997 1158084 922728 933693 902347 1062538
4901 1062538 1196870 1230201 1202180 1068720 1019379 982029 1051998 1160970 1196615 1291829 1322726
$$ packed form
4977H28573M5167P575p1901M2756J9480J06008m5545o2876O8054o3896j25928
4966G47467Q8920J77961M572j39527l3119J41511J36403j67296q7795P1698K44852
4955A185647R4610o0044l3696R6064n9972j62012j3182O0924n0757r3257q834
4944I55491J9300j13392j56063O4945K37733j03225J095J5012K56051N3505k42442
4933I88010J12078j57347k7596j3579p5379O8455J44224m5053P0432Q4148m2890
4922A105503P3652j34218j41603J64315j78655P3984J39800j63688J6300K29059
4912A184449N3359j70090m8184L5977r8673J53159M8087k35356J0965l1346J60191
4901A062538J34332L3331k8021j33460m9341l7350O9969J08972L5645R5214L0897
$$ plain form
4890 1322726 1236857 1108956 1042808 972690 1017652 1170202 1185796 1221612 1106091 935595 1250156
4879 1250156 1219289 1287771 1405151 1392380 1350092 1236301 1152341 1160746 1201678 1114844 1178566
4868 1178566 1469481 1588774 1356316 1182070 1153181 1278097 1241116 1472554 1352164 1193545
4858 1193545 1443431 1554645 1610775 1727598 1682285 1552789 1370694 1459541 1488435 1519543
4848 1519543 1622830 1506131 1589497 1449728 1491920 1856153 1900927 1855400 1872009 1863671 1974010
4837 1974010 2113399 2079191 2198306 1841662 1822211 1897240 1925659 2138198 2308503 2471959
4827 2471959 2541879 2373603 2392432 2104923 2203331 2432836 2400937 2510192 2479438 2593998
4817 2593998 2609304 2596669 2481390 2564149 2502369 2549274 2573929 2552808 2630684 2575239 2550191
$$ packed form
4890A322726q5869j27901o6148p0118M4962J52550J5594L5816j15521j70496L14561
4879A250156l0867O8482J17380j2771m2288j13791q3960Q405M0932q6834O3722
4868A178566K90915J19293k32458j74246k8889J24916l6981K31438j20390j58619
4858A193545K49886J11214N6130J16823m5313j29496j82095Q8847K8894L1108
4848A519543J03287j16699Q3366j39769M2192L64233M4774m5527J6609q338J10339
4837A974010J39389l4208J19115l56644j9451P5029K8419K12539J70305J63456
4827B471959O9920j68276J8829k87509R8408K29505l1899J09255l0754J14560
4817B593998J5306j2635j15279Q2759o1780M6905K4655k1121P7876n5445k5048
$$ plain form
4806 2550191 2707450 2653468 2695786 2875133 2870549 2819978 2857101 2957862 2975878 2788824 2963773
4795 2963773 3072423 3165192 3135875 2985267 3029342 3017256 2928977 2957734 3065310 3102230 3167714
4784 3167714 3426865 3445501 3515976 3606983 3424396 3418247 3610084 3552431 3515979 3491275 3582743
4773 3582743 3680917 3852477 3757782 3943213 4251309 4369436 4653897 4941626 5140076 5458166
4763 5458166 5609728 5824047 5830018 5949642 6194832 5963282 5736694 5550995 5439439 5399250
4753 5399250 5276407 5202945 5368288 5401309 5486518 5507258 5703618 5778564 5604469 5789394
4743 5789394 5964222 6238697 6527665 6415776 6432812 6730478 6880218 6868512 7102983 7384910
4733 7384910 7396027 7348483 7776007 7830106 8101295 8121705 8362824 8529418 8832390 9051709
$$ packed form
4806B550191J57259n3982M2318J79347m584n0571L7123J00761J8016j87054J74949
4795B963773J08650R2769k9317j50608M4075j2086q8279K8757J07576L6920O5484
4784C167714K59151J8636P0475R1007j82587o149J91837n7653l6452k4704R1468
4773C582743R8174J71560r4695J85431L08096J18127K84461K87729J98450L18090
4763E458166J51562K14319N971J19624K45190k31550k26588j85699j11556m0189
4753E399250j22843p3462J65343L3021Q5209K0740J96360P4946j74095J84925
4743E789394J74828K74475K88968j11889J7036K97666J49740j1706K34471K81927
4733G384910J1117m7544M27524N4099K71189K0410K41119J66594L02972K19319
$$ plain form
4723 9051709 9317317 9266986 9312308 9557457 9978215 10230707 10498034 10941630 11012115 11370762
4713 11370762 11592427 11837481 11898804 12224245 12699910 13182572 13521041 13788333 14283093 14945347
4703 14945347 15434798 15771309 16135643 16655973 17416502 18074022 18758029 19623210 20307673
4694 20307673 21245464 22216269 23339986 24588614 26093365 27526464 29191459 31262876
4686 31262876 33139134 35225521 37686456 39972850 42221053 44464320 46250369 47724702
4678 47724702 48951268 49777657 50471298 50805469 50783458 50364759 50000803 49688205 49615300 49532161
4668 49532161 49765814 50594630 51820161 53294566 55497137 58118526 60993379 64275094
4660 64275094 67949066 72389024 76993292 81612852 86134891 90712804 95229862 99258106
$$ packed form
4723I051709K65608n0331M5322K45149M20758K52492K67327M43596P0485L58647
4713A1370762K21665K45054O1323L25441M75665M82662L38469K67292M94760O62254
4703A4945347M89451L36511L64334N20330P60529O57520O84007Q65181O84463
4694B0307673R37791R70805J123717J248628J504751J433099J664995K071417
4686C1262876J876258K086387K460935K286394K248203K243267J786049J474333
4678D7724702J226566Q26389O93641L34171k2011m18699l63956l12598p2905q3139
4668D9532161K33653Q28816J225531J474405K202571K621389K874853L281715
4660F4275094L673972M439958M604268M619560M522039M577913M517058M028244
$$ plain form
4652 99258106 102787902 105587700 106784122 105771488 102003613 96270447 89598207 83150010
4644 83150010 77479314 72920326 69436616 67010331 65508107 64578814 64198680 64308043 64846429
4635 64846429 66370691 68571575 71233747 74420751 78034733 81679140 84912834 87372550
4627 87372550 88834689 88426701 86685201 83676011 79348490 74482337 69245998 63906985
4619 63906985 58687802 54291729 50323753 46944676 44252155 41764092 39664064 37703388
4611 37703388 36058777 34411331 33029762 31891026 30825567 30039417 29401590 28598241 27752340
4602 27752340 27041472 26762884 26541344 26228189 25886256 25654608 25603932 25404722 25373221 25219556
4592 25219556 25245970 25325984 25309607 25441577 25691012 25723775 26002832 26066578 26283539 26478944
$$ packed form
4652I9258106L529796K799798J196422j012634l767875n733166o672240o448197
4644H3150010n670696m558988l483710k426285j502224r29293l80134J09363N38386
4635F4846429J524262K200884K662172L187004L613982L644407L233694K459716
4627H7372550J462139m07988j741500l009190m327521m866153n236339n339013
4619F3906985n219183m396073l967976l379077k692521k488063k100028j960676
4611C7703388j644611j647446j381569j138736j065459p86150o37827q03349q45901
4602B7752340p10868k78588k21540l13155l41933k31648n0676j99210l1501j53665
4592B5219556K6414Q0014j6377J31970K49435L2763K79057O3746K16961J95405
$$ plain form
4582 26478944 26829600 27361121 27765970 28125478 28721216 29464376 30166169 30881972 31694428
4573 31694428 32770771 33485659 34461517 35849516 37133422 38665760 40227406 42013987
4565 42013987 44170703 46385010 49050850 52037320 54949512 58050793 61192565 64418911
4557 64418911 67551933 70781945 73812461 76678698 79074869 81139128 82620669 83551557
4549 83551557 84137717 84070365 83903910 83322904 82550805 81600029 80912946 80360088 79931381 79753361
4539 79753361 79815739 80187637 81116797 82616815 84236883 86127677 88128217 90252786 92317795
4530 92317795 94348062 96614355 98656543 100263684 101145016 100875230 100129320 98951986 97440802
4521 97440802 95680875 93564393 91233905 88797881 86092704 83297180 80519982 78108947
$$ packed form
4582B6478944L50656N31521M04849L59508N95738P43160P01793P15803Q12456
4573C1694428J076343P14888R75858J387999J283906J532338J561646J786581
4565D2013987K156716K214307K665840K986470K912192L101281L141772L226346
4557F4418911L133022L230012L030516K866237K396171K064259J481541R30888
4549H3551557N86160o7352j66455n81006p72099r50776o87083n52858m28707j78020
4539G9753361O2378L71898R29160J500018J620068J890794K000540K124569K065009
4530I2317795K030267K266293K042188J607141Q81332k69786p45910j177334j511184
4521I7440802j759927k116482k330488k436024k705177k795524k777198k411035
$$ plain form
4513 78108947 75715945 73821264 72296927 71057804 69843159 69048518 68474438 68238146 68245141
4504 68245141 68089142 68560290 68814938 69056928 69191074 69317401 69356619 69354601 69334873 69220926
4494 69220926 69003137 68858575 68368154 67902035 67445716 67138744 67121370 67131779 67150960 67755348
4484 67755348 68510831 69531925 70839876 72592201 74478765 76603133 79603297 83160830
4476 83160830 87105023 92056479 97761449 104534094 112188156 121039965 131598917 144319491
4468 144319491 159556850 178244161 200094983 224841301 252969188 284122597 317248986
4461 317248986 347066003 364404944 359897578 333825008 296338346 257269812 222324809
4454 222324809 193112990 169480338 150518768 134690047 121843410 110745993 101316277
$$ packed form
4513G8108947k393002j894681j524337j239123j214645p94641n74080k36292O995
4504F8245141j55999M71148K54648K41990J34146J26327L9218k018j9728j13947
4494F9220926k17789j44562m90421m66119m56319l06972j7374J0409J9181O04388
4484F7755348P55483J021094J307951J752325J886564K124368L000164L557533
4476H3160830L944193M951456N704970O772645P654062Q851809J0558952J2720574
4468A44319491J5237359J8687311K1850822K4746318K8127887L1153409L3126389
4461C17248986K9817017J7338941m507366k6072570l7486662l9068534l4945003
4454B22324809k9211819k3632652j8961570j5828721j2846637j1097417r429716
$$ plain form
4447 101316277 93192483 85897132 79472636 73848924 68759241 64342486 60416116 56994458
4439 56994458 53645940 50646771 48128980 45638128 43606823 41852419 40107023 38436188
4431 38436188 36837182 35482031 34019811 32667023 31629574 30706388 29730358 28718102
4423 28718102 27889205 27202272 26315438 25305258 24633963 23909185 22997070 22370760 21857337
4414 21857337 21240991 20539522 19957564 19396836 18866922 18655616 18178355 17717013 17181963
4405 17181963 16687979 16393013 16300790 15746070 15318983 14699444 14421380 13981973 13585062 13289234
4395 13289234 13132452 12976569 12655735 12474747 12273138 11846474 11594453 11236860 11029725
4386 11029725 11178202 11134089 10877143 10540351 10302729 10111770 10171199 9739046 9470874 9153348
$$ packed form
4447A01316277q123794p295351o424496n623712n089683m416755l926370l421658
4439E6994458l348518k999169k517791k490852k031305j754404j745396j670835
4431C8436188j599006j355151j462220j352788j037449r23186r76030j012256
4423B8718102q28897o86933q86834j010180o71295p24778r12115o26310n13423
4414B1857337o16346p01469n81958n60728n29914k11306m77261m61342n35050
4405A7181963m93984k94966r2223n54720m27087o19539k78064m39407l96911k95828
4395A3289234j56782j55883l20834j80988k01609m26664k52021l57593k07135
4386A1029725J48477m4113k56946l36792k37622j90959N9429m32153k68172l17526
$$ plain form
4376 9153348 9142570 8967267 8968366 8901210 8748484 8621665 8555736 8386359 8354997 8268017 8296072
4365 8296072 7990434 7889574 7784617 7649104 7684572 7511151 7383071 7277033 6941146 6598902
4355 6598902 6504960 6604623 6298490 6074848 6108714 6080000 6128313 6029369 5912333 5931599 5855036
4344 5855036 5730141 5645219 5721916 5729489 5817549 5697731 5650247 5591510 5354642 5337224 5392958
4333 5392958 5325614 5031549 4892352 4796786 4845968 4634157 4535942 4447587 4330111 4158983
4323 4158983 4063033 4067385 4231350 4218353 4193931 4088281 4079952 4018369 3773647 3689378 3803405
4312 3803405 3847958 3794869 3607471 3536155 3634460 3673372 3582378 3296580 3392013 3365621 3261339
4301 3261339 3581497 3530892 3280781 3174960 3063069 3004155 3027296 2828879 2850993 2835506
$$ packed form
4376I153348j0778j75303J099o7156j52726j26819o5929j69377l1362q6980K8055
4365H296072l05638j00860j04957j35513L5468j73421j28080j06038l35887l42244
4355F598902r3942R9663l06133k23642L3866k8714M8313r8944j17036J9266p6563
4344E855036j24895q4922P6697P573Q8060j19818m7484n8737k36868j7418N5734
4333E392958o7344k94065j39197r5566M9182k11811r8215q8355j17476j71128
4323D158983r5950M352J63965j2997k4422j05650q329o1583k44722q4269J14027
4312C803405M4553n3089j87398p1316R8305L8912r0994k85798R5433k6392j04282
4301C261339L20158n0605k50111j05821j11891n8914K3141j98417K2114j5487
$$ plain form
4291 2835506 2701505 2952061 2869095 2805266 2747509 2770962 2857788 2911818 2851017 2773061 2603924
4280 2603924 2374582 2474885 2594231 2755774 2895034 2978508 2774782 2689255 2409629 2560308
4270 2560308 2542839 2592746 2642681 2597824 2693222 2740140 2594813 2430902 2475204 2531276 2617768
4259 2617768 2464902 2271484 2295587 2477642 2441800 2249696 2219949 2312536 2517618 2273252
4249 2273252 2228745 2129723 2009473 2060715 2311554 2106286 2038577 2190731 2208550 2246253 2115738
4238 2115738 2166451 2127017 2085337 2036731 2230937 2181499 2062009 1869570 2023805 1935631 1778003
4227 1778003 1891544 1931441 1852522 1767687 1761012 1898431 1653576 1523951 1670944 1668457 1433148
4216 1433148 1705624 1632365 1429809 1455940 1471806 1461741 1419455 1527755 1474331 1555025 1535524
$$ packed form
4291B835506j34001K50556q2966o3829n7757K3453Q6826N4030o0801p7956j69137
4280B603924k29342J00303J19346J61543J39260Q3474k03726q5527k79626J50679
4270B560308j7469M9907M9935m4857R5398M6918j45327j63911M4302N6072Q6492
4259B617768j52866j93418K4103J82055l5842j92104k9747R2587K05082k44366
4249B273252m4507r9022j20250N1242K50839k05268o7709J52154J7819L7703j30515
4238B115738N0713l9434m1680m8606J94206m9438j19490j92439J54235q8174j57628
4227A778003J13541L9897p8919q4835o675J37419k44855j29625J46993k487k35309
4216A433148K72476p3259k02556K6131J5866j0065m2286J08300n3424Q0694j9501
$$ plain form
4205 1535524 1546647 1564608 1528316 1563268 1436549 1542826 1480378 1431570 1384743 1371080 1567566
4194 1567566 1359735 1469877 1425602 1292963 1219011 1320842 1569017 1619660 1500864 1309526
4184 1309526 1346243 1227609 1442594 1321961 1198063 1152653 1225341 1364117 1455054 1248094
4174 1248094 1252962 1566373 1710022 1594729 1569215 1652521 1555682 1542058 1793218 1870442 2101706
4163 2101706 2168882 2046749 2166869 2178156 2413629 2461738 2548113 2566810 2843280 2584497
4153 2584497 2450974 2308721 2023113 1815547 1572582 1570306 1447880 1519081 1722257 1460079
4143 1460079 1360330 1202791 1055596 1070823 961222 1036886 963371 914196 1128838 1056812 994640
4132 994640 979303 943996 653183 647412 750542 728126 837659 732513 575842 680037 743130
$$ packed form
4205A535524J1123J7961l6292L4952j26719J06277o2448m8808m6827j3663J96486
4194A567566k07831J10142m4275j32639p3952J01831K48175N0643j18796j91338
4184A309526L6717j18634K14985j20633j23898m5410P2688J38776R0937k06960
4174A248094M868L13411J43649j15293k5514Q3306r6839j3624K51160P7224K31264
4163B101706O7176j22133J20120J1287K35473M8109Q6375J8697K76470k58783
4153B584497j33523j42253k85608k07566k42965k276j22426P1201K03176k62178
4143A460079r9749j57539j47195J5227j09601P5664p3515m9175K14642p2026o2172
4132I94640j5337l5307k90813n771J03130k2416J09533j05146j56671J04195O3093
$$ plain form
4121 743130 790911 817583 783029 800873 752838 729565 696136 521048 616381 747364 681102
4110 681102 715149 691348 659845 646555 481871 578701 550846 458475 642638 598855 462022
4099 462022 395463 517092 492054 344781 422893 569783 474379 523445 497713 180969 244278
4088 244278 295283 347783 380788 425109 434305 337715 510833 439952 378036 503926 529677
4077 529677 463509 327874 565640 542811 440757 576289 552421 539297 261581 230753 233610
4066 233610 275758 394126 482263 402221 560483 378969 415903 449031 443585 420742 415398
4055 415398 428347 569646 786104 692408 461744 410009 371233 526704 288671 246672 316378
4044 316378 382101 461099 692496 481792 442414 553447 453457 403774 395830 273710 204494
$$ packed form
4121G43130M7781K6672l4554J7844m8035k3273l3429j75088R5333J30983o6262
4110F81102L4047k3801l1503j3290j64684R6830k7855r2371J84163m3783j36833
4099D62022o6559J21629k5038j47273P8112J46890r5404M9066k5732l16744O3309
4088B44278N1005N2500L3005M4321R196r6590J73118p0881o1916J25890K5751
4077E29677o6168j35635K37766k2829j02054J35532k3868j3124k77716l0828K857
4066B33610M2148J18368Q8137q0042J58262j81514L6934L3128n446k2843n344
4055D15398J2949J41299K16458r3696k30664n1735l8776J55471k38033m1999O9706
4044C16378O5723P8998K31397k10704l9378J11033r9990m9683p944j22120o9216
$$ plain form
4033 204494 308518 273254 451353 124464 13454 146880 164570 266445 338709 254302
4023 254302 256756 187308 279965 383273 514412 474146 594138 506982 575266 493078 579271
4012 579271 759340 645222 613508 545196 471201 321480 464144 345979 157354 585777
4002 585777 664545 641048 550189 482716 352841 330068 386557 412327 392781 351888 272381
3991 272381 396381 317590 370571 537010 659730 419294 288505 316741 426443 256506
3981 256506 332931 444977 492935 410969 392019 342997 269056 388752 307393 288445 533592
3970 533592 225835 225893 382761 336605 412510 244154 98988 107543 82242 30547 248586
3959 248586 283435 210175 68113 59070 143239 -32616 29332 245250 187593 -50376 -162491
$$ packed form
4033B04494J04024l5264J78099l26889j11010J33426J7690J01875P2264q4407
4023B54302K454o9448R2657J03308J31139m0266J19992q7156O8284q2188Q6193
4012E79271J80069j14118l1714o8312p3995j49721J42664j18165j88625M28423
4002E85777P8768k3497r0859o7473j29875k2773N6489K5770j9546m0893p9507
3991B72381J24000p8791N2981J66439J22720k40436j30789K8236J09702j69937
3981B56506P6425J12046M7958q1966j8950m9022p3941J19696q1359j8948K45147
3970E33592l07757N8J56868m6156P5905j68356j45166Q555k5301n1695K18039
3959B48586L4849p3260j42062r043Q4169j75855O1948K15918n7657k37969j12115
$$ plain form
3948 -162491 18922 159546 174686 173307 97228 -42858 91251 32629 151420 -79444 26736
3937 26736 99079 84108 159159 253492 260179 216242 -24492 203027 204624 96366 127652 202776
3925 202776 190615 311535 188596 294277 266855 193618 118649 129404 240541 189738 16587
3914 16587 15481 -38220 39219 75029 -39568 -91724 -14970 17787 -8137 115317 28459 -70030
3902 -70030 94956 96086 43455 112951 -72688 -163361 -236760 68274 136916 256606 238722
3891 238722 -80269 161552 218181 62993 -67414 -207970 96130 137975 -10640 72828
3881 72828 -91968 -65821 -116886 -301022 -314573 -204496 -111444 -95429 -42782 -223260 -22849
3870 -22849 -40963 -3071 -888 119544 -61102 65293 136204 70732 -1525 -163048 59397
$$ packed form
3948a62491J81413J40624J5140j379p6079j40086J34109n8622J18791k30864J06180
3937B6736P2343j4971P5051R4333O687m3937k40734K27519J597j08258L1286P5124
3925B02776j2161J20920j22939J05681k7422p3237p4969J0755J11137n0803j73151
3914A6587j106n3701P7439L5810j14597n2156P6754L2757k5924J23454q6858r8489
3902g0030J64986J130n2631O9496j85639r0673p3399L05034O8642J19690j7884
3891B38722l18991K41821N6629j55188j30407j40556L04100M1845j48615Q3468
3881G2828j64796K6147n1065j84136j3551J10077R3052J6015N2647j80478K00411
3870b2849j8114L7892K183J20432j80646J26395P0911o5472p2257j61523K22445
$$ plain form
3859 59397 119037 34355 152683 239226 240898 32797 56271 113958 -40966 -53350 -95420
3848 -95420 -108653 -14157 1764 136646 399721 222370 110679 138709 110014 46299 -71590
3837 -71590 -256613 -303613 -360339 -262330 94800 30713 -98156 -133154 28995 185496 63821
3826 63821 19034 4471 -72835 -102387 56145 92771 198448 446378 245410 89262 -2114
3815 -2114 66981 310647 354818 148658 68757 -15682 45424 107890 29862 58584 35290 78803
3803 78803 14391 192346 226972 217173 150654 -58892 47928 194046 240377 211991 41491
3792 41491 1705 80027 249803 181571 104349 214382 344049 284525 254254 134460 12589
3781 12589 42078 3034 -48417 -84656 -42947 -151843 -183348 -137519 -134594 -82814 92188 74953
$$ packed form
3859E9397N9640q4682J18328Q6543J672k08101K3474N7687j54924j2384m2070
3848i5420j3233R4496J5921J34882K63075j77351j11691K8030k8695o3715j17889
3837g1590j85023m7000n6726R8009L57130o4087j28869l4998J62149J56501j21675
3826F3821m4787j4563p7306k9552J58532L6626J05677K47930k00968j56148r1376
3815b114O9095K43666M4171k06160p9901q4439O1106O2466p8028K8722k3294M3513
3803G8803o4412J77955L4626r799o6519k09546J06820J46118M6331k8386j70500
3792D1491l9786P8322J69776o8232p7222J10033J29667n9524l0271j19794j21871
3781A2589K9489l9044n1451l6239M1709j08896l1505M5829K925N1780J75002j7235
$$ plain form
3769 74953 80586 200836 123835 -109045 -150388 15201 220666 201743 32208 -49553 125691
3758 125691 -104094 -73029 -91356 131573 306643 148806 112319 165268 212942 65559 15690
3747 15690 138003 -2195 -119849 165859 200391 208391 57702 157710 79097 140561 202000
3736 202000 249191 204755 -18596 -168675 -93316 -95005 -118671 192714 150963 -61559 -22326
3725 -22326 67911 -8742 -86157 -104498 -14946 226958 135560 83965 107383 242291 131239
3714 131239 102328 151481 -54585 -102280 8960 -40242 53014 15806 96616 -30739 -55631
3703 -55631 -10760 150689 284975 182220 58117 31026 -18921 -220673 40832 -59187
3693 -59187 -231737 -43253 -170379 -126762 144341 36817 80752 17309 156640 60516 180557
$$ packed form
3769G4953N633J20250p7001k32880m1343J65589K05465j8923j69535q1761J75244
3758A25691k29785L1065j8327K22929J75070j57837l6487N2949M7674j47383m9869
3747A5690J22313j40198j17654K85708L4532Q000j50689J00008p8613O1464O1439
3736B02000M7191m4436k23351j50079P5359j689k3666L11385m1751k12522L9233
3725b2326R0237p6653p7415j8341Q9552K41904r1398n1595K3418J34908j11052
3714A31239k8911M9153k06066m7695J11240m9202R3256l7208Q0810j27355k4892
3703e5631M4871J61449J34286j02755j24103k7091m9947k01752K61505j00019
3693e9187j72550J88484j27126M3617K71103j07524M3935o3443J39331r6124J20041
$$ plain form
3682 180557 42896 -5114 -9487 -683 -53686 -124335 57878 -26258 24978 59786 -62117
3671 -62117 -183878 -101985 -152756 -110244 7959 125519 162656 4680 -8920 179850 90252
3660 90252 158348 -29234 -34951 16019 -44620 -94677 -166842 -77985 -114939 -102132 56194 19290
3648 19290 -39431 -1798 -51588 -18325 24042 63350 -31932 -153125 105551 197996 187972
3637 187972 44063 -50590 166138 130230 13151 -107579 -26070 -114697 -82131 -69161 -241718
3626 -241718 -174461 -11893 52319 81514 -3440 -194337 -104059 103403 -61097 25241 124305
3615 124305 219466 70188 4685 27832 -14362 -45580 91102 28532 -113868 -109617 -76306
3604 -76306 99311 -64206 -126648 20324 131209 -35943 52300 165342 -81510 12235
$$ packed form
3682A80557j37661m8010m373Q804n3003p0649J82213q4136N1236L4808j21903
3671f2117j21761Q1893n0771M2512J18203J17560L7137j57976j3600J88770q9598
3660I0252O8096j87582n717N0970o0639n0057p2165Q8857l6954J2807J58326l6904
3648A9290n8721L7633m9790L3263M2367L9308r5282j21193K58676R2445j0024
3637A87972j43909r4653K16728l5908j17079j20730Q1509q8627L2566J2970j72557
3626b41718O7257J62568O4212K9195q4954j90897R0278K07462j64500Q6338R9064
3615A24305R5161j49278o5503K3147m2194l1218J36682o2570j42400M251L3311
3604g6306J75617j63517o2442J46972J10885j67152Q8243J13042k46852R3745
$$ plain form
3594 12235 109679 207418 108357 -147695 -295965 18346 63241 -58759 165281 179398 249104
3583 249104 219327 207897 30825 -76968 42793 -117197 -225498 51718 118813 91959
3573 91959 136661 -37270 58872 84458 -147201 -18263 -11175 -129430 -15518 39534 -87000
3562 -87000 -30768 286562 360383 345539 339195 269297 251787 121698 -6939 90079 122032
3551 122032 39107 193775 68032 -7929 211020 351967 9431 57665 15905 -24359 -16556
3540 -16556 -97575 36707 39097 64169 53467 -149152 -219295 -133762 -76527 -92511 -23679 -22433
3528 -22433 -72574 -116499 -133181 -154723 -62491 -42633 -202172 -155974 90935 183826 114775
3517 114775 128129 34521 95152 -25617 69473 -36093 -5496 137731 233044 140031 67
$$ packed form
3594A2235R7444R7739r9061k56052j48270L14311M4895j22000K24040J4117O9706
3583B49104k9777j1430j77072j07793J19761j59990j08301K77216O7095k6854
3573I1959M4702j73931R6142K5586k31659J28938P088j18255J13912N5052j26534
3562h7000N6232L17330P3821j4844o344o9898j7510j30089j28637R7018L1953
3551A22032q2925J54668j25743p5961K18949J40947l42536M8234m1760m0264P803
3540a6556q1019J34282K390K5072j0702k02619p0143Q5533N7235j5984O8832J246
3528b2433n0141m3925j6682k1542R2232J9858j59539M6198K46909R2891o9051
3517A14775J3354r3608O0631j20769R5090j05566L0597J43227R5313r3013j39964
$$ plain form
3506 67 254385 59585 -35666 104504 31717 8592 198156 90607 101845 59392 6674
3495 6674 -29945 -36739 109697 129852 82825 -86330 94161 148315 165446 198193 164365 38980
3483 38980 88766 67140 26979 200272 54946 -135112 5477 -104212 -46671 -239616 -387074
3472 -387074 -225121 -156120 -145922 -107511 -88323 -208470 -103849 -124361 -57670 11612 -124273
3461 -124273 -1213 -26242 50753 -108919 -90779 -129946 -31877 -38446 -194773 -109551 -59263
3450 -59263 104325 108927 166352 159745 175612 -93609 -73850 -21726 -67642 -32352 -14997 102039
3438 102039 173387 126160 152832 -131793 -109586 50562 66234 181013 123878 -22580 34979
3427 34979 269363 157089 174105 134845 -1663 84400 23928 -100530 -252231 -81281 75525
$$ packed form
3506F7K54318j94800r5251J40170p2787k3125J89564j07549J1238m2453n2718
3495F674l6619o794J46436K0155m7027j69155J80491N4154J7131L2747l3828j25385
3483C8980M9786k1626m0161J73293j45326j90058J40589j09689N7541j92945j47458
3472c87074J61953O9001J0198L8411J9188j20147J04621k0512O6691O9282j35885
3461a24273J23060k5029P6995j59672J8140l9167R8069o569j56327Q5222N0288
3450e9263J63588M602N7425o607J5867k69221J9759N2124m5916L5290J7355J17036
3438A02039P1348m7227K6672k84625K2207J60148J5672J14779n7135j46458N7559
3427C4979K34384j12274J7016l9260j36508Q6063o0472j24458j51701J70950J56806
$$ plain form
3416 75525 57719 156092 403385 366262 262596 83795 90026 10942 181062 129312 162653
3405 162653 158150 133726 129988 80974 122316 56503 94769 272400 421667 360267 369391 312808
3393 312808 217706 86904 -37567 -3100 227196 212195 159603 264699 299577 328577 226956
3382 226956 141285 69606 27435 253389 224315 294544 82836 107835 243303 235970 234724
3371 234724 174894 208511 240154 86646 -41547 -35445 56609 29907 -135341 18916 87205
3360 87205 58885 40074 231689 208211 313279 393448 144222 147123 189223 230871 235237 186523
3348 186523 250122 255874 308659 201656 -12494 56025 123409 -6099 97640 272403 362022
3337 362022 260510 227820 392599 307569 248022 204978 231632 532429 601285 379442 563867
$$ packed form
3416G5525j7806R8373K47293l7123j03666j78801O231p9084J70120n1750L3341
3405A62653m503k4424l738m9014M1342o5813L8266J77631J49267o1400R124n6583
3393C12808r5102j30802j24471L4467K30296j5001n2592J05096L4878K9000j01621
3382B26956q5671p1679m2171K25954k9074P0229k11708K4999J35468p333j246
3371B34724n9830L3617L1643j53508j28193O102R2054k6702j65248J54257O8289
3360H7205k8320j8811J91615k3478J05068Q0169k49226K901M2100M1648M366m8714
3348A86523O3599N752N2785j07003k14150O8519O7384j29508J03739J74763Q9619
3337C62022j01512l2690J64779q5030n9547m3044K6654L00797O8856k21843J84425
$$ plain form
3326 563867 504335 308968 172656 137093 190019 368267 368121 309311 151030 301659 415065
3315 415065 543902 558198 624127 597194 159768 182332 426741 363705 329887 339499 522897
3304 522897 599621 649397 578747 529318 607030 578615 594353 519487 492149 643270 705947
3293 705947 441133 359263 592836 719965 778328 836836 1023234 1048691 1080009 1268513 1308764
3282 1308764 1572828 1637834 1586548 1875961 1845661 1948417 2034319 2096410 2375817 2411490 2543435
3271 2543435 2538315 2542427 2717904 2700198 2566273 2489705 2243588 2107204 1866271 1644878 1631573
3260 1631573 1666385 1351765 1086150 1148482 1276427 1098651 916703 957502 959849 1030355 1202041
3249 1202041 1325926 1344198 1055236 968957 1157328 1353843 1434059 1538847 1626122 1768305
$$ packed form
3326E63867n9532j95367j36312l5563N2926J78248j46n8810j58281J50629J13406
3315D15065J28837J4296O5929k6933m37426K2564K44409o3036l3818R612J83398
3304E22897P6724M9776p0650m9429P7712k8415J5738p4866k7338J51121O2677
3293G05947k64814q1870K33573J27129N8363N8508J86398K5457L1318J88504M0251
3282A308764K64064O5006n1286K89413l0300J02756Q5902O2091K79407L5673J31945
3271B543435n120M112J75477j7706j33925p6568k46117j36384k40933k21393j3305
3260A631573L4812l14620k65615O2332J27945j77776j81948M0799K347P0506J71686
3249A202041J23885J8272k88962q6279J88371J96515Q0216J04788Q7275J42183
$$ plain form
3239 1768305 1723937 2035569 2192781 2260052 2229317 1895793 1740278 1705228 1604983 1448882
3229 1448882 1171982 1035385 914907 874158 944133 784317 717255 821005 700383 401519
3219 401519 372482 478005 777876 856676 680990 560791 669910 629133 642848 870343
3209 870343 887802 891904 956019 1082315 1160759 1142382 1149857 1064198 828797 583616 627684
3198 627684 744710 534534 462046 474407 398471 588476 523342 367790 528144 324632
3188 324632 229190 180575 321571 368089 235622 314568 209347 318699 429445 386418 297192
3177 297192 213825 88411 335467 435450 268883 423361 288512 140982 178886 47390
3167 47390 73597 92847 -52274 -70251 33771 42356 10768 43002 -15187 -42253 5815 183717
$$ packed form
3239A768305m4368L11632J57212O7271l0735l33524j55515l5050j00245j56101
3229A448882k76900j36597j20478m0749O9975j59816o7062J03750j20622k98864
3219D01519k9037J05523K99871P8800j75686j20199J09119m0777J3715K27495
3209H70343J7459M102O4115J26296P8444j8377P475q5659k35401k45181M4068
3198F27684J17026k10176p2488J2361p5936J90005o5134j55552J60354k03512
3188C24632r5442m8615J40996M6518j32467P8946j05221J09352J10746m3027q9226
3177B97192q3367j25414K47056R9983j66567J54478j34849j47530L7904j31496
3167D7390K6207J9250j45121j7977J04022Q585l1588L2234n8189k7066M8068J77902
$$ plain form
3155 183717 72923 127742 149572 -105020 12073 120311 2306 76583 22148 90218 339878
3144 339878 405299 244634 157008 276758 163024 82426 -55771 114767 -35070 81246
3134 81246 112935 155836 7542 -9823 16007 135444 134072 148873 195615 291191 289542 102253
3122 102253 -114682 -44850 58454 -11252 28083 73788 199089 251272 -108601 -205608 -6085
3111 -6085 123924 273181 262139 154336 197001 157974 109656 -5932 -149235 -196283 -254301
3100 -254301 -33922 -62602 107282 -85112 -59670 -45029 -6842 -16607 64806 103255 33642
3089 33642 85543 65926 155300 183183 -112239 -83987 38994 30317 121217 216453 925
3078 925 -77794 -59203 57813 -59911 36790 34595 -43362 53762 -176151 96116 288284
$$ packed form
3155A83717j10794N4819K1830k54592J17093J08238j18005P4277n4435O8070K49660
3144C39878O5421j60665q7626J19750j13734q0598j38197J70538j49837J16316
3134H1246L1689M2901j48294j7365K5830J19437j372J4801M6742R5576j649j87289
3122A02253k16935O9832J03304o9706L9335M5705J25301N2183l59873r7007J99523
3111f085J30009J49257j1042j07803M2665l9027m8318j15588j43303m7048n8018
3100b54301K20379k8680J69884j92394K5442J4641L8187r765Q1413L8449o9613
3089C3642N1901j9617Q9374K7883k95422K8252J22981q677R0900R5236k15528
3078I25p8719J8591J17016j17724R6701k195p7957R7124k29913K72267J92168
$$ plain form
3067 288284 870 -788 165598 -34355 -97960 17787 40420 160258 169413 195952 119154
3056 119154 -182040 -207282 119631 173423 -49742 -118013 -152507 53355 -42936 -216009 -159631
3045 -159631 -150049 -55612 -4347 -51395 -173369 48051 150227 73923 4687 -93929 -80209
3034 -80209 -32048 10767 8919 -14664 -173376 -21237 -166032 -205113 -43964 111819 121932
3023 121932 185236 166034 -13341 -83902 238348 210069 89084 123741 -67856 -18796 7638
3012 7638 -38592 -85005 -144974 2592 163793 -26956 -169938 -23934 204756 69734 -83165
3001 -83165 78701 238955 28815 60060 51318 -60583 69046 -9144 -146229 41313 211003
2990 211003 264498 140397 111622 105940 123063 188145 196895 201054 273965 368129 234713 77039
$$ packed form
3067B88284k87414j658J66386j99953o3605J15747K2633J19838R155K6539p6798
3056A19154l01194k5242L26913N3792k23165o8271l4494K05862r6291j73073N6378
3045a59631R582R4437N1265m7048j21974K21420J02176p6304o9236r8616J3720
3034h0209M8161M2815j848k3583j58712J52139j44795l9081J61149J55783J0113
3023A21932O3304j9202j79375p0561L22250k8279j20985L4657j91597M9060K6434
3012G638m6230m6413n9969J47566J61201j90749j42982J46004K28690j35022j52899
3001h3165J61866J60254k10140L1245q742j11901J29629p8190j37085J87542J69690
2990B11003N3495j24101k8775n682J7123O5082Q750M159P2911R4164j33416j57674
$$ plain form
2978 77039 -20201 74834 -83907 5836 105898 153920 37590 -19751 -185258 -16008 300281
2967 300281 140476 201939 117775 167751 133215 147566 15060 -98747 23757 -41040 106273
2956 106273 72135 -29209 185020 64564 153598 178712 81774 90730 88278 145279 107590
2945 107590 184598 11673 -50534 98131 51764 83941 68597 96137 293812 246011 259530
2934 259530 108251 142773 212073 105902 267970 303376 318899 340297 455962 422315 241302
2923 241302 18142 164844 161871 44379 -27560 -51768 79201 222723 146323 187907 160296
2912 160296 130836 138460 271310 239106 220012 311141 291048 297602 223812 129479 67387 77005
2900 77005 143805 86024 30283 168796 335787 278476 97380 125148 141543 77008 29284
$$ packed form
2978G7039r7240R5035j58741Q9743J00062M8022j16330n7341j65507J69250L16289
2967C00281j59805O1463q4164M9976l4536J4351j32506j13807J22504o4797J47313
2956A06273l4138j01344K14229j20456Q9034K5114r6938Q956k452N7001l7689
2945A07590P7008j72925o2207J48665m6367L2177j5344K7540J97675m7801J3519
2934B59530j51279L4522O9300j06171J62068L5406J5523K1398J15665l3647j81013
2923B41302k23160J46702k973j17492p1939k4208J30969J43522p6400M1584k7611
2912A60296k9460P624J32850l2204j9094R1129k0093O554p3790r4333o2092R618
2900G7005O6800n7781n5741J38513J66991n7311j81096K7768J6395o4535m7724
$$ plain form
2889 29284 -115636 53171 165705 97717 99315 188556 185034 -11974 82288 -85880 -64384
2878 -64384 6764 49487 68223 30257 -110 -167619 -97452 76402 72090 151818 -48358
2867 -48358 58639 116755 87902 38285 28407 -116582 -144131 -178489 -250399 -153354 -158240 -193501
2855 -193501 -165299 -118106 36025 171902 117643 63516 -21360 -174002 -80391 -27673 148679
2844 148679 -963 -42220 41498 -62001 -240543 -300240 -157390 177630 174270 76173 -21964
2833 -21964 -28264 -40241 -31653 35122 -113468 -29845 -22083 193106 -48262 -165157 -104123 -147831
2821 -147831 -128002 -63783 42879 76581 46129 -78703 -122313 25503 -12808 39449 74266
2810 74266 53634 -6844 -18405 -87982 -229265 -171234 -170272 -106255 170874 100752 185844 67829
$$ packed form
2889B9284j44920J68807J12534o7988J598Q9241l522j97008R4262j68168K1496
2878f4384P1148M2723J8736l7966l0367j67509P0167J73854m312P9728k00176
2867d8358J06997N8116k8853m9617r878j44989k7549l4358p1910R7045m886l5261
2855a93501K8202M7193J54131J35877n4259n4127q4876j52642R3611N2718J76352
2844A48679j49642m1257Q3718j03499j78542n9697J42850L35020l360r8097r8137
2833b1964o300j1977Q588O6775j48590Q3623P762K15189k41368j16895O1034m3708
2821a47831J9829O4219J06662L3702l0452j24832m3610J47816l8311N2257L4817
2810G4266k0632o0478j1561o9577j41283N8031R62O4017K77129p0122Q5092j18015
$$ plain form
2798 67829 67465 25670 -151848 -148874 -311156 -99883 12711 -8428 -153181 -128241 -109194
2787 -109194 -125222 -34967 83793 -11295 -2666 51113 -13478 -164798 -281114 -213546 -246584
2776 -246584 -170864 -146214 -133173 -131648 -34922 -170600 -100149 -131 -19513 -130890 -147235
2765 -147235 -14877 -29206 -138313 -99999 -107703 -119307 -132583 -44104 -35180 -125293 -365712
2754 -365712 -298601 -277544 -195839 -196079 -148322 -94511 -157709 -105648 -169333 -322299 -299333 -161934
2742 -161934 -236265 -192754 -219053 36028 28842 -169170 -183923 -293867 -151369 -57241 -32708
2731 -32708 -910 -211048 -344548 -233731 -262697 -303817 -189828 -211707 -275767 -134512 58346
2720 58346 86420 -62897 -154685 4937 -123461 -312741 -413978 -212727 -100832 31652
$$ packed form
2798F7829l64m1795j77518K974j62282K11273J12594k1139j44753K4940J9047
2787a09194j6028R0255J18760r5088Q629N3779o4591j51320j16316O7568l3038
2776b46584P5720K4650J3041J525R6726j35678P0451J00018j9382j11377j6345
2765a47235J32358j4329j09107L8314p704j1604j3276Q8479Q924r0113k40419
2754c65712O7111K1057Q1705k40M7757N3811o3198N2061o3685j52966K2966J37399
2742a61934p4331M3511k6299K55081p186j98012j4753j09944J42498R4128K4533
2731c2708L1798k10138j33500J10817k8966m1120J13989k1879o4060J41255J92858
2720E8346K8074j49317r1788J59622j28398j89280j01237K01251J11895J32484
$$ plain form
2710 31652 153141 136520 -25377 -375013 -376856 -120886 -85634 -60880 -93049 -110522 81180
2699 81180 83943 -129083 -25654 50562 19515 19542 -12277 68133 169977 -109093 70667 303283
2687 303283 84460 15572 -54285 -161528 -103896 -134563 -57927 35284 -57102 -55548 -5732
2676 -5732 -3141 52544 150726 -77856 28029 -48442 -144525 36335 172598 151214 77895
2665 77895 34002 22630 -13662 -209871 -363960 -396649 -220864 -181839 -250262 -262418 -262850 -243040
2653 -243040 -35127 -11432 -181425 -205205 -292270 -124214 -98730 -282128 -283817 -196551 -85156
2642 -85156 -141900 -76529 125683 174935 74055 -49952 -10038 147256 36804 -77190 -145937
2631 -145937 -79257 -110873 -128134 -161459 -130068 -161382 -106239 -53033 -1196 4644 72611 78438
$$ packed form
2710C1652J21489j6621j61897l49636j843K55970L5252K4754l2169j7473J91702
2699H1180K763k13026J03429P6216l1047K7l1819Q0410J01844k79070J79760K32616
2687C03283k18823o8888o9857j07243N7632l0667P6636R3211r2386J554M9816
2676e732K591N5685R8182k28582J05885p6471r6083J80860J36263k1384p3319
2665G7895m3893j1372l6292j96209j54089l2689J75785L9025o8423j2156m32J9810
2653b43040K07913K3695j69993k3780q7065J68056K5484j83398j689Q7266J11395
2642h5156n6744O5371K02212M9252j00880j24007L9914J57294j10452j13994o8747
2631a45937O6680l1616j7261l3325L1391l1314N5143N3206N1837N840O7967N827
$$ plain form
2619 78438 -114008 -27505 -202531 -160922 -11067 -59232 -148495 -127327 -61157 -115740 -20976
2608 -20976 262660 210340 386209 -21265 -1855 56446 -54709 144731 -88665 -204965
2598 -204965 -56828 4185 -71556 74328 -49677 -94555 -376416 -296454 -268764 -119962 -44924
2587 -44924 -83243 -92315 -50543 2525 64768 -47920 -37699 -142771 -372052 -398598 -176077
2576 -176077 -120418 -206485 -118906 -61101 -64441 -147675 16443 18577 -239229 -255123 -320817 -427578
2564 -427578 -157393 -25271 116028 26706 107974 41231 96119 37274 -26895 57415 -34451
2553 -34451 -108471 -131875 -16987 22399 -114329 81199 29163 -119295 -189823 -155348 75021
2542 75021 172 -100943 -149502 -38995 1593 -186573 -209388 -276964 -122526 44822 87082
$$ packed form
2619G8438j92446Q6503j75026M1609J49855m8165q9263K1168O6170n4583R4764
2608b0976K83636n2320J75869m07474J9410N8301j11155J99440k33396j16300
2598b04965J48137O1013p5741J45884j24005m4878k81861P9962K7690J48802P5038
2587d4924l8319r072M1772N3068O2243j12688J0221j05072k29281k6546K22521
2576a76077N5659q6067Q7579N7805l340q3234J64118K134k57806j5894o5694j06761
2564d27578K70185J32122J41299q9322Q1268o6743N4888n8845o4169Q4310r1866
2553c4451p4020k3404J14888L9386j36728J95528n2036j48458p0528L4475K30369
2542G5021p4849j01115m8559J10507M0588j88166k2815o7576J54438J67348M2260
$$ plain form
2531 87082 93651 -149548 -99048 73074 -26686 -86280 -145060 -67509 -121761 -216677 -285889 -142262
2519 -142262 59176 -16596 -14472 34719 -175662 -142160 79626 42196 -104464 -44894 62219
2508 62219 14570 6388 166473 -142612 -106184 -126123 -168019 -23914 -61739 -61394 -195417 -207152
2496 -207152 -47124 56267 -7788 61635 31299 -68245 29312 51375 -114860 -230963 -182098
2485 -182098 42855 104484 86181 156056 121511 -148916 -309538 -543560 -226178 -45394
2475 -45394 -89017 -182046 -268838 -66989 -63210 -158523 -117110 -129142 -135221 -163079 -71996 -35774
2463 -35774 -55005 -62422 -135091 -135997 43492 114322 142558 12988 -10764 55274 186287 -46074
2451 -46074 -133045 13489 -4853 -102755 38602 52113 -122460 44689 -167631 -359508 -149155
$$ packed form
2531H7082O569k43199N0500J72122r9760n9594n8780P7551n4252r4916o9212J43627
2519a42262K01438p5772K124M9191k10381L3502K21786l7430j46660N9570J07113
2508F2219m7649q182J60085l09085L6428j9939m1896J44105l7825L45j34023j1735
2496b07152J60028J03391o4055O9423l0336r9544R7557K2063j66235j16103M8865
2485a82098K24953O1629j8303O9875l4545k70427j60622k34022L17382J80784
2475d5394m3623r3029q6792K01849L779r5313M1413j2032o079k7858R1083L6222
2463c5774j9231p417p2669r06J79489P0830K8236j29570k3752O6038J31013k32361
2451d6074q6971J46534j8342r7902J41357J3511j74573J67149k12320j91877K10353
$$ plain form
2440 -149155 174957 87035 -135265 -92909 77058 -84341 -133283 137561 120611 77809 -223855
2429 -223855 -343445 -197173 -175119 45680 87834 -90708 -118895 -56898 116213 96165 223551
2418 223551 356614 166611 -22071 1319 207996 283510 152488 202730 150119 180406 161968
2407 161968 116760 231410 106268 117175 465700 577498 453347 505786 292056 240669
2397 240669 237563 194012 217227 127105 214774 195787 154087 315658 195368 262766 280433
2386 280433 183253 115021 150582 179205 248844 41822 -99946 -21687 71108 -128849 -270545
2375 -270545 14271 256327 58871 44222 201628 32846 -43668 -113959 -84387 -143251 -75147
2364 -75147 -155055 -147510 59033 82094 -135885 -49166 156704 64550 140886 186960 130968
$$ packed form
2440a49155L24112q7922k22300M2356J69967j61399m8942K70844j6950m2802l01664
2429b23855j19590J46272K2054K20799M2154j78542k8187O1997J73111k0048J27386
2418B23551J33063j90003j88682K3390K06677P5514j31022N0242n2611L0287j8438
2407A61968m5208J14650j25142J0907L48525J11798j24151N2439k13730n1387
2397B40669l106m3551K3215r0122Q7669j8987m1700J61571j20290O7398J7667
2386B80433r7180o8232L5561K8623O9639k07022j41768P8259R2795j99957j41696
2375b70545K84816K42056j97456j4649J57406j68782p6514p0291K9572n8864O8104
2364g5147p9908P545K06543K3061k17979Q6719K05870r2154P6336M6074n5992
$$ plain form
2353 130968 180188 211142 127800 99369 214799 284921 223274 224393 142713 218563 213855 133421
2341 133421 26746 -48164 -64379 144458 16718 9766 312959 306961 271245 162613 178862
2330 178862 348563 511998 404641 441031 165514 297854 281984 -2632 208058 222914
2320 222914 177718 -94697 24333 182332 30323 155385 105057 102828 -62848 91577
2310 91577 101694 150891 166836 288195 502590 368608 399068 230731 227871 245893 344863
2299 344863 285906 200560 295067 303180 186633 62812 267403 312141 354518 423642 370921
2288 370921 338056 130323 300659 425993 684436 535577 306095 317525 452685 540017
2278 540017 541690 585574 505473 417047 607631 595023 567558 527670 601422 657379 641032 483862
$$ packed form
2353A30968M9220L0954q3342k8431J15430P0122o1647J119q1680P5850m708q0434
2341A33421j06675p4910j6215K08837j27740o952L03193n998l5716j08632J6249
2330A78862J69701J63435j07357L6390k75517J32340j5870k84616K10690J4856
2320B22914m5196k72415J19030J57999j52009J25062n0328k229j65676J54425
2310I1577J0117M9197J5945J21359K14395j33982L0460j68337k860J8022R8970
2299C44863n8957q5346R4507Q113j16547j23821K04591M4738M2377O9124n2721
2288C70921l2865k07733J70336J25334K58443j48859k29482J1430J35160Q7332
2278E40017J673M3884q0101q8426J90584j2608k7465l9888P3752N5957j6347j57170
$$ plain form
2266 483862 465127 445116 663196 741875 567447 512799 592875 533355 448767 683855 725931
2255 725931 637209 555708 711542 620808 581801 616203 688083 694915 897764 735657 781416
2244 781416 1066786 1047791 1002012 905729 779252 766207 892524 994488 903718 836663 929700
2233 929700 996287 947955 1082545 1194709 1270860 1270631 1120850 1003620 1034345 1282350 1568000
2222 1568000 1522099 1480892 1623618 1855053 1907439 1876296 1768712 1744483 1802766 2104612 1998774
2211 1998774 2078002 2011492 2092361 2327322 2458937 2503536 2490135 2567495 2606287 2779205 2736357
2200 2736357 2955358 3011359 3295644 3203229 3092412 3299287 3272930 3339394 3586100 3688689
2190 3688689 3699966 3813180 4097389 4065574 4217162 4526762 4461657 4768382 4881104 5012490
$$ packed form
2266D83862j8735k0011K18080P8679j74428n4648Q0076n9520q4588K35088M2076
2255G25931q8722q1501J55834r0734l9007L4402P1880O832K02849j62107M5759
2244G81416K85370j8995m5779r6283j26477j3045J26317J01964r0770o7055R3037
2233I29700O6587m8332J34590J12164P6151k29j49781j17230L0725K48005K85650
2222A568000m5901m1207J42726K31435N2386l1143j07584k4229N8283L01846j05838
2211A998774P9228o6510Q0869K34961J31615M4599j3401P7360L8792J72918m2848
2200B736357K19001N6001K84285r2415j10817K06875k6357O6464K46706J02589
2190C688689J1277J13214K84209l1815J51588L09600o5105L06725J12722J31386
$$ plain form
2180 5012490 5227162 5395997 5412658 5546069 5741942 6023087 6286356 6486451 6870436 7164458
2170 7164458 7342482 7456086 7802250 8130595 8495881 8801764 9081710 9399883 9829326 10295812
2160 10295812 10900867 11431659 11778057 12326031 12829916 13600710 14435025 15213296 16284028
2151 16284028 17759257 19349491 20930250 22182410 23321534 24929496 26993858 29716998
2143 29716998 33414667 38604431 44674354 51689705 59799665 69303478 81024080 95835715
2135 95835715 110848216 115998647 104364450 85892159 69459867 56548020 47401165
2128 47401165 40380598 35246908 31056351 27708015 24870144 22582266 20843420 19462940
2120 19462940 18492523 17343174 15927448 14673340 13191827 12299372 11549555 10714601 10163759
$$ packed form
2180E012490K14672J68835J6661J33411J95873K81145K63269K00095L83985K94022
2170G164458J78024J13604L46164L28345L65286L05883K79946L18173M29443M66486
2160A0295812O05055N30792L46398N47974N03885P70794Q34315P78271J070732
2151A6284028J475229J590234J580759J252160J139124J607962K064362K723140
2143B9716998L697669N189764O069923P015351Q109960R503813J1720602J4811635
2135I5835715J5012501N150431j1634197j8472291j6432292j2911847r146855
2128D7401165p020567n133690m190557l348336k837871k287878j738846j380480
2120A9462940r70417j149349j415726j254108j481513q92455p49817q34954n50842
$$ plain form
2111 10163759 9462954 8934343 8287047 8004180 7624130 7353710 7069573 6803949 6514638
2102 6514638 6442546 6148585 5912289 5809470 5585886 5299342 5165338 5069598 4752654 4476762
2092 4476762 4170546 4048770 4055738 3803848 3852993 3729522 3513482 3507629 3487432 3363299 3278661
2081 3278661 3228877 2958234 3123634 2927620 2857379 2667382 2616157 2466580 2203990 2292463
2071 2292463 2286665 2277839 2120372 1851479 2141305 2236629 2198356 1847325 1775114 1789922 1860128
2060 1860128 1899003 1939052 1961925 1638090 1642803 1753923 1581941 1474046 1432144 1401490 1532016
2049 1532016 1443223 1464306 1420984 1363880 1372267 1148140 1010548 1091505 1208395 1164047 1080513
2038 1080513 1173733 1011973 1101738 1245282 982639 809027 762272 959292 806956 791861
$$ packed form
2111A0163759p00805n28611o47296k82867l80050k70420k84137k65624k89311
2102F514638p2092k93961k36296j02819k23584k86544j34004r5740l16944k75892
2092D476762l06216j21776O968k51890M9145j23471k16040n853k0197j24133q4638
2081C278661m9784k70643J65400j96014p0241j89997n1225j49577k62590Q8473
2071B292463n798q826j57467k68893K89826R5324l8273l51031p2211J4808P0206
2060A860128L8875M0049K2873l23835M713J11120j71982j07895m1902l0654J30526
2049A532016q8793K1083m3322n7104Q387k24127j37592Q0957J16890m4348q3534
2038A080513R3220j61760Q9765J43544k62643j73612m6755J97020j52336j5095
$$ plain form
2028 791861 828124 718811 796927 808783 716222 869568 741782 512291 682005 552053
2018 552053 594258 639652 813187 840660 746758 754680 593124 549993 578190 580824 609599 533976
2006 533976 445172 343053 520306 368156 318310 483847 399338 360460 422162 511888 530586
1995 530586 541556 514550 585027 504803 400895 348047 350560 277547 303659 216357 185610 225193
1983 225193 273891 211729 201032 464729 192123 199074 305243 417821 561384 433376 420154
1972 420154 481994 406737 418867 385730 348695 418207 328593 298927 424732 314236 325225
1961 325225 299074 305351 283200 35585 261137 451837 502676 553165 474333 371792 336407
1950 336407 325028 368449 357561 202718 116902 120696 128689 139819 203177 8051 -79179 159022
$$ packed form
2028G91861L6263j09313P8116J1856r2561J53346j27786k29491J69714j29952
2018E52053M2205M5394J73535K7473r3902P922j61556m3131K8197K634K8775p5623
2006E33976q8804j02119J77253j52150m9846J65537q4509l8878O1702Q9726J8698
1995E30586J0970k7006P0477q0224j03908n2848K513p3013K6112q7302l0747L9583
1983B25193M8698o2162j0697K63697k72606O951J06169J12578J43563j28008j3222
1972D20154O1840p5257J2130l3137l7035O9512q9614k9666J25805j10496J0989
1961C25225k6151O277k2151k47615K25552J90700N0839N0489p8832j02541l5385
1950C36407j1379M3421j0888j54843q5816L794P993J1130O3358j95126q7230K38201
$$ plain form
1938 159022 9981 -18271 70369 270422 317774 199656 187157 18052 131927 -13721
1928 -13721 78551 148183 160695 306897 314473 185105 170244 159072 74020 77178 149231 274036
1916 274036 192854 81327 160826 150557 -43992 329063 440673 266925 111190 158917
1906 158917 81190 128033 356395 176948 -8044 -58758 72749 128273 110854 219810 263271
1895 263271 153262 17549 -64629 -132399 153128 -60832 -86463 8969 -97863 -79128 -16168
1884 -16168 96533 -1610 41445 37577 -29090 -27719 -71043 -22743 -70720 -7348 206940 214582
1872 214582 183536 245919 121011 229625 375654 548582 522689 652422 764428 530829
1862 530829 394569 513865 679919 453167 227108 235433 144503 340166 482839 224004
$$ packed form
1938A59022j49041k8252Q8640K00053M7352j18118j2499j69105J13875j45648
1928a3721R2272O9632J2512J46202P576j29368j4861j1172q5052L158P2053J24805
1916B74036q1182j11527P9499j0269j94549L73055J11610j73748j55735M7727
1906A58917p7727M6843K28362j79447j84992n0714J31507N5524j7419J08956M3461
1895B63271j10009j35713q2178o7770K85527k13960k5631R5432j06832J8735O2960
1884a6168J12701r8143M3055l868o6667J371m3324M8300m7977O3372K14288P642
1872B14582l1046O2383j24908J08614J46029J72928k5893J29733J12006k33599
1862E30829j36260J19296J66054k26752k26059Q325r0930J95663J42673k58835
$$ plain form
1852 224004 19227 -63251 226250 247196 254105 288736 434861 157071 -534 -34392 52031
1841 52031 244097 39565 139800 187820 189132 154000 498 21664 84423 133260 170378
1830 170378 104446 23239 223460 96561 271596 412492 253207 240689 121898 -92580
1820 -92580 -57546 -40365 -99183 -43436 59016 10723 72281 11848 144813 29678 -157572
1809 -157572 -171378 -132277 89877 -60678 -160158 -77214 11525 144708 83896 124976 112320
1798 112320 53026 6449 -51834 -28466 -200939 -255679 -201448 -197763 -136139 -130091 -69627 -164423
1786 -164423 -32323 146038 59077 23929 46424 272677 194449 100725 154098 46403 51232
1775 51232 42423 59947 107341 -120748 -171371 8025 125790 140679 99974 94888 -65063
$$ packed form
1852B24004k04777q2478K89501K0946O909L4631J46125k77790j57605l3858Q6423
1841E2031J92066k04532J00235M8020J312l5132j53502K1166O2759M8837L7118
1830A70378o5932q1207K00221j26899J75035J40896j59285j2518j18791k14478
1820i2580L5034J7181n8818N5747J02452m8293O1558o0433J32965j15135j87250
1809a57572j3806L9101K22154j50555r9480Q2944Q8739J33183o0812M1080j2656
1798A12320n9294m6577n8283K3368j72473n4740N4231L685O1624O048O0464r4796
1786a64423J32100J78361q6961l5148K2495K26253p8228r3724N3373j07695M829
1775E1232q809J7524M7394k28089n0623J79396J17765J4889m0705n086j59951
$$ plain form
1764 -65063 -246826 -117664 -216234 -245173 -141467 -23071 35039 10621 4542 237458 65005
1753 65005 -17826 -102830 8122 159897 41855 234827 83487 23287 208087 -124212
1743 -124212 -170855 -30909 51705 -49069 50522 -54233 -84535 7571 -23333 -746 -35756
1732 -35756 -74707 6790 10408 -191564 -183645 -83868 213 79277 209185 134341 35917 65570
1720 65570 136201 129724 40422 -16776 -27336 -83117 57779 -103835 -185021 -94557 -46927 -166847
1708 -166847 -26041 -69553 -210543 -237360 -293879 -140007 -105322 -111900 -113420 -127290 -168333
1697 -168333 -433990 -207561 -52286 -181349 -106657 -114092 69350 9935 25016 -34305 -54108
1686 -54108 -62694 -234153 -186216 -7086 -116447 35438 -13104 -214685 -207200 -178474 -164258
$$ packed form
1764f5063j81763J29162r8570k8939J03706J18396N8110k4418o079K32916j72453
1753F5005q2831q5004J10952J51775j18042J92972j51340o0200J84800l32299
1743a24212m6643J39946Q2614j00774R9591j04755l0302R2106l0904K2587l5010
1732c5756l8951Q1497L618k01972P919R9777Q4081P9064J29908p4844r8424K9653
1720F5570P0631o477q9302n7198j0560n5781J40896j61614q1186R0464M7630j19920
1708a66847J40806m3512j40990k6817n6519J53872L4685o578j520j3870m1043
1697a68333k65657K26429J55275j29063P4692p435J83442n9415J5081n9321j9803
1686e4108q586j71459M7937J79130j09361J51885m8542k01581P485K8726J4216
$$ plain form
1675 -164258 -97997 -54975 -98649 -27346 7420 36164 -91347 -268781 -187341 -289961 -263944
1664 -263944 -154006 -95022 46282 65254 112836 -24958 -9012 99232 -8742 -146563
1654 -146563 122268 8985 11072 93644 -47961 57845 5205 -23335 1232 -69656 6633
1643 6633 89978 -178396 -220272 -94167 -160037 -302898 -405705 -256622 -208482 -101018 6694
1632 6694 -31047 -235952 174829 173187 4551 -28657 -75205 147811 150364 -22749 -90738
1621 -90738 -36898 -28138 10961 -54502 -83578 84106 117781 59402 14677 -91524 140845
1610 140845 21738 115555 77523 -176821 -205897 26769 251930 202339 108036 48690 64931
1599 64931 -135491 -58594 -161378 -180959 -80812 -139921 13110 133020 73670 43872 47907
$$ packed form
1675a64258O6261M3022m3674P1303L4766K8744j27511j77434Q1440j02620K6017
1664b63944J09938N8984J41304J8972M7582j37794J5946J08244j07974j37821
1654a46563K68831j13283K087Q2572j41605J05806n2640k8540K4567p0888P6289
1643F633Q3345k68374m1876J26105o5870j42861j02807J49083M8140J07464J07712
1632F694l7741k04905M10781j642j68636l3208m6548K23016K553j73113o7989
1621i0738N3840Q760L9099o5463k9076J67684L3675n8379m4725j06201K32369
1610A40845j19107R3817l8032k54344k9076K32666K25161m9591r4303n9346J6241
1599F4931k00422P6897j02784j9581J00147n9109J53031J19910n9350k9798M035
$$ plain form
1588 47907 -57568 -56045 -66337 -169554 -116080 -133037 -181479 34893 -115098 -164167 -162305
1577 -162305 -241135 -128217 -35579 -170565 -230522 -19364 130901 -54563 81224 179562
1567 179562 19101 -93998 -199450 -126067 -96530 -18190 -109106 -165171 -247429 -162861 -48226
1556 -48226 -119035 -54631 1943 -92643 76798 -103883 -141867 -52803 -46409 9597 -59359 31251
1544 31251 -105577 -41542 2555 -6383 135405 61448 84475 -33073 -139621 -12998 93247
1533 93247 -12958 62533 60882 -16222 -196638 -88579 -9220 -95892 -82529 59591 7643
1522 7643 -45969 -121018 -195643 -127828 -216009 -142803 -112576 -64929 89784 137881 -18706 157026
1510 157026 86162 146501 21975 -218497 -180325 -95734 -61386 -54057 -21881 64395 -3896
$$ packed form
1588D7907j05475J523j0292j03217N3474j6957m8442K16372j49991m9069J862
1577a62305p8830J12918R2638j34986n9957K11158J50265j85464J35787R8338
1567A79562j60461j13099j05452P3383K9537P8340r0916n6065q2258Q4568J14635
1556d8226p0809O4404N6574r4586J69441j80681l7984Q9064O394N6006o8956R0610
1544C1251j36828O4035M4097q938J41788p3957K3027j17548j06548J26623J06245
1533I3247j06205P5491j651p7104j80416J08059P9359q6672J3363J42120n1948
1522G643n3612p5049p4625O7815q8181P3206L0227M7647J54713M8097j56587J75732
1510A57026p0864O0339j24526k40472L8172Q4591L4348P329L2176Q6276o8291
$$ plain form
1499 -3896 -22659 -138801 -33418 -8272 -48343 -47342 42734 46170 -15616 -90576 38389 169913
1487 169913 -161796 -209249 -260169 8852 208729 105682 -104356 -236067 -164613 -386479
1477 -386479 -290651 -162133 -80564 -93552 -254158 -324338 -145757 -161942 -102783 -43118 16967
1466 16967 45833 113291 -27856 -74913 41784 -187515 -71549 19340 151650 135820 173764
1455 173764 54530 -8528 -34112 -308111 -218034 -250495 -126901 -133124 -199253 -103585 -233905
1444 -233905 -23913 5773 -63698 -36565 76250 86097 3700 -108915 -97770 -146452 -108199
1433 -108199 -63440 -40977 37766 108723 295573 144889 48841 15352 -156478 -226507 -92471
1422 -92471 -187728 -82122 -54516 -219636 -134667 -48979 36267 35772 179504 -40381 -116882
$$ packed form
1499c896j8763j16142J05383K5146m0071J001R0076L436o1786p4960J28965J31524
1487A69913l31709m7453n0920K69021J99877j03047k10038j31711P1454k21866
1477c86479R5828J28518Q1569j2988j60606p0180J78581j6185N9159N9665O0085
1466A6967K8866O7458j41147m7057J16697k29299J15966R0889J32310j5830L7944
1455A73764j19234o3058k5584k73999R0077l2461J23594o223o6129R5668j30320
1444b33905K09992K9686o9471K7133J12815R847q2397j12615J1145m8682L8253
1433a08199M4759K2463P8743P0957J86850j50684r6048l3489j71830p0029J34036
1422i2471r5257J05606K7606j65120Q4969Q5688Q5246m95J43732k19885p6501
$$ plain form
1411 -116882 -203179 -58939 72702 -68087 -124089 47862 198988 69924 -55064 -295438
1401 -295438 -250282 -349246 -250419 -222473 -132579 -141526 -132189 -279314 -186075 -83133 8482 112256
1389 112256 -151507 -11552 -65063 -166781 -171765 104578 22280 -58426 11132 4801 276
1378 276 61576 23908 -3184 8002 -75388 -72090 111033 195780 143319 -69758 -50192 -80556
1366 -80556 192609 60474 45950 19828 176 -132179 -195030 -92133 84423 118018 -50358
1355 -50358 2785 -236890 -82590 -13317 30887 -54211 -143284 -210111 -121260 48161 36867
1344 36867 -36163 -85840 52048 77923 -179069 -180685 -96377 64773 118889 49687 -31768
1333 -31768 -108840 -121034 -228076 -105586 -134253 33157 -179704 -225086 38978 -38706 -95734
$$ packed form
1411a16882q6297J44240J31641j40789n6002J71951J51126j29064j24988k40374
1401b95438M5156r8964R8827K7946Q9894q947R337j47125R3239J02942R1615J03774
1389A12256k63763J39955n3511j01718m984K76343q2298q0706O9558o331m525
1378B76O1300l7668k7092J1186q3390L298J83123Q4747n2461k13077J9566l0364
1366h0556K73165j32135j4524k6122j9652j32355o2851J02897J76556L3595j68376
1355e0358N3143k39675J54300O9273M4204q5098q9073o6827Q8851J69421j1294
1344C6867p3030m9677J37888K5875k56992j616Q4308J61150N4116o9202q1455
1333c1768p7072j2194j07042J22490k8667J67410k12861m5382K64064p7684n7028
$$ plain form
1322 -95734 -121297 -39917 -7653 -8208 -117898 1063 -137108 -156454 63796 143379 49626
1311 49626 45118 33674 132838 168038 -67845 -222860 -96537 22250 79284 -84584 -166605
1300 -166605 -97245 -42062 -143327 -209665 -23977 -22202 -161691 -158045 -216313 -63484 -48225
1289 -48225 -133002 -48603 -37871 -145190 -133402 -167286 10980 -62587 -161819 -107690 -248564
1278 -248564 -147336 -29626 50386 -38479 -84452 -90252 -30931 93772 31739 68081 167741
$$ packed form
1322i5734k5563Q1380L2264n55j09690J18961j38171j9346K20250P9583r3753
1311D9626m508j1444R9164L5200k35883j55015J26323J18787N7034j63868q2021
1300a66605O9360N5183j01265o6338J85688J775j39489L646n8268J52829J5259
1289d8225q4777Q4399J0732j07319J1788l3884J78266p3567r9232N4129j40874
1278b48564J01228J17710Q0012q8865m5973n800N9321J24703o2033L6342R9660
$$ [...]
##END NTUPLES=NMR SPECTRUM
##END=
