##TITLE=1H_CA-8848-5
 DMSO, 8 sc, 
 29.04.2021
##JCAMPDX= 6.0         $$ Bruker NMR JCAMP-DX V2.0
##DATA TYPE= NMR SPECTRUM
##DATA CLASS= NTUPLES
##ORIGIN= UXNMR, Bruker Analytische Messtechnik GmbH
##OWNER= root
$$ XWIN-NMR		Version 3.5
$$ Thu Apr 29 14:43:19 2021 Russian Standard Time (UT+4h)  she@DPX200
##.OBSERVE FREQUENCY= 200.131506
##.OBSERVE NUCLEUS= ^1H
##.ACQUISITION MODE= SIMULTANEOUS
##.ACQUISITION SCHEME= undefined
##.AVERAGES= 8
##.DIGITISER RES= 18
##SPECTROMETER/DATA SYSTEM= spect
##.PULSE SEQUENCE= zg30
##.SOLVENT NAME= DMSO
##.SHIFT REFERENCE= (INTERNAL, DMSO, 0, 16.0041)
##AUDIT TRAIL= $$ (NUMBER, WHEN, WHO, WHERE, WHAT)
$$ ##TITLE= Audit trail, XWIN-NMR		Version 3.5
$$ ##JCAMPDX= 5.01
$$ ##ORIGIN= Bruker BioSpin GmbH
$$ ##OWNER= she
$$ F:/spectra/data/she/nmr/H-F/1/pdata/1/auditp.txt
$$ ##AUDIT TRAIL=  $$ (NUMBER, WHEN, WHO, WHERE, WHAT)
(   1,<2021-04-29 14:42:25.29 +0400>,<she>,<DPX200>,
      <created by zg, POWCHK disabled, PULCHK disabled
       configuration hash MD5:
       00 E9 B6 7A A2 85 ED C7 34 08 36 98 17 FE 4E 26
       data hash MD5: 16K
       63 3C 8E DF 2F 0F 64 2F BC F2 79 A3 87 5C 9F CF>)
(   2,<2021-04-29 14:42:27.85 +0400>,<she>,<DPX200>,
      <Start of raw data processing
       efp BC_mod = 2 LB = 0.24 FT_mod = 6 PKNL = 1 PHC0 = -11125.04 PHC1 = 17.00102 SI = 16K 
       data hash MD5: 16K
       68 38 79 99 4A DC D4 E5 A2 B3 C8 10 3F 84 3D B5>)
(   3,<2021-04-29 14:42:45.17 +0400>,<she>,<DPX200>,
      <pk PHC0 = -0.558952 PHC1 = -2.4 
       data hash MD5: 16K
       3F 4E 20 CE 4A C3 0D 10 91 FB 50 11 8E AB 6A 6C>)
(   4,<2021-04-29 14:42:48.23 +0400>,<she>,<DPX200>,
      <abs ABSG = 5 
       data hash MD5: 16K
       A8 FE A7 EA AF 17 C6 EC CC FF 6C AE F1 16 1A FC>)
$$ ##END=
$$ 
$$ hash MD5
$$ 43 22 F7 B0 CB A5 F9 66 0B 34 74 41 B1 FF D3 16
##$RELAX= 
##$RELAX= 
##$RELAX= 
##$RELAX= 
##$RELAX= 
##$RELAX= 
$$ Bruker specific parameters
$$ --------------------------
##$DU= <F:/spectra>
##$EXPNO= 1
##$NAME= <H-F>
##$PROCNO= 1
##$TYPE= <nmr>
##$USER= <she>
##$AMP= (0..31)
100 100 100 100 100 100 100 100 100 100 100 100 100 100 100 100 100 100 
100 100 100 100 100 100 100 100 100 100 100 100 100 100 
##$AQSEQ= 0
##$AQ_mod= 1
##$AUNM= <au_zg>
##$AUTOPOS= <>
##$BF1= 200.13
##$BF2= 200.13
##$BF3= 200.13
##$BF4= 200.13
##$BF5= 200.13
##$BF6= 200.13
##$BF7= 200.13
##$BF8= 200.13
##$BYTORDA= 1
##$CFDGTYP= 0
##$CFRGTYP= 5
##$CHEMSTR= <none>
##$CNST= (0..31)
1 1 145 1 1 1 1 1 1 1 1 1 1 1 1 1 1 1 1 1 1 1 1 1 1 1 1 1 1 1 1 1 
##$CPDPRG= <>
##$CPDPRG1= <>
##$CPDPRG2= <>
##$CPDPRG3= <>
##$CPDPRG4= <mlev>
##$CPDPRG5= <mlev>
##$CPDPRG6= <mlev>
##$CPDPRG7= <mlev>
##$CPDPRG8= <mlev>
##$CPDPRGB= <>
##$CPDPRGT= <>
##$D= (0..31)
0 1.2 0 0 0 0 0 0 0 0.06 0 0.03 0 0 0 0 0.0002 0 0 0 0 0 0 0 0 0 0 0 0 
0 0 0 
##$DATE= 1619692944
##$DBL= (0..7)
120 120 120 120 120 120 120 120 
##$DBP= (0..7)
150 150 150 150 150 150 150 150 
##$DBP07= 0
##$DBPNAM0= <>
##$DBPNAM1= <>
##$DBPNAM2= <>
##$DBPNAM3= <>
##$DBPNAM4= <>
$$ [...]
##$SUBNAM3= <"">
##$SUBNAM4= <"">
##$SUBNAM5= <"">
##$SUBNAM6= <"">
##$SUBNAM7= <"">
##$SUBNAM8= <"">
##$SUBNAM9= <"">
##$SW= 16.9725357007746
##$SWIBOX= (0..15)
0 0 2 0 0 0 0 0 0 0 0 0 0 0 0 0 
##$SW_h= 3396.73913043478
##$TD= 16384
##$TD0= 1
##$TE= 0
##$TE2= 300
##$TE3= 300
##$TEG= 300
##$TL= (0..7)
0 120 120 120 120 120 120 120 
##$TP= (0..7)
150 150 150 150 150 150 150 150 
##$TP07= 0
##$TPNAME0= <>
##$TPNAME1= <>
##$TPNAME2= <>
##$TPNAME3= <>
##$TPNAME4= <>
##$TPNAME5= <>
##$TPNAME6= <>
##$TPNAME7= <>
##$TPOAL= (0..7)
0.5 0.5 0.5 0.5 0.5 0.5 0.5 0.5 
##$TPOFFS= (0..7)
0 0 0 0 0 0 0 0 
##$TUNHIN= 0
##$TUNHOUT= 0
##$TUNXOUT= 0
##$USERA1= <user>
##$USERA2= <user>
##$USERA3= <user>
##$USERA4= <user>
##$USERA5= <user>
##$V9= 5
##$VALIST= <valist>
##$VCLIST= <CCCCCCCCCCCCCCC>
##$VD= 0
##$VDLIST= <DDDDDDDDDDDDDDD>
##$VPLIST= <PPPPPPPPPPPPPPP>
##$VTLIST= <TTTTTTTTTTTTTTT>
##$WBST= 1024
##$WBSW= 4
##$XGAIN= (0..3)
0 0 0 0 
##$XL= 0
##$YL= 0
##$YMAX_a= 854495
##$YMIN_a= -512041
##$ZGOPTNS= <>
##$ZL1= 120
##$ZL2= 120
##$ZL3= 120
##$ZL4= 120
##$ABSF1= 16.00407
##$ABSF2= -0.9685936
##$ABSG= 5
##$ABSL= 3
##$ALPHA= 0
##$AQORDER= 0
##$ASSFAC= 0
##$ASSFACI= 0
##$ASSFACX= 0
##$ASSWID= 0
##$AUNMP= <proc_1d>
##$AZFE= 0.1
##$AZFW= 0.1
##$BCFW= 0
##$BC_mod= 2
##$BYTORDP= 0
##$COROFFS= 0
##$CY= -3
##$DATMOD= 1
##$DC= 0
##$DFILT= <>
##$DTYPP= 0
##$F1P= 0
##$F2P= 0
##$FCOR= 1
##$FTSIZE= 16384
##$FT_mod= 6
##$GAMMA= 0
##$GB= 0
##$INTBC= 1
##$INTSCL= 1.334414e-10
##$ISEN= 128
##$LB= 0.24
##$LEV0= 0
##$LPBIN= 0
##$MAXI= 10000
##$MC2= 0
##$MEAN= 0
##$ME_mod= 0
##$MI= 1.114404
##$NCOEF= 0
##$NC_proc= -7
##$NLEV= 6
##$NOISF1= 3.799351
##$NOISF2= 2.8
##$NSP= 0
##$NTH_PI= 0
##$NZP= 0
##$OFFSET= 16.00407
##$PC= 1
##$PHC0= -11125.6
##$PHC1= 14.60102
##$PH_mod= 1
##$PKNL= yes
##$PPARMOD= 0
##$PSCAL= 0
##$PSIGN= 0
##$REVERSE= no
##$SF= 200.130001475074
##$SI= 16384
##$SIGF1= 3
##$SIGF2= 2
##$SINO= 5.538805
##$SIOLD= 16384
##$SREGLST= <1H.CDCl3>
##$SSB= 0
##$STSI= 16384
##$STSR= 0
##$SW_p= 3396.73913043479
##$SYMM= 0
##$S_DEV= 0
##$TDeff= 16384
##$TDoff= 0
##$TI= <>
##$TILT= no
##$TM1= 0
##$TM2= 0
##$TOPLEV= 0
##$USERP1= <user>
##$USERP2= <user>
##$USERP3= <user>
##$USERP4= <user>
##$USERP5= <user>
##$WDW= 1
##$XDIM= 16384
##$YMAX_p= 488414824
##$YMIN_p= -1123301
$$ End of Bruker specific parameters
$$ ---------------------------------
##NTUPLES= NMR SPECTRUM
##VAR_NAME=  FREQUENCY,     SPECTRUM/REAL,   SPECTRUM/IMAG
##SYMBOL=    X,             R,               I
##VAR_TYPE=  INDEPENDENT,   DEPENDENT,       DEPENDENT
##VAR_FORM=  AFFN,          ASDF,            ASDF
##VAR_DIM=   16384,         16384,           16384
##UNITS=     HZ,            ARBITRARY UNITS, ARBITRARY UNITS
##FACTOR=    0.207333158178282, 1,           1
##FIRST=     3202.89460914033, 0,            0
##LAST=      -193.844521294459, 0,           0
##MIN=       -193.844521294459, -1123301,    0
##MAX=       3202.89460914033, 488414824,    0
$$ Real data points
##PAGE= N=1
##DATA TABLE= (X++(R..R)), XYDATA
$$ [...]
9513 107473 167508 56199 -17126 16259 49020 5673 107297 -126258 -111373 -52812 -38790
9502 -38790 96806 404992 256565 178187 160379 88858 90074 78514 273145 300069 124446
9491 124446 222559 359450 435723 401943 424657 448974 340728 194048 320296 381524 477111
9480 477111 454876 457475 296418 -3360 118752 266391 235526 124009 47308 14528 33212
9469 33212 253232 211922 17296 -57752 -280925 -403156 -396703 -176072 -158229 -105965 8140
9458 8140 -90439 -218399 -163738 -235287 -249813 16823 -70839 -131994 96091 142009 -56870
9447 -56870 62255 136566 -508 -93120 -203133 -212188 -237419 -161224 -152591 -49353 -23803
9436 -23803 -69837 -222790 -128634 -54910 -125878 -60671 -73965 -152728 -238134 -229847 -98770 85955
9424 85955 -60117 -140277 -215590 -164581 -222368 -438735 -424880 -274119 -123908 -347501 -285867
9413 -285867 -243857 -24667 -204739 -411130 -385828 -352071 -352327 -366062 -359496 -299652 -195913
9402 -195913 -357595 -291872 -207130 -86024 -276820 -452283 -459633 -336677 -381607 -429218 -247482
9391 -247482 -196137 -155108 -431972 -393077 -388405 -550421 -537247 -383893 -290894 -182194 -208946
9380 -208946 -169895 -134073 -307814 -334136 -374305 -364607 -286005 -223118 -127543 -5732 -100998
9369 -100998 -133011 -271188 -198201 -215919 -281440 -210744 -82081 -217015 -271975 -364821 -315867
9358 -315867 -273666 -358450 -395171 -534826 -422910 -335961 -388638 -416705 -344837 -113342 -31366
9347 -31366 -100045 -163435 -200203 -239116 -371282 -362114 -281307 -288918 -202695 -299755 -384533 -448942
9335 -448942 -369068 -250394 -261177 -223773 -139727 -292257 -336039 -276690 -310508 -337092 -369936
9324 -369936 -248989 -275848 -418817 -335704 -246706 -258279 -318978 -348836 -275309 -394813 -297459
9313 -297459 -162922 -221978 -268160 -3610 -63723 -6124 -77759 -229569 -324190 -320694 -151821
9302 -151821 -228588 -304644 -269755 -201386 -202564 -267716 -178542 -345970 -333075 -295191 -294996 -191612
9290 -191612 -71095 -207525 -246620 -241009 -295630 -310774 -141758 -152891 -287407 -166636 -177924
9279 -177924 -144525 -118596 -37808 -172894 -271074 -283061 -159777 -393057 -622666 -352222 -228488
9268 -228488 -196160 -143801 37714 82126 -61260 -222975 -184811 -18598 -80420 -2564 110373
9257 110373 -177560 -192027 -38573 25788 12726 40841 61808 -126335 -95200 -124746 62746
9246 62746 -13170 18824 215111 221428 59402 199229 310546 370333 352462 182767 123038
9235 123038 218794 243030 406480 459886 347286 314654 161749 178046 135501 44386 195768
9224 195768 395190 347910 337429 247335 417908 343304 176964 402281 281348 92397
9214 92397 -456 39139 177853 242714 195619 170164 222915 237050 201620 289769 315242 355540
9202 355540 416423 332053 287981 496161 490105 633266 739003 731536 652639 706794 594475
9191 594475 461773 355130 266901 531512 405350 280037 274262 394599 466375 397228 582241
9180 582241 432300 418346 515866 516677 432243 97272 111292 -116966 -135732 -121793 -124291 57268
9168 57268 142380 3913 -84738 -172847 -273847 4954 36673 -113791 -20176 32329 106696
9157 106696 129290 67300 155335 167392 45868 46696 -64248 13977 11812 -35012 -70437 -76380
9145 -76380 -33474 99658 270751 258106 134769 66860 -37904 23136 149790 169951 170085
9134 170085 230003 198528 76947 200326 61330 -153635 -141814 -161897 -88594 -153736 100305
9123 100305 176747 35918 -40688 181107 198694 6873 191003 155755 254209 219215 101914
9112 101914 232033 89071 -90651 84320 336466 372690 261268 222163 120387 75193
9102 75193 541 117656 305136 228283 186910 267680 413088 380169 353411 339259 258279
9091 258279 269294 281387 252657 350634 342619 212738 206226 117953 328594 439506 406253
9080 406253 351090 510364 569699 692028 766718 579018 615842 597517 623497 531830 561469
9069 561469 688968 780899 893864 867430 877723 777163 913673 858965 639964 746258
9059 746258 901815 956981 1170311 1046535 1176319 1211792 1033077 1143124 1002715 1008638
9049 1008638 985539 1045966 1157201 1267818 1236021 1640094 1498542 1442472 1483589 1419524 1444257
9038 1444257 1429619 1609171 1668995 1817596 2113651 2376098 2589860 2714070 2975334 3190590
9028 3190590 3320857 3263531 3127207 3274165 3260365 3492539 3537980 3597279 3683825 3706193 3766073
9017 3766073 3829472 3682056 3573223 3786747 3754789 3398503 3362088 3205859 3118802 2887824
9007 2887824 2748089 2544580 2245102 2173836 1879803 1723794 1775956 1707726 1645939 1518788
8997 1518788 1301945 1259142 1227323 1291540 1311168 1254701 1357917 1318140 1283795 1224062 1355521
8986 1355521 1353329 1476474 1442069 1393651 1374353 1395893 1345383 1149322 1231199 1255705 1133491
8975 1133491 1178151 1191459 1192092 1069598 1259656 1315839 1208744 1171663 1059310 1040638 1127878
8964 1127878 1236120 1032421 1071069 1077512 1253911 1207220 1176069 1036071 1201749 1342761
8954 1342761 1278172 1047432 971277 982524 1215644 1192904 1179441 1294658 1220233 1255096 1359058
8943 1359058 1398813 1342486 1387192 1566980 1642033 1668498 1547551 1498017 1407872 1462795 1500385
8932 1500385 1304950 1469916 1437499 1447814 1598490 1644159 1770039 1825773 1692749 1556311
8922 1556311 1516947 1613071 1748369 1754191 1790205 1968758 2083869 2008944 1968222 2012333 2117371
8911 2117371 2246376 2157284 2008927 2181910 2278529 2266568 2459757 2593339 2586240 2746074
8901 2746074 3114177 2988822 2882388 2897604 2862307 2770811 2839300 2794775 2644486 2758116
8891 2758116 2894256 2878617 2694789 2777604 2713851 2724264 2985251 3025027 2905401 2744590
8881 2744590 2641572 2679280 2653659 2710263 2827346 2710557 2753888 2561986 2521954 2747184
8871 2747184 2921418 3085920 3135024 3018056 2971278 3177581 3206988 3294873 3542915 3785184
8861 3785184 3841909 3907563 3782166 4093511 3976639 3978100 4019824 3983576 4158875 4179704 4281496
8850 4281496 4328315 4182475 4257429 4297203 4105958 4199248 4238027 4389136 4458959 4423870 4272700
8839 4272700 4422003 4415807 4461828 4608864 4830776 5140406 5316805 5251319 5674219 5973404
8829 5973404 6476277 7116027 7806260 8461810 9191300 9981534 10467338 10316532 9335824 8232084
8819 8232084 7133397 6446756 5744468 5279679 5149154 4908302 4700742 4573002 4625489 4534309
8809 4534309 4672152 4532640 4291708 4070533 3938583 4046980 3866427 3882444 3676544 3571070
8799 3571070 3662753 3772381 3683557 3578191 3587886 3524800 3288248 3134310 3333323 3377163 3280400
8788 3280400 3324035 3366345 3391659 3424415 3346314 3333122 3282136 3202353 3248857 3304163 3413827
8777 3413827 3321341 3355546 3420333 3306941 3161110 3242900 3210474 3224545 3273351 3107214 3155745
8766 3155745 3181896 3216560 3210279 3496526 3445877 3243683 3236416 3161721 3063776 2976866 3098512
8755 3098512 3085550 3303730 3246400 3132357 3048699 2882476 2890931 3034507 3059937 3119223 3161181
8744 3161181 3234801 3247461 3159095 3349637 3431360 3521471 3592812 3544146 3166984 3278650 3425242
8733 3425242 3538311 3455743 3515548 3481617 3389627 3385161 3494790 3433488 3483268 3646506 3624737
8722 3624737 3748608 3660340 3673556 3533811 3451277 3396802 3603874 3540318 3579212 3488149 3414843
8711 3414843 3384214 3494581 3606387 3545949 3577631 3488004 3436407 3594195 3720604 3632652 3568470
8700 3568470 3655751 3753661 3921503 3854422 3818463 4079087 4045497 4068500 4306925 4321576 4252172
8689 4252172 4138411 3973065 3857984 4004773 4339081 4310525 4262749 4138696 4185658 4475074
8679 4475074 4489540 4676482 4648690 4743850 4913874 4957947 4903339 4918824 4910918 4750084 4781000
8668 4781000 5043235 5179562 5151296 5287953 5282132 5297820 5406154 5557680 5441184 5404296
8658 5404296 5511327 5630203 5603267 5617081 5751101 5729585 5835291 5898383 5948553 6062107
8648 6062107 5966930 6004607 6090844 5973271 6092218 6365080 6427110 6457203 6642381 6668598 6668616
8637 6668616 6789750 6687878 6939903 7062803 7120594 7340124 7476618 7594010 7761184 7884664
8627 7884664 8015187 8234607 8521471 8528144 8459261 8746238 9056802 9364222 9615875 9763668
8617 9763668 10046865 10269096 10594563 11073015 11451629 11910330 12384290 12924573 13418939 13994115
8607 13994115 14673020 15493194 16190754 17172970 18146695 18949429 19435845 20144542 20901912
8598 20901912 21185802 21532723 21287313 20912022 20165927 19327053 18394676 17370970 16513661
8589 16513661 15902284 15395375 14862203 14341843 13818453 13855308 13526193 13180083 12879062 12958365
8579 12958365 12924522 12782778 12772234 12844258 12723047 12464263 12498177 12574848 12362613 12171547
8569 12171547 12207986 12376525 12499846 12539157 12638719 12650197 12754658 12642884 12727093 12759291
8559 12759291 12909055 13036362 12938400 12821072 12955477 13032701 13029565 13347161 13639343 13682696
8549 13682696 13963393 14006469 14060393 14194045 14279737 14316902 14540123 14506165 14653605 14830796
8539 14830796 14798217 14892007 15062132 14989139 14967239 15030485 15197420 15493824 15714666 15628139
8529 15628139 15701069 16039509 15969123 16238957 16518155 16572996 16744298 16740169 16800797 16908997
8519 16908997 17173053 17349415 17376243 17404625 17764487 18240951 18465785 18587164 18632073 18895735
8509 18895735 19147644 19301518 19348795 19558938 19574768 19892605 20161399 20394958 20508684 20677992
8499 20677992 20898343 21207298 21569427 21732279 22098473 22413021 22733517 22993012 23215267
8490 23215267 23457917 23548770 23851431 24124251 24579659 24784129 25062058 25306917 25661557 25903025
8480 25903025 26144369 26428519 26785027 27108598 27271584 27435447 27790482 28284669 28716470
8471 28716470 29175922 29388381 29535349 29948944 30443763 30743699 31099494 31341340 31675062
8462 31675062 32050528 32340467 32847469 33374345 33608326 33913599 34198764 34730257 35096864
8453 35096864 35531516 36040720 36305655 36690003 37202140 37631297 37959346 38140913 38447158
8444 38447158 38980148 39456171 39766088 40203101 40638991 40948669 41372753 41727146 42069593
8435 42069593 42539252 43204178 43565360 43775222 44376440 44715659 45113173 45602640 45823508
8426 45823508 46264038 46650980 47164040 47461679 47877316 48197184 48622964 49150717 49411107
8417 49411107 49510488 50003164 50495870 51040183 51383232 51378845 51756117 52358406 52653597 52961855
8407 52961855 53442774 53601642 53737932 54006998 54448570 54596967 54781301 55111326 55418414
8398 55418414 55946859 56121719 56447299 56652189 56887452 57161938 57250944 57626229 57835039 57963825
8388 57963825 58106759 58360107 58358386 58486002 58618756 58821407 58861896 59001904 59103033 59304263
8378 59304263 59337029 59583242 59470649 59508120 59579309 59521676 59433901 59264919 59273718 59594782 59311194
8367 59311194 59265025 59346574 59323134 59300783 59107558 59060190 59165871 59095112 58920658 59106875
8357 59106875 59037510 59052184 59060169 58997543 58948395 58844754 58697407 58733327 58452541 58336019 58536689
8346 58536689 58471803 58344960 58004814 57745808 57844592 57785719 57671835 57442861 57243517 57168538
8336 57168538 56993214 56980098 56941413 56662882 56651923 56540102 56568471 56554885 56479149 56278699
8326 56278699 56146282 55943640 55805981 55650059 55634481 55589005 55571225 55205174 55081225 55086871
8316 55086871 54957272 54841121 54614135 54537299 54556293 54488297 54527169 54500682 54563360 54425187
8306 54425187 54305058 54249846 54253685 54183324 54102781 54266508 54279933 54295946 54195220 54363080 54458539
8295 54458539 54205681 54070248 54246702 54132894 54210668 54077000 53963773 53808910 53869186 54008175
8285 54008175 53879960 53619565 53770443 53903244 53934026 53922764 53957103 54034424 53918849 53943879
8275 53943879 54072451 54096215 54053785 54021461 54135887 54436090 54691154 54804778 54977191 55038350
8265 55038350 55151849 55264858 55301431 55514348 55517995 55788042 55789976 55772756 55888398 55899119 56005869
8254 56005869 56132465 55960812 56037045 56143441 56429920 56581962 56830706 56964255 57208075 57270945
8244 57270945 57362300 57799070 57974731 58017542 57954801 58173896 58448737 58838441 59234314 59205343
8234 59205343 59468415 59644834 59655577 59952000 60204428 60544906 60713008 61051157 61239575 61445083
8224 61445083 61640070 61666398 61986612 62219861 62446849 62859335 63162331 63575444 63757043 64004606
8214 64004606 64292642 64636738 64984610 65314826 65586977 66091285 66342614 66647821 66911794
8205 66911794 67292832 67556670 67772974 68177215 68618503 68905349 69245945 69552367 69808533
8196 69808533 69871670 69989485 70418455 71131725 72277418 71821621 71782857 72085354 72370311 72533221
8186 72533221 72827268 73181186 73186360 73365636 73703452 73950622 74151721 74437441 74449740 74614974
8176 74614974 74624172 74851395 75188314 75543840 75817296 76168721 76276033 76461340 76614064 76789696
8166 76789696 77055482 76931101 77230391 77566929 77623451 77749622 77799904 78052218 77917235 77883993
8156 77883993 78142080 78226368 78099318 78087609 78112904 77919400 77878214 77632226 77698103 77738158
8146 77738158 77742040 77597500 77518289 77550934 77415910 77365322 77318094 77309399 77138349 76923856 76588269
8135 76588269 76691910 76527686 76262452 76167159 76101531 75956598 75716092 75625457 75435724 75371142
8125 75371142 75141482 75059487 74956557 74907453 74564597 74384662 74191135 74063705 73917209 73656600
8115 73656600 73544811 73378251 73295535 73066637 72940912 72835051 72811582 72737193 72697024 72619291
8105 72619291 72340745 72200300 72300494 72206684 72121012 72269246 72035154 71970951 72031784 72161987
8095 72161987 72328687 72225739 72275583 72150696 72322048 72630901 72714639 72820815 73208878 73560886
8085 73560886 73710456 73761820 73801739 74073434 74489744 74722000 74840668 75364261 75946795 76173380
8075 76173380 76475867 77125293 77877828 78597545 79366104 80379236 81643776 83207045 84923761
8066 84923761 87054054 89297658 91875070 94812822 97814078 101027284 104082681 106897396
8058 106897396 108738434 109028209 108024635 105916255 103288684 100866227 98721159 96716884
8050 96716884 95501785 94859227 94496794 94788744 95391299 96345714 97734291 99361202 101540188
8041 101540188 103967114 106559507 109443914 112133192 114425056 115999057 116194384 114649148
8033 114649148 112041798 108803442 105726899 103143563 100980453 99439107 98762424 98815743
8025 98815743 99556887 100782426 102337022 104413006 106741761 109817039 113264199 116499307
8017 116499307 119352082 121604330 122570867 121743984 119494987 116072276 112185973 108272206
8009 108272206 105204806 102702021 100923079 99923021 99552475 99527434 99849344 100646203 101927692
8000 101927692 103471837 105558188 108183816 110677346 113675236 116083636 117382789 117586562
7992 117586562 116246863 113168338 109116434 104689352 100223964 96106836 92720995 90228404
7984 90228404 88092859 86281067 84755033 83445983 82451065 81508915 80766015 80109256 79523846
7975 79523846 79128175 78742447 78229275 77761901 77283894 76743602 76245553 76006531 75609572
7966 75609572 75212191 75014134 74745376 74655282 74474842 74324326 74241498 74210754 74321612 74322771
7956 74322771 74221763 74388473 74347025 74334023 74555230 74954309 75034163 75136256 75555640 75949576
7946 75949576 76213897 76472954 77003797 77525615 78124822 78665570 79441868 80007530 80742427
7937 80742427 81556457 82503877 83437526 84408166 85553115 87069771 88275936 89640708 91349915
7928 91349915 93657662 96174474 98813531 101654974 104745554 107967433 110990323 114060871
7920 114060871 116732496 119036241 120400029 120904753 120398994 119152749 117853777 116918753
7912 116918753 116491367 116496891 117116374 117709146 118140571 118198517 117137264 115232107 112107390
7903 112107390 108072047 103733678 99372935 95160385 91726044 88927470 86521701 84648628
7895 84648628 83279633 82011435 81000573 80191098 79528191 79001244 78866331 78624757 78633702
7886 78633702 78849051 79384806 79954790 80550286 81221376 82534945 83822961 85418799 87541997
7877 87541997 89935336 92821070 96094669 99252529 102283018 104797561 106341047 106966962
7869 106966962 106036202 104412458 102455934 100296681 98370391 97348056 97123435 96963868
7861 96963868 97003142 97135653 96377902 94713688 92010549 88376069 83987207 79175716 74691805
7852 74691805 70723033 67165523 64289022 61807458 59817306 57928624 56147647 54517358
7844 54517358 52988736 51616396 50380812 49048629 47854529 46608470 45423687 44257438
7836 44257438 43148895 42165776 41194290 40377467 39405726 38699585 38130580 37441072 36795579
7827 36795579 36253371 35607438 34982320 34361164 33844808 33392721 32865139 32468740 32001827
7818 32001827 31732344 31484217 31144505 30645900 30299812 30137096 29981231 29816414 29712298
7809 29712298 29586746 29371990 29218782 29042221 28903375 28654618 28509173 28347686 28202974
7800 28202974 27955743 27618756 27179791 26708207 26287565 25612605 25243145 25113614 24775406
7791 24775406 24179144 23929999 23644187 23391447 23174045 22898903 22453425 21702366 22001824
7782 22001824 22194271 21934530 21904093 21701053 21469362 21277998 21231620 21048194 21083986 21118800
7772 21118800 21085550 20979373 20908852 20862412 20776963 20808820 20842603 20781218 20636747 20649650 20512152
7761 20512152 20295898 20138360 19789377 19630170 19346865 18945938 18505914 18394407 18292896
7752 18292896 18234123 18213790 17758642 17746319 17733061 17623899 17581477 17517783 17506316 17563138 17428902
7741 17428902 17333629 17472390 17635407 17475245 17375337 17378564 17251984 17174088 17101230 16822870
7731 16822870 16716086 16629177 16580297 16490050 16631826 16499486 16253330 16191902 16124523 16285751
7721 16285751 16429735 16394315 16395152 16510813 16702752 16931995 16872134 16764285 16730581 16827432 16650452
7710 16650452 16405547 16147693 16161836 15988988 15730879 15460667 15331806 15467908 15577861 15627100
7700 15627100 15670460 15704480 15639226 15756245 15778860 15879729 15986312 16161815 16224008 16386827
7690 16386827 16464375 16936119 17310361 17474239 17817213 18017072 18313544 18679004 19246317 19666691
7680 19666691 20126270 20578716 21023185 21586264 22184671 22863652 23537408 24103830 24546565
7671 24546565 25208295 26168536 27045310 27856407 28721774 30109531 31802192 33447373 35225115
7662 35225115 37393292 39634612 41872874 43758075 45246691 45981914 45633731 44594989
7654 44594989 43241641 42198414 41682946 41817792 42213954 42804807 43843506 44721088 45386221
7645 45386221 45106812 44035424 42232160 39982948 37927472 36050851 34416867 33288461
7637 33288461 32542096 32050929 31739972 31607039 31533671 31682031 31914863 31970899 32608369 33074628
7627 33074628 34024761 34979099 36095935 37504141 39242111 41128281 43433104 46287743
7619 46287743 49404380 52813571 56577098 59658162 62545506 64746634 66145174 66662008
7611 66662008 66304113 65557141 64334036 62978270 61786583 61232112 61141327 61671710 62084769
7602 62084769 61645233 60682298 59029877 56780061 53852847 50167742 46495844 42911947
7594 42911947 39685143 37050805 34797277 32936597 31380384 30307357 29293641 28220789
7586 28220789 27429284 26534785 26291476 25854809 25672367 25722455 25757574 26041001 26707756 27485353
7576 27485353 28307269 29086522 30260843 31839473 33398354 34764588 36077310 36927850 37057284
7567 37057284 36388444 34920634 33246186 32061717 31131864 30720061 30627459 30772467 31240490
7558 31240490 31569455 31510292 30931327 29700464 27749496 25074780 22588006 20566174 18942815
7549 18942815 17483054 16366969 15461262 14597134 13762194 13069825 12291627 11469337 11100344
7540 11100344 10412975 10337888 10011099 9513200 9080609 8745300 8444040 8176046 7998955 7808037
7530 7808037 7622506 7249361 7043405 7055933 6665937 6391220 6524970 6217392 5905414 5883090
7520 5883090 5649271 5579507 5458953 5402662 5175692 4955317 4818340 4728273 4767489 4470139
7510 4470139 4328330 4301975 4196640 3956138 4080412 4071529 4057525 3950056 3727960 3588272
7500 3588272 3623098 3721863 3545828 3308162 3177209 2985601 3224617 3226560 3176060 3118297 3103656
7489 3103656 3043511 2797933 2689663 2691131 2525704 2502719 2663453 2548304 2648140 2469366
7479 2469366 2397078 2385509 2204958 2274416 2316207 2187261 2261113 2227266 2291495 2119533 2034423
7468 2034423 1952923 1913863 1669501 1642959 1726827 1757228 1633228 1475720 1330756 1179073
7458 1179073 1136151 1337295 1423315 1233621 1327470 1267041 1267229 1300987 1326988 1259539 1122710
7447 1122710 1031996 925506 993416 845922 907139 803054 745789 727194 738008 781776 883395
7436 883395 676130 517333 543218 569391 606249 560536 492294 606999 836074 666652 663469
7425 663469 483629 567856 432757 279013 285206 369129 496698 405157 453653 442308 487029
7414 487029 306482 100269 197891 240152 159761 129274 316271 217898 167728 204318 78320
7403 78320 81184 153083 -21923 -36041 -85739 -38643 64628 154589 193879 159520 151006 68735
7391 68735 108779 52388 -158696 -163539 -49843 -85403 -222686 -307651 -332919 -213579 -175897
7380 -175897 -175485 -128162 -94342 -168346 -91919 -95211 -199357 -335880 -362107 -331658 -459389 -672144
7368 -672144 -630977 -422271 -298181 -338974 -437338 -302306 -288156 -219142 -440698 -467105 -227134
7357 -227134 -323076 -467575 -335525 -325535 -425168 -611201 -499842 -487779 -689870 -613462 -496921
7346 -496921 -597665 -598736 -430345 -279645 -426032 -523299 -581531 -552771 -458923 -558472 -555436
7335 -555436 -520965 -419145 -697926 -552668 -464445 -357296 -596654 -656711 -443232 -487564
7325 -487564 -559053 -566892 -649282 -772676 -849543 -900748 -841244 -913691 -725419 -578710 -440893
7314 -440893 -564254 -718865 -607224 -606070 -519187 -344435 -359366 -475934 -557755 -639781 -638437
7303 -638437 -718937 -692325 -756429 -487306 -440968 -386244 -530041 -691154 -722095 -753127 -688597
7292 -688597 -730085 -709067 -702113 -632978 -671654 -461494 -376084 -563771 -745523 -628105 -642946
7281 -642946 -516848 -438008 -594781 -618600 -402910 -452121 -403660 -408959 -462121 -515099 -544746
7270 -544746 -619934 -779569 -934464 -846119 -433689 -368277 -475885 -466042 -596525 -709254 -776836
7259 -776836 -733047 -761697 -674537 -646302 -625865 -683688 -740682 -652652 -495471 -489240 -435089 -495651
7247 -495651 -658638 -656832 -688956 -594467 -510136 -606191 -582027 -432496 -341284 -597975 -485548
7236 -485548 -400728 -648393 -646544 -394568 -383949 -471572 -322900 -364501 -286371 -378545 -455799
7225 -455799 -526377 -619244 -647315 -557010 -580771 -647713 -632071 -547174 -497424 -390219 -302625
7214 -302625 -199196 -136212 -81624 -106877 -298524 -365296 -307019 -423585 -426856 -478020 -512437
7203 -512437 -444285 -360283 -98594 -221831 -470614 -614286 -495183 -495042 -535299 -379724 -527940
7192 -527940 -648721 -536541 -436004 -384741 -442247 -484946 -419588 -499301 -490183 -463049 -487204
7181 -487204 -415807 -343537 -400430 -326765 -552310 -561174 -367143 -288663 -113362 -218179 -286155
7170 -286155 -297886 -324644 -346497 -234019 -188333 -222732 -226437 -384300 -400912 -161697 -43673
7159 -43673 156312 62326 -262156 -296540 -412791 -222593 -59650 -186728 -237255 -284118 -319208
7148 -319208 -268210 -388202 -433464 -414335 -384046 -429540 -571109 -684317 -475195 -279690 -358436
7137 -358436 -430307 -460453 -597395 -404806 -259423 -246778 -311881 -332040 -412845 -449123 -282482
7126 -282482 -183413 -410450 -388423 -124262 -246293 -304793 -445023 -404373 -138365 -271240
7116 -271240 -223485 -235724 -295486 -142360 -100133 -72046 -69349 -33542 -115614 -213532 -388160
7105 -388160 -346265 -324980 -374332 -402171 -382898 -527880 -320389 -192619 -262683 -388526 -423810
7094 -423810 -440978 -357110 -394577 -489044 -460029 -530194 -585714 -431898 -566526 -558088 -426850
7083 -426850 -442653 -227374 -284908 -396272 -623386 -533482 -466412 -402335 -207884 -251916 -301504
7072 -301504 -491825 -343672 -391930 -599164 -616620 -494938 -453335 -438267 -293941 -419994
7062 -419994 -379201 -448064 -706016 -719745 -715665 -566627 -354519 -573543 -667465 -448481 -507682
7051 -507682 -386203 -607172 -583162 -593940 -516581 -294054 -504019 -512634 -541793 -572112 -608224
7040 -608224 -474300 -384456 -363691 -607618 -779714 -704261 -624524 -506018 -468689 -490813 -559577
7029 -559577 -496413 -557152 -675385 -820792 -899185 -761011 -862861 -682548 -534486 -609511
7019 -609511 -567404 -545268 -619698 -647490 -671060 -651816 -793954 -769723 -698794 -651051 -690077
7008 -690077 -653910 -620504 -705141 -706122 -603798 -527484 -690257 -772512 -699025 -598425 -443689
6997 -443689 -630586 -695272 -658576 -618673 -736827 -769672 -527613 -605720 -543479 -450793 -514690
6986 -514690 -629123 -771917 -704191 -553790 -746054 -642198 -554305 -470980 -286558 -409810
6976 -409810 -467855 -256952 -224266 -229610 -333069 -526963 -345195 -294458 -363124 -382490 -327896
6965 -327896 -535022 -489800 -551025 -555386 -294272 -409083 -638802 -592902 -701697 -812077 -878902
6954 -878902 -720550 -649174 -823515 -712193 -717060 -717635 -659016 -693333 -713231 -769344 -849205 -697902
6942 -697902 -543530 -481755 -589994 -559979 -586848 -629315 -570914 -372797 -461503 -431382 -632046
6931 -632046 -463454 -283580 -475111 -601690 -478232 -393594 -532513 -554946 -469374 -533659
6921 -533659 -611847 -521394 -353772 -351836 -322549 -496347 -415158 -539824 -540251 -416875 -529745
6910 -529745 -453823 -273804 -422287 -418208 -274385 -448213 -448272 -439721 -433724 -640887 -364049 -290448
6898 -290448 -336681 -467795 -482720 -488252 -330879 -438157 -361444 -352684 -447618 -333573 -288582
6887 -288582 -253302 -157987 -197095 -190964 -146590 -85224 -192632 -256506 -295591 -306525 -171648
6876 -171648 -111509 -223081 -133935 -201149 -169330 -146979 -170997 -32273 -15096 180860 131640
6865 131640 142694 24404 -85661 -13232 -6843 102401 182199 116036 53333 135650 218505
6854 218505 218370 294497 221586 240755 38521 -58928 66026 -36267 -70650 107866 291588
6843 291588 238790 112461 -12877 245193 197284 242781 453420 388072 509821 556890 450859
6832 450859 260136 272092 109360 139923 203436 294151 285961 358736 475158 577985 582512
6821 582512 459713 546818 587964 515874 552984 621204 607674 633642 435971 469380 610605
6810 610605 549627 711494 662140 535194 693321 813509 776496 770003 787429 1029125 827774
6799 827774 585105 625616 614006 648362 721065 663646 527788 635636 649111 736258 914727
6788 914727 630567 679583 798217 792664 851639 723175 676448 903723 895742 584835 592934
6777 592934 755128 840061 903097 884470 854112 815869 702925 650627 761885 916133 878635
6766 878635 865099 747047 928589 853078 862176 1039943 1072287 880669 763616 913879 963756
6755 963756 819883 778198 843353 851187 984520 1066648 934058 775345 834018 871565 954572
6744 954572 824107 660025 717803 854364 1037898 875254 674951 767496 800167 784939
6734 784939 720579 638736 844525 889510 1074723 1010373 970741 816113 852361 925358 889382
6723 889382 997488 1044560 1192777 1228179 1058065 890283 868903 931015 921123 772056 920761
6712 920761 859182 910533 999291 837834 885114 876073 803044 858118 891260 1162629 1246701
6701 1246701 1133894 976542 1245265 1196553 1118373 1296323 1221847 957026 1134465 1280940
6691 1280940 1137069 1271369 1227260 1138520 1320729 1258792 1362565 1440405 1403279 1366499 1314736
6680 1314736 1283914 1203116 1265539 1187461 1311442 1135300 1136016 1013952 1036774 1027667 1133636
6669 1133636 1096395 1106479 1408981 1377813 1333126 1309089 1213495 1246166 1389748 1323418 1323013
6658 1323013 1343840 1268407 1130469 1137440 1180631 1196375 1086499 1151820 1086514 1071734 1348562
6647 1348562 1473847 1263070 1014844 1104858 1120414 1055974 1097283 907805 812512 837067 980999
6636 980999 1047350 1058206 973141 810111 958710 1172396 864530 892863 1020368 864469
6626 864469 804823 729275 553713 520895 586869 424190 572638 727966 824939 792182 673488
6615 673488 567240 708983 602284 579210 533318 534575 588365 586061 529548 382822 450773
6604 450773 310803 386241 539718 388160 265346 186713 266339 180076 60405 109035 391649
6593 391649 331685 263909 300812 179961 152251 278506 92347 -3915 172403 155716 169599
6582 169599 87192 189058 141981 171757 -4377 -23379 -38965 31210 119376 -74186 66389
6571 66389 132265 299538 157854 19593 165925 -34569 -24788 -38703 9029 1472 -271505
6560 -271505 -230288 -184198 -67602 -123398 -13042 -68697 -328079 -156270 -114732 -84022 63922
6549 63922 -13299 -118832 -275483 -288826 -224316 -175527 -165868 -294264 -243053 -137736 -206191
6538 -206191 -331410 -241484 -297460 -410926 -290929 -254392 -357919 -247321 -294817 -85229
6528 -85229 -107660 -293658 -405144 -465905 -357414 -257707 -219545 -259189 -302498 -284080 -237391
6517 -237391 -43946 -196452 -172681 -66754 -161629 -282581 -403362 -461244 -139107 -185807
6507 -185807 -362240 -296248 -41156 -102101 -376878 -321099 -240139 -366648 -342769 -257183 -203527
6496 -203527 -44505 -92703 -72665 -125365 -152851 -286202 -192369 -217551 78282 -25281 -110325
6485 -110325 -168216 -92072 -178112 -310154 -182093 -169116 -284335 -205939 -137512 -194233 -296755
6474 -296755 -244166 -94937 -80693 -86265 78608 83670 40292 -3872 -154671 -64620 -141001
6463 -141001 57760 41888 1533 -164294 -110175 77198 37730 222113 185195 147289 77600
6452 77600 -25147 206333 221685 276909 526771 295384 409585 553908 579786 681709
6442 681709 613454 659052 836125 888496 865254 1054507 1213948 1259840 1174112 1336477 1376645
6431 1376645 1216244 1171373 1351970 1475951 1697330 1941858 1974455 1995353 2033712 2204861
6421 2204861 2304067 2422426 2368700 2364520 2565458 2609461 2611566 2614200 2458307 2349664 2148333
6410 2148333 2046280 2293863 2214089 1969584 1995413 2019208 1997184 1902603 1665174 1566323 1537081
6399 1537081 1487814 1408673 1367755 1399932 1312004 1225014 1175056 912216 893487 899881 749194
6388 749194 654367 298260 517730 631893 566952 358299 424628 414567 477897 531695 398527
6377 398527 339608 255244 241134 126777 172205 -95232 -153173 -3399 -62984 -82092 -150349
6366 -150349 -43809 45588 -201101 -179645 -124181 -101754 -132227 -186006 -83224 -83618 -201701
6355 -201701 -179652 -262257 -355341 -99783 121616 -171266 -329759 -357762 -237291 -184238 -284008
6344 -284008 -482897 -358436 -185091 -172054 -234742 -343334 -339767 -244305 -221538 -273416 -341663
6333 -341663 -353630 -453885 -318220 -319148 -278750 -202648 -269159 -151451 -102048 -179242 -391678
6322 -391678 -294635 -189672 -225014 -95364 -295356 -422264 -306514 -415602 -410846 -363475 -266366
6311 -266366 -264981 -456493 -646462 -612388 -450200 -389924 -471771 -489269 -343856 -371248 -398906
6300 -398906 -431228 -465117 -247372 -146994 -397385 -425307 -446138 -470793 -433435 -402869 -386964
6289 -386964 -397118 -242554 -166083 -5031 -11659 -105702 -159362 -105532 -304716 -459036 -445692
6278 -445692 -310225 -182884 -369112 -372830 -222489 -157620 -338465 -452285 -544059 -518393 -453550
6267 -453550 -376038 -214694 -238558 -260362 -444377 -189863 -180654 -241712 -229564 -204039 -287688
6256 -287688 -208357 -219967 -398399 -262405 -186790 -352269 -352549 -28169 -17838 -109486 29474
6245 29474 -68793 -286420 -267919 -188560 -197789 -338193 -271413 -283791 -409084 -416918 -423214 -205715
6233 -205715 -156006 -274921 -238453 -420622 -455519 -424981 -323228 -248880 -129109 -74634 -211489
6222 -211489 -453033 -398487 -196854 -334586 -259742 -325610 -275500 -207924 -224595 -329717 -334234
6211 -334234 -297372 -309755 -459415 -432594 -352234 -434075 -375145 -447941 -543011 -413480 -415742
6200 -415742 -369500 -447214 -313667 -468051 -381598 -226067 -203334 -170698 40556 -37059 -213818
6189 -213818 -169909 -252078 -346781 -268781 -173361 -334603 -99560 -6944 -85766 -109230 69185
6178 69185 -195202 -197430 -223899 -233449 -364752 -185178 -294642 -275854 -296051 -314939 -405946
6167 -405946 -390946 -461947 -434116 -312889 -305151 -317496 -263084 -172577 -103592 -249535 -131524
6156 -131524 -180525 -227243 -198688 -243511 -191526 -167241 -99320 -135629 -129565 -205478 -326812 -267340
6144 -267340 -56980 -172326 -259168 -272568 -210879 -96622 -128775 -293985 -371237 -239906 -35896
6133 -35896 -282488 -448457 -327327 -201666 -270667 -150041 -249349 -225953 -114224 -142466 -168735
6122 -168735 -148720 -287226 -236572 -171364 -92120 -62636 -111855 16918 -73262 -190505 -87108
6111 -87108 -25555 -202614 -267547 -49972 -101788 -121303 -206090 -326148 -258737 -107269 -134462
6100 -134462 -45772 48055 -155406 -63909 -161563 -138870 -99785 -108248 -71168 -27510 -13418 -87334
6088 -87334 12648 -68741 -97265 -178585 -138947 -177431 -4871 -21453 193310 244432 16631
6077 16631 -21900 -54724 -14348 -135014 37921 -25111 30356 111470 264648 142207 185025
6066 185025 282705 199126 176495 247907 374731 317539 330885 142749 163682 114630 4243
6055 4243 256020 364200 247688 86252 139026 -52055 5727 137835 6649 103184 73094
6044 73094 46019 -74983 34130 230092 64057 12043 171445 163721 385847 94707 28515
6033 28515 197516 298802 273117 240835 251102 252309 266472 243943 171311 158661 264104
6022 264104 261960 292814 293858 306078 289561 249082 107735 184413 344834 201525 210931 238084
6010 238084 203900 236958 255167 245698 352250 327241 498765 532929 397261 406215 378680
5999 378680 464269 277094 326093 383285 451359 99933 212616 485118 565007 491471 342225
5988 342225 237065 368782 410949 317867 240609 521069 568545 481438 397749 583832 606345
5977 606345 441595 403443 359945 365473 489659 545357 574615 487567 381702 460031 416550
5966 416550 442981 359538 339746 482821 463752 440603 411100 216116 247602 397428 355250
5955 355250 300785 366212 489415 508299 535057 565766 488872 678529 525291 445839 464624
5944 464624 439257 533636 491619 448577 464503 567785 538123 196965 357263 559116 556922
5933 556922 480127 319356 344347 467783 363685 482232 551908 565231 561403 501698 466108
5922 466108 573468 619280 525232 485733 512143 338383 389756 504002 615107 502742 431992
5911 431992 510047 550840 678816 516904 465962 526741 622277 684080 700691 832665 906859
5900 906859 809897 543161 602449 606529 601860 639017 737116 871781 731774 655508 556997
5889 556997 622116 731720 766637 730766 694632 802920 725808 676077 809527 733565 725284
5878 725284 703334 661279 701606 679977 660158 684064 762851 689980 659628 806382 757549
5867 757549 712485 721335 730184 765112 796794 982334 994696 1006638 1268359 1130812 1214436
5856 1214436 1153712 1065672 1144211 1048967 809244 956512 1000956 1145184 1061066 1158857 1222015
5845 1222015 1188204 1241178 1123297 1209820 1322213 1374930 1191134 1155119 1159716 1101285 1136055
5834 1136055 1221324 1243942 1375048 1399766 1374865 1338391 1370603 1306410 1287109 1444384 1498459
5823 1498459 1359331 1376253 1383896 1371713 1357533 1404181 1594802 1398052 1384999 1354931 1321508
5812 1321508 1352817 1214602 1354052 1329902 1354561 1341023 1532943 1278998 1010157 1086215
5802 1086215 1169326 1251232 1197952 1078392 1082533 1146834 1440755 1342095 1220340 1276094 1149468
5791 1149468 1464427 1494780 1231629 1254215 1364988 1093068 954378 968103 1216151 1169155
5781 1169155 1259737 1361962 1184426 1162035 1267468 1342166 1234628 1228616 1154975 1167404 995414
5770 995414 1024041 1078058 1116585 1197074 1268600 1158326 1195488 1471443 1508014 1405795 1282099
5759 1282099 1216714 1458537 1470869 1299443 1300086 1212036 1396710 1518489 1622765 1585451 1427230
5748 1427230 1194546 1083409 1177984 1463673 1494537 1481472 1504195 1467836 1423462 1457399 1373948
5737 1373948 1332264 1088908 1158267 1295643 1106171 1288952 1451158 1445654 1452161 1652270 1613617
5726 1613617 1510286 1442274 1341876 1369222 1430241 1359071 1374552 1620094 1545847 1544353 1796029
5715 1796029 1697236 1571636 1685843 1429957 1563987 1668509 1618768 1640296 1469520 1630740
5705 1630740 1653514 1706207 1744272 1884932 1738820 1649253 1789767 1684777 1690914 1816708 1642109
5694 1642109 1531165 1578800 1603665 1676769 1660366 1606231 1466717 1534748 1788565 1748979 1794635
5683 1794635 1899932 1892100 1879427 1751501 1642254 1677304 1596174 1674022 1684311 1815547 1765705
5672 1765705 1755500 1843391 1674252 1699653 1828198 1805021 1806890 1850925 1931941 1931919 1838607 1931074
5660 1931074 1874817 1978839 1900798 2123032 2236651 2104447 2204594 1997740 1893750 1960750
5650 1960750 2065872 2048215 2186858 2021898 1902487 1998776 2046479 2199872 2155824 2136665
5640 2136665 2160185 2234857 2284351 2327830 2275348 2269174 2442207 2385608 2255829 2314973 2438519
5629 2438519 2251288 2159901 2288192 2295398 2373067 2347509 2410599 2241020 2344720 2292070 2291013
5618 2291013 2409191 2562891 2755361 2666116 2625607 2604066 2521517 2163063 2250837 2397476
5608 2397476 2542165 2405801 2406440 2504891 2390942 2442309 2539467 2555053 2627923 2564272 2559149
5597 2559149 2703646 2605167 2598249 2458675 2604492 2670279 2616239 2600387 2570261 2494502 2526455
5586 2526455 2428399 2412806 2576254 2480818 2613066 2640914 2681054 2724035 2649752 2806072 2862552
5575 2862552 2708540 2546938 2731652 2727950 2861419 2911310 3028447 3180525 3037529 3024540
5565 3024540 3102752 2973905 3174051 3248329 3222271 2945630 2827650 3007410 3119061 3175418
5555 3175418 3136381 3088177 2979787 3108989 3146195 3386969 3239442 3183011 3097753 3046742 3070986
5544 3070986 3233157 3375126 3349135 3360356 3413616 3494849 3509355 3688598 3644904 3417835 3238647
5533 3238647 3468284 3704913 3541359 3421956 3541724 3693297 3756259 3718025 3747807 3676666
5523 3676666 3721305 3812223 3801741 3861065 3820093 3721286 3656896 3743486 3682651 3692304 3835765
5512 3835765 3868292 3798704 3942387 3895267 4024001 3911295 4028284 3988210 4094994 3970542
5502 3970542 3997697 3999767 4011316 4054282 4211396 4279534 4237690 4150942 4096085 4169391 4177886 4283819
5490 4283819 4237113 4220550 4216210 4149256 4131109 4148013 4242969 4349639 4378929 4338027 4233631
5479 4233631 4227438 4038535 4147027 4367470 4528588 4514635 4475789 4392574 4486201 4406395 4521776
5468 4521776 4269115 4206325 4353047 4512685 4542016 4561112 4545337 4405182 4464030 4583418
5458 4583418 4418200 4500450 4556748 4531179 4490965 4528237 4610586 4548492 4591734 4697250 4531315
5447 4531315 4588346 4713591 4719620 4677201 4681195 4798976 4901782 4949676 4774985 4845840 4856966
5436 4856966 4940676 4978760 4968352 5042896 5068462 5186392 5219974 5095723 5092055 5230900 5130718
5425 5130718 5154172 5284786 5298671 5357601 5467866 5400379 5363319 5501937 5721563 5545232
5415 5545232 5564245 5674539 5764203 5778287 5674635 5796996 5702193 5671041 5694407 5777530 5940491
5404 5940491 6007490 5959885 6048046 6204277 6319636 6066261 6029438 6143695 6157768 6055784
5394 6055784 6009077 6260140 6496837 6292198 6504136 6854136 6666369 6583907 6563471 6588161
5384 6588161 6719431 6867136 7041649 6785171 6575194 6574809 6811877 7005524 6940390 7051355
5374 7051355 7071530 7099689 7079508 7036820 7102479 7084025 7238200 7544102 7465045 7396748 7311511
5363 7311511 7387151 7648361 7527764 7541529 7410362 7411696 7631329 7683098 7775592 7806045 7883822
5352 7883822 8026459 8012137 8156851 8227122 8115626 8263579 8338950 8297792 8526991 8533383 8598757
5341 8598757 8716899 8666032 8811496 8971607 9028342 8911089 9044617 9243076 9312815 9555309
5331 9555309 9450833 9377856 9403475 9618196 9777411 9932786 9984041 10032216 9995871 10045799 10222808
5320 10222808 10137838 10327696 10424420 10635450 10705569 10648641 10724071 10767733 10947157 11202619
5310 11202619 11336735 11451681 11418573 11280192 11547800 11764700 11750903 11796457 11912225 12277477
5300 12277477 12334866 12413518 12541340 12560391 12798591 12752021 12809696 13170499 13349278 13313956
5290 13313956 13609649 13695490 13857890 13912049 14010795 14040397 14101241 14380847 14612960 14748104
5280 14748104 14874163 14941380 15117598 15382504 15516906 15718744 15883351 16084442 16279455 16404889
5270 16404889 16585134 17069862 17090282 17091311 17311429 17723765 17894854 18017615 18223597 18390467
5260 18390467 18635074 18957439 19220005 19380967 19657762 19966646 20058314 20250948 20408620 20881185
5250 20881185 21242098 21475001 21624829 22034438 22530020 22809946 22878392 23274144 23493590 23846292
5240 23846292 24246161 24468280 24754736 25099479 25732531 26028991 26357053 26837467 27223725
5231 27223725 27644751 27878587 28332718 28819308 29237893 29627375 30257084 30670212 30903328
5222 30903328 31314218 31956528 32584127 33112680 33447092 33827132 34428427 34827477 35494984
5213 35494984 36008957 36545990 37216230 37664422 38145440 38848123 39491956 39952212 40680746
5204 40680746 41295347 42070891 42945012 43423505 43982263 44709050 45507687 46294717 47133957
5195 47133957 47816727 48633778 49193335 50120996 50892298 51545065 52383575 53007705 53776053
5186 53776053 54723579 55639133 56479911 57210535 58166243 59065451 59729735 60483626 61504659
5177 61504659 62246391 62970474 63726066 64642560 65320893 66108705 67016330 67711183 68266410
5168 68266410 68960359 69592804 70256754 71030626 71563012 72023990 72606189 73145565 73644194
5159 73644194 74072842 74491024 74848218 75032177 75300286 75559875 75690680 75869916 75930648 75865081
5149 75865081 75543319 75541944 75372550 75145170 75022584 74630703 74296418 73716794 73322464 72959885
5139 72959885 72490939 71827678 71282143 70818095 70146800 69443683 68596633 67826560 67310026
5130 67310026 66554027 65520363 64593065 63974272 63339924 62531871 61630648 60859098 60156093
5121 60156093 59252563 58561271 57775167 56878140 56003626 55272209 54598420 53960442 53112581
5112 53112581 52253801 51277906 50436999 49828436 49206919 48755203 48101715 47353878 46623268
5103 46623268 45819341 45186103 44664364 43823402 43126738 42657148 42098827 41547810 41244082
5094 41244082 40718748 39938989 39226776 38943086 38211153 37729651 37336427 36977624 36606271
5085 36606271 36046582 35829980 35420122 34891979 34458456 34037753 33603666 33263256 32908806
5076 32908806 32508881 32250252 31978299 31724104 31120147 30751100 30397386 30032714 29913287
5067 29913287 29645644 29360387 29042712 28692794 28590739 28249857 27900826 27621620 27328299
5058 27328299 27149807 27077274 26649809 26427092 26353997 26185632 25906536 25658068 25665447 25455932
5048 25455932 25154303 24988218 24972776 24762060 24566742 24361581 24280719 24183775 23993962 23877536
5038 23877536 23773484 23567008 23468401 23238973 23204819 23046074 22780295 22861386 22697990 22584010
5028 22584010 22347646 22310589 22311991 22168046 22181439 22191332 21922151 21729246 21644145 21650457 21533198
5017 21533198 21586328 21750591 21533807 21404009 21180629 21115767 21224453 21151200 21188762 21083633
5007 21083633 21047046 21062601 20937127 21010706 20940363 20804827 20739777 20823930 20834950 20955423 20825692
4996 20825692 20843774 20795372 20595517 20543054 20634165 20706908 20839599 20810324 20663276 20485209
4986 20485209 20336356 20426652 20498538 20571732 20511931 20489567 20524086 20511209 20585090 20383556 20479615
4975 20479615 20514932 20458426 20482947 20749211 20866606 20914517 21015719 20966746 21011004 21225516
4965 21225516 21215541 21091769 21036459 21053526 21209481 21034129 21261706 21261425 21202271 21234092 21248668
4954 21248668 21266808 21275938 21431173 21335780 21471045 21506129 21523157 21505947 21368276 21517189 21484486
4943 21484486 21405703 21420164 21327610 21476294 21613763 21560854 21605787 21544667 21523669 21637610 21557426
4932 21557426 21481312 21701568 21937565 21759018 21730358 21751188 21672668 21859007 21934646 22106895
4922 22106895 22063553 21977247 22179352 22185735 22193537 22202403 22459240 22577206 22499386 22417590 22801142
4911 22801142 22804217 22725790 22734977 22846124 23082839 22961811 23176978 23430635 23582035 23798372
4901 23798372 23702090 23718078 23817902 23974045 23883202 23873593 24132225 24175952 24400927 24479743 24749034
4890 24749034 24832857 24908075 24747349 24839910 25065015 25192921 25387142 25412641 25410691 25660185
4880 25660185 25583586 25707843 25695084 25738942 25985302 26103621 26229151 26282013 26431282 26750791
4870 26750791 26920641 27102835 27221811 27369618 27465741 27401538 27587661 27639806 27885678 27891451
4860 27891451 27883541 28014705 28186370 28468459 28666314 28772763 28778750 29057066 29182672 29336686
4850 29336686 29622706 29843583 29729111 29781930 29701694 29976090 30272716 30332133 30535328 30674317
4840 30674317 30893763 31083450 31305001 31497533 31661065 31725440 31803803 31972752 32289500 32584326
4830 32584326 32939936 33007454 33054981 33244026 33500703 33627463 33934933 34135198 34403845 34466717
4820 34466717 34433707 34580622 34934910 35252109 35398999 35681710 35871914 36040428 36096756 36394400
4810 36394400 36562376 36632457 36867798 37000723 37353176 37747992 38010703 38311360 38450866 38649782
4800 38649782 38873028 39099770 39392181 39758349 39854907 40124259 40423636 40654987 41032389 41395967
4790 41395967 41409563 41541761 42039527 42350700 42622654 43032528 43176100 43199988 43522807 43759195
4780 43759195 44028279 44369845 44769589 44955744 45309153 45410496 45711519 46053925 46428550
4771 46428550 46891577 47301918 47639411 47776118 48146109 48423498 48633189 49078020 49423084
4762 49423084 49740592 50113144 50530975 50960308 51479238 51820730 52044213 52556273 52907448
4753 52907448 53213413 53646334 53986182 54198237 54709547 55222335 55676343 56100851 56539050
4744 56539050 56905636 57326348 57740238 58302644 58802350 59283103 59888929 60279116 60646111
4735 60646111 60903110 61316822 61693728 62332146 62984175 63503360 64051463 64674118 65373749
4726 65373749 65784175 66198841 66678119 67254463 67816828 68515105 69117747 69622475 70158534
4717 70158534 70751011 71482082 72003525 72818034 73254528 73964847 74558102 75369585 76042448
4708 76042448 76692060 77447186 78157929 78923043 79551995 80186378 80937242 81801466 82767323
4699 82767323 83521635 84228350 85121610 85976080 86814026 87669241 88542948 89219880 89996745
4690 89996745 90905751 91752522 92476824 93400557 94413139 95472477 96286512 97378017 98425076
4681 98425076 99215055 100166577 101226754 102152402 103190676 104390819 105385264 106314535 107524810
4672 107524810 108653715 109803593 110952451 112030962 113187872 114478665 115725305 116950819
4664 116950819 118034179 119448894 120763511 121996504 123150909 124258180 125472074 126717146
4656 126717146 127920673 129289133 130688319 132196355 133437181 134803678 136195930 137599733
4648 137599733 139109988 140462608 141691367 143392896 145048559 146649090 148310821 149840267
4640 149840267 151247536 152807647 154499581 156225055 157877525 159605218 161420098 163194799
4632 163194799 165090863 166774465 168679427 170574583 172630272 174455657 176438080 178449158
4624 178449158 180354511 182659296 184771800 186834815 188929639 190979307 193345467 195810933
4616 195810933 198045218 200426254 202827171 205216205 207590750 210115878 212836707 215441111
4608 215441111 218038347 220492883 223372886 226126166 228899344 231768760 234614977 237435424
4600 237435424 240412139 243476644 246523646 249297085 252604038 255843074 258778559 261779710
4592 261779710 265097982 268403587 271915696 275455077 278782349 282133602 285846836 289375807
4584 289375807 292841083 296429094 299910049 303422165 306965935 310667649 314537061 318392822
4576 318392822 322022143 325963738 329710817 333732082 337668872 341328329 345230362 349300416
4568 349300416 353273988 357301356 361450205 365444890 369272502 373303574 377575121 381391295
4560 381391295 385292707 389369821 393331406 397202069 401128325 405251091 409165320 412969801
4552 412969801 416672590 420633390 424481305 428147055 431753889 435314573 438726357 442569116
4544 442569116 446048488 449206428 452635276 455584919 458475768 461633309 464381732 466939097
4536 466939097 469338806 471475806 473562030 475623860 477553638 479275779 480781274 482314295
4528 482314295 483526108 484732968 485876761 486651893 487275441 487869841 488245630 488344487 488414824
4519 488414824 488291307 488193961 487802222 487200518 486345823 485503650 484635285 483416011 482052287
4510 482052287 480455351 478789770 477064657 475238462 472972576 470798805 468846355 466301783
4502 466301783 463745181 461186048 458339340 455099935 451977488 449248745 446119096 442933332
4494 442933332 439911429 436640026 433395989 429871606 426345281 422927894 419450180 415633122
4486 415633122 412042882 408583631 404672115 400901590 397278038 393513595 390003533 386277281
4478 386277281 382587864 378941448 375155608 371409140 367760540 364115351 360274481 356566557
4470 356566557 352912990 349224595 345780320 342123778 338687060 335209360 331554658 328344685
4462 328344685 325023047 321462336 318331801 315059580 311659593 308681770 305663041 302610122
4454 302610122 299456613 296389545 293648816 290785823 288027393 285356528 282526631 279976972
4446 279976972 277419651 274987964 272446033 269944966 267642056 265351047 263001551 260601934
4438 260601934 258455053 256454651 254611069 252777446 250833152 249224887 247343467 245656316
4430 245656316 243935736 242159471 240598595 239018299 237574415 236180806 234935956 233796013
4422 233796013 232589641 231333654 230134370 229067274 228112149 227184492 226291019 225290078
4414 225290078 224486967 223893845 222864336 222107420 221459817 220679149 219891707 219174300 218538408
4405 218538408 217907746 217147653 216435392 215961201 215365101 214752009 214043238 213545671 213192334
4396 213192334 212409876 211760337 211181860 210852945 210352065 209860777 209290139 208731676 208405165
4387 208405165 207820672 207580838 207081097 206506014 206024623 205718920 205148154 204502871 203990043
4378 203990043 203664496 203073235 202270569 201516267 200836507 200156178 199124323 197910261 196476573
4369 196476573 195317418 194036914 192530093 190744759 189009718 187526711 185628626 183742676
4361 183742676 182076162 180391834 178782337 177049002 175426273 174057420 172543085 170995563
4353 170995563 169557830 168399314 167170945 165957224 164713556 163582262 162477150 161294618
4345 161294618 160418761 159376642 158468584 157366745 156065344 154589693 153011198 151554584
4337 151554584 149700968 147587121 145412178 143141340 140805262 138470586 136160085 134037284
4329 134037284 131950011 130016371 127881023 125934729 124381160 122523199 120818854 119280487
4321 119280487 117961928 116608972 115243254 114087667 112852162 111710298 110817527 109640403
4313 109640403 108404078 107431957 106626101 105638504 104625263 103408470 102391607 101265984
4305 101265984 99765389 98375413 97094558 95711935 94259402 92920463 91618296 90488821
4297 90488821 89033391 87771927 86638352 85503003 84351224 83345387 82296529 81524183
4289 81524183 80544679 79371546 78503932 77534995 76880124 76282716 75600895 74895113 74250681
4280 74250681 73566934 72728430 72111019 71327977 70760850 70100468 69679167 68992056 68401677
4271 68401677 67793695 67057690 66650790 65940769 65545703 65125037 64541780 63958110 63467249
4262 63467249 63023152 62616820 62036710 61656297 61175976 60734680 60391229 59933365 59685367
4253 59685367 59360649 58959072 58320906 57880574 57492914 57157723 56877490 56448303 56090292
4244 56090292 55719284 55362441 55013695 54739171 54296962 54093894 53858823 53585729 53204270
4235 53204270 52772740 52624330 52244763 52103726 51841949 51543890 51401319 51177937 50676630
4226 50676630 50389951 50295034 49876271 49583172 49446525 49163862 48990721 48740535 48521752 48363524
4216 48363524 48147625 47853525 47644707 47557423 47343432 47163661 46821047 46587460 46346004 46378564
4206 46378564 46345608 45932821 45581912 45309413 45176796 44944745 44822741 44577282 44210662 44159199
4196 44159199 44059778 43956880 43815752 43782883 43498295 43343748 43183945 43112364 43116183 42967400
4186 42967400 42699292 42618035 42614975 42498909 42450532 42523153 42511662 42297890 42285487 42318378 42282273
4175 42282273 42265233 42127686 41870160 41840400 41783163 41742267 41880155 41863148 41636130 41427099
4165 41427099 41382035 41227791 41014273 40944223 41036857 40876747 40864586 40913855 40777673 40604791
4155 40604791 40509366 40469725 40398094 40311320 40218768 40365927 40198704 40074038 39921504 39768005
4145 39768005 39907206 39745253 39706510 39764372 39477512 39412272 39405347 39296964 39174561 39085126
4135 39085126 39048782 39002695 38881539 39017123 39259004 39084866 39018909 39089105 39299822 39285521
4125 39285521 39340881 39460538 39170943 38922393 39064730 39311947 39538413 39749173 39885709 39914559
4115 39914559 40046852 40394075 40658260 40634436 40751001 41027280 41089022 41075975 40913955 41048611
4105 41048611 41228726 40846961 40625344 40604957 40388137 40341017 40274792 40323945 40419426 40261795
4095 40261795 40229861 40099172 40090743 40181310 40270945 40253674 40259611 40513316 40530835 40508943 40623804
4084 40623804 40693787 40639817 40635747 40789495 40895102 41037678 41225089 41451212 41822184 41878753
4074 41878753 41933027 42201931 42566512 42632519 42854377 43087245 43441871 43696514 43941528 44260941
4064 44260941 44595632 45069086 45440358 45732278 46097966 46549308 46837906 47212264 47843838
4055 47843838 48183229 48632209 49350091 49704898 49940511 50376979 50849120 51248139 51754799
4046 51754799 52408768 52842888 53313082 53873626 54365754 54918983 55531226 56047233 56837918
4037 56837918 57621421 58414237 59240922 59935485 60465538 60845684 61483951 62130201 62593781
4028 62593781 63186788 63693055 64152741 64610584 64832520 65020176 64947881 65155448 65527471 65715464
4018 65715464 65690110 65854630 66088870 66215505 66449971 66579088 66905752 67226997 67665490 68277240
4008 68277240 68563499 68945092 69412374 70003577 70465826 70896423 71702398 72201161 72731206
3999 72731206 73526763 74280217 74755210 75701564 76685775 77320093 78157508 78917343 79796233
3990 79796233 80827709 81694249 82478665 83345466 84263159 85268364 86271381 87336452 88641076
3981 88641076 90070899 91391751 92840219 94008366 95167823 96440887 97366386 97642985
3973 97642985 97435310 97022868 97040367 97231117 97614493 97918387 98200716 98622166 99187452 99656610
3963 99656610 99956866 100101183 100379216 100817995 101107538 101338263 101428218 101691750 101792342 101729648
3953 101729648 101906142 101840359 101775448 101573309 101278608 100966489 100589134 100095923 99692898 99234484
3943 99234484 98629873 98092909 97550831 96893499 96223675 95445240 94541630 93833560 93038663
3934 93038663 92156986 91211208 90260674 89427411 88560492 87569641 86543492 85675145 84787250
3925 84787250 83612397 82458660 81454328 80406769 79456132 78585764 77558909 76661299 75523517
3916 75523517 74345143 73267969 72393277 71340520 70119387 69126015 68322380 67332280 66353813
3907 66353813 65200142 64199499 63277356 62482427 61842146 60868092 60019863 59074471 58169347
3898 58169347 57473620 56790700 55920548 55371206 54739612 53866622 53215585 52745171 52293354
3889 52293354 51715852 51283459 50831075 50333689 49905417 49711738 49193986 48693919 48300185
3880 48300185 48035509 48069075 47822615 47577416 47108233 46952711 46720707 46484528 46222859 46161915
3870 46161915 46182670 45902333 45923496 45682050 45511509 45516023 45662202 45674323 45535557 45472255
3860 45472255 45555896 45606969 45654254 45716824 45885976 45993723 46242417 46437204 46604449 46675552
3850 46675552 46599379 46906642 47130231 47338979 47737004 48070531 48334158 48503791 48906259 49304737
3840 49304737 49683669 50151167 50686906 51366772 51921209 52633612 53506604 54413520 55382586
3831 55382586 56438773 57509362 58433868 59095069 59541087 59533037 59108662 59150043 59571767 60117682
3821 60117682 60695193 61468412 62237383 63004720 63957864 65117084 66291661 67532377 68916266
3812 68916266 70228985 71445285 72999988 74489404 75922368 77760514 79534537 81487665
3804 81487665 83504386 85775005 88241703 90411801 92809759 95277459 97895599 100854882
3796 100854882 103883514 107173999 110801513 114794651 118746303 123177544 128093147 133151146
3788 133151146 138672452 144734463 151256438 158431032 166266767 174835478 184160329 194337088
3780 194337088 205534514 218068174 231788676 246727503 263130082 280701050 299484309
3773 299484309 319005059 338939066 358425588 376201571 390591983 400212819 403128503
3766 403128503 398430700 386130001 367413926 344817353 320757404 297316951 275194010
3759 275194010 255152123 237106454 220922909 206561440 193687981 182079519 171878082
3752 171878082 162577073 154393031 146987985 140647066 134762731 129396876 124775345 120637874
3744 120637874 116686007 113125445 109856405 106998689 104347519 101747381 99657776 97636907
3736 97636907 95632621 93800187 92286358 90775809 89440257 88516288 87641733 86806939 85815589
3727 85815589 85055476 84474240 83980379 83617965 83294237 83273977 83422647 83896066 84451517 85224562
3717 85224562 86269370 87757040 89357262 91652537 94156525 96985821 100575322 104381263
3709 104381263 108593750 113284967 118142996 122638190 126087362 127444170 125238773 119617729
3701 119617729 112255202 104367493 97493429 92113534 87968015 84756860 82186453 80175839
3693 80175839 78500033 77046010 75859435 75020488 74235758 73967863 74252512 74962104 75978292
3684 75978292 77369358 79331507 81389653 83268241 85078207 85835902 85526288 83600269
3676 83600269 79773350 75318827 70790086 66679627 63077425 60102311 57690549 55687138
3668 55687138 53833263 51976682 50550512 49335363 48025478 46942745 46189220 45544699
3660 45544699 44709549 43817013 43203345 42666570 42145381 41586927 41103624 40717647 40491304
3651 40491304 40215353 39776394 39373699 38980521 38878720 38833077 38807756 38428412 38147249 37996183
3641 37996183 37900116 37952516 38055946 38215579 38167332 38051863 38154356 38105040 38041252 38170235
3631 38170235 38237782 38246164 38515930 38741782 38973485 39071895 39381093 39833506 40221586 40685225
3621 40685225 40925765 41248413 41503217 41870794 41925435 41983978 41743206 41298410 41078444 40692201
3611 40692201 40190398 39746811 39496653 39226683 38921092 38699396 38442430 38262710 38203236 38287790
3601 38287790 38209449 37975845 37867163 37755126 37609037 37482298 37408360 37246557 37117164 37092886
3591 37092886 37210794 37419252 37704762 37975560 38315447 38653579 38904639 39384351 40004582
3582 40004582 40625687 41165471 41767819 42555971 43360570 44094364 44926032 45935885 47064438
3573 47064438 47940083 48850315 49837843 50888594 51722302 52468801 53374673 54142200 54949324
3564 54949324 55865561 56844576 58024945 59638862 61268039 63309817 65829742 68852770
3556 68852770 72636986 77076156 81632181 86923446 92368656 97552077 102093541 104608403
3548 104608403 104478273 101818461 97998200 92616006 86758689 81716831 78214363 75743233
3540 75743233 74423085 73821956 73897921 73921011 74169661 74676594 75052887 75210038 74898022 74067685
3530 74067685 72734301 70654311 68123812 65664902 63340975 60870480 58787528 57074967
3522 57074967 55309224 53873035 52411216 51408761 50306709 49227672 48107747 47308777
3514 47308777 46590712 45706511 44770273 44070479 43262785 42782862 42327007 41466137 40781108
3505 40781108 40284858 39757794 39225890 38635771 38307893 37821723 37330608 36949285 36621722
3496 36621722 36406451 36002167 35620822 35393852 35215291 34989950 34602620 34406015 34085517
3487 34085517 33966587 33937260 33762618 33463436 33236081 33073604 32887736 32565699 32311868 32076750
3477 32076750 31937484 31655020 31379774 31246017 30937867 30600002 30536450 30362971 30298310 29937027
3467 29937027 29918486 29800666 29615097 29455036 29405004 29645384 29577890 29438973 29452874 29731434
3457 29731434 29835994 29829218 29893432 30034112 30171081 30543906 30712852 30971643 31176351 31539290
3447 31539290 32076689 32353829 32607240 33127363 33482158 33687176 34282647 34860783 35457137
3438 35457137 36022206 36725700 37514468 38332975 39295840 40115495 41102599 42327248 43646537
3429 43646537 44836946 46285387 47656258 49249607 51151827 53122130 55047031 57186304
3421 57186304 59533512 61899574 64567719 67298992 70231782 73527377 76702057 80087173
3413 80087173 83508720 87691989 92042022 97186775 103363125 110784115 119418008 130005569
3405 130005569 143154082 158784856 174523583 192544765 213281125 233075054 244781971
3398 244781971 245552826 229998524 201592982 175302440 154623168 139926343 129727010
3391 129727010 122952048 118449287 115477734 113187547 111614636 110422994 109809519 110026241
3383 110026241 111243961 112852052 114677925 116466924 118396611 119968005 121354025 123042927
3375 123042927 125138615 127851932 130533777 133317119 135418728 136422010 136539437 136159127
3367 136159127 135968087 136045216 136784955 137580129 138096378 137737659 135986164 133091273 129694715
3358 129694715 126193737 123189869 120749871 118776980 116886291 114325736 110911335 107013952
3350 107013952 103084417 99635262 96699113 94481238 92457211 90465213 88001471 85105391
3342 85105391 81553147 77341510 72853565 68228266 63856396 59693944 56003848 52930130
3334 52930130 49957543 47545223 45228865 43038733 41302897 39562280 38279723 36733036
3326 36733036 35284782 34119043 32910781 31827380 30860493 29995632 29319077 28489280 27886106
3317 27886106 27133143 26382736 25629234 24815915 24322103 23803827 23405709 22841674 22330700
3308 22330700 21753498 21173001 20793585 20620033 20311321 19908805 19470886 18965863 18564073
3299 18564073 18248679 17869843 17465129 17167138 17020818 16781920 16439100 16259820 15930015
3290 15930015 15570138 15457964 15312509 15100582 14780360 14609519 14283967 14156179 14072357 13898710
3280 13898710 13780472 13553978 13460969 13311369 13070065 12923183 12830917 12551936 12371968 12073247
3270 12073247 12214148 12110746 11809157 11675860 11726899 11591549 11332535 11361586 11051242 10899980
3260 10899980 10945459 10739572 10753639 10542586 10461848 10351615 10174818 10141534 10068074 10032420
3250 10032420 10051728 9810331 9684148 9538574 9426053 9408424 9328739 9234860 9105529 9149612
3240 9149612 9040170 9191184 9132910 9115219 9069852 8784581 8738110 8710698 8769799 8574718 8466460
3229 8466460 8451310 8352440 8463347 8525821 8321111 8292669 8309249 8381598 8382261 8120188 7846597
3218 7846597 7995906 8306976 8312420 8292337 8163211 7975750 7942868 8014319 8025695 8158362 8123351
3207 8123351 8179849 8022866 7995158 7997780 7998582 7774916 7783589 7847826 7756333 7753765 7863500 7933729
3195 7933729 8067772 8043966 7924967 8087341 8064292 7914164 7780274 7756301 7844363 7887968
3185 7887968 7892883 7832921 7546078 7261501 7265503 7288843 7038020 7084937 6940360 6914899 7024130
3174 7024130 6892950 7002144 6896791 6802064 6774307 6874440 6780603 6622036 6638554 6690031
3164 6690031 6610994 6385768 6337726 6328712 6315132 6283419 6249797 6234467 6284255 6273379 6253136
3153 6253136 6141002 6056181 6045280 6108464 6038048 5945446 5943032 6011820 5832088 5841453 5899374
3142 5899374 5900566 5887952 5784302 5670784 5767905 5592300 5614736 5573960 5617051 5748596 5715639
3131 5715639 5668198 5489232 5583930 5591484 5618028 5511291 5272336 5322293 5367874 5363417 5506222
3120 5506222 5481266 5349383 5294098 5092162 5237548 5416322 5266887 5379466 5300362 5395415
3110 5395415 5456405 5424136 5437616 5385735 5316369 5338802 5457765 5260364 5243641 5328565 5374860
3099 5374860 5292454 5279753 5318137 5455880 5411370 5387312 5475676 5285862 5289715 5252953 5307210
3088 5307210 5300618 5224149 5216769 5365643 5385335 5343559 5376357 5368812 5659636 5621134 5330487
3077 5330487 5284548 5568395 5697444 5587179 5533679 5786940 6009784 5989115 6157078 6033155
3067 6033155 5972239 6041118 6101429 6141735 6089755 6037812 6038293 6038793 5977372 5866796 5848020 5938834
3055 5938834 5933770 5665785 5645425 5784743 5963699 5882073 5841845 5844085 6133231 6025181 6104916
3044 6104916 6231256 6277574 6221009 6203092 6292451 6250866 6448502 6567944 6708880 6776363 6857533
3033 6857533 6921601 6750356 6820870 6995513 7120845 7125624 7100645 7134616 7294408 7430282 7373776
3022 7373776 7445895 7589246 7712853 7660368 7674283 7640779 7613918 7611339 7627261 7690192 7856509
3011 7856509 7956683 8102149 8305942 8543320 8564539 8719359 8945971 8933603 8927425 9016501
3001 9016501 8929613 9093023 9191177 9451212 9682756 9729606 9945905 9920774 9947025 9983563 9878748
2990 9878748 9754666 9628150 9536888 9455156 9373612 9372159 9476617 9471794 9628708 9745664 9900876
2979 9900876 9900889 10120524 10426498 10631961 10765566 11173116 11515197 11957553 12140858 12419975
2969 12419975 12638144 12455887 12173693 11926474 11813217 11452641 11389717 11432754 11279876 11191824
2959 11191824 11049379 10898163 10767970 10854253 10960279 11086333 10961823 11109628 11255614 11286475
2949 11286475 11703296 11696365 11651324 11737302 11881127 12112514 12452214 12513110 12645080 12699336
2939 12699336 12826751 13024062 13338902 13738891 14190533 14520064 15004805 15550933 16086539
2930 16086539 16440598 16317277 15426246 14405981 13456027 13000612 12619434 12056948 11863468
2921 11863468 11699015 11334853 11200857 11205566 10950338 10781970 10796987 10598683 10411052 10372953
2911 10372953 10331397 10316667 10141039 10016564 9826020 9624031 9706883 9827046 9882687 9731369
2901 9731369 9582621 9447249 9551263 9404636 9373925 9469801 9409147 9367806 9429487 9379460 9212423
2890 9212423 9127395 9013510 9058096 9041946 8941590 8926681 8918561 8885245 8850336 8886147 8855028
2879 8855028 8770517 8905378 8981161 9214829 9142499 9156154 9228814 9161446 8965210 8867875 9008581
2868 9008581 9035345 9058772 9111416 9211569 9111488 9176284 9281050 9131956 9088944 9144049 9043531
2857 9043531 8983895 8992058 9098003 9271742 9315404 9202418 9150635 9142410 9150416 9185070 9240711
2846 9240711 9384093 9341610 9378896 9240909 9336334 9439218 9469982 9531551 9555834 9517990 9664531
2835 9664531 9604436 9774415 9736238 10023967 10124365 10178385 10218131 10251284 10392467 10403987 10759658
2824 10759658 10900665 10861453 11114971 11290513 11306139 11596447 11851582 11880466 12018213 12117253
2814 12117253 12175798 12387921 12503344 12700273 12843929 12962977 13085767 13302657 13447556 13662821
2804 13662821 13794283 13887165 13877761 14033264 14321133 14362955 14447276 14672277 14708298 14679619 14921166
2793 14921166 15241104 15421265 15372111 15440205 15564639 15827575 15988132 16175398 16493576 16785554
2783 16785554 17017921 17118995 17571501 18181030 18751884 19220271 19829278 20324218 20817151
2774 20817151 20854442 20660732 19923203 19102413 18288387 17694364 17552353 17322819 17176719 17287353
2764 17287353 17177410 17159198 17039663 16857481 16676703 16603166 16717522 16731731 16711565 16662544
2754 16662544 16667263 16462577 16406520 16549815 16470891 16500181 16556401 16472763 16254633 16278011 16360898
2743 16360898 16514683 16349519 16233791 16289538 16132362 16219585 16386182 16358097 16380879 16566087
2733 16566087 16691560 16641981 16570057 16601639 16638849 16632708 16703983 16596794 16686633 16615233 16546842
2722 16546842 16774099 16832122 16551721 16541868 16612590 16681758 16830145 16707552 16496392 16351526
2712 16351526 16354861 16438111 16308486 16104043 16181613 16044515 16061488 15795562 15635922 15526748
2702 15526748 15492557 15387811 15132219 14864041 14876574 14678408 14732182 14415627 14196913 14002001
2692 14002001 13811499 13625951 13369205 13299300 13007026 12718376 12475325 12110677 12112315 12168766
2682 12168766 11990592 11688055 11548126 11496670 11355246 11253514 11030147 10912832 10902525 10880473
2672 10880473 10632822 10316085 10440035 10420165 10340564 10265806 10218608 10091760 10002738 10092874
2662 10092874 9898534 9875190 9746306 9700351 9737923 9455889 9393245 9480493 9342818 9235235
2652 9235235 9136107 9030242 8975955 8997660 8841117 8910066 8981481 9115927 9159454 9139720 9216531
2641 9216531 9140613 9176357 9301135 9229421 9208577 9317966 9381048 9583694 9532763 9447374 9652353
2630 9652353 9891622 9869775 9933948 10278959 10456656 10569053 10668900 10837022 10933998 11090744
2620 11090744 11288653 11363764 11639059 11683337 11868928 11703250 11760566 11783085 11688432 11537203
2610 11537203 11369947 11335748 11277832 11163799 11104038 10952883 10703634 10510232 10257893 10219676
2600 10219676 9889998 9578554 9330344 8921179 8694504 8465696 8259490 8059127 7748770
2591 7748770 7592452 7462941 7252592 7004283 6898242 6746770 6523550 6292748 6285673 5891037
2581 5891037 5785076 5498159 5462670 5517242 5473525 5513375 5432249 5439750 5454318 5372067 5204277
2570 5204277 5044805 5024930 4970271 5061157 4956002 5113197 4954531 4999108 4922831 5014285 5117031
2559 5117031 5069658 4870961 5055947 4991451 4985965 4960466 4689083 4645163 4872357 4794210 4788476
2548 4788476 4882887 4853989 4955006 4791053 4805520 4707296 4942449 5050034 5096110 4960898
2538 4960898 4924646 5049111 5054292 4936340 4897681 4821400 4979158 4770189 4883141 4983707
2528 4983707 4879009 4795648 4797925 4738728 4777847 4751386 4832361 5058565 4972405 4963248 4774689
2517 4774689 4688236 4863217 4914685 5002754 5014455 4963973 4948202 5156345 4983633 5104972 5187853
2506 5187853 5288635 5167302 5061327 5231735 5236552 5138391 5135645 5169916 5362023 5469009 5565918
2495 5565918 5652397 5691807 5896376 6006023 5967990 6049302 6102710 6165119 6214942 6315596 6423325
2484 6423325 6625522 6884655 6954325 7066510 7249580 7243265 7323297 7499388 7501496 7734210 8026915
2473 8026915 8224969 8452223 8578719 8587395 8821932 9072612 9283611 9393172 9605743 9798553
2463 9798553 9818632 10101466 10132189 10294965 10560981 10410530 10537448 10656642 10728014 10798023
2453 10798023 10819147 10923475 10764120 10591279 10560784 10534080 10637321 10372317 10201966 10167204
2443 10167204 10049105 9807886 9649991 9550518 9382830 9168060 9089711 9028644 8886672 8665932
2433 8665932 8411156 8217903 8063908 7918788 7505738 7325588 7283973 7088785 6815751 6667054
2423 6667054 6595170 6374549 6159394 5932056 5779207 5758588 5636624 5409917 5287089 5120613
2413 5120613 5011031 4986095 4908331 4734463 4756502 4640288 4348325 4467343 4409796 4241725
2403 4241725 4171460 3959711 3947072 4152143 4112090 4122336 3935300 3828330 3876718 3633310
2393 3633310 3595695 3422609 3239772 3292816 3412351 3515742 3638716 3617474 3559841 3354266
2383 3354266 3199759 3314868 3309474 3251552 3249217 3313488 3281072 3184028 3243251 3174909 3187224
2372 3187224 2944498 3084584 3042832 3014724 2910715 2776200 2895704 2911509 2799183 2699837
2362 2699837 2611348 2656329 2732404 2679067 2713635 2717808 2704160 2577046 2572485 2428726 2283531
2351 2283531 2244994 2303069 2203187 1977460 2058572 2151780 2288834 2154915 2001567 2210946
2341 2210946 2248619 2124309 2129972 2211973 2165693 2367632 2443404 2296237 2012775 1830784 1892615
2330 1892615 1983696 1911652 1885727 1921874 2107138 2014889 1886509 1738489 1667960 1893278 1811869
2319 1811869 1629132 1694486 1722848 1840114 1759593 1629270 1867902 1884713 1638641 1649860
2309 1649860 1802804 1834495 1831421 1723292 1657438 1647464 1664102 1669599 1784420 1786111 1586812
2298 1586812 1614839 1750980 1640524 1559748 1458858 1453902 1483760 1561486 1713567 1501504 1669116
2287 1669116 1734721 1723634 1773555 1854955 1801060 1675315 1840971 1787849 1728075 1719790 1645988
2276 1645988 1494129 1573698 1687595 1711935 1712226 1733367 1721055 1717524 1595847 1675438 1642779
2265 1642779 1562799 1692323 1788878 1605880 1606687 1782307 1869481 1914434 1857664 1842350 1762220
2254 1762220 1766769 1627237 1586943 1691160 1813673 1739757 1629729 1574552 1782169 1741380 1684289
2243 1684289 1689650 1728427 1837416 1861001 1745858 1701330 1679413 1865721 1770763 1920023 1924123
2232 1924123 1982365 2013146 1943815 1921487 1944533 2208582 1939950 2052266 2063023 2072362 2107694
2221 2107694 2310957 2286180 2180084 2255519 2456498 2660621 2732673 2755415 2859365 2942119
2211 2942119 3174579 3222928 3367909 3431493 3475829 3646244 3809672 3950629 4136138 4406030
2201 4406030 4603332 5139997 5376163 5635764 5811542 6201960 6463874 6820544 7206254 7426137
2191 7426137 7323351 7249039 7011058 6667133 6044074 5626268 5456589 4793101 4506523 4335350
2181 4335350 4190982 4035815 3929591 3632311 3565551 3595895 3502474 3287666 3239522 3076838
2171 3076838 2881693 2824797 2801176 2813442 2777121 2770033 2779217 2560621 2545878 2753200 2801642
2160 2801642 2770589 2855504 2856265 2754469 2466847 2466486 2382200 2341904 2377916 2245337 2302932 2302463
2148 2302463 2451419 2415796 2231119 2224363 2361932 2571726 2625790 2323152 2213699 2157259
2138 2157259 2251626 2377840 2507791 2637556 2613077 2762706 2696164 2627408 2658343 2741311 2778586
2127 2778586 2707428 2907175 3089416 2914977 2745168 2702568 2597422 2747175 2640131 2585565
2117 2585565 2701184 2846810 2778935 2860611 2982982 2930456 3154977 3157678 3081186 3321599 3222812
2106 3222812 3167752 3285468 3538537 3608497 3574824 3576059 3557022 3757343 3770441 3804573 3846975
2095 3846975 3835649 4011217 4169482 4055833 3988391 3863839 3983705 3927703 4021423 4056138
2085 4056138 3897884 3530608 3309501 3283155 3341928 3188784 3180189 3155276 3126155 2950634 2952656
2074 2952656 3126945 3083874 2998451 3370594 3359547 3213408 3188469 3274029 3244409 2998304 3061545
2063 3061545 2887810 2976378 3032831 2832514 2812505 2776552 2993509 3189174 3084622 3034951
2053 3034951 2848367 2909301 2851894 2964620 2929979 2976377 3015086 2905387 3013010 3097103 3186117
2042 3186117 3168825 3084616 3058395 3088446 3199046 3257049 3423680 3559634 3763447 3773252 3803646
2031 3803646 3756980 3895807 3841429 3867810 3970875 3962644 4015182 4075503 4210177 4253438 4244630
2020 4244630 4288664 4273712 4143792 4134065 4308800 4200439 4239960 4324902 4371812 4556843 4556813
2009 4556813 4548061 4554137 4483825 4382468 4362104 4358599 4445974 4588761 4717575 4808925 4736531
1998 4736531 4661486 4741240 4838481 4869267 4796793 4710878 4775411 4686053 4718376 4763324 4787944
1987 4787944 4407545 4288808 4344240 4232826 4231194 4196445 4361134 4316285 4112054 4068393 3899813
1976 3899813 3862792 3774527 3707727 3736067 3670553 3611254 3690907 3756388 3595860 3405539 3408617
1965 3408617 3311584 3310214 3360826 3380958 3346794 3141546 3125802 2962096 2798086 2889019 2980451
1954 2980451 2791559 2857662 2714312 2590757 2633668 2511593 2400437 2490899 2467843 2367449
1944 2367449 2336098 2339564 2439028 2592499 2425151 2259732 2367654 2444805 2273443 2272532 1956374
1933 1956374 1771548 1813751 1863027 1829741 1582037 1559749 1626331 1349438 1551613 1480910 1346088
1922 1346088 1239561 1128575 1219461 1208891 1192870 1307736 1520101 1393047 1154053 1171803
1912 1171803 1268264 1167795 1099653 1205018 1151746 1318107 1549476 1544273 1314609 1300085 1163607
1901 1163607 1183334 1201804 1196652 1025260 850116 903742 1056580 1090807 1049197 1127889 1064600
1890 1064600 1048260 1032245 1190606 1047796 1014407 979874 985753 965204 1057818 1093307 1376226
1879 1376226 1001809 757290 949526 941519 936859 837985 819243 878047 1056650 1080164 1221688
1868 1221688 1061793 904306 1163877 1246074 1394485 1417041 1178230 1026239 1041414 995392
1858 995392 1021313 1086050 1147717 1046376 830675 702763 874593 1087756 1047680 1048964 886389
1847 886389 930122 958631 839291 1036747 923392 841684 810769 735026 581640 758656 760045
1836 760045 623544 814972 931023 858326 940857 1008715 923320 769445 693342 802332 901039
1825 901039 1007254 909927 856689 899778 972223 1007360 805019 658926 658666 663339 689437 625786
1813 625786 536822 564692 543031 785357 724815 601726 726019 677451 748732 546137 624307
1802 624307 719805 853903 846187 987483 932991 661928 841868 739138 791622 829209 757615
1791 757615 851161 1046769 961326 1077532 1093105 946777 957073 797934 925120 1006014 1071488
1780 1071488 960675 1144933 1260082 1073224 1293664 1506250 1601773 1595740 1574297 1579809 1549084
1769 1549084 1563079 1683436 1663776 1565793 1669546 1844063 1670842 1730721 1845848 1896880
1759 1896880 1822748 1822747 1796012 1979689 2109439 2113280 2087868 2026637 2062656 2132987 2114683 2128677
1747 2128677 2353749 2274479 2306392 2538728 2701207 2606417 2728189 2846318 3020308 2925805
1737 2925805 2820787 2892558 2849742 2976146 3152649 3236850 3176416 3026806 2766859 2744910
1727 2744910 2650249 2367879 2344150 2281101 2215059 2039130 2083002 2002794 2152446 2064564 2023630
1716 2023630 2082776 2056838 2034383 1995986 1999286 2073119 1964487 1906774 1991603 2001478 1824822
1705 1824822 1795797 1658152 1495274 1499402 1398779 1451752 1452231 1546328 1477685 1507914 1573332
1694 1573332 1623153 1666414 1626070 1504538 1523517 1419152 1304727 1194615 1224292 1134168 876578
1683 876578 982058 1060316 1031544 820046 678754 849854 892105 722623 744093 748411 524564
1672 524564 662065 683155 787220 689610 606410 397129 249517 244159 262123 188679 404178
1661 404178 352361 250014 364590 295645 323456 243554 235419 125018 285656 176876 465788
1650 465788 362439 310470 227508 527478 647903 313201 307372 344762 378709 439059 314258
1639 314258 311615 212918 119574 131667 142478 120016 157782 278844 272377 128599 181238 313291
1627 313291 335243 380234 232368 285428 311857 389595 411010 278187 137271 351066 491392
1616 491392 376703 145083 130332 158105 231566 79352 91716 -8716 204177 265353 242107
1605 242107 284101 235986 298146 188453 19867 18678 -23659 67489 243137 203675 232779
1594 232779 355988 253512 129798 206731 216908 281792 136283 -43844 101565 55337
1584 55337 181739 97942 10856 24826 117809 -18975 115187 230871 271279 352381 269187
1573 269187 145928 22081 22752 214778 277773 10918 -158955 14641 158220 327900
1563 327900 163588 47145 -39923 23805 151253 127322 251375 210319 -1171 -187704
1553 -187704 125518 117937 -40875 -89169 121986 -96810 -128934 -131833 30144 161475 209947
1542 209947 13917 117225 194381 180251 139684 114589 135843 137584 203931 158070 123161
1531 123161 198025 96104 55764 33532 152543 129383 181795 201567 110639 63234 -146037
1520 -146037 -225360 -221163 -1044 92423 22099 148698 -153939 -23175 190062 164913 -54521
1509 -54521 -57720 199712 113380 86750 233275 43558 -153129 8618 -66988 -13438 -151685
1498 -151685 -135015 -201888 -49346 30211 94264 -85577 -274073 -234975 -105165 -80659 -177736
1487 -177736 32084 50938 -258553 -200557 25085 129301 -21800 113637 132264 -24895
1477 -24895 -59358 -80852 7989 -46303 -283358 -329259 -105378 33170 66244 110615 13564
1466 13564 -2561 13499 -143445 -148701 116022 12526 -78950 44317 -99728 -24180 110616
1455 110616 -74470 -256749 -159514 -88742 -61649 -192599 -146599 42757 76848 -1619 43039
1444 43039 32075 135906 60882 -88928 -133374 -25246 -48206 -94941 93212 157091 146087
1433 146087 -34299 -10880 4214 193192 111208 22828 201470 -2721 111060 7565
1423 7565 -40933 -102117 -191375 -271920 -321754 -269415 -179646 19930 -36128 64064 127435 26373
1411 26373 11789 -4668 -74591 -115307 -75424 -200851 -226360 -73722 -172085 -280111 -105989
1400 -105989 -187555 -315554 -189395 -64104 -161545 -361144 -81234 -164387 -299166 -182673
1390 -182673 -15204 28900 49836 -30085 185493 32397 -125774 -253312 -327880 -202725
1380 -202725 -304880 -204076 -172532 -108162 -133333 -179353 -71929 -222468 -302831 -198525 -42069
1369 -42069 -48846 -66337 -17760 -26221 56686 46918 80192 80160 -1331 -40548 -12376 -129195 -152242
1356 -152242 -254277 -150373 -96726 -110853 -27710 -23493 -92539 -211072 -44105 -101194 -263008
1345 -263008 -236640 -144416 165964 19990 -293989 -303400 -161454 -29503 24465 -39170 -124828
1334 -124828 91603 46630 21805 -39030 -25514 148665 103526 12402 -173446 -266315 -147267
1323 -147267 31621 -97452 -19104 -76760 -70937 -56723 -5255 41016 -34613 -42483 -166270
1312 -166270 -211090 -246030 -172614 -101526 -12687 -80583 40888 10120 -299133 -384328 -291984
1301 -291984 -123037 -384734 -222257 73480 38357 -31651 -46031 49513 -114577 -61668 -114435
1290 -114435 99477 302248 140334 -4218 -32715 5262 -146197 -156543 -156352 -247721 -241558
1279 -241558 -74390 -1125 112862 -60416 -245544 -13188 -41236 -113545 -21310 -222210
1269 -222210 -78657 -186564 -177255 -123327 -29233 75770 -34799 -120365 -229211 -59056 1202
1258 1202 -22238 -101923 -100036 -100266 -273323 -252642 -311132 -346597 -40227 -71168 -27257 -92456
1246 -92456 -116323 -184569 -240729 -216745 482 40611 211139 106717 -50078 56816 -74010
1235 -74010 -56892 8681 -105281 -266691 -321308 -293682 -167052 -100155 -28477 -245468 -345747
1224 -345747 -240481 -160668 -189326 -293561 -198374 -115361 73499 76534 -36745 -263483 -144932
1213 -144932 -280009 -268716 -81111 -104076 -55716 -111939 -20760 51188 -72472 -154200 -84544
1202 -84544 -40232 -70109 -214028 -76823 -107463 -125875 -148004 -221367 -252750 -56820 -110516
1191 -110516 -280852 -117295 -62282 -259120 -120297 -28442 -34926 97280 -142846 -335704
1181 -335704 -153343 -52714 -196712 -92275 17196 122077 -3146 -158818 94482 -24520
1171 -24520 22435 -35536 -144429 -156029 -138171 -82046 8681 3209 -51456 -196904 -101756 188123
1159 188123 121805 -66473 -126612 -54319 -37459 -152788 -303 178183 166695 -15296 88034
1148 88034 51568 -71706 19545 38446 -106200 18361 -75949 -297548 -30897 -102002 -169625
1137 -169625 -251404 -210519 -239946 -111073 -143270 -161805 -46099 124765 55084 -149915 -123677
1126 -123677 -8991 -88111 -12292 -103008 -69251 -87634 -45151 -138181 -262916 -184757 -107656
1115 -107656 -190199 -186509 -129778 -217380 -179280 -124546 -77866 -73106 -128231 -179126 -106133 -276613
1103 -276613 -297885 -277771 -30032 98202 -42591 -216784 -277428 -240503 -167857 -114542 -176729
1092 -176729 -173076 -113209 -92531 -147914 -211471 -206899 -306338 -302886 -54679 -86810 -29520 -115876
1080 -115876 -183447 -232786 -175763 -33578 -138723 -112419 -119545 -131490 -157066 -191564 -188845 -59715
1068 -59715 34689 122194 -24327 -55797 -54037 128091 -137043 -89826 186419 123949 -85569
1057 -85569 3550 127562 -120571 -73521 -87898 -142578 -93823 62859 74441 119049 64717
1046 64717 32323 -15605 -98144 -39879 -52001 -119843 19027 104451 113781 -49982 -71612 -1020
1034 -1020 41918 39154 87357 -20752 -141535 -44870 -85918 -166455 -124129 -54417 21913 51010
1022 51010 18722 -82723 -134706 -354982 -198206 -49774 -7425 -123926 -151981 -22173 -123005
1011 -123005 -55918 -157997 4327 -119322 -39837 -31241 -145207 -91579 18415 218410 154703
1000 154703 15897 -96615 -236910 -270610 -210069 -313071 -256754 2720 52618 -54272
990 -54272 -118142 -112332 -144428 -57232 -134854 -46501 25311 -156386 -101474 74000 92175 -119308
978 -119308 -21947 69153 -129178 -289844 -247776 -109977 -201725 -426621 -324758 -73593 23300
967 23300 -76046 -56183 -189806 -50859 68435 92772 -118680 -67111 45578 138210 92929
956 92929 -71691 -61643 -49269 78647 11656 259589 64720 -77027 -20629 -9802 137900
945 137900 133702 25122 -199024 -244936 -133569 -26463 108444 92317 -13161 -74493 -10165
934 -10165 -12869 -4974 25703 93037 38071 28566 113564 66910 -71435 58476 -79141 -224659
922 -224659 -148836 -35798 -175259 -67459 49447 -41245 -143172 -11625 -45750 -85596 -23898
911 -23898 -129711 -243087 -139801 -139328 -104924 -87910 -136901 -207190 -182223 -107939 -62096 -39308
899 -39308 -211908 -317620 -405968 -139926 -5393 -81839 -130319 -23095 11149 53544 -42511
888 -42511 24197 -176263 -238359 -165827 -37078 -137621 -238539 -312424 -357941 -178973 -201359
877 -201359 -61873 36391 59060 -60436 142620 102763 -42807 -66735 -113835 16739 7859
866 7859 -207407 -279944 -117667 -239577 -167170 -228117 -300931 -158655 -61181 32155 55836
855 55836 -12965 -31508 -225096 -284703 -128059 -46342 -142943 -185018 -159352 -29819 -75295
844 -75295 -155894 -179156 -114755 6135 -175069 -368254 -81687 108166 36077 -119092 -25537
833 -25537 -49380 39026 -155569 -88101 -53142 -87814 -4717 -11099 -156701 -157152 -138670 -135224
821 -135224 -165990 -193260 -120079 -92356 -22924 -86768 -145124 -195253 -174661 -152102 19381 25856
809 25856 -61299 -63377 19421 -72211 -88362 -177065 70494 115760 10630 162821 184608 -37155
797 -37155 -13689 -60837 218467 193324 -124599 -47558 -33344 -101340 -46034 22434 -19635 -118329
785 -118329 -34973 -50989 -27608 166447 306150 57342 114089 103188 61482 -58521 60138
774 60138 125056 5359 -55822 -170394 -91702 43948 217983 143126 -33727 -34358 -67207
763 -67207 -122314 45152 102945 38077 56518 -38188 -294104 -322974 -86205 112067 73618
752 73618 -115437 -172927 -22875 21003 10408 -29314 -230864 -130794 -169737 -192627 -115969
741 -115969 -50141 -148335 -73613 -110651 36397 178941 137162 85806 10453 91383 -111683
730 -111683 -83593 -20888 69587 -92943 -242015 -273133 -247048 -211288 -244197 -199364 -93017
719 -93017 -26987 53635 -56568 -97578 -216105 -262848 -104200 106977 -71107 -129813 -124815
708 -124815 -78901 -36540 -7116 -172122 -179708 -5096 -84630 68635 38945 126307 85656
697 85656 -45969 29971 154250 39781 -274723 -432432 -372191 -85439 -75001 -147556 -204884
686 -204884 -198496 -45123 -30168 -101586 -134872 -152731 83975 121249 9909 -50915 -41219 -165572
674 -165572 -57425 -4677 -212876 -100691 -143797 -165948 36173 69322 45968 -241325 -210607
663 -210607 -117315 -251023 -390350 -155283 -36873 -87273 -16330 17795 254331 210698 88487
652 88487 -175973 -125040 -30127 -67809 147015 22657 -22356 -50633 -74276 -21677 -60582
641 -60582 -172690 -92167 23130 -62894 -29984 70591 124931 -13185 -35111 -93546 -113442
630 -113442 -46548 4914 -86705 47453 131077 -230907 -367450 -203544 -99509 42024 131241
619 131241 124279 19648 -106087 -162473 -199728 -310580 -221198 -214002 -179754 -85314 146844
608 146844 137232 69830 102505 233958 209804 -125332 -53772 -55024 8787 147786 159952 -24337
596 -24337 189913 141248 -60922 -64575 113185 -92676 -292917 -140969 -203200 -34849 22588
585 22588 -4994 -96986 14151 30919 -50169 -55490 145495 90672 -75642 7286 109708
574 109708 -25578 163031 102125 -44671 -253786 -204127 -45902 -31595 -106200 -32172 -8693
563 -8693 -76855 -66727 -197033 -247569 -204081 -16903 -10617 -40660 -112873 -151108 -105287 72358
551 72358 10985 59772 88359 103397 123981 23396 -120384 58508 4202 -120561 -180428
540 -180428 -235957 -200460 -139217 -62072 -65925 41178 -57484 9157 -46451 -208027 -172171 -5928
528 -5928 -98528 -108207 -45793 29835 -38251 -138167 -115833 -84739 51508 57324 49536 -92978
516 -92978 -212989 -139988 -200014 -25092 -158946 -302382 -263685 -472229 -56328 -4762 -122744
505 -122744 -253472 -232093 -60838 -62252 -123406 -154008 -64122 36767 123865 -190459 -307954
494 -307954 -197267 -302604 -262954 -228925 -86219 -25913 -9326 80558 73976 188396 185801
483 185801 136175 34545 -112262 -54158 -74428 -152581 -95762 -84744 -70973 10840 -74972
472 -74972 -168967 -70455 76673 111414 92403 12276 46355 -55799 -111881 -289406 -154915
461 -154915 -109819 -193698 -153961 -232539 -250205 -11868 685 -67683 -20915 -41404 17251 17000
449 17000 -85960 -97987 -4844 -47544 -84322 -73906 172863 188553 13821 44028 -35041
438 -35041 -149361 -19646 -69661 -127376 82714 1643 -132170 -112655 -183704 -148839 6566
427 6566 91661 88329 16394 4396 74671 -80306 9769 -111868 -155254 -97418 46935 -25692
415 -25692 21432 115059 -18106 -84705 -8061 125877 207538 89496 -184678 4999 -3588
404 -3588 167892 210679 188793 114384 -59732 -114276 -185609 -146953 -131337 66203 59994 59692
392 59692 -90913 -154326 -148915 -270932 -222334 -23968 -47019 52331 -12955 -40781 48159 101239
380 101239 88103 -6889 6261 -56954 16461 -2479 154121 150048 121837 147307 152320 219039
368 219039 296397 139925 9266 -48748 -69756 -126383 -99374 49970 -8413 36091 -104043
357 -104043 -191006 39534 -35140 33661 -3761 -170925 -227441 -255762 -104384 -121344 -66938
346 -66938 1353 -46048 -13427 30727 -68596 -43859 -53543 8142 -49721 51220 90011 54395
334 54395 -139095 -207598 -28718 -23721 208513 241719 45143 84699 73293 -36448 -50771
323 -50771 11446 -23404 50638 115136 -3383 -103081 145250 373571 303760 267847 79075
312 79075 -24831 -166480 71669 69221 -66354 -38805 -87407 -96732 -98516 97413 187232 229778
300 229778 123345 61732 111999 180970 64274 -133483 -18852 -53755 -70387 -40498 21258
289 21258 -57464 -159473 -178718 -186672 -242451 -253588 -113889 -49045 -44453 -17746 -96 -108296
277 -108296 -155985 -237230 -184767 15402 1576 19191 195595 305715 3674 123561 206187
266 206187 159753 26153 120433 37065 81503 -13550 -233380 -76607 42365 2212 51940
255 51940 123670 27293 -122708 -183635 -89731 -112452 53546 103994 197241 56491 -105999
244 -105999 -21673 264518 118436 -19458 -24426 -239642 -37961 120810 46768 -69657 -255314
233 -255314 -127751 44418 29451 42914 -35764 -136483 -18591 105074 67157 47840 54108
222 54108 -167966 -126954 -194038 -120859 25997 -31852 -99436 -79583 -175910 16539 -80120
211 -80120 -22117 -7622 39586 -65244 -185477 -29594 154858 319369 187258 72301 49338
200 49338 81310 21975 128788 279102 73249 73665 18375 -76113 -82121 -184283 23633 63675
188 63675 -13147 -33882 146580 296334 89824 7333 743 -11523 -184720 -189960 -80537
177 -80537 -241124 -80865 31182 20857 77483 226198 65466 45373 -945 -5761 36046
166 36046 22228 26870 55358 11569 30433 -39786 -83072 -141642 -150479 -60248 -31705 -59187
154 -59187 15805 68597 -16307 -10619 37296 22069 112298 -24374 87118 -4283 144426 139679
142 139679 90389 121424 -103921 9602 -77137 -6464 -98919 17304 31359 -141280 -164599
131 -164599 -340989 -150858 -73545 91128 100377 149124 43304 -91424 -82992 -254216 -305841
120 -305841 -171187 -58145 153103 161031 -27664 -18029 -61630 -18246 -178193 -85718 -102182
109 -102182 -153940 -71292 -1261 -65847 -7046 -37962 -96264 -94345 -22776 -149573 -33989 28645
97 28645 -131244 -39198 -160757 -221251 -115882 10633 4397 -16098 -155426 -99950 37262
86 37262 28604 -14973 32454 60351 63375 43091 -6867 -4367 4957 32384 35143 75356 113697
73 113697 137051 125123 248236 88529 51954 32921 7768 53505 -60097 409 99925
62 99925 29414 61751 -99067 -3809 25062 169514 117769 -82388 -136163 18929 90979
51 90979 36601 -8820 -12178 19937 49121 194892 132235 45035 -33595 -40966 4167 -63198
39 -63198 -60184 65440 -403 -61470 -172765 -137657 -74887 -98201 -129666 -49146 -117789 -98981
27 -98981 -15840 -20751 -26601 -37652 18266 18965 -65228 -125993 -98198 -102088 -96036 -110279 -56792
14 -56792 -30215 -101088 -65747 -4177 157976 143234 97834 -56564 -115067 -29453 56240 -7438
2 -7438 27414 7668
0 7668
$$ Imaginary data points
##PAGE= N=2
##DATA TABLE= (X++(I..I)), XYDATA
16383 -4479235 -4447277 -4332689 -4328317 -4315722 -4172231 -3986136 -3818566 -3738339 -3777394 -3677150
16373 -3677150 -3414431 -3360874 -3312017 -3277161 -3214317 -3133089 -3058016 -3011829 -2862980 -2769743 -2604214
16362 -2604214 -2434436 -2503630 -2347039 -2222670 -2165092 -2049538 -2110469 -2080670 -2001701 -1772901
16352 -1772901 -1628145 -1675727 -1593500 -1525505 -1445366 -1242738 -1174681 -1146660 -1149776 -922646 -888374
16341 -888374 -873014 -796837 -755974 -580205 -486773 -415165 -283366 -246052 -152789 -84178 -144783
16330 -144783 31339 348131 413033 444708 637386 734600 672024 555394 633200 846055
16320 846055 924418 1060094 1179691 1204570 1276126 1305272 1308814 1300584 1573922 1605686 1780642
16309 1780642 1773053 1920843 2004978 1985497 2096828 2174286 2270188 2367591 2516128 2376704 2414478
16298 2414478 2453626 2524297 2572478 2729151 2781962 2859788 2979827 3053505 3067596 3125180 3273646
16287 3273646 3318005 3469291 3351256 3423429 3746099 3784592 3640565 3838409 3948646 3965327
16277 3965327 3781113 3963712 4112464 4340589 4243220 4108919 4291247 4301558 4371920 4418718
16267 4418718 4433607 4498480 4743739 4889185 4871955 4743024 4784735 4787964 4819211 5029213 5148176
16256 5148176 5184202 5153120 5196320 5179397 5306674 5417199 5358214 5462281 5472852 5551255 5719268
16245 5719268 5716287 5713075 5766712 5810263 5954713 6023525 6044015 5922545 5941503 6183291 6215074
16234 6215074 6332378 6354591 6322057 6471061 6511025 6547930 6609156 6687882 6660496 6677890 6649186
16223 6649186 6642154 6655718 6603024 6811288 6803986 6921083 7013114 6884816 7080244 7320446 7258721
16212 7258721 7174035 7180485 7077881 7219981 7185054 7231021 7347409 7498476 7499084 7483952 7589698
16201 7589698 7609856 7724107 7773305 7407258 7407836 7436744 7487304 7755988 7876524 7909608 8049607
16190 8049607 7767120 7730928 7720355 7789538 7936079 7848586 8012627 8200452 8107402 8102196 8245053
16179 8245053 8205364 8217796 8262601 8367239 8218816 8323322 8360481 8289620 8228741 8309929 8514033
16168 8514033 8400796 8486073 8680100 8658574 8616828 8627436 8765519 8754155 8694419 8883097
16158 8883097 8726604 8697308 8729677 8787096 8840648 8839108 8756742 8717561 8874328 8789418 8643525
16147 8643525 8722697 8833113 8812486 8978755 9006787 8926972 9045144 8958044 8902047 8825759 8769677
16136 8769677 9036023 8973069 9041679 9150028 9130252 9113659 9179518 9295511 9083543 8990437
16126 8990437 9025903 8884599 8877882 9014062 9247981 9175869 9049687 8970227 9271873 9295891
16116 9295891 9179145 9316720 9313796 9247041 9305948 9254038 9170787 9144226 9222735 9258602 9219844
16105 9219844 9244901 9455862 9408821 9258016 9299449 9299845 9299403 9285702 9250660 9237939 9191259 9309614
16093 9309614 9385956 9332095 9373668 9456395 9361397 9290160 9262377 9326490 9271008 9247249 9282292
16082 9282292 9185595 9517185 9466557 9318702 9129576 9114747 9336481 9437610 9569256 9536895
16072 9536895 9558914 9500058 9478965 9472748 9421982 9506952 9507068 9634230 9586432 9483480 9418385
16061 9418385 9443524 9583800 9450972 9467328 9636457 9648604 9527935 9459261 9524964 9644613
16051 9644613 9664317 9637920 9705514 9550613 9508515 9489603 9547997 9566060 9528011 9599757 9654951
16040 9654951 9534992 9451298 9533375 9409705 9460176 9519647 9438307 9482117 9571856 9601686 9516300
16029 9516300 9706625 9800493 9601344 9684913 9845534 9750943 9769347 9711883 9473224 9453343
16019 9453343 9465073 9496548 9468539 9516185 9653710 9623633 9539991 9546475 9427177 9517308 9797963
16008 9797963 9665973 9581809 9660775 9792220 9640641 9709531 9615816 9590072 9615577 9659809 9693038
15997 9693038 9418518 9683202 9756904 9610577 9688975 9733516 9693193 9656881 9583905 9555149 9455142
15986 9455142 9533555 9566883 9629516 9603212 9482213 9701351 9708461 9730958 9700043 9540611 9561207
15975 9561207 9660218 9764333 9837596 9621042 9648156 9625409 9552228 9489018 9633326 9655541 9648425
15964 9648425 9708211 9825459 9864246 9749315 9729687 9778906 9893824 9783677 9689922 9741278
15954 9741278 9793646 9855317 9947627 9965255 10079439 10015866 10064216 10000914 9961386 9913223 9812236
15943 9812236 9789206 9767875 9635643 9554310 9466901 9700653 9775288 9903738 10006528 9873245
15933 9873245 9875703 9765124 9704443 9594399 9728563 9846167 9823761 9780367 9794340 9973078
$$ [...]
##END NTUPLES=NMR SPECTRUM
##END=
