##TITLE=1H_CA-8848-4
 DMSO, 8 sc, 
 28.04.2021
##JCAMPDX= 6.0         $$ Bruker NMR JCAMP-DX V2.0
##DATA TYPE= NMR SPECTRUM
##DATA CLASS= NTUPLES
##ORIGIN= UXNMR, Bruker Analytische Messtechnik GmbH
##OWNER= root
$$ XWIN-NMR		Version 3.5
$$ Wed Apr 28 14:36:19 2021 Russian Standard Time (UT+4h)  she@DPX200
##.OBSERVE FREQUENCY= 200.131506
##.OBSERVE NUCLEUS= ^1H
##.ACQUISITION MODE= SIMULTANEOUS
##.ACQUISITION SCHEME= undefined
##.AVERAGES= 8
##.DIGITISER RES= 18
##SPECTROMETER/DATA SYSTEM= spect
##.PULSE SEQUENCE= zg30
##.SOLVENT NAME= CDCl3
##.SHIFT REFERENCE= (INTERNAL, CDCl3, 0, 16.048)
##AUDIT TRAIL= $$ (NUMBER, WHEN, WHO, WHERE, WHAT)
$$ ##TITLE= Audit trail, XWIN-NMR		Version 3.5
$$ ##JCAMPDX= 5.01
$$ ##ORIGIN= Bruker BioSpin GmbH
$$ ##OWNER= she
$$ F:/spectra/data/she/nmr/H-F/1/pdata/1/auditp.txt
$$ ##AUDIT TRAIL=  $$ (NUMBER, WHEN, WHO, WHERE, WHAT)
(   1,<2021-04-28 14:35:16.87 +0400>,<she>,<DPX200>,
      <created by zg, POWCHK disabled, PULCHK disabled
       configuration hash MD5:
       00 E9 B6 7A A2 85 ED C7 34 08 36 98 17 FE 4E 26
       data hash MD5: 16K
       B8 03 6B 01 82 A5 2E B6 94 80 EF BB 08 E6 82 D5>)
(   2,<2021-04-28 14:35:19.60 +0400>,<she>,<DPX200>,
      <Start of raw data processing
       efp BC_mod = 2 LB = 0.24 FT_mod = 6 PKNL = 1 PHC0 = -11276.63 PHC1 = 9.60102 SI = 16K 
       data hash MD5: 16K
       64 7E BD CA 6F 22 8F A0 B5 83 84 85 51 CF E3 AB>)
(   3,<2021-04-28 14:35:38.51 +0400>,<she>,<DPX200>,
      <pk PHC0 = 150.6511 PHC1 = 5.2 
       data hash MD5: 16K
       04 D6 E5 29 17 8D 26 83 17 BD 67 30 A2 4F F7 FF>)
(   4,<2021-04-28 14:35:41.92 +0400>,<she>,<DPX200>,
      <abs ABSG = 5 
       data hash MD5: 16K
       59 51 3E 14 C3 A8 7D F7 71 19 02 A1 69 B4 3F 08>)
$$ ##END=
$$ 
$$ hash MD5
$$ DE 0B 2C 27 9E 86 23 20 36 49 2A 50 7C 3C A3 E6
##$RELAX= 
##$RELAX= 
##$RELAX= 
##$RELAX= 
##$RELAX= 
##$RELAX= 
$$ Bruker specific parameters
$$ --------------------------
##$DU= <F:/spectra>
##$EXPNO= 1
##$NAME= <H-F>
##$PROCNO= 1
##$TYPE= <nmr>
##$USER= <she>
##$AMP= (0..31)
100 100 100 100 100 100 100 100 100 100 100 100 100 100 100 100 100 100 
100 100 100 100 100 100 100 100 100 100 100 100 100 100 
##$AQSEQ= 0
##$AQ_mod= 1
##$AUNM= <au_zg>
##$AUTOPOS= <>
##$BF1= 200.13
##$BF2= 200.13
##$BF3= 200.13
##$BF4= 200.13
##$BF5= 200.13
##$BF6= 200.13
##$BF7= 200.13
##$BF8= 200.13
##$BYTORDA= 1
##$CFDGTYP= 0
##$CFRGTYP= 5
##$CHEMSTR= <none>
##$CNST= (0..31)
1 1 145 1 1 1 1 1 1 1 1 1 1 1 1 1 1 1 1 1 1 1 1 1 1 1 1 1 1 1 1 1 
##$CPDPRG= <>
##$CPDPRG1= <>
##$CPDPRG2= <>
##$CPDPRG3= <>
##$CPDPRG4= <mlev>
##$CPDPRG5= <mlev>
##$CPDPRG6= <mlev>
##$CPDPRG7= <mlev>
##$CPDPRG8= <mlev>
##$CPDPRGB= <>
##$CPDPRGT= <>
##$D= (0..31)
0 1.2 0 0 0 0 0 0 0 0.06 0 0.03 0 0 0 0 0.0002 0 0 0 0 0 0 0 0 0 0 0 0 
0 0 0 
##$DATE= 1619606116
##$DBL= (0..7)
120 120 120 120 120 120 120 120 
##$DBP= (0..7)
150 150 150 150 150 150 150 150 
##$DBP07= 0
##$DBPNAM0= <>
##$DBPNAM1= <>
##$DBPNAM2= <>
##$DBPNAM3= <>
##$DBPNAM4= <>
$$ [...]
##$SUBNAM3= <"">
##$SUBNAM4= <"">
##$SUBNAM5= <"">
##$SUBNAM6= <"">
##$SUBNAM7= <"">
##$SUBNAM8= <"">
##$SUBNAM9= <"">
##$SW= 16.9725357007746
##$SWIBOX= (0..15)
0 0 2 0 0 0 0 0 0 0 0 0 0 0 0 0 
##$SW_h= 3396.73913043478
##$TD= 16384
##$TD0= 1
##$TE= 0
##$TE2= 300
##$TE3= 300
##$TEG= 300
##$TL= (0..7)
0 120 120 120 120 120 120 120 
##$TP= (0..7)
150 150 150 150 150 150 150 150 
##$TP07= 0
##$TPNAME0= <>
##$TPNAME1= <>
##$TPNAME2= <>
##$TPNAME3= <>
##$TPNAME4= <>
##$TPNAME5= <>
##$TPNAME6= <>
##$TPNAME7= <>
##$TPOAL= (0..7)
0.5 0.5 0.5 0.5 0.5 0.5 0.5 0.5 
##$TPOFFS= (0..7)
0 0 0 0 0 0 0 0 
##$TUNHIN= 0
##$TUNHOUT= 0
##$TUNXOUT= 0
##$USERA1= <user>
##$USERA2= <user>
##$USERA3= <user>
##$USERA4= <user>
##$USERA5= <user>
##$V9= 5
##$VALIST= <valist>
##$VCLIST= <CCCCCCCCCCCCCCC>
##$VD= 0
##$VDLIST= <DDDDDDDDDDDDDDD>
##$VPLIST= <PPPPPPPPPPPPPPP>
##$VTLIST= <TTTTTTTTTTTTTTT>
##$WBST= 1024
##$WBSW= 4
##$XGAIN= (0..3)
0 0 0 0 
##$XL= 0
##$YL= 0
##$YMAX_a= 763287
##$YMIN_a= -657326
##$ZGOPTNS= <>
##$ZL1= 120
##$ZL2= 120
##$ZL3= 120
##$ZL4= 120
##$ABSF1= 16.04801
##$ABSF2= -0.924654
##$ABSG= 5
##$ABSL= 3
##$ALPHA= 0
##$AQORDER= 0
##$ASSFAC= 0
##$ASSFACI= 0
##$ASSFACX= 0
##$ASSWID= 0
##$AUNMP= <proc_1d>
##$AZFE= 0.1
##$AZFW= 0.1
##$BCFW= 0
##$BC_mod= 2
##$BYTORDP= 0
##$COROFFS= 0
##$CY= -3
##$DATMOD= 1
##$DC= 0
##$DFILT= <>
##$DTYPP= 0
##$F1P= 0
##$F2P= 0
##$FCOR= 1
##$FTSIZE= 16384
##$FT_mod= 6
##$GAMMA= 0
##$GB= 0
##$INTBC= 1
##$INTSCL= 1.334414e-10
##$ISEN= 128
##$LB= 0.24
##$LEV0= 0
##$LPBIN= 0
##$MAXI= 10000
##$MC2= 0
##$MEAN= 0
##$ME_mod= 0
##$MI= 1.114404
##$NCOEF= 0
##$NC_proc= -5
##$NLEV= 6
##$NOISF1= 3.799351
##$NOISF2= 2.8
##$NSP= 0
##$NTH_PI= 0
##$NZP= 0
##$OFFSET= 16.04801
##$PC= 1
##$PHC0= -11125.98
##$PHC1= 14.80102
##$PH_mod= 1
##$PKNL= yes
##$PPARMOD= 0
##$PSCAL= 0
##$PSIGN= 0
##$REVERSE= no
##$SF= 200.129992682189
##$SI= 16384
##$SIGF1= 3
##$SIGF2= 2
##$SINO= 5.538805
##$SIOLD= 16384
##$SREGLST= <1H.CDCl3>
##$SSB= 0
##$STSI= 16384
##$STSR= 0
##$SW_p= 3396.73913043479
##$SYMM= 0
##$S_DEV= 0
##$TDeff= 16384
##$TDoff= 0
##$TI= <>
##$TILT= no
##$TM1= 0
##$TM2= 0
##$TOPLEV= 0
##$USERP1= <user>
##$USERP2= <user>
##$USERP3= <user>
##$USERP4= <user>
##$USERP5= <user>
##$WDW= 1
##$XDIM= 16384
##$YMAX_p= 451226609
##$YMIN_p= -190676
$$ End of Bruker specific parameters
$$ ---------------------------------
##NTUPLES= NMR SPECTRUM
##VAR_NAME=  FREQUENCY,     SPECTRUM/REAL,   SPECTRUM/IMAG
##SYMBOL=    X,             R,               I
##VAR_TYPE=  INDEPENDENT,   DEPENDENT,       DEPENDENT
##VAR_FORM=  AFFN,          ASDF,            ASDF
##VAR_DIM=   16384,         16384,           16384
##UNITS=     HZ,            ARBITRARY UNITS, ARBITRARY UNITS
##FACTOR=    0.207333158178282, 1,           1
##FIRST=     3211.68809833442, 0,            0
##LAST=      -185.051032100372, 0,           0
##MIN=       -185.051032100372, -190676,     0
##MAX=       3211.68809833442, 451226609,    0
$$ Real data points
##PAGE= N=1
##DATA TABLE= (X++(R..R)), XYDATA
$$ [...]
7790A5040112q03720p21086p40553o35877n21773l34554l41731l40838j56487
$$ 15040112 14236392 13515306 12774753 12138876 11617103 11282549 10940818 10599980 10443493
7781A0443493j43516k8498P5447O4538Q1548J47655K54183K66565L64541M17730
$$ 10443493 10299977 10271479 10346926 10411464 10493012 10640667 10894850 11161415 11525956 11943686
7771A1943686M37598N01140O06275O80149O55447P11375P26574P09735O67353
$$ 11943686 12381284 12882424 13488699 14168848 14824295 15535670 16262244 16971979 17639332
7762A7639332N41891L93849L00318J74657J35734Q2653K1315n5462j59623k18490
$$ 17639332 18181223 18575072 18875390 19050047 19185781 19268434 19289749 19234287 19074664 18856174
7752A8856174k91139j86567l86625m81620m34968o09647p43636q69797q08687
$$ 18856174 18565035 18378468 17991843 17510223 17075255 16465608 15721972 14852175 14043488
7743A4043488q68019r54994q78696q62133q55593p00653o63171o05353m73766
$$ 14043488 13175469 12220475 11341779 10479646 9624053 8923400 8260229 7654876 7181110
7734G181110m40434l83586l03846l10871k47744k39109j88431k19595k61106q1727
$$ 7181110 6740676 6357090 6053244 5742373 5494629 5255520 5067089 4847494 4586388 4504661
7724D504661j05324j22314j48926j94742r5405m4093j19261j18218m2959m8819
$$ 4504661 4399337 4277023 4128097 3933355 3837950 3793857 3674596 3556378 3513419 3464600
7714C464600j11302r5652j34267l2054N285r7118p4373p0531q6820o8280m7438
$$ 3464600 3353298 3257646 3123379 3091325 3096610 2999492 2925119 2854588 2767768 2699488 2652050
7703B652050l2717o751r6204j17618j0974m244n2462l6071o1442l520n2934j5724
$$ 2652050 2619333 2612582 2516378 2398760 2387786 2383542 2331080 2295009 2233567 2230047 2177113 2161389
7691B161389k4568o1861j068m1262J2652r161M0820j2965l4498n3359n2642J6925
$$ 2161389 2136821 2074960 2073892 2032630 2045282 2036121 2076941 2063976 2029478 1976119 1923477 1940402
7679A940402j8047j4181O137n7961M650M1371q930K72j4230m685p4492j6854O6579
$$ 1940402 1922355 1908174 1914311 1856350 1861000 1902371 1893441 1893713 1879483 1874798 1800306 1783452 1850031
7666A850031p0560K7855K1199j0860K2307M162n634o9329Q742O3919J958k3907
$$ 1850031 1779471 1807326 1828525 1817665 1839972 1844134 1838500 1769171 1777913 1841832 1843790 1819883
7654A819883k4506q10N9021n408l1835j0512M3469O170M504N1635k0065k103P5827
$$ 1819883 1795377 1794567 1853588 1848180 1816345 1805833 1849302 1855472 1859976 1911611 1891546 1889443 1965270
7641A965270j5241k3086O3329j4183M2472K5481K0317K4993M7736O1044K6771
$$ 1965270 1950029 1926943 1990272 1976089 2018561 2044042 2064359 2089352 2137088 2198132 2224903
7630B224903q781K2749R3115N2437j2440O5872O0589L7819Q4102K6308M9399O7084
$$ 2224903 2216122 2238871 2331986 2384423 2371983 2437855 2498444 2536263 2620365 2646673 2696072 2763156
7618B763156O4373L8228N3369J15686J13386Q6832J01410J52631J31109J06492
$$ 2763156 2827529 2865757 2919126 3034812 3148198 3235030 3336440 3489071 3620180 3726672
7608C726672J46512J42879J95998J67464J42566K04748K24737K12016L16722K79302
$$ 3726672 3873184 4016063 4212061 4379525 4522091 4726839 4951576 5163592 5480314 5759616
7598E759616L74841K83370K67681L91026L69340M52019M28207L53757M52588M40611
$$ 5759616 6134457 6417827 6685508 7076534 7445874 7897893 8326100 8679857 9132445 9573056
7588I573056M23630L56654K79990K14798K42300J97549J49406Q5096L3888R5711
$$ 9573056 9996686 10353340 10633330 10848128 11090428 11287977 11437383 11522479 11556367 11652078
7578A1652078J0536l9177K6334p0755q0932p6062j83038r4585j82954k87338k00746
$$ 11652078 11662614 11623437 11649771 11579016 11498084 11422022 11238984 11144399 10961445 10674107 10473361
7567A0473361j38104j36558j42233j25490l3844J8601M1574R2494J32512J76820
$$ 10473361 10335257 10198699 10056466 9930976 9897132 9915733 9957307 10049801 10182313 10359133
7557A0359133K35656K91882K99014L10836L84401M68145N20421M81487N70114
$$ 10359133 10594789 10886671 11185685 11496521 11880922 12349067 12869488 13350975 13921089
7548A3921089N81493M53500N49157N17199N49452M12930L41201L60919K10117
$$ 13921089 14502582 14956082 15505239 16022438 16571890 16984820 17326021 17686940 17897057
7539A7897057J33201N9026K8587r9929j52634j00958j80481l30732l57804m07912
$$ 17897057 18030258 18089284 18117871 18017942 17865308 17764350 17583869 17253137 16895333 16487421
7529A6487421m67501m76683n28878n63357n62602n86993n19619o10702n60115
$$ 16487421 16019920 15543237 15014359 14451002 13888400 13301407 12781788 12171086 11610971
7520A1610971m76775m40944m28382l72739k25364k01195k91854j34882j65203
$$ 11610971 11134196 10693252 10264870 9892131 9666767 9465572 9173718 9038836 8873633
7511H873633m6040N5234N015L8905L7422R0170J60972J39584J70862J43956J08815
$$ 8873633 8827593 8882827 8887842 8926747 8964169 9054339 9215311 9354895 9525757 9669713 9778528
7500I778528J66032Q3057L8846k366M389n3847j69202j88882j47191j87083k30960
$$ 9778528 9944560 10027617 10066463 10064097 10068486 10014639 9845437 9656555 9509364 9322281 9091321
7489I091321k39746k25435j77970k36506l27777l69398l09511l70330m25165l60097
$$ 9091321 8851575 8626140 8448170 8211664 7883887 7514489 7204978 6834648 6409483 6049386
7479F049386l42212l26501l74864l46280l24050k74608k78418k02319p0392j41590
$$ 6049386 5707174 5380673 5005809 4659529 4335479 4060871 3782453 3580134 3509742 3368152
7469C368152j71575j47372j68503j41332p1674j09423j32863q4574o1652n7946
$$ 3368152 3196577 3049205 2880702 2739370 2667696 2558273 2425410 2340836 2279184 2221238
7459B221238o5300l0902q1845j24265j13715j6957j9852p8263p9995k3756J6048
$$ 2221238 2155938 2125036 2043191 1918926 1805211 1788254 1768402 1690139 1610144 1586388 1602436
7448A602436j0716l0604n7648n1437o0184j5177l0806m0971k9832J0680k8817
$$ 1602436 1591720 1561116 1503468 1452031 1391847 1376670 1345864 1304893 1275061 1285741 1256924
7437A256924l0434j09433m416R873o2482k653q6253K2368J8521l3062L289N576
$$ 1256924 1226490 1117057 1112641 1122514 1060032 1057379 971126 993494 1012015 978953 982242 987818
7425I87818l0311p5321P2083k7639k0077J6057k2965o7261j0660M4032m6417m892
$$ 987818 957507 882186 954269 926630 906553 922610 899645 832384 821724 865756 819339 814447
7413H14447p140q637q2684Q964K0278K2112n0017q3219k5205Q97j6311O2883j9672
$$ 814447 807307 798670 715986 724950 745228 767340 717323 634104 608899 609796 593485 656368 636696
7400F36696l3453n3168l3789m048k676j3844J4726J3999p8155K4359j4831j9428
$$ 636696 603243 550075 516286 512238 509562 495718 510444 524443 446288 470647 455816 436388
7388D36388O20l263K0865n4894q067K876J1642O2129p422k5329k6616m3014L1421
$$ 436388 437008 433745 454610 399716 391649 394525 406167 468296 460874 435545 408929 365915 397336
7375C97336p179j7942L2895m2955n334L6089o8795j8212J8791m9696m8196N0377
$$ 397336 390157 372215 405110 362155 356821 392910 324115 305903 324694 274998 226802 277179
7363B77179O5906o7578P0714L0295j4152q405m3483K7212l4131L1606m5564k5822
$$ 277179 343085 275507 346221 376516 362364 353959 310476 337688 303557 335163 289599 263777
7351B63777N8922J9077p9058j2384J4342m3333k0141N869r627K5573l22k1731
$$ 263777 322699 341776 262718 250334 264676 221343 201202 207071 197444 223017 222695 200964
7339B00964l3234M6532m7701n6438J6158o602j3062j2549M3256K4839k751n7994
$$ 200964 167730 214262 166561 110123 126281 119679 106617 94068 137324 162163 159412 101418
7327A01418k6479R411M6910j1374k9146n2112P0005K0586j2968J0469R320j9247
$$ 101418 74939 84350 131260 119886 90740 38628 108633 129219 116251 126720 136040 116793
7315A16793j1420r137L9723k0367J9227m9167N1289K6379l2258p645k6082j2310
$$ 116793 105373 96236 135959 115592 134819 85652 136941 163320 131062 123417 97335 85025
7303H5025k138M5397J9961O95k3988l1771N433K2337n062j7785n1174j9873O4959
$$ 85025 82887 128284 148245 148940 124952 93181 98614 120951 115889 98104 46930 27057 92016
7290I2016j8987k1779L5998o950O0733K0085j108p7094n3197K789Q320n2364N8580
$$ 92016 73029 51250 87248 80298 141031 161116 160008 82914 29717 32506 40826 -11538 47042
7277D7042O897j1590P577r860M929O963m5255r406O9151K3028k4381j5439k7486
$$ 47042 53939 42349 49926 40066 44995 51958 6703 -2703 66448 89476 65095 49656 22170
7264B2170M6235J1269l4270k6737M1634O5943L470r790o9766N559j775l5726m6413
$$ 22170 68405 79674 45404 18667 60301 126244 129714 119924 50158 55717 53942 18216 -28197
7251b8197O7221J9905L028M5479o0931o0394J6431k378j138J46J6019J6590R991
$$ -28197 39024 58929 61957 107436 46505 -13889 2542 164 -974 -828 15191 31781 41772
7238D1772l6287J4905k8167L408J752K2253L2836m332j8632j3726M8763k7097
$$ 41772 5485 20390 -7777 -4369 -2617 19636 52472 48140 29508 15782 64545 37448
7226C7448j8749J1898P9936n56o4407p61j000O1079k6444l161k8559J618L597
$$ 37448 18699 30597 110533 109977 45570 44809 43809 104888 78444 75283 46724 48342 51939
7213E1939J2357k3407K0063j4533M9152Q180o2315K546J9814Q6336o5336J2788
$$ 51939 64296 40889 60952 46419 95571 103751 41436 43982 63796 150132 84796 97584
7201I7584Q183o347l0614l6850K6264J8163O337M1224J2129n8226p2157O5035
$$ 97584 105767 99420 68806 31956 58220 76383 82720 123944 136073 77847 5690 70725
7189G0725l2052K740m952N0054K8761m527O475q0604m003R622K3110K8713l3615
$$ 70725 38673 41413 36461 86515 115276 110749 117224 36620 32617 42239 65349 94062 60447
7176F0447K5917M3289L9442j9105l2163j926P820K4105j9154L8138k1051l4703
$$ 60447 86364 129653 169095 149990 117827 115901 123721 147826 128672 166810 145759 111056
7164A11056K9536L382r671L527L1973k0308r8942k282M0435N2364l2393m4997
$$ 111056 140592 143974 134303 137830 169803 149495 50553 48271 88706 141070 108677 63680
7152F3680j4017M0621K6926j8543L8432K9657j0400r345k0204L326j2779L3260
$$ 63680 49663 90284 117210 98667 137099 166756 156356 147011 126807 130133 117354 150614
7140A50614M4674K1864l2018j5833k3160o3697J7796O290n573m8103N3902M5031
$$ 150614 195288 217152 185134 169301 146141 82444 100240 106530 100957 52854 106756 151787
7128A51787L883m8426N9194N4333n1950L60q210n9995M2231k5210r4498K0679
$$ 151787 155670 107244 166438 220771 168821 169181 160971 100976 143207 117997 23499 44178
7116D4178P495j5690L607K3086K5633j319L9508l9219L2410k923p184o948k0397
$$ 44178 51673 35983 39590 62676 88309 86990 126498 87279 119689 116766 109582 102634 82237
7103H2237O2356j7631j7169L3557j1131m26K000k7515k2940L4082l1993m998j4614
$$ 82237 144593 126962 109793 143350 132219 131793 133793 106278 83338 117420 85427 80429 65815
7090F5815J6407k8129k8542N4097j9251q283m2922M2408k1284q449K943k0750
$$ 65815 82222 54093 25551 79648 60397 52114 9192 51600 30316 21867 24810 4060
7078D060M9901k6727J5787j1037l7474Q750J8951k4609j4997k3668L8554k7949
$$ 4060 53961 27234 43021 31984 -5490 3260 22211 -2398 -17395 -41063 -2509 -30458
7066c0458n733L8366l3677K3642k8251m582N1484N1956k1350O486o2321L130K494
$$ -30458 -36191 2175 -31502 -7860 -36111 -40693 10791 62747 41397 47883 -14438 -11308 -8814
7053h814O7448n6073J1702k3778J7682l0691k1215N4120m899N1353m0213r4163
$$ -8814 58634 2561 14263 -9515 8167 -22524 -43739 10381 5482 56835 16622 -77541
7041g7541L7350k2197l0062Q612O8035n1848K528M1949j681J5396j0328L7374
$$ -77541 -40191 -62388 -92450 -83838 -15803 -67651 -65123 -23174 -24855 -9459 -19787 17587
7029A7587r146q737o0166k5416N9975M640p49k6367j8151o958Q396l0604m0467
$$ 17587 8441 -296 -60462 -85878 -25903 -21263 -22012 -48379 -66530 -73488 -65092 -95696 -136163
7016a36163J8418Q2733M4483n4424o47m480R309K1008m9952L8244o850L955O9240
$$ -136163 -117745 -35012 9471 -44953 -45600 -50080 -40771 -19763 -69715 -31471 -38321 -34366 34874
7003C4874j442l2813o268n8547j3731r869n1094O2263J8715N8783m3148k4300
$$ 34874 33432 619 -5649 -64196 -77927 -87796 -138890 -76627 -57912 871 -42277 -66577
6991f6577k5270k6558L9747n881J8080K9367k9602n792J2433J8935m5800Q94o3138
$$ -66577 -91847 -118405 -78658 -84539 -66459 -37092 -66694 -72486 -60053 -41118 -86918 -86024 -149162
6978a49162J7408K5549O8805Q186o4575K1591K605J5548J4541j012j9089K4466
$$ -149162 -131754 -106205 -37400 -29214 -93789 -72198 -69593 -54045 -39504 -40516 -59605 -35139
6966c5139K1187M0861k9755j5492j3576p1860P2349L8321n3466j7046k9717l493
$$ -35139 -13952 26909 -2846 -18338 -31914 -103774 -31425 6896 -46570 -63616 -93333 -96826
6954i6826j0216J1254j9943m0100Q7581j6732P803m4450k1939J5506L9034n355
$$ -96826 -107042 -95788 -115731 -155831 -68250 -84982 -77179 -121629 -143568 -128062 -89028 -94383
6942i4383k4035O0183P697l7473L9201M2959J9015m831o0317p3051K310M4928
$$ -94383 -118418 -58235 -50538 -88011 -48810 -5851 13164 8333 -51984 -125035 -122725 -77797
6930g7797N6881j9047L2333m8959n282m807K7623L7346m5960j8758m6305J6448
$$ -77797 -20916 -39963 -7630 -56589 -61871 -66678 -39055 -1709 -47669 -66427 -112732 -96284
6918i6284k202k1014j489k2956Q0567M5217l8491q586k2222N229M4956L5963l5327
$$ -96284 -98486 -119500 -120989 -143945 -63378 -18161 -56652 -65238 -87460 -82231 -37275 -1312 -36639
6905c6639n5627j9323k0974P8234J8772j2877n255k3008M0008k3462J526K100
$$ -36639 -92266 -111589 -132563 -54329 -35557 -48434 -53689 -76697 -36689 -60151 -58625 -56525
6893e6525l0015J9017K4640l0532j3628M4237k0428m6372L0672l5302K9493l074
$$ -56525 -86540 -67523 -42883 -73415 -87043 -42806 -63234 -109606 -78934 -114236 -84743 -87817
6881h7817m04k3970L4210j053r287M0648R626l6587j6412N423n138K6838R973
$$ -87817 -88221 -112191 -77981 -79034 -88321 -47673 -38047 -74634 -91046 -85623 -90761 -63923 -53950
6868e3950K947L8218m1284j1115Q888k980K1933K3658J1724p172o3414M9937R289
$$ -53950 -51003 -12785 -54069 -65184 -56296 -59276 -37343 -13685 -1961 -9133 -72547 -22610 -13321
6855a3321k0838m1428q116q818r631K887k8647L2295M9041k2362N3293l8834r608
$$ -13321 -34159 -75587 -83703 -92521 -102152 -99265 -127912 -95617 -46576 -68938 -15645 -54479 -64087
6842f4087M3945k9962j7071N4497j7220j3253k903K7566L6441n4674n0970n8471
$$ -64087 -20142 -50104 -67175 -12678 -29898 -43151 -46054 -18488 17953 -36721 -87691 -146162
6830a46162J13041j2593q0103N6726K7255n5432k8799k2270K2567K5822L1446
$$ -146162 -33121 -45714 -125817 -69091 -41836 -97268 -126067 -148337 -125770 -99948 -68502
6819f8502J5287K1021Q619o2856M525m3114J9306L8684L3681j3612k1836J2027
$$ -68502 -53215 -32194 -23575 -86431 -81906 -125020 -105714 -67030 -33349 -46961 -68797 -56770
6807e6770k617M3852o4506K6355K3994m7453n255M9715q958j6996J03M5937L053
$$ -56770 -59387 -15535 -80041 -53686 -29692 -77145 -82400 -32685 -41643 -58639 -58536 -12599 -9546
6794i546l7990j2394K0656K7544j4533j6872l2192n2641m745J2271N9765j7685
$$ -9546 -47536 -59930 -39274 -11730 -26263 -43135 -75327 -127968 -132713 -120442 -60677 -78362
6782g8362j7237j7028K0956M5996n1310J933K1596L6929J1081K4041N652r192
$$ -78362 -95599 -112627 -91671 -45675 -96985 -95052 -73456 -36527 -25446 -1405 4247 -4945
6770d945j0205k2461l3961K815L5049R37l9718j5629r55l3275O290j9153K9005
$$ -4945 -15150 -37611 -71572 -68757 -33708 -32771 -72489 -88118 -89073 -122348 -116058 -135211 -106206
6757a06206J8512l428M8981k6092K3144J112j3930j4161M2428n0174M2109L4476
$$ -106206 -87694 -91122 -42141 -68233 -45089 -43977 -57907 -72068 -29640 -79814 -37705 -3229
6745c229j9588k9232j9620k3070l0107M4549k3518L5762n4475L3966l4934k3368
$$ -3229 -22817 -52049 -71669 -94739 -124846 -80297 -103815 -68053 -122528 -88562 -123496 -146864
6733a46864L2774O8406J1552k9739r56J8533K3758n743L3100k6291p0482M5983
$$ -146864 -114090 -45684 -34132 -63871 -64827 -46294 -22536 -28279 4821 -21470 -91952 -45969
6721d5969K8641j641j4877p9120j8703M3004K8131j2446j6843j2072Q643L6315
$$ -45969 -17328 -18969 -33846 -112966 -131669 -88665 -60534 -72980 -89823 -101895 -93252 -56937
6709e6937n6649M8569Q5096m0848j3793n734k6436J2128m378J3227l33l595J2010
$$ -56937 -113586 -65017 20079 -20769 -34562 -40296 -66732 -54604 -58982 -45755 -46088 -49683 -37673
6696c7673L6616l466n90o7339l8526R034K214j8107L3939J13262m0494k6796m2592
$$ -37673 -1057 -4523 -5113 -72452 -110978 -101944 -99730 -117837 -83898 29364 -11130 -37926 -80518
6683h0518o1072P7527l9379k0463J4479p030K7194l6830L7729n734M18J5072J4674
$$ -80518 -141590 -64063 -103442 -123905 -109426 -116456 -89262 -126092 -88363 -94097 -93679 -78607 -63933
6670f3933m578j6126M4834l0903J1430j7153k2389K8355N5445Q594k0453n1799
$$ -63933 -68511 -84637 -39803 -70706 -59276 -76429 -98818 -70463 -15018 -6424 -26877 -78676
6658g8676m4808l0318k0923K3290J5488M5538M3440k8123j2345N4684j4043l8762
$$ -78676 -123484 -153802 -174725 -151435 -135947 -90409 -46969 -75092 -87437 -32753 -46796 -85558
6646h5558j7666n962l3032O9767j8671L417K8129k8402R541m922k5141P2872o2115
$$ -85558 -103224 -109186 -142218 -72451 -91122 -87705 -59576 -87978 -78437 -83359 -108500 -35628 -97743
6633i7743J9030O3483j3089l5950K2510J0517r925k5062N4102m1364J835l085
$$ -97743 -78713 -15230 -28319 -64269 -41759 -31242 -41167 -66229 -12127 -53491 -51656 -54741
6621e4741p374K9386n1920n920N424q619K4090O1981n924n5046m9483L3771Q5129
$$ -54741 -62115 -32729 -84649 -90569 -85145 -93764 -69674 -7693 -13617 -68663 -118146 -84375 754
6608G54K9429k4283N183k6095n9421j0484N8333M0807l3713J7938o777l5739r85
$$ 754 30183 5900 11083 -15012 -74433 -84917 -26584 14223 -19490 -1552 -8329 -44068 -45053
6595d5053J1568l2225L5507N824l1286M9879k793J2419J0487l8974k3349j1185
$$ -45053 -33485 -65710 -30203 -24379 -55665 -5786 -8579 3840 14327 -24647 -47996 -59181
6583e9181l0734L5864M2752J928l852j051o7001J6396O0239k1692m0526j9897
$$ -59181 -89915 -54051 -11299 -9371 -13223 -14274 -81275 -64879 -4640 -26332 -66858 -86755
6571h6755K5740L6534k9161Q74J474l1341m095M3781L1110j0750P735K2714k2262
$$ -86755 -61015 -24481 -53642 -52768 -51294 -82635 -86730 -42949 -11839 -22589 -14854 7860 -14402
6558a4402k2273j0733K8561L2408j4310k0688m282m2852L5827j16J5186L878l9566
$$ -14402 -36675 -47408 -18847 13561 -749 -21437 -25719 -68571 -32744 -32860 -17674 -13796 -53362
6545e3362J7570k2385J3781R434R096K4887R647R549l7839k9203n6189j1992n554
$$ -53362 -35792 -58177 -44396 -34962 -25866 -979 8668 18217 -19622 -48825 -105014 -117006 -122560
6532a22560J68j41j0732n965N8282J7480k2657O1472l0103l9694N4427M4915j0628
$$ -122560 -122392 -122533 -133265 -139230 -80948 -63468 -86125 -24653 -54756 -94450 -40023 4892 -5736
6519e736J2055m126n6983j5000O1109j6753k6898J4347j7675K3547L1152J0599
$$ -5736 6319 2193 -54790 -69790 -8681 -25434 -52332 -37985 -55660 -32113 -961 9638
6507I638k2616P935k8149j48l043n3569K717R633O6546M275k5657N982j8801j6538
$$ 9638 -12978 -5043 -33192 -33340 -36383 -89952 -87235 -77602 -11056 -6781 -32438 -26456 -45257 -61795
6493f1795q568J7484k3977j8380l0736L1198O3967M7976j3930j292k0969K6516
$$ -61795 -70363 -52879 -76856 -95236 -125972 -94774 -30807 17169 3239 1947 -19022 7494
6481G494j02859L5488M0967n8178L9223K3081J90N120o5081k3359O8639m9569
$$ 7494 -95365 -59877 -18910 -77088 -37865 -14784 -14594 -9474 -74555 -97914 -29275 -78844
6469g8844K194j2824K7439O955L1614o3996l694K40k099k9083J5133O2437J4102
$$ -78844 -76650 -89474 -62035 -55080 -23466 -87462 -91156 -90916 -93015 -122098 -106965 -44528 -30426
6456c0426O7766k0555m6309m7597m5155r71N6465J7572M9564j0048j6391R572
$$ -30426 37340 16785 -29524 -77121 -122276 -123247 -66782 -49210 354 -9694 -26085 -16513
6444a6513n1779K3980K5304K7454j0668j05584j6612L7510K154l6922M3493L1828
$$ -16513 -68292 -44312 -19008 8446 -2222 -107806 -124418 -86908 -84754 -121676 -78183 -46355
6432d6355K6909k7416J5639M7560j4511m3033k8115N668j171n855j7551j169l1668
$$ -46355 -19446 -46862 -31223 16337 1826 -41207 -69322 -63654 -64825 -70680 -88231 -89400 -121068
6419a21068L2448J8565J6187k5027L6552p385j4751M8494N037J756L4658l2557
$$ -121068 -88620 -70055 -53868 -78895 -42343 -49728 -64479 -15985 -10948 -9192 25466 -7091
6407g091n3340k8572L3170j6217L7381m4552K0022r012K7963K2424M688o649P738
$$ -7091 -60431 -89003 -55833 -72050 -34669 -79221 -59199 -68211 -40248 -17824 -13136 -19785 -12047
6394a2047n232j6556l30K3235o4805o8555K7224o281j379O1265P007M6358J850
$$ -12047 -17279 -33835 -34165 -10930 -75735 -144290 -117066 -123347 -124726 -63461 -56454 -10096 -8246
6381h246m3164K2915m3206M7373j8220j9945l8854l2941N4602K1488P460j5339
$$ -8246 -51410 -28495 -71701 -24328 -42548 -62493 -101347 -134288 -79686 -58198 -50738 -66077
6369f6077k2925K2888k695J8303n9271P4509j6038J6510K5923J9590k7362n1984
$$ -66077 -89002 -66114 -68809 -50506 -109777 -35268 -51306 -34796 -8873 10717 -16645 -68629
6357f8629n437L2609K2599M0950p7674l5581N3065m9639J5669J9533k2900L0682
$$ -68629 -74066 -41457 -18858 22092 -55582 -91163 -38098 -87737 -72068 -52535 -75435 -44753
6345d4753j4329j6567K6225L6093l6922j8876O4525k2641k605r811j5009L9928
$$ -44753 -59082 -75649 -49424 -13331 -50253 -69129 -4604 -27245 -29850 -39661 -54670 -14742
6333a4742N195K4162k1346J2448J3657k8828P823r319K9503n9587o760j6136O4127
$$ -14742 -9547 14615 -6731 5717 19374 -9454 -1631 -10950 18553 -41034 -47794 -63930 197
6320A97j9800m8492o940M9800J4816l8839M384K4805m356K3424k5756k2760K2486
$$ 197 -19603 -68095 -75035 -25235 -10419 -49258 -44874 -20069 -24425 -1001 -26757 -49517 -27031
6307b7031M6287M635o2824n836j0409M9681K3441j9966l5306j3618l0946l8230
$$ -27031 19256 23891 -38933 -44769 -55178 -5497 17944 -2022 -37328 -50946 -81892 -120122
6295a20122M616O1873l9909N5225K9005m0326k978j7928j496K6734m3136J966
$$ -120122 -115506 -53633 -93542 -38317 -9312 -49638 -52616 -70544 -72040 -45306 -88442 -86476
6283h6476N5683R7O47k757m7119o6700N0940L3914j417j9481M0168R462k6K4143
$$ -86476 -30793 -30696 -30049 -32806 -79925 -146625 -95685 -61771 -63188 -82669 -42501 -33039 -33065 -8922
6269h922l4993K0150M0088m2738n2512j3816K4530J8004q805R98m9181J1591M617
$$ -8922 -43915 -23765 16323 -26415 -78927 -92743 -68213 -50209 -59014 -58016 -107197 -95606 -90989
6256i0989k7176p2511N3283N7846O5374N0861j1127l5665j9846k7953m5131N7579
$$ -90989 -118165 -190676 -137393 -79547 -14173 36688 25561 -10104 -29950 -57903 -103034 -45455
6244d5455L3332L0165l5990R746j4332m6964K7967K4171M0094K098l2144o1610
$$ -45455 -12123 18042 -17948 -8202 -22534 -69498 -41531 -17360 22734 24832 -7312 -68922
6232f8922j4125J6015P1278k7431m6298M5632j6301K6303N4699l216j4982o6048
$$ -68922 -83047 -67032 4246 -23185 -69483 -23851 -40152 -13849 40850 37634 22652 -43396
6220d3396J841K7858k0732L7571n9071k1708R046O0451k3668N880j0263K9033
$$ -43396 -41555 -13697 -34429 3142 -55929 -77637 -68591 -8140 -31808 -25928 -36191 -7158
6208g158k9633k9005Q6652J9115k3867j6603j1860K4688O6356k6965j6746j6226
$$ -7158 -36791 -65796 20856 39971 16104 -499 -12359 12329 78685 51720 34974 18748
6196A8748m3673l2919j0100M717N9789M911j4399k7404L7774m0953M6997N8774
$$ 18748 -24925 -57844 -67944 -63227 -3438 1473 -12926 -40330 -2556 -43509 3488 62262
6184F2262l0180r899m4846J9475K6462k7234j7756K0158o0517P65n389M2340J4966
$$ 62262 32082 22183 -22663 -3188 23274 -3960 -21716 -1558 -62075 -61310 -66699 -24359 -9393
6171i393m8182J0116J9345J6629Q067m9571n9398K1910N3095K7000k7818k8341
$$ -9393 -57575 -47459 -28114 -11485 -3418 -52989 -112387 -90477 -37382 -10382 -38200 -66541
6159f6541K8107L0504o0139M5703J9252j2421O8709N541k9054p8922k9850N322
$$ -66541 -38434 -7930 -68069 -22366 -3114 -15535 53174 58715 29661 -49261 -79111 -73789
6147g3789K2590l3915K7905J00752j640l7578j149K7277M2473n7416n0600k4844
$$ -73789 -51199 -85114 -57209 43543 41903 4325 3176 30453 72926 15510 -35090 -59934
6135e9934L2845P754n7678j2541K2174K5459N9757O799n0621J8490O1644p137
$$ -59934 -27089 -19335 -77013 -89554 -67380 -41921 17836 24635 -25986 -7496 54148 47011
6123D7011k706K2132q2781m7299N973L8588L7256l3749m2012Q821O7806j5221
$$ 47011 44305 66437 -16344 -63643 -57670 -19082 18174 -15575 -57587 -48766 19040 3819
6111C819j2402p385q828J8140j9710l6540L2770L1809J6800N8393m1114o3438
$$ 3819 -8583 -15968 -24796 -6656 -26366 -62906 -30136 1673 18473 76866 35752 -27686
6099b7686J5842j2250j3553K0139N3382j8268j7943k5312k4617j7836M6408m531
$$ -27686 -11844 -24094 -37647 -17508 35874 17606 -337 -25649 -50266 -68102 -21694 -26225
6087b6225o484J5750j0482J9819j9500L38k7693L2124M459M4284m6010p6252j0857
$$ -26225 -32709 -16959 -27441 -7622 -27122 -26784 -54477 -22353 -17894 26390 -19620 -95872 -106729
6074a06729L9730P175m097K8657O1077q789J7349j3424k3392r287K992l1890J2097
$$ -106729 -66999 -59824 -63921 -35264 25813 17024 34373 20949 -2443 -11730 -8738 -40628 -28531
6061b8531P238k394p193o878J5231L1115m918n1393M4013O669o358J5023j1825
$$ -28531 -21293 -23687 -30880 -37758 -22527 8588 3670 -47723 -3710 2959 -3399 11624 -201
6048b01P401n2286L1371N058l3872j9697K0242l32K7087L2930j1431J5842k6428
$$ -201 7200 -45086 -13715 -8657 -42529 -62226 -41984 -42316 -15229 17701 6270 22112 -4316
6035d316J2208k0978o334n2011L647L7252K3897j0605M0843j6653N597J7014J5028
$$ -4316 7892 -13086 -19420 -71431 -67784 -30532 -6635 -17240 23603 6950 12547 29561 44589
6022D4589J4426l2796J707j3751k1391K6429l5035M5861j4879n4937p329O6743
$$ 44589 59015 26219 27926 14175 -7216 19213 -15822 30039 15160 -39777 -47106 19637
6010A9637J1637j05222P4200K1591k0882q311M0663J3598j3386o1642J9125L0142
$$ 19637 31274 -73948 252 21843 961 -7350 33313 46911 33525 -28117 -8992 21150
5998B1150L9284j7514o4573j8480K9662J7322k1637j2952r943N7491q371n8481
$$ 21150 60434 42920 -21653 -40133 -10471 6851 -14786 -27738 -37681 19810 11439 -47042
5986d7042j1646j7924J7284J4654L0676M7644j2792n5257L1336K8823j6972P4634
$$ -47042 -58688 -76612 -59328 -44674 -13998 33646 20854 -34403 -3067 25756 8784 83418
5974H3418j8038l7995J2047L8359m591k0064j2053l3779n4284M0673L8121L2321
$$ 83418 65380 27385 39432 77791 73200 53136 41083 7304 -46980 -6307 31814 64135
5962F4135j5k1093j8693j6501K7877L2950q855r0509J9078K5689J0189L258J1610
$$ 64135 64120 43027 24334 7833 35710 68660 59805 -30704 -11626 14063 24252 27510 39120
5949C9120j9190L4015J6688q278j5522M990R360M0964k8136n335l2932m5074N7920
$$ 39120 19930 53945 70633 62355 46833 51823 61183 102147 74011 68676 35744 -9330 48590
5936D8590j1156n5772L328R7938j5390l9621j1362K4289M6283L3272m0495O524
$$ 48590 37434 -18338 -15010 82928 67538 27917 16555 40844 87127 120399 79904 86428
5924H6428k9860j8040n2481M9018J9357L3205l3771j856k4655m2943k8999O5627
$$ 86428 56568 38528 -13953 35065 54422 87627 53856 52000 27345 -15598 -44597 21030
5912B1030Q470j6401M1722N0757J1346n9896o0458k1225L6327J9527M5608k9833
$$ 21030 29500 13099 54821 105578 116924 57028 -3430 -24655 11672 31199 76807 46974
5900D6974K9771K7310j0763M795J5831j9737l4412N1260K958k476K5190l5453
$$ 46974 76745 104055 93292 98087 113918 94181 59769 111029 113987 111511 136701 101248
5888A01248k7202p569L0537r874r12j5268k0436k2952Q4901j2470p64p179R235
$$ 101248 74046 66477 97014 87140 86228 70960 50524 27572 112473 100003 99239 92060 101295
5875A01295l466R399n606j1797K1516K4788l225n4396K3199J2533J7552j2065
$$ 101295 97829 107228 101622 89825 111341 136129 132904 78508 101707 114240 131792 119727
5863A19727m7673M5992J0215j9380L5580K5815p4354l0033M1694M3964M140j4901
$$ 119727 72054 118046 128261 108881 144461 170276 95922 65889 107583 151547 155687 140786
5851A40786N98o7786L5395L9168M7216J317m8555N9341J6777l8523J2136p421
$$ 140786 141384 73598 108993 148161 195377 196694 148139 207480 224257 185734 197870 190449
5839A90449k4260q3076L1553K3222J3003j0360M3265J7174l3163j334j595J1100
$$ 190449 166189 83113 114666 137888 150891 140531 183796 200970 167807 166473 164878 175978
5827A75978j025L1316m543n0926m855P8378n4721l3335P6970q6522k9304K1522
$$ 175978 174953 206269 201726 150800 145945 224323 169602 136267 213237 126715 97411 118933
5815A18933l3262J8187J9839M019L8418N793l2903k3964R932j059m0259K1656
$$ 118933 85671 103858 123697 127716 166134 171927 139024 115060 124992 123933 83674 105330
5803A05330J8586J621q9778m546L5018K0328M2064k0217j6075j2163M5975L5535
$$ 105330 123916 125537 35759 31213 66231 86559 128623 108406 92331 80168 126143 161678
5791A61678j51680K7861k4296K8876O296j8818k5608P8800J7444l0710l869Q4770
$$ 161678 9998 37859 13563 42439 48735 29917 4309 83109 100553 69843 65974 150744
5779A50744K4296p1811o250j9294J9188J7601p8606k8896J5428P808N8192M1893
$$ 150744 175040 103229 96979 77685 96873 114474 35868 6972 22400 30208 88400 130293
5767A30293k8396l2755K510J8876J6835n0327J5769j1333M2059j2801j31028R0688
$$ 130293 101897 69142 71652 90528 107363 57036 72805 61472 103531 90730 -40298 50390
5755E0390L0790J3189L5821q964o4715o97O5710k9777K4850j8052M0330K7221
$$ 50390 81180 94369 130190 121226 56511 55814 121524 91747 116597 98545 138875 166096
5743A66096J5979l0034M2761o6909J6178k0187n4622L411l823l1029L5622k3309
$$ 166096 182075 152041 194802 127893 144071 123884 69262 72673 68850 37821 73443 50134
5731E0134K7014J1338N605P265k2151M102L3823j0629k2559K3151j4411j6033
$$ 50134 77148 88486 94091 101356 79205 83307 117130 106501 83942 107093 92682 76649
5719G6649L4120M4697o0499n2288j9571K8839l5245l57J3402J1054L3408M7427
$$ 76649 110769 155466 94967 42679 23108 51947 16702 16345 29747 40801 74209 121636
5707A21636J5311k1963J823l1609n7759q590L8451m4875l738J0551M7084j2503
$$ 121636 136947 114984 116807 85198 27439 18849 57300 12425 8687 19238 66322 53819
5695E3819M0032l1309L4572J1205k9970J3012m3529K6851k0831L0199K4368k6426
$$ 53819 93851 62542 97114 108319 78349 91361 47832 74683 53852 84051 108419 81993
5683H1993M7269l371L7588j1415K9244O751l8343n693q22l1194P854n9470k9185
$$ 81993 129262 125891 163479 152064 181308 188059 149716 144023 143201 112007 119861 60391 31206
5670C1206P0788J8557R5240k9234r0785p865L5753m0630J889j6167r105M6533
$$ 31206 101994 120551 215791 186557 95772 87907 123660 83030 84919 68752 59647 106180
5658A06180J1129j7815M414L2657j4715n4832M3994l3385K4704N3953l7700m013
$$ 106180 117309 99494 103908 136565 121850 67018 111012 77627 102331 156284 118584 114571
5646A14571J5195R324p185n1481J7501m119m2830J7326j0359O122J5897j4439
$$ 114571 129766 139090 131905 80424 97925 93806 50976 68302 57943 64065 79962 65523
5634F5523Q0435L7618o1493m42N4430k1855m7641J0174L6974J6211P905K3153
$$ 65523 145958 183576 122083 121641 176071 154216 106575 116749 153723 169934 177839 200992
5622B00992n3485L3134l4588K677j3540o8679N1608K3387j3846j0997O7608l6733
$$ 200992 147507 180641 146053 148730 135190 66511 118119 141506 127660 116663 184271 147538
5610A47538P990J4767l2268o2873N6708J3658M4072K864L891J210m533j9016o175
$$ 147538 155528 170295 138027 75154 131862 145520 189592 192456 196347 197557 193024 174008 167833
5597A67833k6038K2570J3768j1920K2423l5026J0433j4391j0569K7183J4229m4733
$$ 167833 141795 164365 178133 166213 188636 153610 164043 149652 139083 166266 180495 135762
5585A35762k3656J5218r464O8430J5157l4149J0707J1121L0797n0950o4094O4297
$$ 135762 112106 127324 117860 186290 201447 167298 178005 189126 219923 168973 104879 169176
5573A69176K2966l5842L6035K9797L3538j05096j6008K9717L1238O7900l2943
$$ 169176 192142 156300 192335 222132 255670 150574 134566 164283 195521 263421 230478
5562B30478k3685O2085k0747j4637K5689j13498P0259J04143o2065n1239K0945
$$ 230478 206793 268878 248131 233494 259183 145685 215944 320087 258022 206783 227728
5551B27728j2160J3662M91l7213P800N0298m257p5029Q534L8332j8677J7Q5909
$$ 227728 215568 229230 229721 192508 200308 250606 246349 171320 179854 218186 199509 199526 285435
5538B85435N888j2136k6250k8278R980N7172J0142p3744L6736J6636N6509O019
$$ 285435 291323 279187 252937 224659 234639 291811 301953 228209 264945 281581 338090 344109
5526C44109m5500m2553O7435N9640j11114P021K4374L5478n9053N541r090K2573
$$ 344109 298609 256056 323491 383131 272017 279038 303412 338890 279837 285378 276288 298861
5514B98861P253K2526j3551L805k1542p180k0213K5184l5562m0753J9466K1778
$$ 298861 306114 328640 315089 318894 297352 290172 269959 295143 259581 218828 238294 260072
5502B60072n875J5777L3095p411l5115l1305k389M313O7233J4324K599k9592l2905
$$ 260072 254197 269974 303069 295658 260543 229238 226849 231162 298395 312719 315318 285726 252821
5489B52821M545L6615l735J0395o937l0395N4081j2605j2588p1859m9853L7685
$$ 252821 257366 293981 290246 300641 293704 263309 317390 304785 292197 220338 170485 208170
5477B08170O7930L7823j0499K3884L260k1644L4623M856m9131K7285j2059l8438
$$ 208170 276100 313923 303424 327308 330568 308924 343547 348403 299272 326557 314498 276060
5465B76060O0853k8386j1769j717J4636L8943K5500m6990n4029J4063j4099J5340
$$ 276060 336913 308527 296758 295041 309677 348620 374120 327130 273101 287164 273065 288405
5453B88405P403K0563n7701J7274j5647K4816O9009K0016l2268q900l934n0146
$$ 288405 295808 316371 258670 275944 260297 285113 354122 374138 341870 332970 329036 278890
5441B78890L4674J3383L0110K737j9593J5496K6462k530K6070N7774j08009n2858
$$ 278890 313564 326947 357057 359794 340201 355697 382159 379629 405699 463473 355464 302606
5429C02606m0523k5240J1543L5049j1715P6633k7792N577N3729k7669J6129J1088
$$ 302606 262083 236843 248386 283435 271720 348353 320561 326138 379867 352198 368327 379415
5417C79415k3988Q608k7215j1395K6863L1538L421o4127k3552N0701L299K0792
$$ 379415 355427 364035 336820 325425 352288 383826 387247 323120 299568 350269 353568 374360
5405C74360K4038k650J390J5274k5295L4109j756J6111J6909r3868K2036J801
$$ 374360 398398 395748 397138 412412 387117 421226 419470 435581 452490 358622 380658 382459
5393C82459k740l2154J6891N2105o251n1797j7910Q0343k8284p7230J2101k2193
$$ 382459 379719 347565 364456 416561 410310 358513 340603 420946 392662 315432 327533 305340
5381C05340K1102j1159n568Q0596J0810r569O688O869k4100o409K4742K055j7307
$$ 305340 326442 315283 309715 390311 401121 391552 398240 405109 381009 374600 399342 401397 384090
5368C84090n7613Q618L4360j375o0110K1583l967L3728R523m4716l7144n0159
$$ 384090 326477 335095 369455 368080 307970 329553 325586 359314 368837 324121 286977 236818
5356B36818L7478N4933M2372k0397j0878K2491O888j9578k7041j4674O2496M6819
$$ 236818 274296 329229 371601 351204 340326 362817 369705 350127 323086 308412 370908 417727
5344D17727o8806J9424k1464j3158L7915j471L023J4139N164J5575L1834j4913
$$ 417727 348921 368345 346881 333723 371638 370167 373190 387329 392493 408068 439902 424989
5332D24989p7185k1204P9800l8436n7703J4767k0532P299K8329k762M3600j3629
$$ 424989 347804 326600 406400 367964 310261 325028 304496 311795 340124 337362 380962 367333
5320C67333k8964M1717L3385j4990n7301l119k2609l2223m0706K9563N9207k8886
$$ 367333 338369 380086 413471 398481 341180 338061 315452 283229 242523 272086 331293 302407
5308C02407k4993L1657j1839J4923j0464L2015L8950k6709J4366l2882l3404j2793
$$ 302407 277414 309071 297232 312155 301691 333706 372656 345947 360313 327431 294027 281234
5296B81234N8612j9419L9259M4276k9476k506m6450j20K1557k4922k3195l077
$$ 281234 339846 320427 359686 403962 374486 371980 325530 325410 346967 322045 298850 295773
5284B95773J6707M4809Q348m8580N1866j8991j8509N1332L2850r3811J2785J2721
$$ 295773 312480 357289 365637 317057 368923 349932 331423 382755 415605 321794 334579 347300
5272C47300J2483M7058J0799p0400k9118j2953J1147L3551l3908J1164k949J6093
$$ 347300 359783 406841 417640 347240 318122 305169 316316 349867 315959 327123 324174 340267
5260C40267K412N9186l6030j5596K2036j5575p34K4934l3608L0018J403P752k2712
$$ 340267 342679 401865 365835 350239 372275 356700 355966 380900 347292 377310 378713 386465 363753
5247C63753j7639J2020K0015m0333J7621J1825r034J4465K6243l2422l7169J2962
$$ 363753 346114 358134 378149 337816 355437 367262 358228 372693 398936 366514 329345 342307
5235C42307R045k1544J4527N5440l213p433L0913l0583k2232p7866N8039L2005
$$ 342307 351352 329808 344335 399775 396562 389129 420042 389459 367227 289361 347400 379405
5223C79405k087N9459j2273p8690O745j5855m2509R3200K637P197J8077L7891
$$ 379405 377318 436777 424504 345814 352559 336704 294195 387395 390032 397229 415306 453197
5211D53197K2565k9820p913K1672L6357j1960n4007k7954L6825J6609l4038L2022
$$ 453197 475762 445942 438029 459701 496058 484098 430091 402137 438962 455571 421533 453555
5199D53555j6363l514P1431P707n3423l047L5787n998l6402K2001L2799K4793
$$ 453555 437192 433678 505109 512816 459393 456346 492133 486135 449733 471734 504533 529326
5187E29326n9507J9822K579J2075M0316j4805o1509M6362N5206L6845q783l2288
$$ 529326 469819 489641 492220 504295 544611 529806 468297 514659 569865 606710 597927 565639
5175E65639J5914J9847l0564r5865j4220K9922L7698J5237n0432K0057l3532K2501
$$ 565639 581553 601400 570836 474971 460751 490673 528371 543608 493176 513233 479701 502202
5163E02202K8205O285j1215L0980j5023k9010K9911k953J751M7677o7531m0936
$$ 502202 530407 536692 525477 556457 541434 512424 542335 539382 541133 588810 521279 480343
5151D80343N0843J8885k089n0304L1571j6340K031j93j537k4816O006N2450P2044
$$ 480343 531186 550071 547982 497678 529249 512909 514940 514747 513210 488394 494400 546850 618894
5138F18894K7284k5756k5219O550k8841k3651j9905K0659L0410k1646K3886J0435
$$ 618894 646178 620422 595203 601753 572912 549261 529356 550015 580425 558779 582665 593100
5126E93100K4485k2576l5957k6016O8783l7248N772k2959k4193K8985P5361N890
$$ 593100 617585 595009 559052 533036 601819 564571 570343 547384 523191 552176 627537 633427
5114F33427n5346k0582j1529K7234N6050j708m1462l7372K2538n140k089M2390
$$ 633427 578081 557499 545970 573204 629254 627546 586084 548712 571250 566110 564021 606411
5102F06411K88J4934L9715K1783q108l052n6578m9919J2079M2665o4611o177O9735
$$ 606411 606699 621633 661348 683131 675023 671971 615393 565474 577553 620218 555607 549430 619165
5089F19165K5803m0041j0360k2141K9162k3219n78j3206J2809k2509P6839M425
$$ 619165 644968 604927 594567 572426 601588 578369 577791 564585 577394 554885 631724 636149
5077F36149l0702J6125p122j7877L4523K1948j3847K7569l1168l3086O3524l6558
$$ 636149 605447 621572 614450 596573 631096 653044 639197 666766 635598 602512 666036 629478
5065F29478r717M1650M2454N116K5137j35k8590l0131o6466k0752K5182m707K8448
$$ 629478 619761 661411 703865 708981 734118 733983 705393 675262 608796 588044 613226 608519 636967
5052F36967O4221O196j6503J2928j5278O534p168m3185J5744P5328l5114l5439
$$ 636967 701188 707384 690881 703809 688531 695065 687897 644712 660456 735784 700670 665231
5040F65231O0630J4058O310r733k242p425L844M1720L5327m2100k7489Q155n433
$$ 665231 725861 739919 746229 736496 734254 726829 730673 772393 807720 765620 738131 746286 740853
5027G40853M2362j7815m1094j067j9432Q7703k431l4187J802R609M3171k2356
$$ 740853 783215 765400 724306 723239 703807 791510 789079 754892 756694 766303 809474 787118
5015G87118M169R801J7285O940l9284q044N3983j4072r733L8061l265O736k84
$$ 787118 791287 801088 818373 825313 786029 777985 831968 817896 808163 846224 842959 849695 849411
5002H49411k834l6405L0135O9702N9235n1802k2423m725M0483p3026L2809j8137
$$ 849411 846577 810172 840307 910009 969244 917442 895019 890294 930777 857751 890560 872423
4990H72423m5291K7920N0889K5363k4413J5736Q0715l1222k4475J7269j1272j4579
$$ 872423 827132 855052 905941 931304 906891 922627 1003342 972120 947645 964914 953642 939063
4978I39063j2658k3270k402M2628k1367J7613J7138J7477p7291j3619O3952J0629
$$ 939063 926405 903135 900733 943361 921994 939607 956745 974222 896931 883312 947264 957893
4966I57893M027N1771J3439o8801J7922K7548n518O5004l5272j8577L8123n0214
$$ 957893 961920 1013691 1027130 958329 976251 1003799 998281 1063285 1028013 1009436 1047559 997345
4954I97345L795K6068l0077J4659K5355L8514K1537q3423L6949Q6029k1771k7175
$$ 997345 1001140 1027208 997131 1011790 1037145 1075659 1097196 1013773 1050722 1136751 1114980 1087805
4942A087805L3841o649L0194J957o1542j8820J1447k6432L5763P1891J7830n3032
$$ 1087805 1121646 1114997 1145191 1147148 1085606 1066786 1078233 1051801 1087564 1159455 1177285 1124253
4930A124253L307k6454k25R7546j4745m5752Q727o788K0889L6362o0318J3089
$$ 1124253 1127560 1101106 1100881 1198427 1183682 1137930 1146657 1139869 1160758 1197120 1136802 1149891
4918A149891P3667Q6605l9856m5082l192k620o36k7O4310L6453o2715k8748J5006
$$ 1149891 1223558 1310163 1270307 1225225 1222033 1219413 1218777 1218750 1283060 1319513 1256798 1228050 1243056
4905A243056P591J7719K9293m1396K3956L6961J2483K9222l0835n9325L9904j9071
$$ 1243056 1250647 1268366 1297659 1256263 1280219 1317180 1329663 1358885 1328050 1268725 1308629 1289558
4893A289558K2702O0171P0824p3079n2614L6853J3330j8452j1372L2711J5011
$$ 1289558 1312260 1372431 1443255 1370176 1317562 1354415 1367745 1349293 1337921 1370632 1385643
4882A385643L2549K0118K184N0514Q502K761o077K0888J7038n6048j501j7407
$$ 1385643 1418192 1438310 1440494 1491008 1499510 1502271 1496194 1517082 1534120 1478072 1476571 1459164
4870A459164N0660N7495k3827n3119K9417J3802r538m8069J7571L3594N7124l010
$$ 1459164 1509824 1567319 1543492 1490373 1519790 1533592 1524054 1475985 1493556 1527150 1584274 1581264
4858A581264k9284P4527k998l2242l152M2843P025K3473l995l9059L0022L1921
$$ 1581264 1551980 1626507 1623509 1591267 1588115 1630958 1637983 1661456 1657461 1618402 1648424 1680345
4846A680345M5430M1584L7627j5863l9655M2456P0242j6392m3500J3360R593K0131
$$ 1680345 1725775 1767359 1804986 1789123 1749468 1791924 1862166 1845774 1802274 1815634 1825227 1845358
4834A845358O4393K2306M6511K4202P116M3293O76k1693k3972L719L8939O0777
$$ 1845358 1909751 1932057 1978568 2002770 2009886 2053179 2053855 2032162 2008190 2011909 2050848 2111625
4822B111625k7879j5860k428J7574K5147J4218L4606j5491K9876N101N0217N0426
$$ 2111625 2083746 2067886 2065458 2083032 2108179 2122397 2157003 2141512 2171388 2176489 2226706 2277132
4810B277132J3927J0996J9194m3046j264N2273l2134L7251j5511J2377k3762O2165
$$ 2277132 2291059 2302055 2321249 2278203 2276939 2329212 2297078 2334329 2318818 2331195 2307433 2369598
4798B369598M9066L1594J68K0877k5267P024P2868k347o85L790O4819N5201N1285
$$ 2369598 2418664 2450258 2450426 2471303 2446036 2453060 2525928 2523581 2522896 2526686 2591505 2646706 2697991
4785B697991k20o7371m5698J5178R5717J30068r492M4221K9699n500p6543Q4291
$$ 2697991 2697771 2630400 2584702 2599880 2695597 2825665 2816173 2860394 2890093 2884593 2808050 2892341
4773B892341N3984n191j1576N7426O4477M471r012P6893J11601M2473l3111j399
$$ 2892341 2946325 2941134 2929558 2986984 3051461 3055932 3046920 3123813 3235414 3277887 3244776 3243377
4761C243377l3035J16349O5883q405M4275k1264O3418K0206N4294O8179n822N3718
$$ 3243377 3210342 3326691 3392574 3384169 3428444 3407180 3470598 3490804 3545098 3613277 3607455 3661173
4749C661173N6481L4754L1225K1294L7194M3418K2558Q0265K4772K2199N7547
$$ 3661173 3717654 3752408 3783633 3804927 3842121 3885539 3908097 3988362 4013134 4035333 4092880
4738D092880j6091P9065J07769J1058L2188k046M6390Q2724J01932P3941L1728
$$ 4092880 4076789 4155854 4263623 4274681 4306869 4304823 4351213 4433937 4535869 4609810 4641538
4727D641538M0967r386R1704J04556Q5726p297O9417M1115Q8842L6216J6243O1974
$$ 4641538 4682505 4673119 4764823 4869379 4955105 4947808 5017225 5058340 5147182 5183398 5199641 5261615
4715E261615J07607K4818J6139J02698J16121N5422M7264j3061N5159n354P0906
$$ 5261615 5369222 5394040 5410179 5512877 5628998 5684420 5731684 5718623 5773782 5768428 5839334
4704E839334M8778P7386M6483O2004K2201M0467L4521O3835J30817Q2399O7085
$$ 5839334 5888112 5965498 6011981 6073985 6096186 6136653 6171174 6235009 6365826 6448225 6515310
4693F515310O1014P6611K0645L2119J9052Q5521R4730J19511J14397N8129N3695
$$ 6515310 6576324 6652935 6673580 6705699 6724751 6810272 6905002 7024513 7138910 7197039 7250734
4682G250734P3837J4282J06110Q8585J00179J01953Q0802P9557Q5116P8884J07705
$$ 7250734 7324571 7338853 7444963 7533548 7633727 7735680 7816482 7896039 7981155 8060039 8167744
4671H167744O5825J10898P5056N5907J19090J35017Q5231M4071R0328J51189J45315
$$ 8167744 8233569 8344467 8419523 8475430 8594520 8729537 8814768 8858839 8949167 9100356 9245671
4660I245671J13548O6898Q7776J09903R9552Q8556P9279J22204Q5773N8666J49348
$$ 9245671 9359219 9426117 9513893 9623796 9723348 9811904 9891183 10013387 10099160 10157826 10307174
4649A0307174J09096R2681J19021J13534J58835J19355J45829J56275J29204J44888
$$ 10307174 10416270 10508951 10627972 10741506 10900341 11019696 11165525 11321800 11451004 11595892
4639A1595892J13968K25972J09352J63514J62542R0683K02055J10925J28722J95538
$$ 11595892 11709860 11935832 12045184 12208698 12371240 12461923 12663978 12774903 12903625 13099163
4629A3099163J88982J68933J98629J79774J87676K04380J69524K27485K01853
$$ 13099163 13288145 13457078 13655707 13835481 14023157 14227537 14397061 14624546 14826399
4620A4826399J83799K85684K14261J84380J58792J65383K41433L33793K56304
$$ 14826399 15010198 15295882 15510143 15694523 15853315 16018698 16260131 16593924 16850228
4611A6850228K57890K71920K27260K69428K41212K19615K27561K92233L15991
$$ 16850228 17108118 17380038 17607298 17876726 18117938 18337553 18565114 18857347 19173338
4602A9173338L35650K68655K78537L11281L81965L36858L39362L48268L42566
$$ 19173338 19508988 19777643 20056180 20367461 20749426 21086284 21425646 21773914 22116480
4593B2116480L75964L47098M19378M33543L53166M27702M85838M64322N04765
$$ 22116480 22492444 22839542 23258920 23692463 24045629 24473331 24959169 25423491 25928256
4584B5928256M41521M77609M71277N24806N24723N16685N55422N69056O32603
$$ 25928256 26369777 26847386 27318663 27843469 28368192 28884877 29440299 30009355 30641958
4575C0641958O37306O41583O84482O65151O67897O85485P33656P28075P50553
$$ 30641958 31279264 31920847 32605329 33270480 33938377 34623862 35357518 36085593 36836146
4566C6836146Q25318P98268Q56649Q32871Q37437R21584R01145Q84044R66463
$$ 36836146 37661464 38459732 39316381 40149252 40986689 41908273 42809418 43693462 44659925
4557D4659925R42489J020359J026223J020181J066931J054562J066837J109348
$$ 44659925 45602414 46622773 47648996 48669177 49736108 50790670 51857507 52966855
4549E2966855J217696J196280J229132J269756J326913J386519J464665J420483
$$ 52966855 54184551 55380831 56609963 57879719 59206632 60593151 62057816 63478299
4541F3478299J510613J653338J649564J643462J756292J906293J857259J958545
$$ 63478299 64988912 66642250 68291814 69935276 71691568 73597861 75455120 77413665
4533G7413665K011931K295378K218823K282455K447713K448673K634431K755617
$$ 77413665 79425596 81720974 83939797 86222252 88669965 91118638 93753069 96508686
4525I6508686K856404L050039L211573L329750L491518L561696L812181L975966
$$ 96508686 99365090 102415129 105626702 108956452 112447970 116009666 119821847 123797813
4517A23797813M143306M467929M671573M861227N089010N358170N661164N918407
$$ 123797813 127941119 132409048 137080621 141941848 147030858 152389028 158050192 163968599
4509A63968599O248510O555768O830030P160675P485770P894154Q330625Q738675
$$ 163968599 170217109 176772877 183602907 190763582 198249352 206143506 214474131 223212806
4501B23212806R139809R434624R924143J0275255J0709864J1080465J1558225
$$ 223212806 232352615 241787239 251711382 261986637 272696501 283776966 295335191
4494B95335191J1826298J2082390J2275462J2484868J2483256J2450860J2208877
$$ 295335191 307161489 319243879 331519341 344004209 356487465 368938325 381147202
4487C81147202J1829343J1316573J0505173R509583Q414335P036044N464364L842684
$$ 381147202 392976545 404293118 414798291 424307874 432722209 439758253 445222617 449065301
4479D49065301J981925J79383j725808l506012n229331o788794q257094r373771
$$ 449065301 451047226 451226609 449500801 445994789 440765458 433976664 425719570 416345799
4471D16345799j0377136j1178934j1715490j2062417j2280109j2337414j2301612
$$ 416345799 405968663 394789729 383074239 371011822 358731713 346394299 334092687
4464C34092687j2117482j1822877j1455794j1092992j0797527j0374567r905222
$$ 334092687 321975205 310152328 298696534 287603542 276806015 266431448 256526226
4457B56526226r446888r054893q676551q184651p804332p357957p019241o760327
$$ 256526226 247079338 238024445 229347894 221163243 213358911 206000954 198981713 192221386
4449A92221386o339645o044591n768124n455996n168264m958891m679564m521713
$$ 192221386 185881741 179837150 174069026 168613030 163444766 158485875 153806311 149284598
4441A49284598m336259m042154l932029l740905l539846l382604l207633l054573
$$ 149284598 144948339 140906185 136974156 133233251 129693405 126310801 123103168 120048595
4433A20048595k861977k768940k638562k488993k348013k198588k170016k070216
$$ 120048595 117186618 114417678 111779116 109290123 106942110 104743522 102573506 100503290
4425A00503290j866613j736922j711011j504083j509316j356628j287356j123696
$$ 100503290 98636677 96899755 95188744 93684661 92175345 90818717 89531361 88407665
4417H8407665r94518r32914q75275p83805o20172o14249m12429l59244l51121
$$ 88407665 87413147 86480233 85604958 84821153 84200981 83586732 83174303 82815059 82463938
4408H2463938j68418o2302l944K9749Q5301J99115K36324K82051L23438M01117
$$ 82463938 82295520 82233218 82229274 82259023 82344324 82543439 82779763 83061814 83385252 83786369
4398H3786369M23302L82781M06971M25618K48338K86479O9358L4961l1537j50522
$$ 83786369 84209671 84592452 84999423 85425041 85673379 85959858 86029216 86064177 86032640 85882118
4388H5882118l60266m90313n70993q18993r30539j115394j214550j322935j479452
$$ 85882118 85521852 85031539 84460546 83641553 82711014 81595620 80381070 79058135 77578683
4379G7578683j552917j656844j733613j808195j885294j922174k017370j960574
$$ 77578683 76025766 74368922 72635309 70827114 68941820 67019646 65002276 63041702
4371F3041702k043905j931952j968486j900486j878129j751872j634772j573818
$$ 63041702 60997797 59065845 57097359 55196873 53318744 51566872 49932100 48358282
4363D8358282j496617j429940j386923j330550j227253j193028j155658j055303
$$ 48358282 46861665 45431725 44044802 42714252 41486999 40293971 39138313 38083010
4355C8083010r55593r40847r27768q98986q29700p70956p10141p66965p55347
$$ 38083010 37127417 36186570 35258802 34359816 33530116 32759160 32049019 31282054 30526707
4346C0526707o42647o56436n65132o20973n46000n14184n77645n56505m99275
$$ 30526707 29884060 29227624 28662492 28041519 27495519 26981335 26403690 25847185 25347910
4337B5347910m64459n09971m69410m11599l90960m14083l75739l78089l70527
$$ 25347910 24883451 24373480 23904070 23492471 23101511 22687428 22311689 21933600 21563073
4328B1563073l92661k71595l30129l60930l79865l36148k15807k98371l20301
$$ 21563073 21170412 20898817 20568688 20207758 19827893 19491745 19275938 18977567 18657266
4319A8657266l04440l22745k84928l16918j93311j74366k67034k78873k46953
$$ 18657266 18352826 18030081 17745153 17428235 17234924 17060558 16793524 16514651 16267698
4310A6267698j50390k25065k50453k09962k54935j93088j97676j87206j71156
$$ 16267698 16117308 15892243 15641790 15431828 15176893 14983805 14786129 14598923 14427767
4301A4427767k01209j81054j86827j92872j24725j87718k02831j11049j62057
$$ 14427767 14226558 14045504 13858677 13665805 13541080 13353362 13150531 13039482 12877425
4292A2877425j77204j23148j80340j10209j30448j28301j67004j64209j61082
$$ 12877425 12700221 12577073 12396733 12286524 12156076 12027775 11860771 11696562 11535480
4283A1535480j48314j07200j28858r4844q4813j59556j69284j62686j03891r0039
$$ 11535480 11387166 11279966 11151108 11056264 10971451 10811895 10642611 10479925 10376034 10285995
4273A0285995n8708j18222j61681j31592o9424r4955m6662n0982j14212j71367
$$ 10285995 10227287 10109065 9947384 9815792 9746368 9651413 9604751 9553769 9439557 9268190
4263I268190p6664p7978j07326q0022q6890j35935r7804o9726m3548r8786q6482
$$ 9268190 9191526 9113548 9006222 8926200 8839310 8703375 8605571 8535845 8492297 8393511 8307029
4252H307029j24929j21051o7210p9750l3183j17413m6380j01719r6208j20544
$$ 8307029 8182100 8061049 7993839 7914089 7880906 7763493 7717113 7615394 7519186 7398642
4242G398642o4924l9685q3290j06369n4829k5738p4864p5767o5638m3117p8680
$$ 7398642 7333718 7294033 7210743 7104374 7049545 7023807 6948943 6873176 6807538 6764421 6685741
4231F685741j19087r51j03803q7243n6338o0461l8742l6209n5532l9258q3164
$$ 6685741 6566654 6565703 6461900 6374657 6318319 6257858 6219116 6182907 6127375 6088117 6004953
4220F004953n9628r5755k1659o0293m6657k4075r1605l5675k4623r8449j3819
$$ 6004953 5945325 5849570 5827911 5767618 5720961 5696886 5605281 5569606 5544983 5446534 5432715
4209E432715n5417p0418K7947k0748k0629m0169o0846l0254q0524j8748o5372
$$ 5432715 5377298 5306880 5334827 5314079 5293450 5253281 5192435 5162181 5081657 5062909 4997537
4198D997537o0141q4381k6618k6516j3063n360m2610n2399k2481j1591l7362m4963
$$ 4997537 4937396 4853015 4826397 4799881 4786818 4781458 4738848 4686449 4663968 4652377 4615015 4570052
4186D570052k1098p7249p4805j885j8041q3333p900J1502n3759p0341L4018j9632
$$ 4570052 4548954 4471705 4396900 4395015 4376974 4293641 4285741 4297243 4243484 4173143 4207161 4187529
4174D187529p1981m7084k2704o9818j1121L5424p5753j7553k0754l5751l0753
$$ 4187529 4115548 4068464 4045760 3975942 3964821 4000245 3924492 3906939 3886185 3850434 3819681
4163C819681p2807q2008k5918O504L3798n3317n84p8176n6903l2968L6792Q389
$$ 3819681 3746874 3664866 3638948 3645452 3679250 3625933 3625349 3547173 3490270 3457302 3494094 3502483
4151C502483n9844J438l1814r2995j0894n4844j8819m6894J0000k3435J2096j2736
$$ 3502483 3442639 3444077 3412263 3319268 3308374 3253530 3234711 3187817 3197817 3174382 3186478 3173742
4139C173742n801l8415k270n2554m3311J3884q127l3465L9505k6123l8701k2657
$$ 3173742 3167941 3129526 3127256 3074702 3031391 3045275 3037148 3003683 3043188 3017065 2978364 2955707
4127B955707j4614K4752m1603K4281k7396l604O6530k5789r4230n4265K8152j2312
$$ 2955707 2941093 2965845 2924242 2948523 2921127 2917523 2984053 2958264 2864034 2809769 2837921 2825609
4115B825609L9519k6835l4320j0517J3182J0888n5104r267N926J1158j621o3598
$$ 2825609 2865128 2838293 2803973 2793456 2806638 2817526 2762422 2753155 2759081 2770239 2768618 2705020
4103B705020Q564l1946j7466P0050n5606l0345K7180J3587p597O991n6711l6345
$$ 2705020 2713584 2681638 2664172 2734222 2678616 2648271 2675451 2689038 2681441 2688432 2631721 2595376
4091B595376j6088M2079k477l4017m3178Q666N463L5963o515l5291L5562m8386
$$ 2595376 2579288 2621367 2618890 2584873 2541695 2550361 2555824 2591787 2585272 2549981 2585543 2537157
4079B537157q0547K5248L4413R99M338J0105L48j8229j9168p887m4087O9143K1443
$$ 2537157 2456610 2481858 2516271 2517270 2521608 2531713 2532061 2513832 2494664 2486777 2442690 2511833 2533276
4066B533276l4869j5637l053K4371K2567m763k7870p483q228J4684K7905J434
$$ 2533276 2498407 2482770 2479717 2504088 2526655 2521892 2494022 2486539 2478311 2492995 2520900 2522334
4054B522334M2351K3716j3144n6375q112n8074n1772k5134K176K5218n4346J053
$$ 2522334 2564685 2588401 2575257 2518882 2510770 2452696 2400924 2375790 2377966 2403184 2348838 2349891
4042B349891J5019L3473o7930M695L1093R037N8573n7262p4514M8728L3179j5868
$$ 2349891 2364910 2398383 2330453 2335148 2366241 2375278 2433851 2376589 2302075 2350803 2383982 2368114
4030B368114K9462M4664L5082M9560K8812O222L4576P8979L9634O4858M6100J89111
$$ 2368114 2397576 2442240 2477322 2526882 2555694 2561916 2596492 2675471 2715105 2779963 2826063 3015174
4018C015174J68805L9533Q7849J14153J77015J95267J55789R0005L8685p1608
$$ 3015174 3183979 3223512 3311361 3425514 3602529 3797796 3953585 4043590 4082275 4010667
4008D010667j60114j62482j68204k31176k53318k08566j40090n4280j7665q0128
$$ 4010667 3850553 3688071 3519867 3288691 3035373 2826807 2686717 2632437 2614772 2534644
3998B534644k3872q5384r3475k9251j6415l2996q70k1858k2067l0392j2683k9793
$$ 2534644 2510772 2425388 2331913 2302662 2286247 2253251 2252381 2230523 2208456 2178064 2165381 2135588
3986B135588p387j8745K7348k8101J2838Q9955j0687o2246j8785P7367j0900k9941
$$ 2135588 2128201 2109456 2136804 2108703 2121541 2211496 2200809 2138563 2119778 2197145 2186245 2156304
3974B156304m650q7013k1991N478K349n9716P870J7418J7097M0863n6656K141
$$ 2156304 2151654 2064641 2042650 2048128 2050477 1990761 1998631 2016049 2033146 2074009 2017353 2019494
3962B019494K6906j8353l347K397m2083l5796q398l7327L7119J14044P450m4716
$$ 2019494 2046400 2028047 2024700 2027097 1985014 1949218 1940820 1903493 1940612 2054656 2062106 2017390
3950B017390n0642k9309N80L7508L7703L2292n0357k4820K1688l8108o5029k557
$$ 2017390 1966748 1937439 1938019 1975527 2013230 2045522 1995165 1970345 1992033 1953925 1888896 1886339
3938A886339K4734N3505K0129l3298j3525j2668j7150J8922l7722K144k3042j4097
$$ 1886339 1911073 1964578 1984707 1951409 1937884 1925216 1908066 1926988 1889266 1891410 1868368 1854271
3926A854271J807O467J1360O8616m1647o079k2957K5437L4383j3589M3178L6425
$$ 1854271 1856078 1862545 1873905 1942521 1900874 1894795 1871838 1897275 1931658 1918069 1961247 1997672
3914A997672l8810l6175K9458N084q778k3638L0977M0409M9956N2147o9620O4
$$ 1997672 1958862 1922687 1952145 1957229 1948451 1924813 1955790 1996199 2046155 2098302 2028682 2028746
3902B028746O86M862j5601l4522M607K832J8002n9828l0079M5817j7548j2850
$$ 2028746 2029432 2034294 2018693 1984171 1988778 1991610 2009612 1949784 1919705 1965522 1947974 1935124
3890A935124L1381O0822j6136k9977K6215M7931J7005K704L2581l5902N116J8498
$$ 1935124 1966505 2027327 2011191 1981214 2007429 2055360 2072365 2075069 2107650 2071748 2076864 2095362
3878B095362M428P5465N8393j13531P2030L3156p9731L0602M9605o39L478l5685
$$ 2095362 2099790 2175255 2233648 2120117 2192147 2225303 2145572 2176174 2225779 2225140 2228618 2192933
3866B192933Q2744K4793L919O5522l0951K2687N5039L4113r50J2393O8996N981
$$ 2192933 2275677 2300470 2304389 2369911 2338960 2361647 2416686 2450799 2449849 2462242 2531238 2537219
3854B537219J072K7566N3776Q7992M0175N4367J46560O0703P0136Q0589J07673
$$ 2537219 2538291 2565857 2619633 2707625 2747800 2802167 2948727 3009430 3079566 3160155 3267828
3843C267828N8936N5895K34906J21294O6146J98222J40936J16803L5523J2416
$$ 3267828 3326764 3382659 3617565 3738859 3805005 4003227 4144163 4260966 4296489 4308905
3833D308905J8573k4398j4160q3189j03657q5676j19457o8433n2899m9327j0337
$$ 4308905 4327478 4303080 4288920 4205731 4102074 4016398 3896941 3828508 3775609 3726282 3715945
3822C715945l4136R751O4409N4207O668O6754M5397N0797L0110M3822N9499J3944
$$ 3715945 3681809 3691560 3755969 3810176 3816844 3883598 3928995 3979792 4009902 4053724 4113223 4127167
3810D127167J5376M3801K2237J1414O8240M3939O4055p502N1508P5218O6198M9932
$$ 4127167 4142543 4186344 4208581 4219995 4288235 4332174 4396229 4388727 4440235 4515453 4581651 4631583
3798D631583q510m8840m2374J7998J33358K7481j1281j4242k2387M1967K6103
$$ 4631583 4623073 4574233 4531859 4549857 4683215 4710696 4699415 4685173 4662786 4704753 4730856
3787D730856Q511o6231J9145L0665K5590k7316m788N9875Q3191L1429J7580N5127
$$ 4730856 4739367 4673136 4692281 4722946 4748536 4721220 4716432 4776307 4859498 4890927 4908507 4963634
3775D963634P9844L2913N4220N4018P0086R458K0290P3511O8904J09439N6576
$$ 4963634 5043478 5076391 5130611 5184629 5254715 5264173 5284463 5357974 5426878 5536317 5592893
3764E592893J17344J35195J46156J02607J09028J37960R6860J17210J46703J33353
$$ 5592893 5710237 5845432 5991588 6094195 6203223 6341183 6438043 6555253 6701956 6835309
3754F835309J82525J56978K11218J55785J46074K06231K34677J73281K07426L25694
$$ 6835309 7017834 7174812 7386030 7541815 7687889 7894120 8128797 8302078 8509504 8835198
3744H835198K65437L31293K61816L69679L51073M13019L24549M31607M72507M85349
$$ 8835198 9100635 9431928 9693744 10063423 10414496 10827515 11152064 11583671 12056178 12541527
3734A2541527N10553O18554O48144O76186P87341P99958R05081R50275R17729
$$ 12541527 13052080 13670634 14318778 14994964 15782305 16582263 17487344 18437619 19355348
3725A9355348J001071J253087J189564J170879J036729P33782L94436L1889l05060
$$ 19355348 20356419 21609506 22799070 23969949 25006678 25740460 26134896 26166785 25861725
3716B5861725m66829m90524p23198p57302p80263q44785o97585n71235l98753
$$ 25861725 25394896 24904372 24181174 23423872 22643609 21798824 21101239 20530004 20131251
3707B0131251k10332r0708j5127N8505J22068K02379K75169K63069L10829L91824
$$ 20131251 19920919 19830211 19815084 19873589 19995657 20198036 20473205 20736274 21047103 21438927
3697B1438927M23468L51073M54832N40782N18161N37684O44207O44846N97582
$$ 21438927 21862395 22213468 22668300 23209082 23727243 24264927 24909134 25553980 26151562
3688B6151562O67811O93766P86586P61745Q68578Q59816R58175R56204J022068
$$ 26151562 26819373 27513139 28299725 29061470 29930048 30789864 31748039 32704243 33726311
3679C3726311J080850J086794J184920J169323J177684J251390J337763J437504
$$ 33726311 34807161 35893955 37078875 38248198 39425882 40677272 42015035 43452539
3671D3452539J380693J400118J426575J457152J614098J606900J621875J617803
$$ 43452539 44833232 46233350 47659925 49117077 50731175 52338075 53959950 55577753
3663E5577753J621856J564671J603512J679114J562491J543231J473052J484446
$$ 55577753 57199609 58764280 60367792 62046906 63609397 65152628 66625680 68110126
3655F8110126J348318J273876J185180J087415R19247P45570O91620N19540L05019
$$ 68110126 69458444 70732320 71917500 73004915 73924162 74669732 75361352 75880892 76185911
3646G6185911K56133M8867j49080l73664n35523o41711p59381r52060j092210
$$ 76185911 76442044 76490911 76341831 75968167 75432644 74790933 74031552 73079492 71987282
3637G1987282j194515j309194j346043j449098j524672j646789j635864j641097
$$ 71987282 70792767 69483573 68137530 66688432 65163760 63516971 61881107 60240010
3629F0240010j741059j619286j624579j688478j619570j617910j605923j511962
$$ 60240010 58498951 56879665 55255086 53566608 51947038 50329128 48723205 47211243
3621D7211243j460092j511873j368113j360853j384952j239305j133700j138428
$$ 47211243 45751151 44239278 42871165 41510312 40125360 38886055 37752355 36613927
3613C6613927j036982j016737j034518r63414r38024q69542p47374p29809o52585
$$ 36613927 35576945 34560208 33525690 32562276 31624252 30754710 30007336 29277527 28624942
3604B8624942o97426o26723o59310n61640n43995n51473m58348l78801l21481
$$ 28624942 27927516 27300793 26641483 26079843 25535848 24984375 24526027 24147226 23825745
3595B3825745l17007k83512k24932k38954j07718j72499j28539J3255O5718J39357
$$ 23825745 23508738 23225226 23000294 22761340 22653622 22481123 22352584 22365839 22431557 22570914
3585B2570914K66734L48924L38084M86232O07235O78908P83139Q35303Q41888
$$ 22570914 22837648 23186572 23524656 24010888 24618123 25297031 26080170 26915473 27757361
3576B7757361N98148J93406j21627n30179r24938j129275j414570j496942j488168
$$ 27757361 28355509 28548915 28427288 27897109 26972171 25842896 24428326 22931384 21443216
3567B1443216j535318j360448j252754j064376p98786p52292p02429n48920m37435
$$ 21443216 19907898 18547450 17294696 16230320 15431534 14679242 13976813 13427893 12990458
3558A2990458m36759l54935l53330l40889k54281k29691k30422l39583j85191
$$ 12990458 12553699 12198764 11845434 11504545 11250264 11020573 10790151 10450568 10265377
3549A0265377j56758k28152k35607j51397j60064j32710j45652r4132j15070j32191
$$ 10265377 10108619 9880467 9644860 9493463 9333399 9200689 9055037 8960905 8845835 8713644
3539H713644j30901j31733j07708r8920j12199r6039j35262q7488j01451j04067
$$ 8713644 8582743 8451010 8343302 8244382 8132183 8036144 7900882 7813394 7711943 7607876
3529G607876r9497j72876q1931n9970p4697l1720j09234o0018n6902m6139q7043
$$ 7607876 7508379 7335503 7253572 7193602 7118905 7087185 6977951 6917933 6861031 6814892 6727849
3518F727849q1368m4776j2795k628p0860j0839m5985o3343p6399K870l5133n7315
$$ 6727849 6646481 6601705 6588910 6586282 6515422 6504583 6458598 6395255 6318856 6321726 6286593 6229278
3506F229278M4377j3107l9456o3370k9173J0286r794L2150j547N3176P400k8928
$$ 6229278 6273655 6260548 6221092 6157722 6128549 6138835 6129041 6161191 6159644 6212820 6220220 6191292
3494F191292M0721K4561J8393R800k2047K120L8307O7162r812N0125N8432l1498
$$ 6191292 6232013 6256574 6274967 6284767 6262720 6264840 6303147 6370309 6360497 6410622 6469054 6437556
3482F437556M1650P6566p4661L317N8512K3342O3682L8714K8771N1099P1082M5933
$$ 6437556 6479206 6555772 6481111 6484428 6542940 6566282 6629964 6668678 6697449 6748548 6819630 6865563
3470F865563O4830L7035L739J28266J2922M6647J35446m6867J18763J46794Q3666
$$ 6865563 6930393 6967428 6971167 7099433 7112355 7159002 7294448 7247581 7366344 7513138 7596804
3459G596804Q2724J20784J52692Q9968P3373J22475J04756P8487J41070J53561
$$ 7596804 7679528 7800312 7953004 8042972 8116345 8238820 8343576 8422063 8563133 8716694
3449H716694J17385J44073J42731J43397J68678J74720J43298J97691K15520K23821
$$ 8716694 8834079 8978152 9120883 9264280 9432958 9607678 9750976 9948667 10164187 10388008
3439A0388008K52196K51178K68292K98196K65951L00762L39102K31349L44747
$$ 10388008 10640204 10891382 11159674 11457870 11723821 12024583 12363685 12595034 12939781
3430A2939781M19105M67211M16631N27199N61055M37373N17005O83770Q38625
$$ 12939781 13358886 13826097 14242728 14769927 15330982 15768355 16285360 16969130 17807755
3421A7807755Q92738R30289R90079J046209J124624J194222J306775J445922J554765
$$ 17807755 18700493 19630782 20620861 21667070 22791694 23985916 25292691 26738613 28293378
3412B8293378J868258K156410K391819K563333K727579K945713L253836L622837
$$ 28293378 30161636 32318046 34709865 37273198 40000777 42946490 46200326 49823163
3404D9823163M060893M362454M342604L766461K520535R02367p33071j770483
$$ 49823163 53884056 58246510 62589114 66355575 68876110 69778477 69045406 67274923
3396F7274923k295061k700010l176178l597315l487629k895780k172553j556474
$$ 67274923 64979862 62279852 59103674 55506359 52018730 49122950 46950397 45393923
3388D5393923j071651o14277k49027N0611L62094N09099N75996O66500P09047
$$ 45393923 44322272 43707995 43458968 43509579 43871673 44380772 44956768 45623268 46332315
3379D6332315P10055P59498Q72095R16529J026520R74848R74203Q79782P03675
$$ 46332315 47042370 47801868 48673963 49590492 50617012 51591860 52566063 53445845 54149520
3370E4149520N44675N03522N55521M69923M07151L45514K95305Q0032k088j31377
$$ 54149520 54694195 55197717 55753238 56223161 56630312 56975826 57271131 57351163 57349075 57217698
3360E7217698l46426l80632l29755l47831n13138m58853m32064n10670n19366
$$ 57217698 56871272 56490640 56160885 55813054 55299916 54841063 54408999 53898329 53378963
3351E3378963m90629m33318l54132k68057k78064k08413o3345L1471R8807L01792
$$ 53378963 52888334 52455016 52100884 51832827 51554763 51346350 51283005 51314476 51413283 51715075
3341E1715075M21002N07254N96248P55379R67605J083253J206093J372835J534411
$$ 51715075 52136077 52643331 53239579 53994958 54962563 56045816 57251909 58624744 60159155
3332F0159155J578522J663201J764046J821654J883171J872457J797057J708197
$$ 60159155 61737677 63400878 65164924 66986578 68869749 70742206 72539263 74247460
3324G4247460J656875J430206J238418R55449P21336N06363Q2832k20898n20340
$$ 74247460 75904335 77334541 78572959 79528408 80249744 80756107 80838939 80618041 80097701
3315H0097701q20579j148235j391675j679384j888537k046959k296366k402609
$$ 80097701 79277122 78128887 76737212 75057828 73169291 71122332 68825966 66423357
3307F6423357k493334k594395k583682k577776k531674k456675k337987k222825
$$ 66423357 63930023 61335628 58751946 56174170 53642496 51185821 48847834 46625009
3299D6625009k063160k102951j896912j791421j676981j540857j508863j355810
$$ 46625009 44561849 42458898 40561986 38770565 37093584 35552727 34043864 32688054
3291C2688054j244219j247613j116249j027142j007950r18186q85555q31341q40349
$$ 32688054 31443835 30196222 29079973 28052831 27044881 26126695 25241140 24409799 23569450
3282B3569450p39524o94724p14176o04063o37218o01190n53067n79301m92075
$$ 23569450 22829926 22135202 21421026 20816963 20179745 19578555 19025488 18446187 17954112
3273A7954112m44843n10232m78436l98940l83481m04201l42926l80976m24941
$$ 17954112 17509269 16999037 16520601 16121661 15738180 15333979 14991053 14610077 14185136
3264A4185136l41411k79893l13721l41082l11288k87856j94805l41687k31167
$$ 14185136 13843725 13563832 13250111 12909029 12597741 12309885 12115080 11773393 11542226
3255A1542226k54293k95751j89315k09289k03050j98275j92394j46098j62790
$$ 11542226 11287933 10992182 10802867 10593578 10390528 10192253 9999859 9853761 9690971
3246I690971j86207j87744r8189k04968j53755k04070j40418j24353j55362j81604
$$ 9690971 9504764 9317020 9218831 9013863 8860108 8656038 8515620 8391267 8235905 8054301
3236H054301j29996j02165j08119j84151j77829j07468o3934j16236j57539j13291
$$ 8054301 7924305 7822140 7714021 7529870 7352041 7244573 7180639 7064403 6906864 6793573
3226F793573j53147j13069r5199j51118m5158p4913p4484r2514j07968n3095j19845
$$ 6793573 6640426 6527357 6432158 6281040 6235882 6160969 6086485 5993971 5886003 5832908 5713063
3215E713063p0929j06452r0782q6187l0087j5021r4672j07746r4197o6959r8230
$$ 5713063 5642134 5535682 5444900 5358713 5328626 5313605 5218933 5111187 5016990 4950031 4851801
3204D851801n0557l7213r7799j0768m8978r2056p8264o6359q8141k4983p0137
$$ 4851801 4801244 4764031 4666232 4655464 4606486 4514430 4436166 4369807 4281666 4256683 4186546
3193D186546n2345l0923k7129n9161m3122r8636l7223O114r9067m7561k1803n0638
$$ 4186546 4134201 4103278 4076149 4016988 3973866 3875230 3838007 3844121 3745054 3697493 3675690 3625052
3181C625052m7098j09178J258l4195q1945l1927n7484o4182J917J1327m1233q9953
$$ 3625052 3577954 3468776 3470034 3435839 3353894 3321967 3264483 3200301 3202218 3213545 3172312 3082359
3169C082359j8065K8368n6229n0484m9465J8899J6251n0605j0693K6837l3306
$$ 3082359 3064294 3092662 3036433 2985949 2936484 2955383 2971634 2921029 2910336 2937173 2903867
3158B903867o7804q889l5524p0269Q797q974l7805o2260k6034K429Q279n2937
$$ 2903867 2836063 2827174 2791650 2721381 2730178 2721204 2683399 2621139 2595105 2597534 2605813 2552876
3146B552876m9009k2846n9964L0167P708n0283j4538j1573n0660k1731j1824k73
$$ 2552876 2503867 2481021 2421057 2451224 2458932 2408649 2394111 2382538 2331878 2310147 2298323 2298050
3134B298050j02052p257K3186L3097o6375K7798O8951n5614k716n198j11877k0436
$$ 2298050 2195998 2188741 2211927 2245024 2178649 2206447 2275398 2219784 2217068 2211870 2099993 2079557
3122B079557J3179l270k205K5544k0700l9212o368K458l7256n6047p2944r025
$$ 2079557 2092736 2089466 2087261 2112805 2092105 2052893 2046525 2048983 2011727 1955680 1882736 1873711
3110A873711M1145O429l2571n2897P904K5742k7443p1217P188j1296m5326q099
$$ 1873711 1914856 1921285 1888714 1835817 1843721 1869463 1842020 1770803 1777991 1766695 1721369 1713270
3098A713270O5729P304M5793l2955o5617k1889k5216n4997j1484L780M9619P918
$$ 1713270 1778999 1786303 1832096 1799141 1733524 1711635 1686419 1631422 1619938 1623718 1673337 1681255
3086A681255m1754N4705o633q8873Q917L6464M4439k6924m6679M3915L2980l0005
$$ 1681255 1639501 1694206 1687573 1598700 1607617 1644081 1688520 1661596 1614917 1658832 1691812 1661807
3074A661807L0793J1188Q362n3360M2476J0363J4422Q934j3442K0829J2272j06326
$$ 1661807 1692600 1703788 1712150 1658790 1701266 1711629 1726051 1734985 1721543 1742372 1754644 1648318
3062A648318n4906J4225l4685m6470J8202j6346J5442k0607k1577l4755M656l4063
$$ 1648318 1593412 1607637 1572952 1526482 1544684 1528338 1543780 1523173 1501596 1466841 1471497 1437434
3050A437434m5569K2509J5156L1578k2150m7346N5720J7563p8549J9863k4054
$$ 1437434 1391865 1414374 1429530 1461108 1438958 1391612 1447332 1464895 1386346 1406209 1382155
3039A382155M107L7500R9718L6117l7070q3745j6430l300l2147k7076K4250o473
$$ 1382155 1386262 1423762 1523480 1559597 1522527 1438782 1422352 1419052 1386905 1359829 1384079 1377606
3027A377606P2466j9730J4450j4989n5659K0701q6314K743J6000n996j1895M0277
$$ 1377606 1450072 1430342 1444792 1429803 1374144 1394845 1308531 1311274 1327274 1321278 1309383 1349660
3015A349660J2990m870p6793k0939m2734K0907N5013l0880Q808o0029j3612j5901
$$ 1349660 1362650 1357780 1280987 1260048 1217314 1238221 1293234 1262354 1271162 1211133 1197521 1181620
3003A181620L3293O9862N4774l3598p3470K0452J6111k8864l454M1659L8438p0577
$$ 1181620 1214913 1284775 1339549 1305951 1232481 1252933 1269044 1240180 1236726 1278385 1316823 1246246
2991A246246o8581j9909J1652r141O8080J753l2950o6583j7119j8678j580N3352
$$ 1246246 1177665 1157756 1169408 1160267 1228347 1230100 1197150 1130567 1113448 1094770 1093190 1146542
2979A146542r5580m4499k8865J4724J0090k0570n80o5749o2983K1545M5758j5129
$$ 1146542 1050962 1006463 977598 992322 1002412 981842 981262 915513 852530 874075 919833 904704
2967I04704L4050r601k3430k6776J3656k1774n3227l665j1673j3516M3810K0488
$$ 904704 938754 929153 905723 878947 892603 870829 817602 813937 802264 788748 832558 853046
2955H53046l8840l1872m2274K2156p94K0672n3795j5212P809m5751M6675L8973
$$ 853046 814206 782334 740060 762216 761422 782094 728299 713087 720896 675145 721820 760793
2943G60793l8946o57L9958m9069K6357k0417j0224k6623K1677k1913j635J8191
$$ 760793 721847 721190 761148 712079 738436 718019 707795 681172 702849 680936 679301 697492
2931F97492k18M0839j7901n0668j0016O865M2110n7189m9975K1639l8689K2455
$$ 697492 697274 738113 720212 669544 659528 666393 708503 651314 601339 622978 584289 606744
2919F06744K2713l6701l3016J7758j9605N0008R694J5944m8766L631l3793n169
$$ 606744 629457 592756 559740 577498 557893 607901 617595 633539 584773 588404 554611 549442
2907E49442L0964j5306L661o0474P636L8919j5573K2339M4631k6232J1441j4700
$$ 549442 580406 565100 568761 508287 515923 554842 539269 561608 606239 580007 591448 576748
2895E76748n9866o605J1797K9996P5452o7150n538K0850k8810j4464l9257J7409
$$ 576748 516882 510277 522074 552070 627522 560372 554834 575684 546874 532410 493153 510562
2883E10562N852Q466j7206k6181q019M1886M2038k6075r6660K7202j963L0607
$$ 510562 516414 524880 507674 481493 473474 515360 557398 531323 434663 461865 459902 490509
2871D90509N2279j8611l6680j4829j1715L0357j0793m508m2227k240k347M9634
$$ 490509 542788 524177 487497 472668 460953 491310 480517 476009 433782 431542 429195 478829
2859D78829J4496k5076m3647N39M7504l6351O866k0880L1076L9445l6560j4543
$$ 478829 493325 468249 424602 425141 472645 436294 443160 422280 453356 492801 456241 441698
2847D41698L4905l1462n3180L645J0324O205J162J0858P8360M7653J9585p2563
$$ 441698 476603 445141 391961 395606 405930 412135 413297 424155 502515 550168 569753 497190
2835D97190n8103O880l48L2010j6456J7574n646K2989k149k5874j9637k4892M0615
$$ 497190 439087 445967 445619 477629 461173 478747 473101 496090 493941 468067 448430 423538 464153
2822D64153L6399m0219N811J0903M4328q013k4770N5185Q824p300J7500n5506
$$ 464153 500552 460333 466144 477047 521375 513362 488592 543777 552601 545301 562801 507295
2810E07295n4896J06135n4437m1246J4111J0660J7072L1203J0314l4663J9032
$$ 507295 452399 558534 504097 462851 476962 487622 504694 535897 546211 511548 530580
2799E30580k5509l626J7820n2534J0867N9620O057M6461O1453m6686n666k3893
$$ 530580 505071 501445 519265 466731 477598 537218 543275 589736 651189 604503 598837 574944
2787E74944K0068l2248M5962q427L4515M6691O2113K0501L5060N798J7294N7418
$$ 574944 595012 562764 608726 600299 634814 681505 743618 764119 799179 804977 822271 879689
2775H79689l609N2149N5921L0042J9351Q6498N3021P2691O8137Q7184R0915J62464
$$ 879689 876080 928229 984150 1014192 1033543 1120041 1173062 1245753 1313890 1401074 1491989 1654453
2763A654453P4319r12m3495k0289o4269n6533j07351j10741l4978r7518j41219
$$ 1654453 1728772 1727860 1684365 1664076 1599807 1543274 1435923 1325182 1290204 1192686 1051467
2752A051467q6499l9707q8866l2145p7520k4665n1992j0052l7620k4025J1484
$$ 1051467 964968 925261 836395 804250 726730 702065 650073 640021 602401 578376 589860
2741E89860o8165n3746j4640j818Q221J9317k107m0026L3820k1291l7482k6671
$$ 589860 521695 467949 453309 451491 459712 479029 476922 436896 470716 449425 411943 385272
2729C85272L0510l0233K2247k5624l5880P9870n9435K7243J3245n2327p434o4651
$$ 385272 415782 385549 407796 382172 346292 426162 366727 393970 407215 354888 347454 282803
2717B82803r876K4590j265Q0265m9963L782m658j161l4922q896j5964L9256k9026
$$ 282803 272927 297517 296252 376517 326554 330336 325678 324517 289595 280699 264735 303991 274965
2704B74965j2310Q1099K006n225n6886N8078m347n3203L3933k6385k1235J8951
$$ 274965 262655 343754 345760 340535 283649 341727 337380 284177 318110 291725 270490 289441
2692B89441N1330p7745j9010j9522K2477J9102m2593K3267K7041j8238Q926n9050
$$ 289441 340771 263026 244016 224494 246971 266073 223480 246747 273788 255550 264476 205426
2680B05426O9233N056M887o611j0303K739J4790P489M74j6336r009r97J6824L0412
$$ 205426 274659 279715 284602 277991 267688 270427 285217 292706 293180 276844 267835 266838 283662 314074
2666C14074m5792L3831l1305j22036j6141P7852j0920K65J0486j2654l6320M8331
$$ 314074 268282 302113 270808 148772 132631 210483 199563 199828 210314 197660 161340 209671
2654B09671J9487P6805L653J268n6635L3837j2008n1913n0686L4650L8046L2434
$$ 209671 229158 305963 309616 310884 254249 288086 276078 224165 173479 208129 246175 278609
2642B78609n799K4785k67q8095K0290m7503J5167L2599J3576n4439L7101J6000
$$ 278609 272810 297595 297328 209233 229523 182020 197187 229786 243362 188923 226024 242024
2630B42024K8475L3451m5407J5786j4268k0878l0131M8640k1085O2951r194j471
$$ 242024 270499 303950 258543 274329 260061 239183 209052 257692 236607 299558 290364 288893
2618B88893n759n4631m3683k034M7835L6916l5597n92K0540n048K5628j6233l0086
$$ 288893 283134 228503 184820 182786 230621 267537 231940 231348 251888 246840 272468 256235 226149
2605B26149n524m7565l3840M6719k5686p391K906M6543K3991J4082k6498J9403
$$ 226149 220625 173060 139220 185939 160253 152862 155768 202311 226302 240384 213886 233289
2593B33289k0517N316J9080L417k1306K007J8577M8663J152r0502j4099r661j0816
$$ 233289 212772 218088 237168 240585 219279 221286 239863 288526 289678 199176 185077 175416 164600
2580A64600M543M951j8645j7967j9087j0156O2697m1988q577M0938K8097l3938
$$ 164600 169143 174094 155449 137482 118395 108239 170936 128948 120371 161309 189406 155468
2568A55468K9704P5945m3569k6941J5933m5265M9626L9169l6375J0856M4791l2348
$$ 155468 185172 261117 217548 190607 206540 161275 210901 250070 213695 224551 269342 236994
2556B36994j5742J4109n0845j720O412L2335k3511L092L9787J1916j2736l3262
$$ 236994 221252 235361 184516 182796 189208 221543 198032 201124 240911 252827 240091 206829
2544B06829n0648R899j296N7403n102k3895q576l3188p240L6763k2619Q575j659
$$ 206829 156181 166080 164784 222187 217085 193190 184614 151426 144186 180949 158330 166905 165246
2531A65246K6654J8976k1464L4014j646l4033M122L9442k8476L5687J895j9009
$$ 165246 191900 210876 189412 223426 221780 187747 191869 231311 202835 238522 240417 221408
2519B21408l5456J5592l9180o875O5973J9362m7205k7883L8203O668N2960k7158
$$ 221408 185952 201544 162364 155489 221462 240824 193619 165736 203939 210607 263567 236409
2507B36409k3459M934j8560l5096J9003L4174N7687k2661q7232N6881L0140n0509
$$ 236409 212950 217884 199324 164228 183231 217405 275092 252431 165199 222080 252220 201711
2495B01711m0618L5388K5092p287j9342N4165M7691l8708J0180p4637K5536j749
$$ 201711 161093 196481 221573 214286 194944 249109 296800 258092 268272 193635 219171 217422
2483B17422q793K7709K5811M3467o9207K032l3104Q156K1358n0085j7801N1172
$$ 217422 208629 236338 262149 305616 236409 238441 205337 213493 234851 184766 166965 218137
2471B18137k5789L0555k573L3793Q208K9554K5425l0953k7566M6265K4727n6182
$$ 218137 192348 222903 220330 254123 262331 291885 317310 286357 258791 305056 329783 273601
2459B73601p0959P611M3621L758N9120O4724r5312m0472J8730o7904J7128n993
$$ 273601 202642 210253 253874 257632 316752 381476 286164 245692 264422 196518 213646 207653
2447B07653J7496M5128N4552q1290m2299l60m534K6376M371j477k5839L076m1442
$$ 207653 225149 270277 324829 243539 201240 200880 196346 222722 227093 225616 199777 202853 161411
2434A61411J1843J573p0073K7284O6867n789j3753K0651K9571l3568l6716O3708
$$ 161411 173254 174827 104754 132038 198905 193116 179363 200014 229585 196017 159301 223009
2422B23009l2867j5614M3467K1028l9905K6335m9259j7400J0757K2836J9787J8006
$$ 223009 190142 174528 217995 239023 199118 225453 176194 158794 169551 192387 212174 230180
2410B30180q230j2677j2276Q787j202J4880j1664o221l3088J4123r5k9492L3502
$$ 230180 221950 209273 196997 205784 204582 219462 207798 201577 168489 182612 182517 153025 186527
2397A86527j6698P0514m256o8832m3627L6072P3014m3333P712K6556j9419j0730
$$ 186527 169829 240343 236087 167255 123628 159700 232714 189381 197093 223649 204230 193500
2385A93500j7626n569J4117l4083M182n134l6955J9465j9776J6568M2899M17m360
$$ 193500 175874 170305 184422 150339 154521 149387 112432 131897 112121 128689 171588 172005 167645
2372A67645m301Q879K7633k0216l407j7562P907m4463K4742K7811l8446M243J0191
$$ 167645 163344 172223 199856 179640 176233 158671 166578 122115 146857 174668 136222 140465 150656
2359A50656K8358J9930m7833k6477r628n4k6181M1800Q451K8175M3054j7197l4978
$$ 150656 179014 198944 151111 124634 115006 114952 88771 130571 139022 167197 210251 193054 158076
2346A58076K984J2876k6246k5303M5449l5425q245n3636J1463Q355M9848R6971
$$ 158076 161060 173936 147690 122387 167836 132411 124166 70530 81993 90348 140196 237167
2334B37167l7385m85N732l1703j2752O4578m6457Q656q219j057l7674K2962j3228
$$ 237167 199782 199297 205029 173326 160574 225152 178695 187351 179132 178075 140401 163363 150135
2321A50135Q195M4275l2717j1176K616J7446R71J5513n1881o0207J1724J6669
$$ 150135 158330 202605 169888 158712 161328 178774 179745 195258 143377 83170 94894 111563
2309A11563o010L0860j1073J0244M3363k203l9415k8017L1523l916k2091j446
$$ 111563 105553 136413 125340 135584 178947 176744 137329 109312 140835 136919 114828 113382
2297A13382M0344M2799o9386q703K4374K0050M1408n3610m0938m0892O3927O7870
$$ 113382 153726 196525 127139 118436 142810 162860 204268 150658 109720 68828 132755 200625
2285B00625k6297K5389p403j3534l3011P6723L8320o5243m3126K0902j2202m7038
$$ 200625 174328 199717 192314 178780 145769 222492 260812 195569 152443 173345 161143 114105
2273A14105J8303K0892L9701M5465k3056k978j326M700K3257m1625k9273k4391
$$ 114105 132408 153300 193001 238466 215410 212432 211106 215806 239063 197438 168165 143774
2261A43774K6574M0683m854n2249O8200R1r014L954O761l3985K0455L2964J6075
$$ 143774 170348 211031 206177 153928 222128 222219 213205 217159 223920 189935 210390 243354 259429
2248B59429j106k6454k3454k9331L406k3001L9443O78j8401O33J7927K6944M6627
$$ 259429 258323 231869 208415 179084 182490 159489 198932 199610 181209 181842 199769 226713 273340
2235B73340j8365K4656J4968p4628K7090N5120j1068K1637o895m1443L1562J5891
$$ 273340 254975 279631 294599 219971 247061 302181 291113 312750 305855 264412 295974 311865
2223C11865L8034n2575l295L2713k5256N2170k630k7353o1400o582r121o11M1358
$$ 311865 349899 297324 294029 326742 301486 353656 351026 323673 262273 255691 246570 245959 287317
2210B87317o429M3854j9334p716j1563j916L746M4118l5430K359K1724L2513L2333
$$ 287317 280888 324742 305408 297692 286129 284213 287959 332077 296647 299006 320730 353243 385576
2197C85576m9288j5366k8752m0540O9074P8730k6135j9138l0301O7064O649m6140
$$ 385576 336288 320922 292170 251630 320704 399434 373299 354161 323860 390924 397573 351433
2185C51433R00K3465l222M6516L5277k3430j7782N379r724N7985J5870l1165n276
$$ 351433 352333 375798 372576 419092 454369 430939 413157 418536 408812 466797 482667 451502 446226
2172D46226L302J5016N379n0523J0905L8058L9942k0908k4838j0452K2678j1395
$$ 446226 449528 464544 469923 419400 430305 468363 508305 487397 462559 452107 474785 463390
2160D63390k625n6275R6033J5431l6434N7634l461j1293L4180M5713o4281Q062
$$ 463390 460765 404490 500523 515954 479520 537154 533693 522400 556580 602293 538012 546074
2148E46074m4022J5055K7156M0340l080K6302M2280K9529J2681o8847q48N3414
$$ 546074 502052 517107 544263 584603 581523 607825 650105 679634 692315 623468 622620 676034
2136F76034K2177N4481m9706L3214O2410O3012j7367n153K0796L791L8401k3245
$$ 676034 698211 752692 702986 736200 798610 861622 844255 839102 859898 863689 902090 878845
2124H78845M0734j9003m444n76l7730M2268o993j8123k6190j1036k349p3686O879
$$ 878845 919579 900576 896132 895556 857826 900094 893101 874978 848788 837752 835403 761717 768596
2111G68596Q36o2215j0847l974j8029L7149J916q8993J508l4992k0340J0273m901
$$ 768596 769432 707217 696370 692396 674367 711516 713432 624439 625947 590955 570615 580888 575987
2098E75987o2178M556L945l4406j2785m9836m7935m3711R097L153k1351M6019
$$ 575987 513809 518365 522310 487904 475119 425283 377348 333637 342734 345887 324536 370555
2086C70555P1476p1490m8057N230j4819n1229l0059K0241J2431n0726L8890N8894
$$ 370555 442031 370541 322484 327714 312895 261666 231607 251848 264279 213553 252443 311337
2074C11337q829l3563m952M2464o6624k0329N9653p3555m4504R4748N100n8816
$$ 311337 302508 268945 263993 306457 239833 219504 279157 205602 161098 255846 260946 202130
2062B02130Q2852l2356l0520M4693j1754p1688k3929l7553J4648K8681p756k1101
$$ 202130 284982 252626 222106 266799 255045 183357 159428 121875 136523 165204 157448 136347
2050A36347L6842J6330L9179K426m3693r918j7687m1459j2462J3140M1593j6419
$$ 136347 173189 189519 228698 231124 187431 177513 159826 118367 105905 119045 160638 144219
2038A44219O879M5240k9430J3681m1474K9148k0896l746k9473L575O3346J0532
$$ 144219 151098 196338 166908 180589 139115 168263 147367 143621 114148 117723 181069 191601
2026A91601l9466L2215l1816k4289N3300K4326n1354l1039O489L0559L594k0586
$$ 191601 152135 184350 152534 128245 181545 205871 154517 123478 129967 160526 164120 143534
2014A43534k9876J6919M5800l810r830J716M9658L7298L8489l7296N2366l4046
$$ 143534 113658 130577 176377 172567 162737 164453 214111 251409 289898 252602 304968 270922
2002B70922l4271M0040O4645o3550n8110J5086p198K0130l1604J8997k0288j2583
$$ 270922 236651 276691 341336 277786 219676 234762 227564 247694 216090 235087 214799 202216
1990B02216l0734n0060J57L4978K8550o192n3306J2169L3969L9860K7297M8552
$$ 202216 171482 121422 121579 156557 185107 178915 125609 137778 171747 211607 238904 287456
1978B87456m9762O693N0656q084l1928o1584O0847M0705K1028j2541O1201K7534
$$ 287456 237694 244387 295043 286959 255031 193447 254294 294999 316027 303486 364687 392221
1966C92221k0060j666J453k5278k3922j7656k1889j4645j6891R712L7618k2491
$$ 392221 372161 370495 371948 346670 322748 305092 283203 268558 251667 261379 298997 276506
1954B76506p8065j8339O761j4163p436p738M1030P2720P977L7239o0217j9160
$$ 276506 198441 180102 186863 172700 165264 157526 198556 271276 279253 316492 256275 237115
1942B37115K1315n0231m1200n380K8300L2184L8269J5885j1786j2394p5838L2529
$$ 237115 258430 208199 166999 161619 189919 222103 260372 276257 264471 252077 176239 208768
1930B08768M9433L7459J096j8106r1064m4986L6524j367l5068J4082J3216K4729
$$ 208768 258201 295660 296756 278650 187586 142600 179124 177757 142689 156771 169987 194716
1918A94716l3827k2192J9609K8922N9534N787l1804o3651K3039j2127L2596j7676
$$ 194716 160889 138697 158306 187228 246762 252549 220745 157094 180133 168006 200602 182926
1906A82926o9191J1949M9596m5316o6202M2377L5561j6702J3593q025j833m5292
$$ 182926 113735 125684 175280 129964 63762 106139 141700 124998 138591 130566 128733 83441
1894H3441J0811N0157k7139l574j9404m2222K044P0650k3837L4899k65k4728L0703
$$ 83441 94252 144409 117270 113696 94292 52070 54114 124764 100927 135826 135561 110833 141536
1881A41536J316l9562L4540K3343m7793J4758l5547K5094J7603Q903o6872N2279
$$ 141536 142852 103290 137830 161173 113380 128138 92591 117685 135288 144191 77319 129598
1869A29598o8667K3422j4515k6121L1912k3008k2542k477R8538R038j6626O804
$$ 129598 60931 84353 69838 43717 75629 52621 30079 27602 126140 135178 118552 125356
1857A25356j8064j3623n9769m0222L2919M4775k0912K4034N3248K0006K404j2835
$$ 125356 107292 93669 33900 -6322 26597 71372 50460 74494 127742 147748 150152 137317
1845A37317K3917m5858o5040J0460M2433J5673J4813M4025l7461J4856L8555j6884
$$ 137317 161234 115376 50336 60796 103229 118902 133715 177740 140279 155135 193690 176806
1833A76806o4695K373J8774K1578N1659m4894L3938j2588J2530O858K5667n572
$$ 176806 112111 114484 133258 154836 206495 161601 195539 182951 195481 202339 228006 222434
1821B22434k980J1729L0925j9571p354J0428L5075l0947L4K9514J4145L1374J0748
$$ 222434 219454 231183 262108 242537 235183 245611 280686 249739 249773 279287 293432 324806 335554
1808C35554n328J1865J5941k4348L1689Q4745K1503P5890L4265q283N0238K456
$$ 335554 330226 342091 358032 333684 365373 450118 471621 547511 581776 573493 623731 626187
1796F26187k5650p988J0547K8588J3241L101K4174K4501n1393J6347L9638M593
$$ 626187 600537 592549 603096 631684 644925 648026 672200 696701 645308 661655 701293 705886
1784G05886K2889Q70K7606K7924N4350n1851J2914j1125J2660L0737M7503L8071
$$ 705886 728775 729645 757251 785175 839525 787674 800588 789463 802123 832860 880363 918434
1772I18434O7351K9423L934M4576k9491K7964N5405n1280k8124L5795l7404L945
$$ 918434 985785 1015208 1019142 1063718 1034227 1062191 1117596 1066316 1038192 1073987 1036583 1040528
1760A040528N6092m6284j4398L2945l6867j23526k7613j1612J3113J6516o992
$$ 1040528 1096620 1050336 1035938 1068883 1032016 908490 880877 869265 882378 898894 891902
1749H91902j0310m5472n6792q9443M8336j1723K6360l9956k3459K9242J9025M305
$$ 891902 881592 836120 779328 689885 738221 726498 752858 712902 689443 718685 737710 742015
1737G42015r9878j5746K2397l1787r947m5587k7605O0875k150m1606j887p263
$$ 742015 642137 626391 648788 617001 607054 561467 533862 594737 592587 550981 549094 541831
1725E41831K1182M567k343o376k9341j9742l6099j9010j2268l6257J8210j6882
$$ 541831 563013 567580 565237 558861 529520 509778 473679 454669 442401 406144 424354 407472
1713D07472m263p8404k7409N7492o6043p6858M7555l86o628l035K4686P880q8882
$$ 407472 403209 324805 297396 354888 288845 211987 259542 259156 252528 249493 274179 282059 193177
1700A93177m6248K4989M3863l0658L3595Q1304m5141j6074l1141l7355K5061L3684
$$ 193177 146929 171918 215781 185123 218718 300022 254881 238807 207666 170311 195372 229056
1688B29056k0485k8949j3518o839Q348j3935k0014K2652K3162N35M774o2788m1134
$$ 229056 208571 179622 166104 159265 167613 153678 133664 156316 179478 180013 184787 121999 80865
1675H0865k750K420R1718j3731j11864L7129K192m2251R599N6156J0563q692o4489
$$ 80865 78115 80535 172253 158522 46658 83787 85979 43728 53327 109483 120046 111354 46865
1662D6865J2036l5898N4123J7385j1647j5340j8436M460r311J8958K7989J6050
$$ 46865 58901 23003 77126 94511 82864 67524 49088 53548 44237 63195 91184 107234
1650A07234J0933o0434m610j4470k1523O733N3546l5785K4006J8950q3722M3369
$$ 107234 118167 57733 53123 38653 17130 23863 77409 41624 65630 84580 858 44227
1638D4227J9900j1429M1767l011l1747k830O4184m225m3843n954Q323k3970m3412
$$ 44227 64127 52698 94465 91454 59707 56877 121061 116836 72993 67039 75362 51392 7980
1625G980K9430m3601K1004M254K1994n7484K9345K9211j5101j1207O472j1265
$$ 7980 37410 -6191 14813 19067 41061 -16423 12922 42133 27032 15825 22297 11032
1613A1032o2432J6164M6982J2214j5077P224m1677L5357N1893J7355m6725j9142
$$ 11032 -51400 -35236 11746 23960 8883 16107 -25570 9787 61680 79035 32310 13168
1601A3168m053R930K4289O8360Q061q2350j5909l9670M005M2549M5601r3049K4576
$$ 13168 9115 19045 43334 111694 119755 37405 21496 -18174 -14169 28380 73981 -19068 5508
1588E508O787K5838l3390k7230k8077O3985J6060k3968J9669J4505k2194J0934
$$ 5508 12295 38133 4743 -22487 -50564 13421 29481 5513 25182 39687 17493 28427
1576B8427J0179m4643J578q2130L4532J7242O0217J3135l0293n2250O7004J2439
$$ 28427 38606 -6037 -4459 -86589 -52057 -34815 25402 38537 8244 -44006 22998 35437
1564C5437l8248M1928j2682n1618K0097n5157m517K079K547J2398l297N3172k8918
$$ 35437 -2811 39117 26435 -25183 -5086 -60243 -64760 -62681 -60134 -47736 -51033 2139 -26779
1551b6779L7308P927l088K5606m3979l5897J056j284J2865R1L3938j2532J4451
$$ -26779 10529 18456 15368 40974 -3005 -38902 -37846 -39130 -26265 -26174 7764 -4768 9683
1538I683M2055m8657j5611j5295L6237K9685l5138M6290j551o355l7361K4280
$$ 9683 51738 3081 -12530 -27825 8412 38097 2959 49249 47698 41343 3982 28262
1526B8262l028M0637l4157q7366J0868j882J891J5877k5015m367J6621N111j5770
$$ 28262 25234 65871 31714 -55652 -44784 -46666 -44775 -28898 -53913 -58280 -41659 -36548 -52318
1513e2318J5133M119J4937L4591k1765k9959N3180K6181m0873J980m8984l7919
$$ -52318 -37185 -33066 -18129 16462 -5303 -35262 17918 44099 3226 5206 -43778 -81697
1501h1697k9682m586Q5206K6243m4698j0626n723K4333J6541j7584q22P6845k2771
$$ -81697 -111379 -115965 -30759 -4516 -49214 -59840 -65563 -41230 -24689 -42273 -43095 33750 10979
1488A0979K1434M0042o1035k140r030N827L61k3473O9255k4307n2140j7910K6876
$$ 10979 32413 72455 11420 9280 250 6077 6438 -17035 52220 27913 -24227 -42137 -15261
1475a5261M5871k9508k3599K071l8010K0530o0141L9579M0290k8625j4844J1755
$$ -15261 30610 1102 -22497 -20426 -58436 -37906 -98047 -58468 -18178 -46803 -61647 -49892
1463d9892K9966r462J5848K0616o4694l5313N1297M8849l1040O025k1392p6868
$$ -49892 -19926 -29388 -13540 7076 -57618 -92931 -41634 7215 -23825 -17800 -39192 -116060
1451a16060J5246O1325M8281m750L6776j2781j9912n6892J2333K577j5824j3643
$$ -116060 -100814 -39489 8792 4042 40818 28037 8125 -48767 -36434 -33857 -49681 -63324
1439f3324K335p930J2921L3212M1221l2001n3956L6062K4298l395q45l2819Q764
$$ -63324 -60989 -68919 -55998 -22786 18435 -13566 -67522 -31460 -7162 -10557 -11402 -44221 -35457
1426c5457M358k5110j9550J1143M4376m5456N8871k9346L156K7443p204k5235
$$ -35457 -31099 -56209 -75759 -64616 -20240 -65696 -6825 -36171 -33015 -5572 -12776 -38011
1414c8011J1670K9735k0092j1310J8169K5405m4382m5586L8120K8698r9508N5074
$$ -38011 -26341 3394 -16698 -28008 -9839 15566 -28816 -74402 -36282 -7584 -107092 -52018
1402e2018M5052m9800j1395M5351n492K4484N142j1517k475l2507l776k563O4537
$$ -52018 -6966 -56766 -68161 -22810 -28302 -3818 1324 -10193 -12668 -45175 -48951 -51514 13023
1389A3023J0476j2306k6989m2319m9351K2432r445L2485L3014k537K7636o4315
$$ 13023 23499 11193 -15796 -58115 -107466 -85034 -94479 -61994 -28980 -31517 -3881 -68196
1377f8196K9735K6197j1109J5317J2917O380j5367k8618J3021j6935r157J731
$$ -68196 -38461 -12264 -23373 -8056 4861 11241 -4126 -32744 -19723 -36658 -45815 -44084
1365d4084O6216k8421n9503K8941M7888p076n0365n2720J2423n0544P8642O8745
$$ -44084 22132 -6289 -65792 -36851 11037 3961 -46404 -99124 -86701 -137245 -58603 10142
1353A0142j2213L1372L791o0247j8726R214l5961P943K2653Q85L5833N0006l639
$$ 10142 -2071 29301 33092 -27155 -45881 -36667 -72628 -64685 -42032 -41147 -5314 44692 41053
1340D1053o601k8694m8711k1379P5284J1127L517j7959n0229j4737M6333l4050
$$ 41053 34452 5758 -42953 -64332 10952 22079 25596 7637 -42592 -57329 -10996 -45046
1328d5046K4380k8629j1505J9556N2200k4573K9737k1658j4637J0640j8794L3378
$$ -45046 -20666 -49295 -60800 -41244 10956 -13617 16120 -5538 -20175 -9535 -28329 5049
1316E049m843o4536n226L067K1586j0334J8517l4909L6655Q820j2301L3036K6620
$$ 5049 206 -64330 -69556 -66489 -44903 -55237 -36720 -71629 -34974 -26154 -38455 -5419 21201
$$ [...]
##END NTUPLES=NMR SPECTRUM
##END=
