##TITLE=1H_CA-8848-3
 DMSO, 8 sc, 
 28.04.2021
##JCAMPDX= 6.0         $$ Bruker NMR JCAMP-DX V2.0
##DATA TYPE= NMR SPECTRUM
##DATA CLASS= NTUPLES
##ORIGIN= UXNMR, Bruker Analytische Messtechnik GmbH
##OWNER= root
$$ XWIN-NMR		Version 3.5
$$ Wed Apr 28 14:51:17 2021 Russian Standard Time (UT+4h)  she@DPX200
##.OBSERVE FREQUENCY= 200.131506
##.OBSERVE NUCLEUS= ^1H
##.ACQUISITION MODE= SIMULTANEOUS
##.ACQUISITION SCHEME= undefined
##.AVERAGES= 8
##.DIGITISER RES= 18
##SPECTROMETER/DATA SYSTEM= spect
##.PULSE SEQUENCE= zg30
##.SOLVENT NAME= CDCl3
##.SHIFT REFERENCE= (INTERNAL, CDCl3, 0, 16.048)
##AUDIT TRAIL= $$ (NUMBER, WHEN, WHO, WHERE, WHAT)
$$ ##TITLE= Audit trail, XWIN-NMR		Version 3.5
$$ ##JCAMPDX= 5.01
$$ ##ORIGIN= Bruker BioSpin GmbH
$$ ##OWNER= she
$$ F:/spectra/data/she/nmr/H-F/1/pdata/1/auditp.txt
$$ ##AUDIT TRAIL=  $$ (NUMBER, WHEN, WHO, WHERE, WHAT)
(   1,<2021-04-28 14:49:43.78 +0400>,<she>,<DPX200>,
      <created by zg, POWCHK disabled, PULCHK disabled
       configuration hash MD5:
       00 E9 B6 7A A2 85 ED C7 34 08 36 98 17 FE 4E 26
       data hash MD5: 16K
       43 CB 46 3D A6 30 B2 5B 07 53 4B B9 61 4D 0F 61>)
(   2,<2021-04-28 14:50:30.75 +0400>,<she>,<DPX200>,
      <Start of raw data processing
       efp BC_mod = 2 LB = 0.24 FT_mod = 6 PKNL = 1 PHC0 = -11126.37 PHC1 = 14.20102 SI = 16K 
       data hash MD5: 16K
       26 1A BC DA 37 FB 2E C4 06 17 0B 8E 0B 31 B7 CC>)
(   3,<2021-04-28 14:50:43.28 +0400>,<she>,<DPX200>,
      <pk PHC0 = 1.882919 PHC1 = -1.8 
       data hash MD5: 16K
       CE 4D FC 6A 1C 67 96 F8 FF 69 87 A9 9F 87 49 1F>)
(   4,<2021-04-28 14:50:46.20 +0400>,<she>,<DPX200>,
      <abs ABSG = 5 
       data hash MD5: 16K
       69 82 3C 76 9D 47 50 07 39 9E F6 69 8B 10 F1 C0>)
$$ ##END=
$$ 
$$ hash MD5
$$ D4 D3 51 5B 61 22 C5 A1 49 6F C1 79 D0 34 14 BD
##$RELAX= 
##$RELAX= 
##$RELAX= 
##$RELAX= 
##$RELAX= 
##$RELAX= 
$$ Bruker specific parameters
$$ --------------------------
##$DU= <F:/spectra>
##$EXPNO= 1
##$NAME= <H-F>
##$PROCNO= 1
##$TYPE= <nmr>
##$USER= <she>
##$AMP= (0..31)
100 100 100 100 100 100 100 100 100 100 100 100 100 100 100 100 100 100 
100 100 100 100 100 100 100 100 100 100 100 100 100 100 
##$AQSEQ= 0
##$AQ_mod= 1
##$AUNM= <au_zg>
##$AUTOPOS= <>
##$BF1= 200.13
##$BF2= 200.13
##$BF3= 200.13
##$BF4= 200.13
##$BF5= 200.13
##$BF6= 200.13
##$BF7= 200.13
##$BF8= 200.13
##$BYTORDA= 1
##$CFDGTYP= 0
##$CFRGTYP= 5
##$CHEMSTR= <none>
##$CNST= (0..31)
1 1 145 1 1 1 1 1 1 1 1 1 1 1 1 1 1 1 1 1 1 1 1 1 1 1 1 1 1 1 1 1 
##$CPDPRG= <>
##$CPDPRG1= <>
##$CPDPRG2= <>
##$CPDPRG3= <>
##$CPDPRG4= <mlev>
##$CPDPRG5= <mlev>
##$CPDPRG6= <mlev>
##$CPDPRG7= <mlev>
##$CPDPRG8= <mlev>
##$CPDPRGB= <>
##$CPDPRGT= <>
##$D= (0..31)
0 1.2 0 0 0 0 0 0 0 0.06 0 0.03 0 0 0 0 0.0002 0 0 0 0 0 0 0 0 0 0 0 0 
0 0 0 
##$DATE= 1619606983
##$DBL= (0..7)
120 120 120 120 120 120 120 120 
##$DBP= (0..7)
150 150 150 150 150 150 150 150 
##$DBP07= 0
##$DBPNAM0= <>
##$DBPNAM1= <>
##$DBPNAM2= <>
##$DBPNAM3= <>
##$DBPNAM4= <>
$$ [...]
##$SUBNAM3= <"">
##$SUBNAM4= <"">
##$SUBNAM5= <"">
##$SUBNAM6= <"">
##$SUBNAM7= <"">
##$SUBNAM8= <"">
##$SUBNAM9= <"">
##$SW= 16.9725357007746
##$SWIBOX= (0..15)
0 0 2 0 0 0 0 0 0 0 0 0 0 0 0 0 
##$SW_h= 3396.73913043478
##$TD= 16384
##$TD0= 1
##$TE= 0
##$TE2= 300
##$TE3= 300
##$TEG= 300
##$TL= (0..7)
0 120 120 120 120 120 120 120 
##$TP= (0..7)
150 150 150 150 150 150 150 150 
##$TP07= 0
##$TPNAME0= <>
##$TPNAME1= <>
##$TPNAME2= <>
##$TPNAME3= <>
##$TPNAME4= <>
##$TPNAME5= <>
##$TPNAME6= <>
##$TPNAME7= <>
##$TPOAL= (0..7)
0.5 0.5 0.5 0.5 0.5 0.5 0.5 0.5 
##$TPOFFS= (0..7)
0 0 0 0 0 0 0 0 
##$TUNHIN= 0
##$TUNHOUT= 0
##$TUNXOUT= 0
##$USERA1= <user>
##$USERA2= <user>
##$USERA3= <user>
##$USERA4= <user>
##$USERA5= <user>
##$V9= 5
##$VALIST= <valist>
##$VCLIST= <CCCCCCCCCCCCCCC>
##$VD= 0
##$VDLIST= <DDDDDDDDDDDDDDD>
##$VPLIST= <PPPPPPPPPPPPPPP>
##$VTLIST= <TTTTTTTTTTTTTTT>
##$WBST= 1024
##$WBSW= 4
##$XGAIN= (0..3)
0 0 0 0 
##$XL= 0
##$YL= 0
##$YMAX_a= 677371
##$YMIN_a= -595219
##$ZGOPTNS= <>
##$ZL1= 120
##$ZL2= 120
##$ZL3= 120
##$ZL4= 120
##$ABSF1= 16.04801
##$ABSF2= -0.924654
##$ABSG= 5
##$ABSL= 3
##$ALPHA= 0
##$AQORDER= 0
##$ASSFAC= 0
##$ASSFACI= 0
##$ASSFACX= 0
##$ASSWID= 0
##$AUNMP= <proc_1d>
##$AZFE= 0.1
##$AZFW= 0.1
##$BCFW= 0
##$BC_mod= 2
##$BYTORDP= 0
##$COROFFS= 0
##$CY= -3
##$DATMOD= 1
##$DC= 0
##$DFILT= <>
##$DTYPP= 0
##$F1P= 0
##$F2P= 0
##$FCOR= 1
##$FTSIZE= 16384
##$FT_mod= 6
##$GAMMA= 0
##$GB= 0
##$INTBC= 1
##$INTSCL= 1.334414e-10
##$ISEN= 128
##$LB= 0.24
##$LEV0= 0
##$LPBIN= 0
##$MAXI= 10000
##$MC2= 0
##$MEAN= 0
##$ME_mod= 0
##$MI= 1.114404
##$NCOEF= 0
##$NC_proc= -5
##$NLEV= 6
##$NOISF1= 3.799351
##$NOISF2= 2.8
##$NSP= 0
##$NTH_PI= 0
##$NZP= 0
##$OFFSET= 16.04801
##$PC= 1
##$PHC0= -11124.49
##$PHC1= 12.40102
##$PH_mod= 1
##$PKNL= yes
##$PPARMOD= 0
##$PSCAL= 0
##$PSIGN= 0
##$REVERSE= no
##$SF= 200.129992682189
##$SI= 16384
##$SIGF1= 3
##$SIGF2= 2
##$SINO= 5.538805
##$SIOLD= 16384
##$SREGLST= <1H.CDCl3>
##$SSB= 0
##$STSI= 16384
##$STSR= 0
##$SW_p= 3396.73913043479
##$SYMM= 0
##$S_DEV= 0
##$TDeff= 16384
##$TDoff= 0
##$TI= <>
##$TILT= no
##$TM1= 0
##$TM2= 0
##$TOPLEV= 0
##$USERP1= <user>
##$USERP2= <user>
##$USERP3= <user>
##$USERP4= <user>
##$USERP5= <user>
##$WDW= 1
##$XDIM= 16384
##$YMAX_p= 464868667
##$YMIN_p= -191241
$$ End of Bruker specific parameters
$$ ---------------------------------
##NTUPLES= NMR SPECTRUM
##VAR_NAME=  FREQUENCY,     SPECTRUM/REAL,   SPECTRUM/IMAG
##SYMBOL=    X,             R,               I
##VAR_TYPE=  INDEPENDENT,   DEPENDENT,       DEPENDENT
##VAR_FORM=  AFFN,          ASDF,            ASDF
##VAR_DIM=   16384,         16384,           16384
##UNITS=     HZ,            ARBITRARY UNITS, ARBITRARY UNITS
##FACTOR=    0.207333158178282, 1,           1
##FIRST=     3211.68809833442, 0,            0
##LAST=      -185.051032100372, 0,           0
##MIN=       -185.051032100372, -191241,     0
##MAX=       3211.68809833442, 464868667,    0
$$ Real data points
##PAGE= N=1
##DATA TABLE= (X++(R..R)), XYDATA
$$ [...]
7803G418308l21564k88249k58967j94183j31210j16892J6950n4252N9805M6751
$$ 7418308 7096744 6808495 6549528 6355345 6224135 6107243 6124193 6069941 6129746 6176497
7793F176497Q2503J15922J43783K08321K71933K78539L69775N24289M50214L77595
$$ 6176497 6259000 6374922 6518705 6727026 6998959 7277498 7647273 8171562 8621776 8999371
7783H999371O34318O39935O26139N44281N00197M05213J66821K2115m5705j33803
$$ 8999371 9633689 10273624 10899763 11444044 11944241 12349454 12516275 12538390 12492685 12358882
7773A2358882j52272p8886l8215J2507M0091J13309R540r7090k74740m75807o05386
$$ 12358882 12206610 12127724 12089509 12102016 12142107 12255416 12264956 12167866 11893126 11417319 10811933
7762A0811933o83802p55776p21969p13449n48836n54001n18650m50293l89408
$$ 10811933 10128131 9372355 8650386 7936937 7388101 6834100 6315450 5865157 5475749
7753E475749l03053k41539k30946j99369j94690k04867j71166j62852j16871j80016
$$ 5475749 5172696 4931157 4700211 4500842 4306152 4101285 3930119 3767267 3650396 3470380
7743C470380q5455q2839j29344n8374p9154o5133l3973o8905n5097r3533l6621
$$ 3470380 3384925 3302086 3172742 3114368 3035214 2970081 2936108 2867203 2812106 2718573 2681952
7732B681952q8659k8655l0635n5787k6284L0543l4752n7745O390N8992k0964J3060
$$ 2681952 2593293 2564638 2534003 2478216 2451932 2482475 2447723 2389978 2396368 2455360 2434396 2447456
7720B447456J167J835j0422M566M2399M2598J127L5606J6331O3074M6364j8133
$$ 2447456 2448623 2450458 2440036 2444602 2487001 2529599 2530726 2566332 2582663 2645737 2692101 2673968
7708B673968O111k2894J2213m6809q4095o2679j20564o8516m3123M4016n4352
$$ 2673968 2680079 2657185 2669398 2622589 2538494 2475815 2355251 2286735 2243612 2287628 2233276
7697B233276j14997L112j16648n0784O5734j9597N811L8939j4630K0926l4105
$$ 2233276 2118279 2121391 2004743 1953959 2019693 2000096 2005907 2044846 2030216 2051142 2017037
7686B017037k2716Q188M4380j6904j83Q373k515n2394m74L3856j3150J1775K1554
$$ 2017037 1994321 2002509 2046889 2029985 2029802 2038175 2035660 1983266 1982792 2016648 2003498 2015273 2036827
7673B036827p14K0317p2988N9998o3425k9312l4391J4611J9208j6878m2673j2968
$$ 2036827 2036113 2056430 1983442 2043440 1980015 1950703 1916312 1930923 1950131 1933253 1890580 1877612
7661A877612o9713l0394j5137l1673j12666J7018Q1572n2777n8461J4556k9471
$$ 1877612 1807899 1777505 1762368 1730695 1618029 1635047 1716619 1663842 1605381 1619937 1590466
7650A590466n1746M0588k2343P764K7070M0783l4242K9969k8507J9024L3680J40402
$$ 1590466 1538720 1579308 1556965 1564729 1591799 1632582 1598340 1628309 1599802 1618826 1652506 1792908
7638A792908k9338j9403M558N5949K6551k314P228P3215o226M6606L6527m0593
$$ 1792908 1763570 1744167 1748725 1804674 1831225 1828911 1836139 1909354 1903128 1949734 1986261 1945668
7626A945668L8727O9039J3997J20732L9180M5217J07908L041J12675R6499R5315
$$ 1945668 1984395 2053434 2067431 2188163 2227343 2272560 2380468 2383509 2496184 2592683 2687998
7615B687998Q6317J12532J19076J87490K14418J60761J58242K22562K42262K70114
$$ 2687998 2774315 2886847 3005923 3193413 3407831 3568592 3726834 3949396 4191658 4461772
7605D461772L82267M05868K91137L60552L73836L50992L67037K44954J07607Q6647
$$ 4461772 4844039 5249907 5541044 5901596 6275432 6626424 6993461 7238415 7346022 7432669
7595G432669o1030n3907j1130n7344p436j4872P8028J08007K5517l258l4915j36489
$$ 7432669 7371639 7317732 7306602 7249258 7241822 7226950 7304978 7412985 7438502 7435244 7400329 7263840
7583G263840k74745k82941k86948k93845k62597j66906j14826j09253j15965N411
$$ 7263840 6989095 6706154 6419206 6125361 5862764 5695858 5581032 5471779 5355814 5361225
7573E361225k6582o6847l8803J01434J83882K02666K27990K41908K12105K73434
$$ 5361225 5334643 5267796 5228993 5330427 5514309 5716975 5944965 6186873 6398978 6672412
7563F672412M38584L99188M90396N07611M74233O34257N81885M65010M62273K94185
$$ 6672412 7110996 7510184 8000580 8508191 8982424 9616681 10198566 10663576 11125849 11420034
7553A1420034K42183K21656Q6809L6032j24520q8165j53870j09637o5585m1886
$$ 11420034 11662217 11883873 11970682 12006714 11882194 11794029 11640159 11530522 11464937 11423051
7543A1423051p9451j35531k60986l05913l87030m94942m69514n64599n40181n39979
$$ 11423051 11343600 11208069 10947083 10641170 10254140 9759198 9289684 8725085 8184904 7644925
7533G644925m83293m24724m15616l54546k60378k05050j91365k07087p8512p7980
$$ 7644925 7161632 6736908 6321292 5966746 5706368 5501318 5309953 5102866 5024354 4946374
7523D946374j02501k0963J02863Q824J03977J0436J37121J65891K17608K35382
$$ 4946374 4843873 4822910 4925773 4934597 5038574 5049010 5186131 5352022 5569630 5805012
7513E805012J65365J91825K04246K00201J01632l4427L6635j46266k13837k08000
$$ 5805012 5970377 6162202 6366448 6566649 6668281 6633854 6670489 6524223 6310386 6102386
7503F102386j41048o0580j4180m2905L6521l4845j54090j00064k46967l14802
$$ 6102386 5961338 5900758 5886578 5843673 5880194 5845349 5691259 5591195 5344228 5029426
7493E029426m03724l26585l30420k89966l10902k29286k00687j62745j64256j69189
$$ 5029426 4625702 4299117 3968697 3678731 3367829 3138543 2937856 2775111 2610855 2441666
7483B441666j17553j57010j12937p0417p0535n6585j09549n0044q9166l8335j7427
$$ 2441666 2324113 2167103 2054166 1983749 1913214 1856629 1747080 1697036 1607870 1569535 1552108
7472A552108n9302r7052K8696l3084j13034q4502o9202J0325K4825m3624k8652
$$ 1552108 1492806 1395754 1424450 1391366 1278332 1193830 1124628 1134953 1159778 1116154 1087502
7461A087502j6014L9413q2603m9985m1313k7359l2675P8016j2173p3572k5115
$$ 1087502 1071488 1110901 1028298 978313 937000 909641 876966 954982 942809 869237 844122
7450H44122R578k6687n3503L0175j02047k7294J7905M099n54M62j7512j6063k2287
$$ 844122 853700 827013 773510 803685 701638 674344 692249 696348 695794 696256 678744 662681 640394
7437F40394M2084K2545o228n1169m3265j9277j0202n9258j5297L1131m7251k3818
$$ 640394 682478 705023 698795 647626 604361 585084 574882 515624 500327 531458 484207 460389
7425D60389K6522L457N3331n5673l7022p671K0183k0118K2173r6522k6010O3336
$$ 460389 486911 490368 543699 488026 451004 443333 463516 443398 465571 369049 343039 406375
7413D06375K4499l4085J68K2234m692J647k9571J547p193K9479K580o4110P441
$$ 406375 430874 396789 396957 419191 414499 416146 386575 388122 380929 410408 412988 348878 356319
7400C56319J5479j03377j2133J8883K902M7995j009m7528J6853n7316M9756Q2609
$$ 356319 371798 268421 256288 275171 278073 326068 325059 277531 294384 237068 286824 369433
7388C69433r264l8432p662K3142J9228o7307M918l6651k9851O3933l8947p695
$$ 369433 360169 321737 314075 337217 356445 289138 294056 257405 227554 291487 252540 244845
7376B44845l1422l0510j7775l4925R3399j1803M676l2287M4269m3207K7563j4465
$$ 244845 213423 182913 165138 130213 223612 211809 216485 184198 228467 185260 212823 198358
7364A98358m7367R846m676N0013q470n4345k7494R593Q8527M403m8611K6740k7332
$$ 198358 150991 160837 156161 206174 197704 143359 115865 125458 213985 218388 169777 196517 169185
7351A69185N5260N0028k4573q5456q6001J1188L8834j05447N1306j174L3826m4845
$$ 169185 224445 274473 249900 164444 78443 89631 128465 23018 74324 73150 106976 62131
7339F2131j5653J7318L4427J4234K3823Q45K2834l7451l3054L2810M288M439l6349
$$ 62131 46478 63796 98223 112457 136280 137125 159959 122508 89454 122264 126552 130991 94642
7326I4642o1696N9383J785m0686L6573o6364N5915L1259m6809P8414l8905n2137
$$ 94642 32946 92329 94114 53428 90001 23637 79552 110811 64002 142416 103511 51374
7314E1374m5967j1306L1313L177l199O3639K0057n0337j3501k0816O0294j5508
$$ 51374 5407 -5899 25414 28591 25392 89031 109088 58751 45250 24434 84728 69220
7302F9220j3396K0898n9386P3433J8254j07207J9513n218j4603J7695N8769k1987
$$ 69220 55824 76722 17336 90769 109023 1816 21329 16111 1508 19203 77972 55985
7290E5985M477k4078K6409o0388L2226N0267m709k0983J6645k7412q441j4143
$$ 55985 60462 36384 62793 2405 34631 84898 80189 59206 75851 48439 39998 25855
7278B5855J4281n4872r776Q178M9810M0053m0137P9391l5941n1566N3753K8084
$$ 25855 40136 -14736 -24512 -16334 33476 73529 33392 112783 76842 25276 79029 107113
7266A07113n7184K5742l0623J9596K6043j950n76l4523L34L1371o8816L1233k1997
$$ 107113 49929 75671 45048 64644 90687 88737 88161 53638 53972 85343 16527 47760 25763
7253B5763M410L4857p7182L7089N1931n1831o7480M6321j5476j1205K5088Pp5148
$$ 25763 30173 65030 -12152 24937 76868 25037 -42443 3878 -11598 -22803 2285 2292 -72856
7240g2856n992P1584K0889K3018k5974m817N060j4343n725N9654j4314J4242J1305
$$ -72856 -78848 -7264 13625 36643 10669 5852 10912 -3431 -9156 50498 36184 50426 61731
7227F1731K072k1392J2381l7946l6329J4391M7159K7585o1689j270J0582j4214
$$ 61731 63803 42411 54792 16846 -19483 -5092 42067 69652 7963 6693 17275 3061
7215C061J501K9287K0073j7031p445l4064L4388L7944K5217k1919n5998l59M7539
$$ 3061 4562 33849 53922 36891 29446 -4618 29770 67714 92931 71012 15014 14655 62194
7202F2194O770n7194N4406l1122j3265l3231q4648K9298P119J7818P2036j6714
$$ 62194 68964 11770 66176 35054 21789 -11442 -96090 -66792 -59673 -41855 30181 13467
7190A3467J9697j2676m5427R6187L2641m6843N4141q068j312m766O252L2672j06290
$$ 13467 33164 20488 -24939 71248 103889 57046 111187 103119 101807 97041 103293 135965 29675
7177B9675M2365k02j4721Q8661k8639n4116O7429K2325l5212Q499o236O184j3927
$$ 29675 72040 71838 57117 145778 117139 63023 130452 152777 117565 126064 119828 126012 112085
7164A12085L1534O536k222J8516r2268m1808J4861K6134O959n67J2870L6697m2630
$$ 112085 143619 150155 147933 166449 74181 32373 47234 73368 80327 79760 92630 129327 86697
7151H6697j03559K3991M7757J7757j4438J09944l2342o1174m1061J9302q794K2668
$$ 86697 -16862 7129 54886 72643 58205 168149 135807 74633 33572 52874 44080 66748
7139F6748n7362j2779M3789P7861J246L7412J9032J4892k3735p3757K6495K3333
$$ 66748 9386 -3393 40396 118257 119503 156915 175947 190839 167104 93347 119842 143175
7127A43175o5524o857M927L2718P01j1320O1825l4048k1681k968R348J839l8255
$$ 143175 77651 70794 75721 108439 109140 97820 159645 125597 103916 100948 110296 112135 73880
7114G3880m5254L301n465Q4983N4973m9779o2078K940n68L8903K2009k8832n0720
$$ 73880 28626 31927 26462 111445 166418 116639 54561 57501 56933 95836 117845 89013 38293
7101C8293M8490N766M0329l6089L6216l9673l4903l0604l9653J060J1552r258
$$ 38293 86783 92549 132878 96789 133005 93332 58429 27825 -11828 -10768 784 -8474
7089h474j6462L4728L6032o426j0397k6270o984r2K9034r4571J7909M0406n2049
$$ -8474 -24936 9792 45824 39398 29001 2731 -4253 -4345 24689 -69882 -51973 -11567 -63616
7076f3616L5633K6981k1906J1634p710K0962K3723J0394l0807k6607J4672K2622
$$ -63616 -27983 -1002 -22908 -11274 -18984 1978 25701 36095 5288 -21319 -6647 15975
7064A5975J1233n105L4240q3523m0899O2171K116N54j579L238M3689l6540r262
$$ 15975 27208 22103 56343 -27180 -68079 -5908 -3792 -3238 -4817 -1579 42110 5570 -3692
7051c692N6382R939K1297P746o1453K9250l8064p2364M349M068n0004K1727l891
$$ -3692 52690 62629 83926 91672 30219 59469 21405 -50959 -46610 -42542 -92546 -70819 -74710
7038g4710k1224K4926P4483P102j8375M8718n2977j1051L982m9279P5653m7797
$$ -74710 -95934 -71008 3475 10577 -7798 40920 -12057 -23108 -19126 -68405 7248 -40549
7026d0549k0603m1622N4592M5016J5256n8034j3060J928J9014m3402L7354P597
$$ -40549 -61152 -102774 -48182 -3166 12090 -45944 -59004 -57076 -38062 -81464 -44110 -36513
7014c6513K7421J2691j17496O2867M130j1607o2315K0652L1769P6921l4413L1810
$$ -36513 -9092 3599 -113897 -51030 -46900 -58507 -120822 -100170 -68401 8520 -25893 5917
7002E917L2930l1368n5810n9068M5201O6123l2436K9975j3978L8141k7498k6592
$$ 5917 38847 7479 -48331 -107399 -62198 3925 -28511 1464 -12514 25627 -1871 -28463
6990b8463j8127K4925j4763j8197m9234j5150O7758k4085L9834M6067k3420r926
$$ -28463 -46590 -21665 -36428 -54625 -103859 -119009 -51251 -75336 -35502 10565 -12855 -22781
6978b2781k6914J2124k0892n7335J8361P686N763R447R3086l4939m0991k9643
$$ -22781 -49695 -37571 -58463 -115798 -97437 -89751 -83988 -74541 18545 -16394 -57385 -87028
6966h7028N7592m0553P7652n6794j3169J3650K2414m2644n968m3800R261r669
$$ -87028 -29436 -69989 7663 -49131 -62300 -48650 -26236 -68880 -74848 -118648 -109387 -119056
6954a19056J01377J0771j5537J6180j8017L5152K3784k1484r948M9115l3364m2751
$$ -119056 -17679 -6908 -22445 -6265 -24282 10870 34654 13170 3222 52337 18973 -23778
6942b3778o0104j4748j0106J5057K4351O0964o2280q949l6065M7731L2256l2822
$$ -23778 -83882 -98630 -108736 -93679 -69328 -8364 -70644 -79593 -115658 -67927 -35671 -68493
6930f8493j7342K0684o416M2950k988k0798P057m216J6796K1710q2624K7087k8985
$$ -68493 -85835 -65151 -71567 -28617 -31605 -52403 -45346 -49562 -32766 -11056 -93680 -66593 -95578
6917i5578K9749M4832n5565j7748K6302j5965n340k2011M564k8176Q3824J5179
$$ -95578 -65829 -20997 -76562 -94310 -68008 -83973 -89313 -111324 -106760 -134936 -51112 -35933
6905c5933m3715k5780L6995k3166n8007O8392K0015j5651l1148M4112q898K0860
$$ -35933 -79648 -105428 -68433 -91599 -149606 -81214 -61199 -76850 -107998 -63886 -72784 -51924
6893e1924J4378l07k2185o2442K269J1597J467O7298j4496J7982m2459Q15N2427
$$ -51924 -37546 -37853 -60038 -122480 -120211 -108614 -107147 -39849 -54345 -36363 -78822 -78007 -25580
6880b5580L4831j1069n011n5646O007N5960k7224j2530l1923n4502M3698k0883
$$ -25580 9251 -1818 -6829 -62475 -56468 -508 -27732 -40262 -72185 -126687 -82989 -103872
6868a03872n3067K8703M1602K6344l4153M988J27034j1330p7231j1078k6505L1836
$$ -103872 -156939 -128236 -86634 -60290 -94443 -89455 37579 26249 -50982 -62060 -88565 -56729
6856e6729k1518k1092l8493N2100Q459k7155k3479K8856K0436J9096J8144K4192
$$ -56729 -78247 -99339 -137832 -85732 -77273 -104428 -127907 -99051 -78615 -59519 -41375 -17183
6844a7183k8300J4560K6723n4472k4785k524L8737N179L5726m3618o7916M1984
$$ -17183 -45483 -30923 -4200 -58672 -83457 -85981 -47244 -42065 -6339 -49957 -117873 -75889
6832g5889M3879q008q478L0870o0353r09K2407q33k7350L6496p076M1404K710
$$ -75889 -32010 -40018 -48496 -17626 -77979 -78888 -56481 -57314 -84664 -48168 -55244 -13840 -11130
6819a1130l8514M3236l3872K7949k1323p0832L7083j4805p917M0266k7460l2188
$$ -11130 -49644 -6408 -40280 -12331 -33654 -104486 -67403 -82208 -90125 -49859 -77319 -109507
6807a09507K7788k6963M1352l012M432k0001q7766P3683j389O13L1451Q3L4555
$$ -109507 -81719 -108682 -67330 -70342 -65910 -85911 -173677 -99994 -101383 -100770 -69319 -69236 -34681
6794c4681J2177q1346k2704K181L3094M3435j3944k8162M1537p3373M560q962
$$ -34681 -22504 -103850 -126554 -124373 -91279 -47844 -61788 -89950 -48413 -121786 -117226 -126188
6782a26188O1373L7885k4189O345O0340J1834k3531p9116k7148l8201L3597j6404
$$ -126188 -64815 -26930 -51119 -44774 15566 27400 3869 -75247 -102395 -140596 -106999 -123403
6770a23403m0222K0020j4494L1489O9153k0225j1091l1647O5686J6301K2128J8406
$$ -123403 -163625 -143605 -158099 -126610 -57457 -77682 -88773 -120420 -54734 -38433 -16305 2101
6758B101J2540o1638J7884j3437l8356O783l3731r443n611M0479l4360Q670K7608
$$ 2101 14641 -46997 -29113 -42550 -80906 -74123 -107854 -117297 -122908 -82429 -116789 -108119 -80511
6745h0511L6531m2326M5124n9400k0844k3139O5311M9248L6628n6704k1182l2717
$$ -80511 -43980 -86306 -41182 -100582 -121426 -144565 -79254 -30006 6622 -50082 -71264 -103981
6733a03981K5440M0828j1112M2410N29l9376R687L0042m600q6659j5431L605j4825
$$ -103981 -78541 -37713 -48825 -6415 -5886 -45262 -35575 -5533 -10133 -96792 -112223 -108618 -123443
6720a23443K2261K9420K520K8484J1084n1476k990J5571M2663J893l7489L323
$$ -123443 -101182 -71762 -69242 -40758 -29674 -81150 -84140 -68569 -25906 -24013 -61502 -58179
6708e8179j3045P435m8134J05O0969j8676n7717K2308l9242L2288M1143l1441
$$ -58179 -71224 -63789 -111923 -111818 -50849 -69525 -127242 -104934 -144176 -111888 -70745 -102186
6696a02186r550K7293M3112r939K5313j8736L3611n4m9638L500o109m0255k7676
$$ -102186 -111736 -84443 -41331 -51270 -25957 -44693 -11082 -11136 -60774 -57274 -63383 -103638 -131314
6683a31314N5243J2781m7295J2693N7186L197r0966L1775M7190o9175r112O1774
$$ -131314 -76071 -63290 -110585 -97892 -40706 -37509 -128475 -96700 -49510 -118685 -127797 -66023
6671f6023q8872M9174Q1847j8765j0148k7261J7490K5202m0066O266p682p835
$$ -66023 -154895 -105721 -23874 -42639 -52787 -80048 -62558 -37356 -77422 -71156 -78838 -86673
6659h6673j1309l7236K9662l8146K0206M4742l8779l6648J9067K3934L9727K359
$$ -86673 -97982 -135218 -105556 -143702 -123496 -78754 -117533 -154181 -135114 -111180 -71453 -69094
6647f9094J2384m032N724K616j3656J5763L6090K8263j998j2904o0770l4839L3342
$$ -69094 -56710 -60742 -55018 -52402 -66058 -50295 -14205 14058 12060 -844 -61614 -96453 -63111
6634f3111K7493j0741j0952J4586j8393M6953K4212k1968K8508o7632j7350K4735
$$ -63111 -35618 -46359 -57311 -42725 -61118 -14165 10047 -11921 16587 -51045 -68395 -43660
6622d3660K3857l781m6669M157K7973j3891L6131k0464j7110O6579m7386m3129
$$ -43660 -19803 -23584 -70253 -66096 -38123 -52014 -15883 -36347 -53457 13122 -34264 -77393
6610g7393k4934Q861N2528J9839N4295l5466r355q558J8463m1741k3349N075K185
$$ -77393 -102327 -93466 -40938 -21099 33196 -2270 -11625 -20183 -1720 -43461 -66810 -61735 -59550
6597e9550O7476j5406L9253q942m3493N7271n6191k0298J2420m6444J6751K3275
$$ -59550 7926 -7480 31773 22831 -20662 36609 -19582 -39880 -27460 -73904 -57153 -33878
6585c3878k683k8216m110k33n209m2784L5592Q7716k8693j3662J4911K4754k1635
$$ -33878 -36561 -64777 -68887 -69120 -74329 -117113 -81521 6195 -22498 -36160 -21249 3505 -18130
6572a8130k4191o6333J6258J7387m1334L4242k3213k4186P9348p495J7583P5166
$$ -18130 -42321 -108654 -92396 -75009 -116343 -82101 -105314 -129500 -50152 -57647 -40064 35102
6560C5102m0136J996J092o7301K9679l3571L3512M862l5101l150K0523L1930M3040
$$ 35102 -5034 -3038 -1946 -69247 -39568 -73139 -39627 -34765 -69866 -73016 -52493 -20563 22477
6547B2477k7133p6605L8320K8267N7367o5345m9709K2691N969k7892K9848k7598
$$ 22477 -4656 -81261 -42941 -14674 42693 -22652 -72361 -49670 -43701 -71593 -41745 -69343
6535f9343J4573K8707o754r4393O2828n4847O05n15J5704M5065j445J4481Q010
$$ -69343 -54770 -26063 -32817 -127210 -64382 -119229 -118624 -119139 -103435 -58370 -59815 -45334 -37324
6522c7324l4943J2744K8414J1538k6341j5094M3644O679j6780m2350j6327Q9140
$$ -37324 -72267 -59523 -31109 -19571 -45912 -61006 -17362 -10683 -27463 -69813 -86140 3000
6510C000m6618m7109P4722J13n2946j7378K3385J7867j7422j86J03499q1547j4610
$$ 3000 -43618 -90727 -16005 -15892 -68838 -86216 -62831 -44964 -62386 -62572 40927 -40620 -55230
6497e5230p6224O4289K0371j1413p2236K4865M4628J2547j3123m2548m4715J16202
$$ -55230 -131454 -67165 -46794 -58207 -130443 -105578 -60950 -48403 -61526 -104074 -148789 -32587
6485c2587J0535n9793L0664k168J5360M3687l0420l0108J3741l435L7460j3664
$$ -32587 -22052 -81845 -51181 -53349 -37989 5698 -24722 -54830 -41089 -44524 -7064 -20728
6473b0728k0515L175J4286k5903j7384n6162M2421j6975K8342O1295k0459R986
$$ -20728 -41243 -38068 -23782 -49685 -67069 -123231 -80810 -97785 -69443 -8148 -28607 -18621
6461a8621J7739J3159J3028k8201k0857o1986O4766j05681l206O7580K1156n635
$$ -18621 -882 12277 25305 -2896 -23753 -85739 -20973 -126654 -129860 -62280 -41124 -46759
6449d6759K1347K1691k1773o0832L0963J7127n0894j3067q448M6788q922k3936
$$ -46759 -25412 -3721 -25494 -86326 -55363 -38236 -89130 -102197 -110645 -63857 -72779 -96715
6437i6715p971M7766m3325L3352j1949M113L8265M0342o4691J4289L3379k959
$$ -96715 -104686 -56920 -100245 -66893 -78842 -74729 -36464 3878 -60813 -46524 -13145 -16104
6425a6104r4242M4777N2490j1212J4174k6373k6225J5266k0832k0468L4085n1797
$$ -16104 -110346 -65569 -13079 -24291 -10117 -36490 -62715 -47449 -68281 -88749 -54664 -106461
6413a06461K4320q821L1588j8932P386k9417j997P8552M4866k7088L674P321p1150
$$ -106461 -82141 -90962 -59374 -78306 -70920 -100337 -102334 -23782 21084 -6004 -2330 4991 -66159
6400f6159k8771j8887j3593O7179N2521l8147n4438j3220l5725P5M5850k37p025
$$ -66159 -94930 -113817 -127410 -60231 -7710 -45857 -100295 -113515 -149240 -149165 -103315 -103552 -110577
6387a10577M6192N9618n1217q9958M199O6491K0129R1980k2471k6250j3821L0192
$$ -110577 -64385 -4767 -55984 -145942 -141743 -75252 -55123 36857 14386 -11864 -25685 4507
6375D507j7838J2003j3894r357k2773n8234L8920j0578q515p061J5877M3303k3989
$$ 4507 -13331 -1328 -15222 -24579 -47352 -105586 -66666 -77244 -85759 -92820 -76943 -33640 -57629
6362e7629J4969J8704l1919J270p1015p261N8760J5598J2513M390j9047L9045
$$ -57629 -42660 -23956 -55875 -54605 -125620 -132881 -74121 -58523 -46010 -41620 -60667 -21622
6350b1622o8422k8453L6406M8024m7045N1298M2768R116K5990l1937l5890l0953
$$ -21622 -90044 -118497 -82091 -34067 -81112 -29814 12954 22070 48060 16123 -19767 -50720
6338e0720j5428L1524j2186Q054p9092L7388M867j1284j1503M0475l8805j7291
$$ -50720 -66148 -34624 -46810 -38756 -117848 -80460 -75593 -86877 -98380 -57905 -96710 -114001
6326a14001J7534j3549N6935k1155L5177j0382J026R843m4805j7673j8802j6287
$$ -114001 -96467 -110016 -53081 -74236 -39059 -49441 -48415 -38572 -83377 -101050 -119852 -136139
6314a36139L3458O373L4202r030J8767K1521o3259j4891J2973J3493K3701p0775
$$ -136139 -102681 -96308 -62106 -71136 -52369 -30848 -94107 -108998 -96025 -82532 -58831 -129606
6302a29606K5105O7926l2841p1227K8647N4125L1779n9073l4755J1885P4620K6293
$$ -129606 -104501 -36575 -69416 -140643 -111996 -57871 -26092 -85165 -119920 -108035 -33415 -7122
6290g122M3168p546r529L2374l7116m7958N121n2378J3160L1123L6816k9148j9481
$$ -7122 36046 28500 18971 51345 14229 -33729 -28608 -80986 -67826 -36703 113 -29035 -48516
6277d8516n0952l6999J7756M4388j857m616N8603L1602o1567k0697N880l1484
$$ -48516 -99468 -136467 -118711 -74323 -76180 -80796 -22193 9409 -52158 -72855 -66975 -98459
6265i8459M6906L0865N0994j3981r9800N7411N0315n1038J079Q958Q472l0007
$$ -98459 -51553 -20688 30306 16325 -83475 -26064 24251 -26787 -25708 -16750 -8278 -38285
6253c8285m1210M1328r424j5907O2136R326K3818o0913k8921m2169O2K5434L2498
$$ -38285 -79495 -38167 -47591 -63498 -1362 7964 31782 -29131 -58052 -100221 -100159 -74725 -42227
6240d2227k8500O1340L8422p08m1687q4074Q5184m543k432j2745k3003l5606K5425
$$ -42227 -70727 -9387 29035 28327 -13360 -97434 -12250 -16793 -19225 -31970 -54973 -90579 -65154
6227f5154P1053R830p9943J5857L9402J0586l3104L07l5378J84M3384l6628L0426
$$ -65154 5899 15729 -64214 -48357 -8955 1631 -31473 -31166 -66544 -66360 -22976 -59604 -29178
6214b9178m872K3168q188m2758l384K9274k4331l3210j3539Q7000J6751M4085
$$ -29178 -34050 -10882 -19070 -61828 -65212 -35938 -60269 -93479 -107018 -20018 -3267 40818
6202D0818l6719o9539r0189l2900L356K7928L2272L3729j1595P3478m6103J1325
$$ 40818 4099 -65440 -155629 -188529 -185173 -157245 -124973 -91244 -102839 -29361 -75464 -64139
6190f4139j9942m565L2786O637K8004N4955r6884J3901O6238j1797p228k6542
$$ -64139 -84081 -88646 -55860 -49223 -21219 33736 -63148 -49247 16991 5194 -2034 -28576
6178b8576O390k834j8406q220R631j1323P2653o3104p712j6666N2999J1321k1986
$$ -28576 -22186 -25020 -43426 -51646 -42015 -53338 19315 -43789 -51501 -68167 -15168 -3847 -25833
6165b5833j6701K1995j1893J3210K2604N1214j09926K740j4831l0323k8488L2001
$$ -25833 -42534 -20539 -32432 -19222 3382 54596 -55330 -52590 -67421 -97744 -126232 -94231
6153i4231O2222M7270l8438j062l5162n8373n238N6331n8100O1831J2533M0496
$$ -94231 -32009 15261 -23177 -24239 -59401 -117774 -123012 -66681 -124781 -62950 -50417 -9921
6141i921P9724j01626n8115j7644N870N034M7939K5725k9925o7914O9162L2230
$$ -9921 69803 -31823 -89938 -107582 -101712 -96678 -48739 -23014 -52939 -120853 -51691 -19461
6129a9461J2190m0077o96O100j4094j3530J9332l5329L5481J2816L5504j949J8908
$$ -19461 -7271 -47348 -48044 -41944 -56038 -69568 -50236 -85565 -50084 -37268 -1764 -3713 15195
6116A5195k8841o796l8055K3737l0183q035N706N8843o1741M6401o145l2913J8127
$$ 15195 -13646 -20442 -58497 -34760 -64943 -72978 -67272 -8429 -70170 -23769 -29914 -62827 -44700
6103d4700k4982K4903J9547M2968l1440L4008L7845k9614o2501m2289o707L1871
$$ -44700 -69682 -44779 -25232 17736 -13704 20304 58149 28535 -33966 -76255 -82962 -51091
6091e1091r572O1227P9086k8703q349L5412q9518J0028M4557l9114o9166N1946
$$ -51091 -60663 564 79650 50947 42598 78010 -11508 -1480 43077 3963 -65203 -13257
6079a3257k8568l7370l6840p398K6755Q3797K6019N1847n2714p5979J12187k5982
$$ -13257 -41825 -79195 -116035 -123433 -96678 -12881 13138 64985 12271 -63708 48479 22497
6067B2497n8354Q724K5445J7574l6529K4793p015p9727J6144L3552M724N022m8339
$$ 22497 -35857 -27133 -1688 15886 -20643 4150 -2865 -82592 -66448 -32896 -28172 -23150 -71489
6054g1489K1644K7475k8166K6296J2638p8412K0906j6653P6146K5027l8494K2322
$$ -71489 -49845 -22370 -50536 -24240 -11602 -90014 -69108 -85761 -9615 15412 -23082 -760
6042g60K1114m4354J8330j300K5904k5603k1665N4543l2671O142L2025J1976N8250
$$ -760 20354 -24000 -5670 -6970 18934 -6669 -28334 26209 -6462 -320 31705 43681 101931
6029A01931k9154m4225q147k3292L4061j2836k2371j4495O9O8500M3653l5735
$$ 101931 72777 28552 20405 -2887 31174 18338 -4033 -18528 -18459 50041 93694 57959
6017E7959N825n6239r634O401K9837J2050N8049Q328p7996n6564J6655n3909M3934
$$ 57959 63784 7545 -2089 4312 34149 46199 104248 112576 34580 -21984 -5329 -59238 -15304
6004a5304J2219L4246p113O817j8796K3382n6805K440Q568j20926L3642j0438
$$ -15304 -3085 31161 24048 30865 12069 35451 -21354 -18914 -10346 -131272 -97630 -108068
5992a08068L4Q8840K8973p3167K2916M0625j4819J2323j7297J4609n0046j3880
$$ -108068 -108034 -19194 9779 -63388 -40472 153 -14666 -2343 -19640 -5031 -55077 -68957
5980f8957L3471Q0J7858J9195o808K5223j4229K6484l7634m5221l1480R8118P7617
$$ -68957 -35486 -35406 -17548 1647 -5161 20062 5833 32317 -5317 -50538 -82018 16100 93717
5967I3717j03443Q094l5720m8310K2589P8878n3196J5813j9025P1725M9044m4097
$$ 93717 -9726 -1632 -37352 -85662 -63073 15805 -37391 -21578 -40603 31122 80166 36069
5955C6069N382L61q4197Q915l0684l5197L1055R041M9998j3313l9380O9322J9507
$$ 36069 41451 41812 -42385 -33470 -64154 -99351 -68296 -59255 -9257 -22570 -61950 7372 26879
5942B6879M2976n1239n4306j1215k1910q944M8347k1361O511j422K6003L7350
$$ 26879 69855 18616 -35690 -46905 -68815 -77759 -29412 -50773 -44262 -45684 -19681 17669
5930A7669M6906L9679q4428J9869k5807N691K9752N826l5351N4766o8153j9283
$$ 17669 64575 104254 19826 39695 13888 19579 49331 55157 19806 74572 6419 -12864
5918a2864M5769L6253j5443M164k1214K4004k9783N0096n4639o6636Q840J2518
$$ -12864 32905 69158 53715 57879 36665 60669 30886 80982 26343 -40293 -31453 -18935
5906a8935n8480N3181N0008M238n223j3244K5125o7108M1331K9975o9620L6920
$$ -18935 -77415 -24234 25774 30012 24789 11545 36670 -30438 10893 40868 -28752 8168
5894H168M6756J7073m3299m7356J1425L4812j4288l0783P3975K4298K3164P377
$$ 8168 54924 71997 28698 -18658 -7233 27579 13291 -17492 56483 80781 103945 111322
5882A11322J4823m4297p711j1936o2217m0767Q5138j4832O1409j3638L134O0032
$$ 111322 126145 81848 74137 62201 -16 -40783 44355 29523 90932 77294 80428 140460
5870A40460j3853l5008k6157k7168O355k0898L4894L6040J26K6268K219k925Q487
$$ 140460 126607 91599 65442 38274 44629 23731 58625 94665 94791 121059 123278 120353 128840
5857A28840l1812j4831k9738M3892P861K2869K2518J3001j642O0952k5757o0320
$$ 128840 97028 82197 52459 96351 104212 127081 149599 162600 160958 221910 196153 135833
5845A35833p949J645L2346M7132M9756k7893n6049m929M586L7030O514J6171p4382
$$ 135833 127884 129529 161875 209007 258763 230870 174821 169892 174478 211508 218022 234193 159811
5832A59811k1610K2813j7742L426m4283m1732N1828Q7876n6860K0171r097m2501
$$ 159811 138201 161014 143272 146698 102415 60683 112511 200387 143527 163698 154601 112100
5820A12100O0669J7309j6670m7977J9400N1323K445R442p3323l978j6473K7946
$$ 112100 172769 190078 173408 125431 144831 196154 198599 208041 134718 130740 114267 142213
5808A42213J7895R323j5456K7037o1492l3303m0568N7546m4807Q003o656L4003
$$ 142213 160108 169431 153975 181012 119520 86217 45649 103195 58388 66391 59735 93738
5796I3738k928N874p748P269J9099M731k6411m0021k4070M4260L3395J2438N164
$$ 93738 90810 96684 88936 96205 115304 120035 93624 53603 29533 73793 107188 119626 124790
5783A24790J1911m3241n1386O903J3521M883n6072m4528K3234O6659m2299K7744
$$ 124790 136701 93460 42074 48977 62498 67381 11309 -33219 -9985 56674 14375 42119
5771D2119L1436M634l558L6328p939p413n8699J3721L301n648j7408N1306m5824
$$ 42119 73555 78189 74631 110959 103020 95607 36908 50629 53930 48282 30874 82180 36356
5758C6356M6249k8706L8833P284j3572J5223o327M346n2728m9725l2597J11k0220
$$ 36356 82605 53899 92732 100016 86444 101667 95340 99686 46958 -2767 -35364 -35253 -55473
5745e5473M7500L5888K8908L124O58k381j0694r624O536R021N1295m382m2813
$$ -55473 -7973 27915 56823 59947 60605 58224 47530 37906 44442 53463 104758 100376 57563
5732E7563l6560K8694J1989m4887n6540K7621P6402M0709k2116o8331m7343L2041
$$ 57563 21003 49697 61686 16799 -39741 -12120 64282 104991 82875 14544 -32799 -758
5720g58L8791Q961k8426K0333N3814l4691m1296J8879K0959k5321M3995O4539
$$ -758 38033 46994 18568 38901 92715 58024 16728 35607 56566 31245 75240 139779
5708A39779j2528k7469j12702p8648O8308M7274r067M1994q730L33k5879j2759
$$ 139779 127251 99782 -12920 -91568 -23260 24014 14947 56941 48211 48544 22665 9906
5696I906N8331k2445j6637J5566Q089J13627o2178o9815M2044k7035L6702P937
$$ 9906 68237 45792 29155 44721 52810 166437 104259 34444 76488 49453 86155 94092
5684I4092j8987M0168J5249o331j852q9895K051k6966j4319M2156L3516k598l0101
$$ 94092 75105 115273 130522 124191 122339 32444 34495 7529 -6790 35366 68882 66284 36183
5671C6183N564l356L6503M5404Q562m4772L4954p693p5495j94M2060k1999M8707
$$ 36183 41747 38391 74894 120298 128860 84088 119042 111349 35854 35660 77720 55721 104428
5658A04428N7768r0251K6914j7289l9808l0473M0039J9084m9312L7388m927j9535
$$ 104428 162196 71945 98859 81570 41762 11289 51328 70412 21100 58488 53561 34026
5646C4026J5441l779j5058N1610k7240l304N1797k7656M3151j1796l242o2338
$$ 34026 49467 45688 30630 82240 55000 51696 103493 75837 118988 107192 103950 41612
5634D1612N3245L6462o7537j034J5511N4265O2900p8830n2240n5922L9356P6966
$$ 41612 94857 131319 63782 62748 78259 132524 195424 116594 64354 8432 47788 124754
5622A24754l177k4519n294n2016O001M8365M6310k2361k0080l0495K799J4254
$$ 124754 121577 97058 91764 39748 45749 94114 140424 118063 97983 67488 70287 84541
5610H4541M0830o101j14936K0761M2078J08358J3476k6338j0840O7480n1016m4164
$$ 84541 125371 119270 4334 25095 67173 175531 189007 162669 151829 219309 168293 124129
5598A24129j7828M4728n876q155m7039L3054K8254k4226k8966K5780j7498M1240
$$ 124129 106301 151029 145153 136998 89959 123013 151267 127041 98075 123855 106357 147597
5586A47597K7006k3425j7531K0456N1704K7742m7571L2319j9945j6031r263m9660
$$ 147597 174603 151178 133647 154103 205807 233549 185978 218297 198352 182321 173058 123398
5574A23398L7299j2672m3662R3822J3287j3306K3927j7078k8910m2294K7852l1528
$$ 123398 160697 148025 104363 198185 211472 198166 222093 205015 176105 133811 161663 130135
5562A30135J5556k4147J3501k7809K791N3685O6924k7875m2126k7886J9902k4842
$$ 130135 145691 121544 135045 107236 110027 163712 230636 202761 160635 132749 152651 127809
5550A27809L9430j0150n17o3523l7262P587N5907L6088j6443j0266M3230k372
$$ 127809 167239 157089 156572 93049 55787 63374 119281 155369 138926 128660 171890 169518
5538A69518r926K7856l3344J686L6411k1237O394l3631j6976J6575J6176L3549
$$ 169518 159592 187448 154104 155790 192201 170964 177358 143727 126751 143326 159502 193051
5526A93051p2370m5245j0670M7099k5967O4096k5489o3562o009N8673K4311j6901
$$ 193051 120681 75436 64766 111865 85898 149994 124505 60943 54934 113607 137918 121017
5514A21017L616K277n6M4241O1891q834l6063m6729k1492n390J0027p153m0321
$$ 121017 124633 126910 126854 171095 232986 224152 188089 141360 119868 114478 124505 117352 77031
5501G7031J9980L8460N02m7522j2756O7662L360k7293l743J0688O742k3895l3260
$$ 77031 97011 135471 135973 88451 75695 143357 146717 119424 115681 126369 133111 109216 75956
5488G5956O4510J3799j4189O626N586M6331j0433l6571K3463o567n7280J586j7033
$$ 75956 140466 154265 140076 146702 152288 198619 188186 151615 175078 168511 111231 112817 95784
5475I5784J3653L5990J1988l5659J7174N4419l1587p5322M8003M6947m0310O5834
$$ 95784 109437 145427 157415 121756 138930 193349 161762 86440 134443 181390 141080 206914
5463B06914j995p198J3288p334L302K2427J9295m926J499o2151K5683K3263j1794
$$ 206914 204919 197721 211009 203675 206977 229404 248699 243773 245272 183121 208804 232067 220273
5450B20273k461j0056K1134j0553k7687P0234k4707N42J5948m0004M325n2549
$$ 220273 217812 207756 228890 218337 190650 260884 236177 236719 252667 212663 216988 164439
5438A64439M2699M3732K3483o1444o119L889K8424N8240l3930l6796L9592j4772
$$ 164439 207138 250870 274353 212909 206790 210679 239103 297343 263413 226617 266209 251437
5426B51437j3215r275J7400M401J5821M4530j0725l2341n7623L3502J922j9354
$$ 251437 238222 228947 246347 250748 266569 311099 300374 268033 210410 243912 245834 226480
5414B26480j5726J4284J8032K3496m7284L4886Q086k0897n218K248K706j9951
$$ 226480 210754 225038 243070 266566 219282 254168 262254 241357 236139 238387 241093 221142
5402B21142k9443j2905J02933M5959J5740l120l9321o7494l6152M8793r390L2069
$$ 221142 191699 178794 281727 327686 343426 340306 300985 233491 197339 246132 236742 268811
5390B68811M9368p694K149j2308q666K6420K9189n2146q6228L1317J2503Q997
$$ 268811 318179 310485 312634 300326 291660 318080 347269 295123 208895 240212 252715 261712
5378B61712r4113J3921N4167J4896L034L416m76j1049K6747l2846M0099j4854
$$ 261712 167599 181520 235687 250583 253617 257033 256557 245508 272255 239409 279508 264654
5366B64654j1239o043M4455j7885m3680P6872L0709n4490K177k0679k0955L4189
$$ 264654 253415 247372 291827 273942 230262 307134 337843 283353 285530 264851 243896 278085
5354B78085l6355o7027o35L2329Q063j7271O8992k0265o1730L9823L3779j2604
$$ 278085 241730 174703 174068 206397 214460 197189 266181 245916 184186 224009 257788 245184
5342B45184K8044l7032K4530N7128k6256j4004Q6007k8510k1936r437o0519L3946
$$ 245184 273228 236196 260726 317854 291598 277594 363601 335091 313155 303718 243199 277145
5330B77145m3812M8658N8092p4537M1253j8634j2280R470K824l5810N0070k3171
$$ 277145 233333 281991 340083 265546 306799 288165 275885 285355 288179 252369 302439 279268
5318B79268k2251m6399O3044K6126n0813M544k8761n940r90L48o5689J7696N5155
$$ 279268 257017 210618 273662 299788 248975 253519 224758 218818 217828 218176 152487 170183 225338
5305B25338O159q250P2148K2046m0715J4325K8949o2584N3660N711m4548l8834
$$ 225338 231497 223247 295395 317441 276726 291051 320000 257416 311076 316787 272239 233405
5293B33405l6912K5991N4857j4121m981m4519M1260l3017j0598L0971R107J3226
$$ 233405 196493 222484 277341 263220 258239 213720 254980 221963 211365 242336 251443 264669
5281B64669Q5475n5824o1215L9076M5269l8772m6011k0648N8440L0343j4440n7326
$$ 264669 350144 294320 233105 272181 317450 278678 232667 212019 270459 300802 286362 229036
5269B29036K7794L6516L8071m6191m9228k9107n906M3793M5443J503K587N5758
$$ 229036 256830 293346 331417 285226 235998 206891 200985 244778 290221 291724 294311 350069
5257C50069n9807j8879o1711o304m053J5335L8320j1924j1300J5088M9517l9192
$$ 350069 290262 271383 209672 203368 199315 214650 252970 241046 229746 244834 294351 255159
5245B55159j6034M4502J1911l845j9571n926L9383J9022q9717N040L891N2918
$$ 255159 239125 283627 295538 291693 272122 266196 305579 324601 234884 239924 243815 296733
5233B96733k0043K7667M1004j2491l4152K1095M7881O9136p1033n6967O965l269
$$ 296733 276690 304357 345361 332870 298718 319813 367694 436830 365797 308830 315795 312526
5221C12526k2477K1929k9064R612N0807l3664q605K2265K7823J056j4938m349
$$ 312526 290049 311978 282914 292526 343333 309669 301064 323329 351152 352208 337270 332921
5209C32921J1975k1181k5933j4842o6665M1692L7183l9238o001m9218L8555K0217
$$ 332921 344896 323715 297782 282940 216275 257967 295150 255912 249911 200693 239248 259465
5197B59465L1317L5987M9572n46J0923j2657j4220J1338j0862K0226m8653j1067
$$ 259465 290782 326769 376341 375795 386718 374061 359841 371179 360317 380543 331890 320823
5185C20823J6750P0151K5320j02711k5678J6894L3349K0153N7341p5743k51P5753
$$ 320823 337573 407724 433044 330333 304655 321549 354898 375051 432392 356649 356398 432151
5173D32151k1872j3098p031j9176L0508O426n8343K1716J7611K236L3299o366
$$ 432151 410279 397181 390150 370974 401482 407908 349565 371281 388892 391128 424427 418061
5161D18061J0320K5066n459R808J7069l0614n589M0173k0070M0635k5484J1155
$$ 418061 428381 453447 447988 457796 474865 444251 438662 478835 458765 499400 473916 485071
5149D85071J008K7018l5923j3105J8349N4672J0443p305K5230n7767j2271k5350
$$ 485071 486079 513097 477174 464069 482418 537090 547533 540228 565458 507691 495420 470070
5137D70070j5694M1460O3001m7841R703K9458k456r473n9185N7364O994M159j0059
$$ 470070 454376 495836 558837 510996 520699 550157 547701 538228 479043 536407 543401 547560 537501
5124E37501p0382O5324m5216J0230P4499m9376j825M221O033M7723m5113m3056
$$ 537501 467119 532443 487227 497457 571956 522580 520755 524976 531009 578732 533619 490563
5112D90563m255k5410L2076L23q1718j58K3569L8493j472K0402J3384k4257j88
$$ 490563 486308 460898 492974 493297 411579 411421 434990 473483 472011 492413 505797 481540 481352
5099D81352O7371Q4911n5849K0946o3978n1140N2181k0672l3164J1744N1395j4934
$$ 481352 548723 633634 577785 598731 534753 483613 535794 515122 481958 493702 545097 530163
5087E30163L3313M5821k6985k7460q534K3729j8970j9068l6238R914K994N0186
$$ 530163 563476 609297 582312 554852 546318 570047 551077 532009 495771 505685 508679 558865
5075E58865j0158M4619P4745r9893j2759o753l5351j6292M8509o5217J6342P1428
$$ 558865 548707 593326 668071 568178 555419 548666 513315 497023 545532 480315 496657 568085
5063E68085J1691m6940J0852P7434k8083J0014N8629n1832j793n0941O3033l5750
$$ 568085 579776 532836 543688 621122 593039 603053 661682 609850 608057 557116 620149 584399
5051E84399l1469N0178m8122N7901O2724j1568l0740N0015j2388k6281p011m5577
$$ 584399 552930 603108 554986 612887 675611 664043 633303 683318 670930 644649 637638 592061
5039E92061M9788m574p2049J0479J4072J02651K7112n3142m8234l556M1286M0181
$$ 592061 641849 637275 565226 575705 589777 692428 719540 666398 618164 614608 655894 696075
5027F96075n0801R692N721K5178J5086m9408O9613J774k8067J1208j3467K9422
$$ 696075 645274 654966 660687 685865 700951 651543 721156 722930 694863 706071 692604 722026
5015G22026L5590k1129L807N688K0738j8187k4771K4635m908p034m4663K0107
$$ 722026 757616 736487 740294 745982 766720 748533 723762 748397 743489 736455 691792 711899
5003G11899J28335n818m1387m7881j6735J3019j7640M0726L3823k8063L0506N3155
$$ 711899 840234 834416 793029 745148 728413 741432 723792 764518 798341 770278 800784 853939
4991H53939o5132M5076J8594l1638j6413n6482K4757N1470J881N7080m4543K6077
$$ 853939 788807 833883 852477 820839 804426 747944 772701 824171 826052 883132 838589 864666
4979H64666N555j4552J8078q1965J1605Q7052k6708K7260K5344j6808k255m6427
$$ 864666 870221 855669 873747 791782 803387 890439 863731 890991 916335 899527 897272 850845
4967H50845R5408n923n1248Q527k0839l9224K8865N8033J2497j491Q057L7876
$$ 850845 946253 940330 889082 897609 876770 837546 866411 924444 936941 935450 943507 981383
4955I81383M091J8403l9190o0039Q4620M420o8866M3513L1435j6386m432J714
$$ 981383 985474 1003877 964687 904648 989268 993688 924822 968335 999770 983384 978952 980666
4943I80666q557l3202M0454J2913o1926M0996J9916m7657N4704j4929J4419o0741
$$ 980666 972109 938907 979361 992274 930348 971344 991260 943603 998307 983378 997797 937056
4931I37056J4222P9711j8143N0979N1562o2198K6463O5846j00977N5606l804j1469
$$ 937056 951278 1030989 1012846 1063825 1115387 1053189 1079652 1145498 1044521 1100127 1096323 1084854
4919A084854j0191O4725j0864k0087n780N172l2157M8306J8689o2636L3021L6037
$$ 1084854 1074663 1139388 1128524 1108437 1102657 1107829 1075672 1123978 1142667 1080031 1113052 1149089
4907A149089J3566q842N15K6514N833N5676J5209m3487L9801n8651k8745j7743
$$ 1149089 1162655 1153813 1154328 1180842 1186675 1242351 1257560 1214073 1253874 1195223 1166478 1148735
4895A148735L2020Q7168j5187r4547O6017N7597J1655M606R068l024Q575O2676
$$ 1148735 1180755 1267923 1252736 1158189 1224206 1281803 1293458 1298064 1307132 1304108 1312683 1375359
4883A375359j8045p9342J205k178o442L7806J4316j0345K7046Q720j1831R509
$$ 1375359 1357314 1277972 1279177 1276999 1270557 1308363 1322679 1312334 1339380 1348100 1336269 1345778
4871A345778M7978L2746o125L7647m1024m6061k0030O9006m282N41O7208q790
$$ 1345778 1393756 1426502 1420377 1458024 1417000 1370939 1350909 1419915 1415633 1416174 1483382 1474592
4859A474592M3588M838m4675K0585R1073k2808q315J1287j4352M6180P773j3460
$$ 1474592 1518180 1523018 1478343 1498928 1590001 1567193 1558878 1570165 1555813 1601993 1609766 1596306
4847A596306o4249K2474K4866k7890N4055L719R0644j3221J5305P21m3780M736
$$ 1596306 1532057 1554531 1579397 1551507 1605562 1609281 1699925 1686704 1702009 1702730 1658950 1663686
4835A663686L1065M6243N3855k2103L311M9617O4375o0749M087M162L2874Q0952
$$ 1663686 1694751 1740994 1794849 1772746 1776057 1825674 1890049 1829300 1833387 1837549 1870423 1951375
4823A951375J9500n9826J3976R3356P396j1713J9843P2067l313Q259o2959O0972
$$ 1951375 1970875 1911049 1925025 2018381 2025777 2014064 2033907 2105974 2102661 2110920 2047961 2108933
4811B108933O8671n61k3720J1077k3905M3344M315l5326L9809J08547n267N2571
$$ 2108933 2177604 2177043 2153323 2164400 2140495 2183839 2188154 2152828 2192637 2301184 2295917 2348488
4799B348488k4786M1868K4287m9826N15k2200j1210L3637O6795O9802K6725n6016
$$ 2348488 2323702 2365570 2389857 2340031 2340546 2318346 2307136 2340773 2407568 2477370 2504095 2448079
4787B448079J8537O3099O2049k019j8501J8529J6443r008N0871O5313J177M561
$$ 2448079 2466616 2529715 2591764 2589745 2571244 2589773 2606216 2597208 2648079 2713392 2714569 2719130
4775B719130K3461K0838N5359J3566K1201n6658J03759J4858N6976n2019l854
$$ 2719130 2742591 2763429 2818788 2832354 2853555 2796897 2900656 2915514 2972490 2920471 2916617
4764B916617P6610l385P8930p642n731L6325J1545O2532j3753N5952N6837J5672
$$ 2916617 2993227 2989842 3068772 3061130 3055399 3091724 3103269 3165801 3152048 3208000 3264837 3280509
4752C280509O417L5615J7685r779K5101j7095J12827j5180L2805k3378L5287R577
$$ 3280509 3286926 3322541 3340226 3330447 3355548 3338453 3451280 3436100 3468905 3445527 3480814 3490391
4740C490391J7827K3463J35609M9357J9283J9231l3582R1416N1640L1271R9251
$$ 3490391 3508218 3531681 3667290 3716647 3735930 3755161 3721579 3812995 3864635 3895906 3995157
4729C995157J1443J0733K1365P3359M2440K2789N3049N8853Q0903Q5083K6303
$$ 3995157 4006600 4017333 4038698 4112057 4154497 4177286 4230335 4289188 4370091 4455174 4481477
4718D481477K2894N0353Q282L9540R2375J29848N5102L7259L618L781J05161Q0336
$$ 4481477 4504371 4554724 4563006 4602546 4694921 4824769 4879871 4917130 4920748 4924529 5029690 5110026
4706E110026L1191P7700P0559O8202k7675J16722N5828K9757Q2426M4072N710
$$ 5110026 5141217 5218917 5289476 5357678 5330003 5446725 5502553 5532310 5614736 5658808 5664518
4695E664518k9222N0364l268R9029R9581J20983L1662P2868P8849M8489N7351
$$ 5664518 5635296 5685660 5682392 5781421 5881002 6001985 6033647 6106515 6185364 6233853 6291204
4684F291204O4133J05468P7770J28902J7088K7064R9438L6213M9603R0541P3260
$$ 6291204 6355337 6460805 6538575 6667477 6684565 6711629 6811067 6847280 6896883 6987424 7060684
4673G060684N2369P5383J22222R1256O3966L9385P7222O5180J48615M2510O1352
$$ 7060684 7113053 7188436 7310658 7401914 7465880 7505265 7582487 7647667 7796282 7838792 7900144
4662G900144Q5580J46444R0595J16577J18551O9632P5700R9695Q3483J9320R5743
$$ 7900144 7985724 8132168 8222763 8339340 8457891 8527523 8603223 8702918 8786401 8805721 8901464
4651H901464J42543Q2797J09826J26111J07841O9105Q2448P6368J97014J23946
$$ 8901464 9044007 9126804 9236630 9362741 9470582 9539687 9622135 9698503 9895517 10019463
4641A0019463K3966J76473R2636J65151J48551J31298J80517P1587R9537J26070
$$ 10019463 10043429 10219902 10312538 10477689 10626240 10757538 10938055 11009642 11109179 11235249
4631A1235249J63664J68956J24714J65276J65920J39408J59083J27973J52954
$$ 11235249 11398913 11567869 11692583 11857859 12023779 12163187 12322270 12450243 12603197
4622A2603197J66645J55809J90376J90805K09543J95538K33498K25400K27048
$$ 12603197 12769842 12925651 13116027 13306832 13516375 13711913 13945411 14170811 14397859
4613A4397859Q2084J99520K72596J87348K15232K29645K83625K38147K21708K77344
$$ 14397859 14479943 14679463 14952059 15139407 15354639 15584284 15867909 16106056 16327764 16605108
4603A6605108K76755K32496J97749K46700K44153K68032L04144L04060K57658
$$ 16605108 16881863 17114359 17312108 17558808 17802961 18070993 18375137 18679197 18936855
4594A8936855L50551L26158L61093L33111K73949M23389L37400L18092M55640
$$ 18936855 19287406 19613564 19974657 20307768 20581717 21005106 21342506 21660598 22116238
4585B2116238L77114M28746L93634M09341M72786M06859M10930M87104M90665
$$ 22116238 22493352 22922098 23315732 23725073 24197859 24604718 25015648 25502752 25993417
4576B5993417M59354M98024N29557N69539N89869N85542N50307N39560N65727
$$ 25993417 26452771 26950795 27480352 28049891 28639760 29225302 29775609 30315169 30880896
4567C0880896O72710O15853O31902O72688O89625P22212P04468Q35862Q11911
$$ 30880896 31553606 32169459 32801361 33474049 34163674 34885886 35590354 36426216 37238127
4558C7238127P48317Q52034Q31506Q44964Q14486R79446Q60794Q55544R17585
$$ 37238127 37986444 38838478 39669984 40514948 41329434 42308880 43169674 44025218 44942803
4549D4942803R52050R47524R94665J075955J008715J044651J144646J158267J180028
$$ 44942803 45894853 46842377 47837042 48912997 49921712 50966363 52111009 53269276 54449304
4540E4449304J246694J210585J298089J385338J343294J470302J521837J476704
$$ 54449304 55695998 56906583 58204672 59590010 60933304 62403606 63925443 65402147
4532F5402147J604494J646995J767501J760851J836476J907662K011887K009761
$$ 65402147 67006641 68653636 70421137 72181988 74018464 75926126 77938013 79947774
4524G9947774K203808K281062K366180K485056K540171K776192K885261K949515
$$ 79947774 82151582 84432644 86798824 89283880 91824051 94600243 97485504 100435019
4516A00435019L149560L249379L442337L659437L816550M026455M252301M529366
$$ 100435019 103584579 106833958 110276295 113935732 117752282 121778737 126031038 130560404
4508A30560404M738637N039306N385913N654949N955887O253944O642791O952939
$$ 130560404 135299041 140338347 145724260 151379209 157335096 163589040 170231831 177184770
4500A77184770P230242P632949P982465Q271244Q614403Q792973Q964344R230049
$$ 177184770 184415012 192047961 200030426 208301670 216916073 225709046 234673390 243903439
4492B43903439R392991R604425R741528R846824R954165J0128002J0304507J0426382
$$ 243903439 253296430 262900855 272642383 282489207 292443372 302571374 312875881 323302263
4484C23302263J0464920J0800577J0973955J1158681J1261524J1260574J1137311
$$ 323302263 333767183 344567760 355541715 366700396 377961920 389222494 400359805
4477D00359805J0840282J0417833R796148Q893254P793268O512018N035960L515705
$$ 400359805 411200087 421617920 431414068 440307322 448100590 454612608 459648568 463164273
4469D63164273J704394j27020j983229l819019n533878p074008q580006r811492
$$ 463164273 464868667 464741647 462758418 458939399 453405521 446331513 437751507 427940015
4461D27940015j0815777j1599223j2203217j2633723j2818311j2868643j2722579
$$ 427940015 417124238 405525015 393321798 380688075 367869764 355001121 342278542
4454C42278542j2616243j2442206j2077342j1697473j1309869j0863872j0435795
$$ 342278542 329662299 317220093 305142751 293445278 282135409 271271537 260835742
4447B60835742r997946r532184r083393q697112q234442p870907p533673p164872
$$ 260835742 250837796 241305612 232222219 223525107 215290665 207419758 199886085 192721213
4439A92721213o800018o496061o136840n947841n659855n323233n021629m851127
$$ 192721213 185921195 179425134 173288294 167340453 161680598 156357365 151335736 146484609
4431A46484609m698687m465139m166795m137257l945301l705650l647643l455213
$$ 146484609 141785922 137320783 133153988 129016731 125071430 121365780 117718137 114262924
4423A14262924l320788l238389l026534k862758k846254k762713k676324k524562
$$ 114262924 110942136 107703747 104677213 101814455 98968201 96205488 93529164 91004602
4415I1004602k398460k337453k301009k121756k121286k023104k022248j859815
$$ 91004602 88606142 86268689 83967680 81845924 79724638 77701534 75679286 73819471
4407G3819471j778379j749895j764952j614762j605727j560387j445886j375914
$$ 73819471 72041092 70291197 68526245 66911483 65305756 63745369 62299483 60923569
4399F0923569j421705j356956j313388j270827j243085j179297j165948j064251
$$ 60923569 59501864 58144908 56831520 55560693 54317608 53138311 51972363 50908112
4391E0908112j079796j030565r92672r81698r86945r00561r31320r00356p40060
$$ 50908112 49828316 48797751 47805079 46823381 45836436 44935875 44004555 43104199 42364139
4382D2364139q51777p88767p53963p43130p40100p93916o59401o32386p05840
$$ 42364139 41512362 40723595 39969632 39226502 38486402 37692486 37033085 36400699 35694859
4373C5694859o71403o49960n52440o86292n87037o12268m68513n43419n68857
$$ 35694859 35023456 34373496 33821056 33134764 32547727 31935459 31466946 30923527 30354670
4364C0354670n51957m85056n80215m96147n46987l71494l64270m96652n27324
$$ 30354670 29802713 29317657 28737442 28241295 27694308 27322814 26958544 26461892 25934568
4355B5934568l98967l81716m01760m55701m24345l35019m08274l68230l28218
$$ 25934568 25535601 25153885 24752125 24296424 23872079 23537060 23128786 22760556 22432338
4346B2432338l31717l09706k98859l15602l20199l49172k47374l45138l05351
$$ 22432338 22100621 21790915 21492056 21176454 20856255 20507083 20259709 19914571 19609220
4337A9609220k23671k49435l42075k30140k30868k63889k00131k61860l00349
$$ 19609220 19385549 19136114 18794039 18563899 18333031 18069142 17869011 17607151 17306802
4328A7306802k57367k15363k59238k73251k48601j94989j53317j75007j42979
$$ 17306802 17049435 16834072 16574834 16301583 16052982 15857993 15704676 15529669 15386690
4319A5386690k30213k07873j99028k24019k17466j49873k18160j29757j32490
$$ 15386690 15156477 14948604 14749576 14525557 14308091 14158218 13940058 13810301 13677811
4310A3677811k05843j93023j87952k06464k23487j14175j29742j90861j69970
$$ 13677811 13471968 13278945 13090993 12884529 12661042 12546867 12417125 12226264 12056294
4301A2056294j41682j12038j19133j36205j27640j40016k05104j26092j47302
$$ 12056294 11914612 11802574 11683441 11547236 11419596 11279580 11074476 10948384 10801082
4292A0801082n5435j44683j52614o9824m8545n6638q9180j37703j50792j37014
$$ 10801082 10745647 10600964 10448350 10378526 10329981 10273343 10184163 10046460 9895668 9758654
4282I758654j73577k05358j04838j15756j00706p1519p6419j11775p4416p9904
$$ 9758654 9585077 9379719 9274881 9159125 9058419 8986900 8910481 8798706 8724290 8644386
4272H644386r3441n1949j19767p4801m7620j19380j34320n6866n7898r9899r0873
$$ 8644386 8550945 8498996 8379229 8304428 8256808 8137428 8003108 7946242 7888344 7788445 7697572
4261G697572p4530j5062k0194r5402l6066r5698n5910j07706k9599m6822j9861
$$ 7697572 7623042 7607980 7587786 7492384 7456318 7360620 7304710 7197004 7167405 7120583 7100722
4250G100722o0877j27587q5925k2301j16796r5987k8576m4985j72406m7886n4084
$$ 7100722 7039845 6912258 6826333 6804032 6687236 6591249 6562673 6517688 6345282 6297396 6243312
4239F243312o3805n7348k3254q2964l3138k9173m6898n6155r8131n7001q4555
$$ 6243312 6179507 6122159 6098905 6015941 5982803 5953630 5906732 5850577 5752446 5695445 5610890
4228E610890l9190j7167N980r5039m2826j1852j00319l9983j9323o389m3795l9458
$$ 5610890 5571700 5554533 5560513 5465474 5422648 5410796 5310477 5270494 5251171 5244782 5200987 5161529
4216E161529J3104n9925k8196q7840n2398n24l6214j15621q1005n6469J249R102
$$ 5161529 5174633 5114708 5086512 4998672 4946274 4945750 4909536 4793915 4712910 4656441 4657690 4666792
4204D666792m197j1753k4589o8169k5691o4216l5541q8136m2528m6922j3672k3000
$$ 4666792 4662595 4650842 4626253 4558084 4532393 4468177 4432636 4344500 4301972 4255050 4241378 4218378
4192D218378L0835n7473j8924J5273j17867l7195o4301l7712n38j8473k1445l6312
$$ 4218378 4249213 4191740 4172816 4188089 4070222 4033027 3968726 3931014 3930476 3912003 3890558 3854246
4180C854246j5586p5308m5505o4547L910J566j8546m77K2851M8397m1648q5564
$$ 3854246 3838660 3763352 3717847 3653300 3657210 3658776 3640230 3639753 3662604 3711001 3669353 3583789
4168C583789l2413q911r9335j7513L9068o0903p0867L4783o930j2116k0082J0354
$$ 3583789 3551376 3542465 3443130 3425617 3464685 3403782 3332915 3367698 3360768 3348652 3328570 3338924
4156C338924k9781q1016o5630L5466o9071L1223l2941m0761j2434k9185j0141
$$ 3338924 3309143 3228127 3162497 3197963 3128892 3160115 3127174 3086413 3073979 3044794 3034653
4145C034653j30764k1609L4613p6626m6694K4153j8001k495J7211p5290n2847
$$ 3034653 2903889 2882280 2916893 2840267 2793573 2817726 2799725 2797230 2814441 2739151 2686304
4134B686304o4642K4077K3090k5391J4238k342l0562L5956k9666k0164l0666j1492
$$ 2686304 2621662 2645739 2668829 2643438 2657676 2655334 2624772 2660728 2631062 2610898 2580232 2568740
4122B568740l875n5505L1814K7498m4206k6803k6011j916o539J0355p3015k4980
$$ 2568740 2564865 2509360 2541174 2568672 2524466 2497663 2471652 2469736 2463197 2473552 2400537 2375557
4110B375557J4390o4364O243j3278N0050j2580K5637l7829q0783N478l8302l1520
$$ 2375557 2389947 2325583 2331826 2318548 2368598 2356018 2381655 2343826 2263043 2268521 2230219 2198699
4098B198699j927j6926L7539l1345k356M5094j0757p7020j295k7374J4212n6483
$$ 2198699 2196772 2179846 2217385 2186040 2183684 2228778 2218021 2141001 2139706 2112332 2126544 2070061
4086B070061N8680j8279k0208k3706j8540m9094J1021k9243k1300N003M6645M553
$$ 2070061 2128741 2110462 2090254 2066548 2048008 1998914 2009935 1980692 1959392 1964395 2011040 2015593
4074B015593M5369L469k5222k8968K075o602Q515j3441m5080O3445j2192K6198
$$ 2015593 2060962 2064431 2039209 2010241 2012316 2005714 2014229 2000788 1955708 2019153 2006961 2033159
4062B033159k4112J1020k0477K8602p5214J6606R73M3068n421K6889L085j3357
$$ 2033159 2009047 2020067 1999590 2028192 1952978 1969584 1970557 2013625 2008204 2035093 2038178 2024821
4050B024821l1302K039l2757O4483n1127K1075J0264O1189n8829j7620p9536O442
$$ 2024821 1993519 1995558 1962801 2027284 1976157 1997232 2007496 2068685 2009856 1992236 1912700 1919142
4038A919142l7621J8945k0562Q222N6027M2824o059k7559m791J5083K0642o091
$$ 1919142 1881521 1900466 1879904 1888126 1944153 1986977 1980918 1953359 1948568 1963651 1984293 1978202
4026A978202K816K0283P3600m3102K3852k7347J23856J5949P2430K5562R3333
$$ 1978202 1981018 2001301 2074901 2031799 2055651 2028304 2152160 2168109 2240539 2266101 2359434
4015B359434m961N8968J16941J28025K04350J92740J09874J89366R0223R2018
$$ 2359434 2354473 2413441 2530382 2658407 2862757 3055497 3165371 3354737 3444960 3536978
4005C536978J13897J44953p3590k70736k56155k15856k63689o0379j67289q7457
$$ 3536978 3650875 3795828 3722238 3451502 3195347 2979491 2715802 2655423 2488134 2400677
3995B400677j25084j15343j6432q1819j14348k1469K8650j0883k6511k5914k9606
$$ 2400677 2275593 2160250 2143818 2061999 1947651 1926182 1954832 1943949 1917438 1891524 1861918
3984A861918k3295o2229o2798k8349L2224k6826O796J5700l1149l9415K911R279
$$ 1861918 1838623 1776394 1713596 1685247 1717471 1690645 1697441 1713141 1681992 1642577 1645488 1654767
3972A654767k3357q429j2075K1120k9814l9944k9847j2093K25k2807M596K6738
$$ 1654767 1631410 1622981 1610906 1632026 1602212 1562268 1532421 1520328 1520553 1497746 1502342 1529080
3960A529080q4275J0469J4543N9796L7993j785l6805J3092r3149P9294j2765m1340
$$ 1529080 1444805 1455274 1469817 1529613 1567606 1565821 1529016 1542108 1448959 1528253 1515488 1474148
3948A474148J5624L4940k2875k4238j2683P6333n5422k5342l9815N871k8425Q627
$$ 1474148 1489772 1524712 1501837 1477599 1464916 1541249 1485827 1460485 1420670 1426541 1398116 1406743
3936A406743N1245N3015L083j5567L6978j8373k8221R924l0109l1583j7790R3586
$$ 1406743 1457988 1511003 1514086 1498519 1535497 1517124 1488903 1498827 1468718 1437135 1419345 1512931
3924A512931J5829M64O6792P6424l6902k6005K9568J0170k8254j5426J326J2282
$$ 1512931 1528760 1529224 1596016 1672440 1635538 1609533 1639101 1649271 1621017 1605591 1606917 1619199
3912A619199Q38L874L3796l3388L6648L8966L2221r12K8286l7117k5563J666Q3848
$$ 1619199 1620037 1623911 1657707 1624319 1660967 1699933 1732154 1731242 1759528 1722411 1696848 1698514 1782362
3899A782362m3225K5825l685m311l6455L2475L9712l3624J0038J6505M8316O8112
$$ 1782362 1739137 1764962 1761277 1756966 1720511 1752986 1792698 1759074 1769112 1785617 1833933 1902045
3887A902045l1204N5093k9052m5246J3521J00934j4696O5579K4687n2552j7390
$$ 1902045 1870841 1925934 1896882 1851636 1865157 1966091 1951395 2016974 2041661 1989109 1971719
3876A971719N1034K9229l5193M9302N2526K095N3654O9792o7773L1373k1286L764
$$ 1971719 2022753 2051982 2016789 2066091 2118617 2120712 2174366 2244158 2176385 2207758 2186472 2190236
3864B190236O861L4056O2502N1324N5371N8523J6707J6589K3422l6443J5571Q1004
$$ 2190236 2197097 2231153 2293655 2344979 2400350 2458873 2475580 2492169 2515591 2479148 2494719 2575723
3852B575723O3401J04443M0886j8850P2154J63980M3505K4427J09489J68230Q9779
$$ 2575723 2639124 2743567 2784453 2765603 2837757 3001737 3045242 3069669 3179158 3347388 3437167
3841C437167Q3642Q2347K20441J74954K05457K07006J83168J65693Q4563P6654
$$ 3437167 3520809 3603156 3823597 3998551 4204008 4411014 4594182 4759875 4844438 4921092
3831D921092l0661r4570j38721r3072q4817o8759j838j2791j1206K4200P416O9825
$$ 4921092 4890431 4795861 4657140 4564068 4479251 4410492 4408654 4395863 4384657 4408857 4416273 4486098
3819D486098J2821N0696P0082R2139J22000J11502P5927R9389O7880M1143R4425
$$ 4486098 4498919 4549615 4619697 4711836 4833836 4945338 5021265 5120654 5188534 5229677 5324102
3808E324102J79508N4360J47841R8972J24370Q2787R5832N8395J42805J62958
$$ 5324102 5503610 5557970 5705811 5804783 5929153 6011940 6107772 6166167 6308972 6471930
3798F471930Q2752L9820J43894J64151J54515J33009J15211O5611P9529J49347
$$ 6471930 6554682 6594502 6738396 6902547 7057062 7190071 7305282 7370893 7450422 7599769
3788G599769R3019J70735J40675J27864J75495J72943J59153J97402J74775K69469
$$ 7599769 7692788 7863523 8004198 8132062 8307557 8480500 8639653 8837055 9011830 9281299
3778I281299J36326K14658J72485R7525J96649L29295K06249K19485L16993L10675
$$ 9281299 9417625 9632283 9804768 9902293 10098942 10428237 10634486 10853971 11170964 11481639
3768A1481639K33803K87225L36930K92192K83571M18470L36792M32487M36498
$$ 11481639 11715442 12002667 12339597 12631789 12915360 13333830 13670622 14103109 14539607
3759A4539607L97718L92687M83543N52700M52144N36837O32811O52865O86631
$$ 14539607 14937325 15330012 15813555 16366255 16818399 17355236 17988047 18640912 19327543
3750A9327543P49205P60920Q69062Q63431R32918J106585J117125J103648J263160
$$ 19327543 20076748 20837668 21706730 22570161 23503079 24609664 25726789 26830437 28093597
3741B8093597J410506J527873J564653J649796J758217J830603J927777K042726
$$ 28093597 29504103 31031976 32596629 34246425 36004642 37835245 39763022 41805748
3733D1805748K193379K339656K412894K479296K541243K598554K593083K561327
$$ 41805748 43999127 46338783 48751677 51230973 53772216 56370770 58963853 61525180
3725F1525180K443377K071483J495021Q13871N2211m99818q16584r56665r04916
$$ 61525180 63968557 66040040 67535061 68348932 68401143 67901325 67084741 66128076 65223160
3716F5223160j070643j065767j087514j161182j206819j317572j446167j480356
$$ 65223160 64152517 63086750 61999236 60838054 59631235 58313663 56867496 55387140
3708E5387140j542534j486748j502771j554633j574714j511191j464748j463121
$$ 55387140 53844606 52357858 50855087 49300454 47725740 46214549 44749801 43286680
3700D3286680j454369j435821j407207j368293j301828j289217j230693j241862
$$ 43286680 41832311 40396490 38989283 37620990 36319162 35029945 33799252 32557390
3692C2557390j171872j124795j145392j059328r94903j010033r71269q72915p72290
$$ 32557390 31385518 30260723 29115331 28056003 27061100 26051067 25079798 24206883 23434593
3683B3434593q94954p74477p21093o59215o68727o31008n92438n53246n36425
$$ 23434593 22539639 21765162 21044069 20384854 19716127 19085119 18492681 17939435 17403010
3674A7403010m46609n36963m83339m39341l95264l55967l63458m20854m06094
$$ 17403010 16956401 16419438 15936099 15496758 15101494 14745527 14382069 13961215 13555121
3665A3555121l19791l82342k67519k70641l43673l36714l09614k67629k37480
$$ 13555121 13235330 12852988 12585469 12314828 11971155 11634441 11324827 11057198 10819718
3656A0819718k41118k69871k60549k53830k28890k34868k74743j75759j74237
$$ 10819718 10578600 10308729 10048180 9794350 9565460 9330592 9055849 8880090 8705853
3647H705853k26253k29259j72255j58361j09850k29703j63995j47857j25814j43697
$$ 8705853 8479600 8250341 8078086 7919725 7809875 7580172 7416177 7268320 7142506 6998809
3637F998809j13602j28536q1844j48064n2757j16822j37274l703j69581j11272
$$ 6998809 6885207 6756671 6674827 6526763 6474006 6357184 6219910 6216207 6046626 5935354
3627E935354j44206o8405m7987o8414p8589j3630p9232K8139j20275o5015o2400
$$ 5935354 5791148 5722743 5674756 5606342 5527753 5514123 5434891 5463030 5342755 5277740 5215340
3616E215340m6405K4658m3739o6269l3320k3046J2244p489j3676m2813O09O6435
$$ 5215340 5168935 5193593 5149854 5083585 5050265 5027219 5039463 5031974 5018298 4975485 4976094 5042529
3604E042529M2396p998M0722N8086L0941R4438J36554R8723J9666J35720J00433
$$ 5042529 5084925 5076927 5117649 5175735 5206676 5301114 5437668 5536391 5556057 5691777 5792210
3593E792210J19174K00058K55278K44755L06615L78122M08814M27571N93068O87381
$$ 5792210 5911384 6111442 6366720 6611475 6918090 7296212 7705026 8132597 8725665 9413046
3583I413046P88583R88807J023343J046624J236706J267179J264991J127040P70488
$$ 9413046 10201629 11190436 12213779 13260403 14497109 15764288 17029279 18156319 18926807
3574A8926807J24309l29436p90350j181893j544522j554718j428554j177860j018821
$$ 18926807 19051116 18721680 17931330 16749437 15204915 13650197 12221643 11043783 10024962
3565A0024962q43488o98045o26801m15585l83146l35295k54211k21354k85880
$$ 10024962 9181474 8483429 7856628 7441043 7057897 6722602 6468391 6247037 5961157
3556E961157k74911j66212j87596j03398j49908j72243j35707j04896o0849j51771
$$ 5961157 5686246 5520034 5332438 5229040 5079132 4906889 4771182 4666286 4605437 4453666
3546D453666q6725m7843n4186o0360m2232o4175p8641p0012j6820n2648q2715
$$ 4453666 4366941 4319098 4264912 4204552 4162320 4098145 4019504 3949492 3932672 3880024 3797309
3535C797309J8707m2163k6948l1081k7188M0619j0181J4994m0723r974j7827L1456
$$ 3797309 3816016 3773853 3746905 3715824 3688636 3729255 3719074 3734068 3693345 3683371 3665544 3697000
3523C697000j7690r450l0812k7574J0995j6000M4048j1139l2090K7519j3317L7867
$$ 3697000 3679310 3669860 3639048 3611474 3622469 3606469 3650517 3639378 3607288 3634807 3621490 3659357
3511C659357J0132L9358O7381L2082L5971J1998j9670M3605L6061m4936L3876
$$ 3659357 3669489 3708847 3776228 3808310 3844281 3856279 3836609 3880214 3916275 3871339 3905215
3500C905215R8431K0987N0767M3677O6880M946L3621O7175L7011K9821Q6365O7909
$$ 3905215 4003646 4024633 4075400 4119077 4185957 4190903 4224524 4291699 4328710 4358531 4444896 4512805
3488D512805q828J7259R7233R0550P7072R6716J26315O595J08692R3108N5023
$$ 4512805 4503977 4521236 4618469 4709019 4786091 4882807 5009122 5015717 5124409 5217517 5272540
3477E272540Q3537R2721J06054R4916J47018N9576R6373J13359Q9720Q4632J48515
$$ 5272540 5356077 5448798 5554852 5649768 5796786 5856362 5952735 6066094 6155814 6240446 6388961
3466F388961L5740J68975J82005J35566J06324J14517K14027J45965P9643J81696
$$ 6388961 6424701 6593676 6775681 6911247 7017571 7132088 7346115 7492080 7571723 7753419
3456G753419J22582J98914K20532J11042J81369J32524J41906J26668J98860K19226
$$ 7753419 7876001 8074915 8295447 8406489 8587858 8720382 8862288 8988956 9187816 9407042
3446I407042K44848K53827J90332K50677K82709K08331K11161L01989L25745L08244
$$ 9407042 9651890 9905717 10096049 10346726 10629435 10837766 11048927 11350916 11676661 11984905
3436A1984905L35307L54712L29256M36095M24844M43442M24023N08437N52489
$$ 11984905 12320212 12674924 13004180 13440275 13865119 14308561 14732584 15241021 15793510
3427A5793510N09163O10800O05366P59734P70320P58703Q03690R93452J067516
$$ 15793510 16302673 16913473 17518839 18278573 19048893 19807596 20611286 21604738 22672254
3418B2672254J267629J371984J514028J744799J915937K113041K367873K779179
$$ 22672254 23939883 25311867 26825895 28570694 30486631 32599672 34967545 37746724
3410C7746724K976644L531949M208255M885960N215093N451570N592316N823896
$$ 37746724 40723368 44255317 48463572 53349532 58564625 64016195 69608511 75432407
3402G5432407N664368N540228L886154R19867k224998l789178l106587k364550
$$ 75432407 81096775 86637003 90523157 91443024 89218026 85428848 82322261 79957711
3394G9957711j765187r33992k0551P46354J577418K208947K617501K915841L115780
$$ 79957711 78192524 77258532 77237981 77984335 79561753 81770700 84388201 87304042 90419822
3385I0419822L198793L119603K846341K416430J610854Q29000l5692r14684j626364
$$ 90419822 93618615 96738218 99584559 102000989 103611843 104440843 104405151 103490467 101864103
3376A01864103k071860k357006k383504k479700k588804k660848k725754k614271
$$ 101864103 99792243 97435237 95051733 92572033 89983229 87322381 84596627 81982356
3368H1982356k433626k272538j960280j704010j642954j785589j962277k160630
$$ 81982356 79548730 77276192 75315912 73611902 71968948 70183359 68221082 66060452
3360F6060452k288530k221724k020341j958886j865436j781113j811578j948466
$$ 66060452 63771922 61550198 59529857 57570971 55705535 53924422 52112844 50164378
3352E0164378k062307k144741k100497j947278j910018j771354j682959j679056
$$ 50164378 48102071 45957330 43856833 41909555 39999537 38228183 36545224 34866168
3344C4866168j656270j660295j617612j609613j500869j355106j188932j145905
$$ 34866168 33209898 31549603 29931991 28322378 26821509 25466403 24277471 23131566
3336B3131566j102045r34273r03219q12998p58244p35270o34723n44100n30847
$$ 23131566 22029521 21095248 20192029 19379031 18620787 17885517 17250794 16706694 16175847
3327A6175847n37248n38135m73722m64706m18139l27318m64247m21492l47658
$$ 16175847 15638599 15100464 14626742 14162036 13743897 13416579 12952332 12530840 12183182
3318A2183182k82808k48930l52196l67634l30084k17918k06483k35546k56403
$$ 12183182 11900374 11651444 11299248 10931614 10601530 10383612 10177129 9941583 9685180
3309I685180j68771k28284j91794j76798k13104j99369j66506j90160j69779j86943
$$ 9685180 9516409 9288125 9096331 8919533 8706429 8507060 8340554 8150394 7980615 7793672
3299G793672j72009j56420k40707p0478p9301j45746j27022j28261j10298j70462
$$ 7793672 7621663 7465243 7224536 7154058 7074757 6929011 6801989 6673728 6563430 6392968
3289F392968j20188r2648l7952j16471j29849j53544k01662q3835q7714q6532
$$ 6392968 6272780 6180132 6142180 6025709 5895860 5742316 5540654 5456819 5369105 5282573
3279E282573j11088l8689o7480o8006p6252m8287j05611q6897n7737j17639j7012
$$ 5282573 5171485 5132796 5065316 4997310 4921058 4872771 4767160 4680263 4622526 4504887 4487875
3268D487875p2386j22609j9060k5276q4932r7087l7556J487j9395l9034l8722
$$ 4487875 4415489 4292880 4273820 4248544 4163612 4066525 4028969 4030456 4011061 3972027 3933305
3257C933305j02116l2197J091n4122m1793k4917o7258n9347k111J8032l3850l1117
$$ 3933305 3831189 3798992 3800083 3745961 3704168 3679251 3611993 3552646 3550535 3568567 3534717 3503600
3245C503600L2419k9798j1327o716O222m7736m9192l0625k3893k6697k5860o1957
$$ 3503600 3536019 3506221 3494894 3488178 3494400 3446664 3397472 3366847 3342954 3316257 3290397 3228440
3233C228440q8287k1653k1795k3642j7146k2977n75l9566K8880j6958j4749o1608
$$ 3228440 3140153 3118500 3096705 3073063 3055917 3032940 3032365 2992799 3021679 3004721 2989972 2928364
3221B928364L2458k5810m2772k1370k5165m4533q7258l7923n1720m8797m7204
$$ 2928364 2960822 2935012 2892240 2870870 2845705 2801172 2713914 2675991 2624271 2575474 2528270
3210B528270j9497j6039K1820k0586k3666m0679O541m8587j02604n1885L7966
$$ 2528270 2508773 2492734 2514554 2493968 2470302 2429623 2436164 2387577 2284973 2233088 2271054
3199B271054n6063o2636Q018L2773m1465N470K0963j23218j7437l5174m9889M407
$$ 2271054 2214991 2152355 2160373 2193146 2151681 2157151 2178114 2054896 2037459 2002285 1952396 1956803
3187A956803R037m0410k5151o230j30918k8196j0439j430j4052j5715j2686l5563
$$ 1956803 1965840 1925430 1900279 1894049 1763131 1734935 1724496 1723066 1709014 1693299 1680613 1645050
3175A645050l311n2476J5970N3885q7173L9487M7509m1908N649n7507m9989L567
$$ 1645050 1641739 1589263 1605233 1659118 1571945 1611432 1658941 1617033 1622682 1565175 1515186 1518753
3163A518753m2377j2673O4620J3665N3698j5571j1063m7884n8826O1568N5258
$$ 1518753 1476376 1463703 1528323 1541988 1595686 1580115 1569052 1521168 1462342 1523910 1579168
3152A579168o2395K4541L2868K8552q3585K429P5818J4428R3010k7964J8445J05303
$$ 1579168 1516773 1541314 1574182 1602734 1519149 1521578 1597396 1611824 1704834 1676870 1695315 1800618
3140A800618L6601j9013m3202J9415O0653Q4984J43726J0130N6808Q8483M3337
$$ 1800618 1837219 1818206 1775004 1794419 1855072 1940056 2083782 2093912 2150720 2239203 2282540
3129B282540l1624R0945R0172O5040l2682o3693J0132j3380o5176q9132m0512
$$ 2282540 2250916 2341861 2432033 2497073 2464391 2400698 2410830 2397450 2332274 2243142 2202630
3118B202630j48509m6585j34740n2030q4773j24898n9199j2549O9215m7778n7805
$$ 2202630 2054121 2007536 1872796 1820766 1735993 1611095 1551896 1539347 1608562 1560784 1502979
3107A502979n0956j3165k9609q2644K3562n7639l0671M9325o866o4303n0690P193
$$ 1502979 1452023 1438858 1409249 1326605 1350167 1292528 1261857 1311182 1304316 1240013 1189323 1196516
3095A196516n3890J1320m0028n0802M1910p579k9242J6511k2269K7655o2058m2560
$$ 1196516 1142626 1153946 1113918 1063116 1105026 1097447 1068205 1084716 1062447 1090102 1028044 985484
3083I85484K6449j9464O2841K3048l5969J7250j6120O3150L4525k3086N774M6727
$$ 985484 1011933 992469 1055310 1078358 1042389 1059639 1043519 1106669 1141194 1118108 1123882 1170609
3071A170609O8647M0831m5577K5176R794p613J9106k0431M0664k2813p2591m6068
$$ 1170609 1239256 1280087 1234510 1259686 1269480 1261867 1280973 1260542 1301206 1278393 1205802 1159734
3059A159734J6984n991J9265L0380j6623M022L4446m1893j658K9200j421M709
$$ 1159734 1176718 1170727 1189992 1220372 1203749 1207771 1242217 1200324 1198666 1227866 1226445 1231154
3047A231154j0214l2259o0459p7295l7564K6946j5928J0190J7236J5604K8195
$$ 1231154 1220940 1188681 1128222 1050927 1013363 1040309 1024381 1034571 1051807 1067411 1095606
3036A095606r207j1290m9260n3385M4259m253k3830K8444j3670p623l0717J0581
$$ 1095606 1086399 1075109 1025849 972464 1016723 1012470 988640 1017084 1003414 995791 965074 975655
3024I75655l5509p2178K9994K6395L1981k0788p5262J824k3048l9378K2705o874
$$ 975655 940146 867968 897962 924357 956338 935550 860288 862112 839064 799686 822391 815517
3012H15517P515J1108o2896o2055l6022k6642L2623N7002P2960l8320j01273K5270
$$ 815517 823032 834140 771244 709189 673167 646525 679148 736150 809110 770790 669517 694787
3000F94787o7131L249j5569N2775j1709M7516k4207p9175M5997K9353J9010m7497
$$ 694787 627656 630905 615336 668111 656402 703918 679711 600536 646533 675886 694896 647399
2988F47399J1546j5079n048j1671K1860k9971o0340k3239K1810l7276P004k3546
$$ 647399 658945 643866 638818 627147 649007 619036 558696 535457 557267 519991 526995 503449
2976E03449P2349m6364j6771m4926l0061K7463Q1660K4502o2687j8637l5497J8381
$$ 503449 575798 529434 512663 467737 437676 465139 546799 571301 508614 489977 454480 472861
2964D72861K251K2610l8509J366l0268K4583l7302K7016j6891L1079j1671o450
$$ 472861 475112 497722 459213 460579 430311 454894 417592 444608 427717 458796 447125 440675
2952D40675m244n861o7486Q2144k376j3051j3433m2685k636J0388n701K8569K0956
$$ 440675 436431 430570 363084 445228 442852 429801 416368 373683 371047 381435 375734 404303 425259
2939D25259J8707j4279n9376Q185J1684P5870j387J3814l4934J4422m9075J294
$$ 425259 443966 429687 370311 378496 390180 466050 464663 478477 443543 457965 408890 410184
2927D10184l6495k6129N1458n7634K7175N3226j6997l5953O0233p71q2334L8818
$$ 410184 373689 347560 399018 341384 368559 421785 404788 368835 429068 428297 345963 384781
2915C84781j6296K4781n5085l7041k2231K7603L4528K5579m4358J3012o1471k0169
$$ 384781 368485 393266 338181 301140 278909 306512 341040 366619 322261 335273 273802 253633
2903B53633m5394J2066M4726m4224o781K9738k715K4938l5940J6909O9727n6439
$$ 253633 208239 220305 265031 220807 214026 243764 241049 265987 230047 246956 316683 260244
2891B60244k7387J4052L6902L068p784K2542m5247m1313L4131J3479m660m6597
$$ 260244 232857 246909 283811 286879 279095 301637 256390 215077 249208 262687 258027 211430
2879B11430j0154K8260l0221O629M8183j2854q885p977j0277j2720L0991p0596
$$ 211430 201276 229536 199315 205944 254127 241273 232388 224411 214134 201414 232405 161809
2867A61809L3068J4439N4695L2321K5961K7826m3046o5051k6086m8320j748P4785
$$ 161809 194877 209316 264011 296332 322293 350119 307073 242022 215936 167616 165868 240653
2855B40653j7795n808k3649K4319O76o6187l0510O4837j872J2387K3582k7674
$$ 240653 222858 217050 193401 217720 218396 152209 121699 186536 184664 197051 220633 192959
2843A92959N440l0089n7217N7015J3695J7220K890k2929m04K5260K0831j747l2236
$$ 192959 198399 168310 111093 168108 181803 199023 201913 178984 178580 203840 224671 222924 190688
2830A90688L2521l3249n0225l486M0025O5645n3783j80K0689K2981K1260J2059
$$ 190688 223209 189960 139735 136249 176274 241919 188136 187956 208645 231626 252886 264945
2818B64945l2407M1882p3456O4155q950k1439J9310K2709J7193M2502M947k6213
$$ 264945 232538 274420 200964 265119 256169 234730 254040 276749 293942 336444 341391 315178
2806C15178r936K9254r12l1142Q2143L4077N4693l7831l2897r812k2778M1412
$$ 315178 305242 334496 333584 302442 384585 418662 473355 435524 402627 392815 370037 411449
2794D11449O0954l8244k964M9030L8203J1666j8322P302Q8204M2157J3712Q0241
$$ 411449 472403 434159 431195 480225 518428 530094 511772 519074 607278 649435 663147 743388
2782G43388K5498O8423O3124J11207P2494J48138J22787J07470J29847J28150
$$ 743388 768886 837309 900433 1011640 1084134 1232272 1355059 1462529 1592376 1720526
2772A720526Q2558m5960n4402j26968j68791j33382j16073j04847p0916j85233
$$ 1720526 1803084 1757124 1702722 1575754 1406963 1273581 1157508 1052661 981745 796512
2762G96512o7796k2863n6660q6883J1144k8473m8637l69l7732N548l6317o2250
$$ 796512 728716 705853 649193 562310 573454 544981 496344 495975 458243 463791 427474 365224
2750C65224M8987L7321r0328r2764k4676N4249n2802l166M3175j7324m838J4980
$$ 365224 414211 451532 361204 268440 243764 298013 245211 242045 285220 267896 263058 278038
2738B78038r738j867J9316l7682J0513M1426m940k5569j6707L7850m2120m3613
$$ 278038 268300 266433 285749 248067 258580 300006 295066 269497 252790 290640 248520 204907
2726B04907j2711n00J3740n7190J8017J7829K4220K6376Q271p4179J0226l1542
$$ 204907 192196 191696 205436 148246 166263 184092 208312 234688 242959 168780 179006 147464
2714A47464Q441Q208J0586j1284K3999l9686m2228M4780l453O000K076m5697K4334
$$ 147464 155905 164113 174699 163415 187414 147728 105500 150280 146827 152827 154903 109206 133540
2701A33540j1569J5265L3314o8556j4576P002K2803L8717j0881l3408o078j1870
$$ 133540 121971 137236 170550 101994 87418 94420 117223 155940 145059 111651 105573 93703
2689I3703R9535k1609o6030j2583j8966K280O3969j6275K0815j3967J2839j5350
$$ 93703 193238 171629 105599 93016 74050 76330 140299 124024 144839 130872 143711 128361
2677A28361n3043J4991L2749j389J2218k3568L5221J3067l2924J8709J0452j5691
$$ 128361 75318 90309 123058 121669 133887 110319 145540 158607 125683 144392 154844 139153
2665A39153n070j9513J2545l199j3814K1206k1725M1377m1292m0784K2147J1461
$$ 139153 134083 114570 127115 123916 110102 131308 109583 150960 109668 68884 91031 102492
2653A02492M0489M7542l8391o5819q721L3283o012K8363j5082N7951J5328n7275
$$ 102492 142981 190523 152132 86313 77592 110875 104863 133226 118144 176095 191423 134148
2641A34148L4294n2151k2037O7380k3007n1672j8697J3626J6144K5083L906l0040
$$ 134148 168442 116291 94254 161634 138627 86955 68258 81884 98028 123111 127017 96977
2629I6977O7150L2173n2331l0399M0860L4326m0013n0934M3566K1336p275P306
$$ 96977 164127 196300 143969 113570 154430 188756 148743 97809 141375 162711 155436 162742
2617A62742M9448p5128k2542K1981m1201r316L0424j7692l4196O9353l0625J2893
$$ 162742 212190 137062 114520 136501 95300 85984 116408 98716 64520 133873 103248 116141
2605A16141m1701N351P5832m2129l5346o184J1210k071L767j3131J6735k541J0596
$$ 116141 74440 79791 155623 113494 78148 71964 83174 81103 84870 71739 88474 85933 96529
2592I6529J5537n3922K9651O095k3356P378L372L7953J7513o3179m1012p423r859
$$ 96529 112066 58144 87795 93890 70534 77912 81284 119237 136750 73571 32559 25136 15277
2579A5277K2885J02631k7346l2400M139K3443O528l0372k7674J9272M3381j0358
$$ 15277 38162 140793 113447 81047 85186 108629 115157 84785 57111 76383 119764 109406
2567A09406j0276p024P434j9555j4279O301J8070J9529L0288K0038K9422l0553
$$ 109406 99130 92106 99540 79985 65706 72007 90077 109606 139894 159932 189354 158801
2555A58801r025k6045m7715K8155K6347j7319j227n3654o2656L4923N423P1457
$$ 158801 149776 123731 76016 104171 130518 113199 111972 58318 -4338 30585 36008 107465
2543A07465J3631l8289K4422J7365l4187m3023k4197M0534K973L6064P6877J1290
$$ 107465 121096 82807 107229 124594 90407 47384 23187 63721 66694 102758 179635 190925
2531A90925j3964q7888n9246O6729J4899M8288q526n9351J8920K2671k552m1130
$$ 190925 176961 89073 29827 96556 111455 159743 151217 91866 110786 133457 130905 89775
2519H9775j2373N243P260l0977M2618m1148O6417M355j12686L1484M1182N288
$$ 89775 77402 82645 89905 58928 101546 60398 126815 131170 18484 49968 91150 96438
2507I6438o742K5669K1499J1703K4885k5064j745m593R617q1906L8417m238O512
$$ 96438 89696 115365 136864 148567 173452 148388 146643 142050 151667 69761 108178 103940 110452
2494A10452K7158l180L0341K8185l9809K3334k4985n5051K0528M9138m5201o2723
$$ 110452 137610 134430 164771 192956 153147 176481 151496 96445 116973 166111 120910 58187
2482E8187K1586M5975m3185L4323K9261j0532K6492p768J9120N317k4521Q792
$$ 58187 79773 125748 82563 116886 146147 135615 162107 154339 173459 178776 154255 163047
2470A63047J2810K7194O5597P43o5438j3830K819k7550L0552m9293j2897R058
$$ 163047 175857 203051 268648 269391 203953 190123 192942 165392 195944 146651 133754 142812
2458A42812J5967n997O4528m784N1581o3078K1169l7948k4061K2462j3311o1788
$$ 142812 158779 152782 217310 212526 264107 201029 222198 184250 160189 182651 169340 107552
2446A07552J08807J2819R748l4908J6936p4062K1218j821k0573N7491k3625j435
$$ 107552 216359 229178 238926 204018 220954 146892 168110 166289 145716 203207 179582 178147
2434A78147L4192m8198j5486K308n3251L9848J652K1492L4956l3601K195m1281
$$ 178147 212339 164141 148655 150963 97712 137560 139212 160704 195660 162059 164254 122973
2422A22973m1566K2483J4905N1361l1958N854q8433l4475l4810N7059M592K8259
$$ 122973 81407 103890 118795 170156 138198 144052 55619 21144 -13666 43393 47985 76244
2410G6244J7213J4591l1624l2165k5833k0475O9425M4734l4668J2115m5034j8440
$$ 76244 93457 108048 76424 44259 18426 -2049 67376 112110 77442 89557 44523 26083
2398B6083j0121P449L7149J2549l6759K1556L2076r90l3272O0360K2087N197o2082
$$ 26083 15962 23411 60560 73109 36350 57906 89982 88992 55720 116080 138167 143364 81282
2385H1282p1509k785N2287J9733r639o6034M80P6K1317M5787O374k3380l5891
$$ 81282 9773 6988 59275 79008 69369 3335 3815 3891 25208 70995 77369 53989 18098
2372A8098K7142r689n030j20m3617N5498j4099l1004Q395J3337M5342k7795m6361
$$ 18098 45240 35551 30521 30401 -13216 42282 28183 -2821 5574 18911 64253 36458 -9903
2359i903M5142J8392P7492m0433l5311K3609p2024m1279P704L8753P3084Q913
$$ -9903 35239 53631 131123 90690 55379 78988 6964 -34315 -26611 12142 85226 94139
2347I4139j5443r800q3294J3623K1177j4475J5903k3905m1579O1912m924n730
$$ 94139 78696 68896 -14398 -775 20402 5927 21830 -2075 -43654 18258 13334 7604
2335G604m4314R0248j4829J3428o8491J3861K3301K1632l8333K7452k7406P0650
$$ 7604 -36710 53538 38709 52137 -16354 -2493 20808 42440 4107 31559 4153 74803
2323G4803J6742M4412k8680p4966o8661O2048r160p124M4176k1637J6661K5065
$$ 74803 91545 135957 107277 32311 -36350 25698 16538 9414 53590 31953 48614 73679
2311G3679p8262m1132O0763K4094M4733L4755m622K8478l5780n8346m3170Q779
$$ 73679 -4583 -45715 15048 39142 83875 118630 114008 142486 106706 48360 5190 13969
2299A3969O0000j3977J7467k7248O3519L136M26k204K4511o7357L8601m5401M3223
$$ 13969 73969 59992 77459 50211 113730 116866 117292 115088 139599 72242 110843 65442 108665
2286A08665J0429k071j4775m3677o663L1170k7683J3835l8436N4273l6764o189
$$ 108665 119094 117023 102248 58571 51908 83078 55395 69230 30794 85067 48303 42114
2274D2114m7429Q4269N9525l2937n8017k1183M8758m8000J8308k2744j4700M7141
$$ 42114 -5315 78954 138479 105542 47525 26342 75100 27100 45408 22664 7964 55105
2262E5105L3402K6985m3737k2748L4419l1429K681L6880j9916R358O2631k481
$$ 55105 88507 115492 71755 49007 83426 51997 54678 91558 71642 81000 143631 141150
2250A41150j58o7403N5101K0151m0279L263O966J6539N3822n054o895j6972m7003
$$ 141150 140992 73589 128690 148841 108562 111825 118791 135330 189152 184098 177203 160231 113228
2237A13228K9710O411j1087o3964J556K6115J4466O3683o185j1991k663J1079
$$ 113228 142938 149349 138262 74298 75854 101969 116435 180118 173933 161942 159279 170358
2225A70358q1890M8498M2664p0178j1179o278J9179N6842l8273K5761K3669k3788
$$ 170358 88468 136966 179630 109452 98273 91995 111174 168016 129743 155504 179173 155385
2213A55385l3983L7841J598k845n4356N7003P9261m5052J5696L3058J6323O079
$$ 155385 121402 159243 160841 157996 103640 160643 239904 194852 210548 243606 259929 266008
2201B66008l7529m2209n4004L6695m641k1424K3498N243M56L6248p454k1903J1575
$$ 266008 228479 186270 132266 168961 164320 142896 166394 171637 172093 208341 200887 178984 190559
2188A90559M9247J7272j415q750o2055M7073m0214l7293O2201j3361L3155J192
$$ 190559 239806 257078 255663 246913 184858 231931 191717 154424 216625 203264 236419 237611
2176B37611r2927M3782J1235K4209L9578J0276l418K941j9477O0021J2583K95
$$ 237611 144684 188466 199701 223910 263488 273764 270346 273287 253810 313831 326414 326709
2164C26709o1397K2854J6554L7589n0763O043J7025L9716O337q742k885K340n6482
$$ 326709 265312 288166 304720 342309 291546 297589 314614 354330 360667 351925 349040 351380 294898
2151B94898l9062m326M8729K6885o827J5953j5885R692R479K8332M6873l5844
$$ 294898 255836 251510 300239 327124 320297 336250 320365 330057 339536 367868 414741 378897
2139C78897m2999n9499j5453P0406k7339Q2158n0307l596j7346Q5804o1160j1834
$$ 378897 335898 276399 260946 331352 304013 386171 335864 332268 314922 400726 339566 327732
2127C27732j7648L6262K5769k6114k0662K6507o93L4655o8917j2434L0539n0900
$$ 327732 310084 346346 372115 346001 325339 351846 351153 385808 316891 304457 334996 284096
2115B84096j8046J4875K9272L2099l1638R070m2076k5763k9151m5256M8240O9224
$$ 284096 266050 280925 310197 342296 310658 319728 277652 251889 222738 177482 225722 294946
2103B94946m3515k2795P5351n2485n7087j8859K2433j396P127L7728N287r3272
$$ 294946 251431 228636 303987 251502 194415 175556 197989 196593 203720 241448 246735 153463
2091A53463K4220j4343L2756n1754o3467L1867K1455J7555J6672r1203J6074K467
$$ 153463 177683 163340 196096 144342 80875 112742 134197 151752 168424 77221 93295 95762
2079I5762J7363l1416L5679J1179n1930k3426L9624j5655j0242o379N1014l0529
$$ 95762 113125 81709 117388 128567 76637 53211 92835 77180 66938 60559 111573 81044
2067H1044J3697Q960L4280l4514Q7570n1798J9652j1880q1875M4858j9080m4419
$$ 81044 94741 103701 137981 103467 191037 139239 158891 147011 65136 109994 90914 46495
2055D6495L572l248J4111O126Q065M0520l1423J3588P4763L8120n3024p8556o8003
$$ 46495 50067 46819 60930 67056 75121 115641 84218 97806 172569 210689 157665 79109 11106
2042A1106J10986l2757K8961p24M803l8680K1346l5676L4749k9013K0473J7240
$$ 11106 122092 89335 118296 117572 122375 83695 105041 69365 104114 75101 95574 112814
2030A12814K1391j4644O130J4504j908k2134j6042n2620M3243L7439n1986l4459
$$ 112814 134205 119561 125691 140195 138287 116153 100111 47491 90734 128173 76187 41728
2018D1728J18345m274L6750q105K159M324m3346Q041j3705k9753k967M0356j6702
$$ 41728 160073 155799 192549 184444 186603 190927 147581 155622 141917 112164 109197 149553 132851
2005A32851l7514O3873K4004L4976K0544P686K0348O1953J6977j7757P3991l6920
$$ 132851 95337 159210 183214 218190 238734 246420 266768 328721 345698 327941 401932 365012
1993C65012l4266o6396O1657J3047j32351k1889O9250P679L1263l6383r176m3098
$$ 365012 330746 264350 326007 339054 206703 184814 254064 261743 293006 256623 247447 204349
1981B04349j0875L5332J1655j0833L9298l5656R5527k4839l9482J5603M1450l2640
$$ 204349 193474 228806 240461 229628 268926 233270 328797 303958 264476 280079 321529 288889
1969B88889P5929L0584K516O9041j6090L1738L11L7135L7306r2805l276k0940
$$ 288889 364818 395402 397918 466959 450869 482607 482918 520053 557359 464554 461278 440338
1957D40338n2679j94l1365p4599n3407K142L8964J6318k9221o050O5281q3070
$$ 440338 387659 387465 356100 281501 228094 230236 269200 285518 256297 250247 315528 232458
1945B32458L0572k0128m3763N1031K464j9410L1947K8677n0679M4054j6440m5508
$$ 232458 263030 242902 199139 250170 252634 233224 265171 293848 243169 287223 270783 225275
1933B25275N708L8184J4981J3277j5019K9203j3112m9324k6265k7072K347k9136
$$ 225275 230983 269167 284148 297425 282406 311609 298497 249173 222908 195836 198183 169047
1921A69047l9774L4060j13382J7364j3322L7365J8071M8146k7347n9034P186J9865
$$ 169047 129273 163333 49951 67315 53993 91358 109429 157575 130228 71194 78380 98245
1909I8245M633K3911l7809L5476m4133l4864J9144M541m2727j5194L6269M4542
$$ 98245 102878 126789 88980 124456 80323 45459 64603 69144 26417 11223 47492 92034
1897I2034j6752J2068o3114J280J4035o1761J4242n1365N9291J1895J3017j4909
$$ 92034 75282 87350 24236 25516 39551 -22210 -7968 -59333 -42 11853 24870 9961
1885I961K7508k8482n554J1895k1770J2360l6731k1894L5314J6758N2423O653
$$ 9961 37469 8987 3433 15328 -6442 5918 -30813 -52707 -17393 -635 51788 58441
1873E8441m2631m7008P0672k5767L2171L996m4540J9574K8528k4515K9022M3072
$$ 58441 15810 -31198 39474 13707 45878 49874 5334 24908 53436 28921 57943 101015
1861A01015n895j22374N603L6443M9644j07474n9678L9740O1240J9139J9872L6064
$$ 101015 95120 -27254 -21651 14792 64436 -43038 -102716 -62976 -1736 17403 37275 73339
1849G3339j4764R496n513k9739q719M1391o0518m827l7420m026K4485o7058O6915
$$ 73339 58575 68071 62558 32819 24100 65491 4973 146 -37274 -41300 -16815 -83873 -16958
1836a6958Q0626L7456J6727r763L593q9292k6428J7349P7804m6715J5133k3497
$$ -16958 63668 101124 117851 108088 111681 22389 -4039 13310 91114 44399 59532 36035
1824C6035K1849M723R957Q141p320l9811L2487O7601l5372n4646J03986K9432
$$ 36035 57884 62607 72564 80705 73385 33574 66061 133662 98290 43644 147630 177062
1812A77062L5873k9453J3196Q712J9330k3738K8141N1831l4742k0493K2842J04584
$$ 177062 212935 183482 196678 205390 224720 200982 229123 280954 246212 225719 248561 353145
1800C53145k2993n6405O0720L1945o90j7602m786L5021O9892q375m1648N7079
$$ 353145 330152 273747 334467 366412 365722 348120 343334 378355 448247 439872 398224 455303
1788D55303j8725k2093k8177L9652Q355K0057L5541n9919k1273M2756k7689K3169
$$ 455303 436578 414485 386308 425960 434315 454372 489913 429994 408721 451477 423788 446957
1776D46957M555L7678K68N0390L6553R9905j3346N2026J7525n1264M85N4144L3367
$$ 446957 451512 489190 489458 539848 576401 676306 662960 714986 732511 681247 681732 735876 769243
1763G69243j6430n335m777q213n9926n6136L2296n2403J9292m9673k2516j1528
$$ 769243 752813 747478 742701 734488 674562 618426 650722 598319 617611 567938 545422 533894
1751E33894J1692L2576j4886k6987j2459l0398l6909O5648j2482j2962K4754l0998
$$ 533894 545586 578162 563276 536289 523830 493432 456523 522171 509689 496727 521481 490483
1739D90483K2143J5910j2973N0182p6022n3824m4235J5177K1129k878k325K2702
$$ 490483 512626 528536 515563 565745 489723 435899 391664 406841 427970 425092 422767 445469
1727D45469n2463k6533m339J7077o169j2275l1357R8145N934p5931L4456n7039
$$ 445469 393006 366473 362134 379211 373042 360767 329410 427555 433489 357558 392014 334975
1715C34975o3653n2174m495L4954o9979K4596m0965l2579K9733P6530j6008J4206
$$ 334975 271322 219148 214653 249607 179628 204224 163259 130680 160413 236943 220935 235141
1703B35141N1612l1693O940k3217r030j1852k9992M640J0590J842K5549J4152
$$ 235141 286753 255060 262000 238783 229753 217901 187909 192549 203139 204981 230530 244682
1691B44682k2265J4227p0268J4576N0926n4487j4584l1883J660R63l1046J7907
$$ 244682 222417 236644 166376 180952 231878 177391 162807 130924 132584 133547 102501 120408
1679A20408N3293k4643j2177j9487k6906k1541m1771N817J0697K0464Q5059m5747
$$ 120408 173701 149058 136881 117394 90488 68947 27176 32993 43690 64154 149213 103466
1667A03466k3450p4535P476j8058M0080k8509J1762L8841j5992k6246K4680l2627
$$ 103466 80016 5481 12957 -5101 34979 6470 18232 57073 41081 14835 39515 6888
1655F888j0974L5013m6754L561L5186j5365l1946j0776J2289k907M9783K8732
$$ 6888 -4086 30927 -15827 -12266 22920 7555 -24391 -35167 -22878 -25785 23998 52730
1643E2730m7273L724k7566l1737J2059L4144j3845J7380n7538J7886J1593L3730
$$ 52730 5457 9181 -18385 -50122 -38063 -3919 -17764 -384 -57922 -40036 -28443 5287
1631E287q9023n6900J6721M2195L7864M2856K6219n6840p7540N4643m2510L9191
$$ 5287 -83736 -140636 -123915 -81720 -43856 -1000 25219 -31621 -109161 -54518 -97028 -57837
1619e7837l4339k0566k3705N2540M5489j0648J953L0962J7814j3782k3842l6234
$$ -57837 -92176 -112742 -136447 -83907 -38418 -49066 -47113 -16151 1663 -12119 -35961 -72195
1607g2195J7470j6133o901k1148P536J722J3355N6101O4429o7516l7509Q180O1801
$$ -72195 -54725 -70858 -77759 -98907 -91371 -89649 -76294 -20193 44236 -23280 -60789 -52609 9192
1594I192k4529o0132o1832M1547L7439K9278L9152n3698j3771R600k2725l6940
$$ 9192 -15337 -75469 -137301 -95754 -58315 -29037 10115 -43583 -57354 -47754 -70479 -107419
1582a07419j1943L9851j5026m7412O7963j9601k7751Q8700n7692K848N524r848
$$ -107419 -119362 -79511 -94537 -141949 -73986 -93587 -121338 -32638 -90330 -87482 -81958 -91806
1570i1806K1954K1237L8873o2442l8141M9500k8092L4464q547k3787O314j294
$$ -91806 -69852 -48615 -9742 -72184 -110325 -60825 -88917 -54453 -63000 -86787 -80473 -81767
1558h1767J3966L1542m117N3332k7162K2946n1675l5203q447l0116N3036M1592
$$ -81767 -67801 -36259 -40376 12956 -14206 8740 -42935 -78138 -86585 -116701 -63665 -22073
1546b2073k4303N110k9087M8141m0156m3214L8124K8951l3483n535K1366n1050
$$ -22073 -46376 -41266 -70353 -22212 -62368 -105582 -67458 -38507 -71990 -77525 -56159 -107209
1534a07209l346L1269K834j269O5897j3777j0835K4133o795o4470O5205l7168
$$ -107209 -110555 -79286 -76452 -77721 -11824 -25601 -36436 -12303 -19098 -83568 -18363 -55531
1522e5531n3531M6247N6910m8297o3943N3040l867n4172M2525L6158q0071P1478
$$ -55531 -109062 -62815 -5905 -54202 -118145 -65105 -68972 -123144 -80619 -44461 -124532 -53054
1510e3054L1051n7662M0902n6097N9680K709j4339O638k0237K2149K4177r0935
$$ -53054 -22003 -79665 -38763 -94860 -35180 -32471 -46810 -40172 -60409 -38260 -14083 -105018
1498a05018M5052N469j2917p465M1019j5771n4543L9149J428j995J2773J8624
$$ -105018 -59966 -54497 -67414 -74879 -33860 -49631 -104174 -65025 -63597 -65592 -52819 -34195
1486c4195K7166l4688o1403j3183P0944n0333j1945M8921L2211n1584J945R029
$$ -34195 -7029 -41717 -103120 -116303 -45359 -95692 -107637 -58716 -26505 -78089 -76144 -67115
1474f7115k7824K2832K0747K2090J0396J7958n6284J1798m985J8387J244n4348
$$ -67115 -94939 -72107 -51360 -29270 -18874 -916 -57200 -45402 -50387 -32000 -30756 -85104
1462h5104j3158J8393K3538M0444P123j4647p4538J587M593k0132K9038P6522
$$ -85104 -98262 -79869 -56331 -15887 -8764 -23411 -97949 -96362 -91769 -111901 -82863 -6341
1450f341j7580p1720l7499N06O5586l6845L2541n547j193K5035k3926n866K4386
$$ -6341 -23921 -95641 -133140 -132634 -67048 -103893 -71352 -76899 -78092 -53057 -76983 -82849 -58463
1437e8463K5512k9318O843m3061M8725l2710J5122L3456q3835l489M6164r447
$$ -58463 -32951 -62269 -55426 -98487 -49762 -82472 -67350 -33894 -117729 -121218 -75054 -84501
1425h4501Q2787m1230N639l7070k7691N6539N305k4789R627K228K5533P69o3655
$$ -84501 -1714 -42944 -37305 -74375 -102066 -45527 -40222 -65011 -55384 -53156 -27623 -26854 -90509
1412i0509n057o784J348k415j4710K2494L5043o5690l0806j0075J6770O7232L7217
$$ -90509 -95566 -102350 -101002 -103417 -118127 -95633 -60590 -126280 -157086 -167161 -150391 -83159 -45942
1399d5942M4653m615j1854m5519J9729J4960q6265L1329K987k6349l7082k772
$$ -45942 -1289 -5904 -17758 -63277 -43548 -28588 -114853 -83524 -80537 -106886 -143968 -146740
1387a46740O5820L9473l7615N4922j655j7709R58k0588l2674k9700L875l477o2940
$$ -146740 -80920 -41447 -79062 -24140 -25795 -43504 -42546 -63134 -95808 -125508 -121633 -125110 -188050
1374a88050M1105J1433N9627L9199k0820r057k3923m1365K5773L8921n4576l0384
$$ -188050 -146945 -135512 -75885 -36686 -57506 -66563 -90486 -131851 -106078 -67157 -121733 -152117
1362a52117N0492J8861L5892n0237N7958J6502K828O205k6331J1102P291J57j599
$$ -152117 -101625 -82764 -46872 -97109 -39151 -22649 -19821 -13616 -39947 -28845 -21554 -21397 -22996
1349b2996M230n6146L1251l2676J4878n7842l5729J7141N7936l6608j1401j3327
$$ -22996 -18766 -74912 -43661 -76337 -61459 -119301 -155030 -137889 -79953 -116561 -127962 -141289
1337a41289r257O5577K8724p9136J8355O00J2803J3189O4094p678K2860J3590
$$ -141289 -150546 -84969 -56245 -135381 -117026 -116426 -103623 -90434 -26340 -34018 -11158 2432
1325B432J3123Q8m3523j7800j2402J3175L0432l0863l6933K3817J2734k4251j4990
$$ 2432 15555 15643 -27880 -45680 -58082 -44907 -14475 -45338 -82271 -58454 -45720 -69971 -84961
1312h4961j0077j5845J4099O134k6864N4399O3376m4897K0234j8473l9292K7036
$$ -84961 -95038 -110883 -96784 -90650 -117514 -63115 261 -44636 -24402 -42875 -82167 -55131
1300e5131R0606r481l8916J745l7820o33K8928K793n771m9249k7606J5997K3961
$$ -55131 35475 25994 -12922 -11177 -48997 -49630 -20702 -17909 -23680 -72929 -100535 -84538 -60577
1287f0577j0225l1239k23M0204m993R085O8649q414n0255K55k7196K154K9197
$$ -60577 -70802 -102041 -102264 -62060 -67053 -57968 10681 2267 -47988 -47733 -74929 -72775 -43578
$$ [...]
##END NTUPLES=NMR SPECTRUM
##END=
