##TITLE=1H_CA-8848-2
 DMSO, 8 sc, 
 28.04.2021
##JCAMPDX= 6.0         $$ Bruker NMR JCAMP-DX V2.0
##DATA TYPE= NMR SPECTRUM
##DATA CLASS= NTUPLES
##ORIGIN= UXNMR, Bruker Analytische Messtechnik GmbH
##OWNER= root
$$ XWIN-NMR		Version 3.5
$$ Wed Apr 28 14:43:34 2021 Russian Standard Time (UT+4h)  she@DPX200
##.OBSERVE FREQUENCY= 200.131506
##.OBSERVE NUCLEUS= ^1H
##.ACQUISITION MODE= SIMULTANEOUS
##.ACQUISITION SCHEME= undefined
##.AVERAGES= 8
##.DIGITISER RES= 18
##SPECTROMETER/DATA SYSTEM= spect
##.PULSE SEQUENCE= zg30
##.SOLVENT NAME= CDCl3
##.SHIFT REFERENCE= (INTERNAL, CDCl3, 0, 16.048)
##AUDIT TRAIL= $$ (NUMBER, WHEN, WHO, WHERE, WHAT)
$$ ##TITLE= Audit trail, XWIN-NMR		Version 3.5
$$ ##JCAMPDX= 5.01
$$ ##ORIGIN= Bruker BioSpin GmbH
$$ ##OWNER= she
$$ F:/spectra/data/she/nmr/H-F/1/pdata/1/auditp.txt
$$ ##AUDIT TRAIL=  $$ (NUMBER, WHEN, WHO, WHERE, WHAT)
(   1,<2021-04-28 14:42:44.65 +0400>,<she>,<DPX200>,
      <created by zg, POWCHK disabled, PULCHK disabled
       configuration hash MD5:
       00 E9 B6 7A A2 85 ED C7 34 08 36 98 17 FE 4E 26
       data hash MD5: 16K
       BF 6D 68 81 79 0C AC 28 8C A1 B9 D2 30 07 1F 8A>)
(   2,<2021-04-28 14:42:47.14 +0400>,<she>,<DPX200>,
      <Start of raw data processing
       efp BC_mod = 2 LB = 0.24 FT_mod = 6 PKNL = 1 PHC0 = -11125.98 PHC1 = 14.80102 SI = 16K 
       data hash MD5: 16K
       EA 32 0A 7D 31 70 A0 34 C6 EC 30 39 59 40 CA F6>)
(   3,<2021-04-28 14:43:01.76 +0400>,<she>,<DPX200>,
      <pk PHC0 = -0.3861849 PHC1 = -0.6000003 
       data hash MD5: 16K
       ED 60 C3 5F E0 8C F1 41 9D 0B B3 C1 DA 5E 66 7C>)
(   4,<2021-04-28 14:43:04.87 +0400>,<she>,<DPX200>,
      <abs ABSG = 5 
       data hash MD5: 16K
       1F 81 34 A8 B4 DD EB AF 71 A6 DF 7D 5A BD B6 DB>)
$$ ##END=
$$ 
$$ hash MD5
$$ E5 3E B0 B7 E0 1B 60 BB 9C A4 34 5C D5 DD 53 C0
##$RELAX= 
##$RELAX= 
##$RELAX= 
##$RELAX= 
##$RELAX= 
##$RELAX= 
$$ Bruker specific parameters
$$ --------------------------
##$DU= <F:/spectra>
##$EXPNO= 1
##$NAME= <H-F>
##$PROCNO= 1
##$TYPE= <nmr>
##$USER= <she>
##$AMP= (0..31)
100 100 100 100 100 100 100 100 100 100 100 100 100 100 100 100 100 100 
100 100 100 100 100 100 100 100 100 100 100 100 100 100 
##$AQSEQ= 0
##$AQ_mod= 1
##$AUNM= <au_zg>
##$AUTOPOS= <>
##$BF1= 200.13
##$BF2= 200.13
##$BF3= 200.13
##$BF4= 200.13
##$BF5= 200.13
##$BF6= 200.13
##$BF7= 200.13
##$BF8= 200.13
##$BYTORDA= 1
##$CFDGTYP= 0
##$CFRGTYP= 5
##$CHEMSTR= <none>
##$CNST= (0..31)
1 1 145 1 1 1 1 1 1 1 1 1 1 1 1 1 1 1 1 1 1 1 1 1 1 1 1 1 1 1 1 1 
##$CPDPRG= <>
##$CPDPRG1= <>
##$CPDPRG2= <>
##$CPDPRG3= <>
##$CPDPRG4= <mlev>
##$CPDPRG5= <mlev>
##$CPDPRG6= <mlev>
##$CPDPRG7= <mlev>
##$CPDPRG8= <mlev>
##$CPDPRGB= <>
##$CPDPRGT= <>
##$D= (0..31)
0 1.2 0 0 0 0 0 0 0 0.06 0 0.03 0 0 0 0 0.0002 0 0 0 0 0 0 0 0 0 0 0 0 
0 0 0 
##$DATE= 1619606564
##$DBL= (0..7)
120 120 120 120 120 120 120 120 
##$DBP= (0..7)
150 150 150 150 150 150 150 150 
##$DBP07= 0
##$DBPNAM0= <>
##$DBPNAM1= <>
##$DBPNAM2= <>
##$DBPNAM3= <>
##$DBPNAM4= <>
$$ [...]
##$SUBNAM3= <"">
##$SUBNAM4= <"">
##$SUBNAM5= <"">
##$SUBNAM6= <"">
##$SUBNAM7= <"">
##$SUBNAM8= <"">
##$SUBNAM9= <"">
##$SW= 16.9725357007746
##$SWIBOX= (0..15)
0 0 2 0 0 0 0 0 0 0 0 0 0 0 0 0 
##$SW_h= 3396.73913043478
##$TD= 16384
##$TD0= 1
##$TE= 0
##$TE2= 300
##$TE3= 300
##$TEG= 300
##$TL= (0..7)
0 120 120 120 120 120 120 120 
##$TP= (0..7)
150 150 150 150 150 150 150 150 
##$TP07= 0
##$TPNAME0= <>
##$TPNAME1= <>
##$TPNAME2= <>
##$TPNAME3= <>
##$TPNAME4= <>
##$TPNAME5= <>
##$TPNAME6= <>
##$TPNAME7= <>
##$TPOAL= (0..7)
0.5 0.5 0.5 0.5 0.5 0.5 0.5 0.5 
##$TPOFFS= (0..7)
0 0 0 0 0 0 0 0 
##$TUNHIN= 0
##$TUNHOUT= 0
##$TUNXOUT= 0
##$USERA1= <user>
##$USERA2= <user>
##$USERA3= <user>
##$USERA4= <user>
##$USERA5= <user>
##$V9= 5
##$VALIST= <valist>
##$VCLIST= <CCCCCCCCCCCCCCC>
##$VD= 0
##$VDLIST= <DDDDDDDDDDDDDDD>
##$VPLIST= <PPPPPPPPPPPPPPP>
##$VTLIST= <TTTTTTTTTTTTTTT>
##$WBST= 1024
##$WBSW= 4
##$XGAIN= (0..3)
0 0 0 0 
##$XL= 0
##$YL= 0
##$YMAX_a= 778262
##$YMIN_a= -705221
##$ZGOPTNS= <>
##$ZL1= 120
##$ZL2= 120
##$ZL3= 120
##$ZL4= 120
##$ABSF1= 16.04801
##$ABSF2= -0.924654
##$ABSG= 5
##$ABSL= 3
##$ALPHA= 0
##$AQORDER= 0
##$ASSFAC= 0
##$ASSFACI= 0
##$ASSFACX= 0
##$ASSWID= 0
##$AUNMP= <proc_1d>
##$AZFE= 0.1
##$AZFW= 0.1
##$BCFW= 0
##$BC_mod= 2
##$BYTORDP= 0
##$COROFFS= 0
##$CY= -3
##$DATMOD= 1
##$DC= 0
##$DFILT= <>
##$DTYPP= 0
##$F1P= 0
##$F2P= 0
##$FCOR= 1
##$FTSIZE= 16384
##$FT_mod= 6
##$GAMMA= 0
##$GB= 0
##$INTBC= 1
##$INTSCL= 1.334414e-10
##$ISEN= 128
##$LB= 0.24
##$LEV0= 0
##$LPBIN= 0
##$MAXI= 10000
##$MC2= 0
##$MEAN= 0
##$ME_mod= 0
##$MI= 1.114404
##$NCOEF= 0
##$NC_proc= -6
##$NLEV= 6
##$NOISF1= 3.799351
##$NOISF2= 2.8
##$NSP= 0
##$NTH_PI= 0
##$NZP= 0
##$OFFSET= 16.04801
##$PC= 1
##$PHC0= -11126.37
##$PHC1= 14.20102
##$PH_mod= 1
##$PKNL= yes
##$PPARMOD= 0
##$PSCAL= 0
##$PSIGN= 0
##$REVERSE= no
##$SF= 200.129992682189
##$SI= 16384
##$SIGF1= 3
##$SIGF2= 2
##$SINO= 5.538805
##$SIOLD= 16384
##$SREGLST= <1H.CDCl3>
##$SSB= 0
##$STSI= 16384
##$STSR= 0
##$SW_p= 3396.73913043479
##$SYMM= 0
##$S_DEV= 0
##$TDeff= 16384
##$TDoff= 0
##$TI= <>
##$TILT= no
##$TM1= 0
##$TM2= 0
##$TOPLEV= 0
##$USERP1= <user>
##$USERP2= <user>
##$USERP3= <user>
##$USERP4= <user>
##$USERP5= <user>
##$WDW= 1
##$XDIM= 16384
##$YMAX_p= 391335960
##$YMIN_p= -474507
$$ End of Bruker specific parameters
$$ ---------------------------------
##NTUPLES= NMR SPECTRUM
##VAR_NAME=  FREQUENCY,     SPECTRUM/REAL,   SPECTRUM/IMAG
##SYMBOL=    X,             R,               I
##VAR_TYPE=  INDEPENDENT,   DEPENDENT,       DEPENDENT
##VAR_FORM=  AFFN,          ASDF,            ASDF
##VAR_DIM=   16384,         16384,           16384
##UNITS=     HZ,            ARBITRARY UNITS, ARBITRARY UNITS
##FACTOR=    0.207333158178282, 1,           1
##FIRST=     3211.68809833442, 0,            0
##LAST=      -185.051032100372, 0,           0
##MIN=       -185.051032100372, -474507,     0
##MAX=       3211.68809833442, 391335960,    0
$$ Real data points
##PAGE= N=1
##DATA TABLE= (X++(R..R)), XYDATA
$$ [...]
7789B0659343o6200j10132k79509k61878k01590k47642n7076l10383l15995l41648
7779A8467290o39113p18883p86382q40747q12420q01290r60997p29041p23923
7770A1454494n93724n92105o90716m88448l07791m13126l05525l81147l15305
7761G366607l27903l78871k64676j97714k19827O710k42721l38208k08132j32705
7751E062560j55596j03928m772j49217j85468k896o5889L5325j06383j61601j0036
7740D152099r0374n6972l5236j18474j66929n4688l6677j14462l4152R2200q3108
7729C453227r7931j72200r323l5039k8850j61445r7577j7102O700J75815p5883
7718B940392n783o7586n1931R463j3221N983N3214Q1054o7127q7221N6366P9367
$$ y = [20659343, 20593143, 20483011, 20203502, 19941624, 19740034, 19492392, 19435316, 19124933, 18808938, 18467290, 17828177, 17109294, 16322912, 15482165, 14669745, 13868455, 12907458, 12178417, 11454494, 10860770, 10268665, 9577949, 9089501, 8781710, 8368584, 8063059, 7681912, 7366607, 7038704, 6659833, 6395157, 6197443, 5977616, 5984326, 5741605, 5403397, 5195265, 5062560, 4906964, 4803036, 4798264, 4649047, 4463579, 4460683, 4394794, 4430119, 4323736, 4162135, 4152099, 4061725, 4004753, 3969517, 3851043, 3684114, 3629426, 3592749, 3478287, 3444135, 3536335, 3453227, 3355296, 3183096, 3173773, 3138734, 3109884, 2948439, 2850862, 2833760, 2840460, 3016275, 2940392, 2934609, 2867023, 2815092, 2824555, 2811334, 2817317, 2870531, 2951585, 2884458, 2797237, 2853603, 2932970]
7706B932970K665p3469Q29J2343M588M2270O5429l0364j19378n189R8332L44j12292
7693B819078q5709J565P0285k1215M3643n5157o794Q4191L68M9708J10267l155
7681C007075K18779J09946j7886j34436K9076J56909Q7788J01963j4596O0248
7671C604866j7302l14j7493Q229m1991j46255J38647J13302o7196j08121J06849
7660C573221M3371o0850J53023K071m7832j5152m2369m5465J46416R0967p6063
7649C721338R7100R9694Q4290O6933O7806O4337J51417N114J92671J21741J67216
7638D839657R1453J88679J03369R7962J69594R8578K24896J72277K40684L39418
7628F566567N9186K01771M78013K75167K08386K96379L11180L12330L24698L00663
$$ y = [2932970, 2935635, 2862166, 2862995, 2875338, 2879926, 2922196, 2987625, 2957261, 2837883, 2832694, 2931026, 2931370, 2819078, 2733369, 2734934, 2805219, 2784004, 2827647, 2772490, 2765696, 2849887, 2850255, 2899963, 3010230, 3007075, 3225854, 3335800, 3317914, 3183478, 3212554, 3369463, 3457251, 3559214, 3544618, 3604866, 3587564, 3587250, 3569757, 3577986, 3535995, 3389740, 3528387, 3641689, 3574493, 3466372, 3573221, 3616592, 3555742, 3708765, 3710836, 3663004, 3647852, 3605483, 3560018, 3706434, 3797401, 3721338, 3818438, 3918132, 4002422, 4069355, 4137161, 4201498, 4352915, 4358029, 4550700, 4672441, 4839657, 4931110, 5119789, 5223158, 5321120, 5490714, 5589292, 5814188, 5986465, 6227149, 6566567, 6625753, 6827524, 7305537, 7580704, 7789090, 8085469, 8396649, 8708979, 9033677, 9334340]
7618I334340L08076L95435M19349M51985M59197M34227M33718K97977M31255L90277
7608A3355836K15840J23257J07641p9846J9986O0230j08273r4739L2808M8527
7598A3681267O4048Q5761j8592j86556k55819l02210k11221k18029l85109k36443
7588A2017097n0300j09680k06023m6292K12162P6279J57762J97439J82544J86901
7578A2617889K57704M14317M42592N36383O02061M88329N21421N47357O01836
7569A7029889O13692O88054O22542N37008M02117M09944K53183J2920K8691j3705
7559B0584335j81608k70146l14149j29637j96958k30671k71566m90173n25616
7550A7973811m96055o68646o98232n69028p38017p82400p06201n47448n67103
$$ y = [9334340, 9642416, 10037851, 10457200, 10909185, 11368382, 11802609, 12236327, 12534304, 12965559, 13355836, 13571676, 13694933, 13802574, 13722728, 13742714, 13802944, 13694671, 13599932, 13632740, 13681267, 13745315, 13831076, 13812484, 13625928, 13370109, 13067899, 12856678, 12638649, 12253540, 12017097, 11966797, 11857117, 11651094, 11604802, 11816964, 11893243, 12051005, 12248444, 12430988, 12617889, 12875593, 13289910, 13732502, 14268885, 14870946, 15359275, 15880696, 16428053, 17029889, 17643581, 18331635, 18954177, 19491185, 19893302, 20303246, 20556429, 20569349, 20598040, 20584335, 20402727, 20132581, 19818432, 19688795, 19491837, 19261166, 18989600, 18499427, 17973811, 17477756, 16809110, 16110878, 15541850, 14803833, 14021433, 13315232, 12767784, 12200681]
7541A2200681n03318l53903m12538l51989k02571j34382o4146r6085j26052p4739
7531I880958k5188Q7419R4016O5810J45453J93878J39931P0235Q2834K33872L14016
7520A1283234J43858q5261r2421j82385l03808j58429j80437k82778k19796r0335
7510I831442j13572p8864j69595k59856l29571l90140m44044m30105m25972m15050
7500F774673l80381l02144l39497l24353l44733l01544k16248j13270j08964k46824
7490D096715k42512j89773j61420j05959p1163j59669j36347j11165j42256j20761
7480B655690o9111l2452o7712q5767K7883n6129L1131j05144j29012r9859M8606
7469B118124q2052q6498q9291m4493j06042p5752J1015j5285m1434k0785L9578
$$ y = [12200681, 11697363, 11343460, 10930922, 10578933, 10376362, 10241980, 10177834, 10081749, 9955697, 9880958, 9855770, 9943189, 10037205, 10103015, 10248468, 10442346, 10582277, 10652512, 10735346, 10969218, 11283234, 11427092, 11341831, 11249410, 11067025, 10763217, 10604788, 10424351, 10141573, 9921777, 9831442, 9717870, 9639006, 9469411, 9209555, 8879984, 8489844, 8045800, 7615695, 7189723, 6774673, 6394292, 6092148, 5752651, 5428298, 5083565, 4782021, 4565773, 4452503, 4343539, 4096715, 3854203, 3664430, 3503010, 3397051, 3325888, 3166219, 3029872, 2918707, 2776451, 2655690, 2586579, 2554127, 2486415, 2400648, 2428531, 2372402, 2403533, 2298389, 2169377, 2069518, 2118124, 2036072, 1949574, 1860283, 1815790, 1709748, 1633996, 1645011, 1629726, 1588292, 1567507, 1607085]
7458A607085j40688n3781R897m00N1596p753j21632N378L3899p6535n4224N0219
7446A303061L4546k0514j30935O4990l2720p2563j93196J0218K1380q4118J9456
7435I19605p7728j29791J13730P102o6292o5714m5674L7786o0806r8875O6061
7424E99404p4478O8383Q1743n0991J0359j7647J27247k6345q9104l5496j31078
7413D61997k206L8065L7759k8285K6075p9995j10134k3857M0493p6372q6592n2319
7401A44629K6351P2060M3720m2371p5585n0661P5804J11190l1175j5818R0805
7390C48949l6066O683K1684L3532N4934k4480J24937j05490j33737q363p461l0976
7378B44146o174m7047Q512p9327O5215j04873p0644J08488l3660j5993O8936j3834
$$ y = [1607085, 1466397, 1412616, 1422513, 1422113, 1473709, 1465956, 1344324, 1349702, 1383601, 1307066, 1252842, 1303061, 1337607, 1317093, 1186158, 1251148, 1218428, 1145865, 952669, 962887, 984267, 900149, 919605, 841877, 712086, 825816, 832918, 766626, 700912, 655238, 693024, 632218, 533343, 599404, 524926, 593309, 675052, 624061, 634420, 616773, 744020, 717675, 628571, 593075, 461997, 459791, 497856, 535615, 507330, 533405, 453410, 343276, 319419, 359912, 283540, 196948, 144629, 170980, 243040, 286760, 244389, 168804, 118143, 193947, 305137, 273962, 258144, 348949, 312883, 319566, 341250, 374782, 429716, 405236, 530173, 424683, 290946, 282583, 275122, 244146, 237972, 190925, 199437, 120110, 185325, 80452, 9808, 118296, 84636, 68643, 137579, 123745]
7366A23745l1668N1019m9064m7188Q3058l7784n761M4380M05l4690J9621p3430
7354D2643k6573m099L4761K8101k6148m0326J38573l5420j36015n3362J8822l2856
7342i1899O8121j5300K7534J1965q9730J11049R3124L7765n8844j0523M4115k0571
7330A06806k9799k1942p0373n6766n092Q4619Q8345l6435j6788J0597r0101m7020
7318h3949K4575l6741r2244J16807J1369j25955J67691K9620k3850M9074J26364
7307A62761J0087n0188l1933J21417j10637l1773J00531K273L8852r9013j17798
7296e421p3880O5530J7483r0141m8556L9377M1379j9173m2041p2083k2970Q7493
7284a23003L8391p7106m8185J07908j4671R7046K6794N4134N4476k5760P8268
$$ y = [123745, 92077, 143096, 94032, 46844, 129902, 92118, 86357, 130737, 131142, 96452, 116073, 42643, 16070, 11971, 46732, 74833, 48685, 8359, 146932, 111512, -24503, -77865, -59043, -91899, -23778, -39078, -11544, 421, -89309, 21740, 114864, 152629, 93785, 83262, 127377, 106806, 77007, 55065, -15308, -72074, -77166, 7453, 95798, 59363, 42575, 53172, -36929, -83949, -59374, -96115, -188359, -71552, -60183, -186138, -18447, 11173, -12677, 36397, 162761, 172848, 122660, 90727, 212144, 101507, 69734, 170265, 172538, 211390, 112377, -5421, -79301, -13771, 3712, -86429, -134985, -95608, -54229, -73402, -115443, -187526, -210496, -123003, -84612, -161718, -209903, -101995, -116666, -19620, 7174, 61308, 115784, 90024, 168292]
7273A68292N8920m8840j14735o4315M1467M8074l0611o1308N0784L945p5866k7527
7261e1720O4954q3040J15574K1067j31374n076k6264n305N3466L268J11900o911
7249F0539M168L6937j5330l2695R6949K6621j5030j05615Q4310n9242l8939K1125
7237F3798k2724K697k1935k5321o2184J34564k1841q8336n7326K4905K4474l2712
7225h1941L8842K3351L5805J3866j9227j8266J1310j25290L4825P1646r696j6962
7213d1737q0318J26354J5359K1036N148m1607n0905J8466m9585J0055J26864j8848
7201D0282m8574l4691o8426Q9393L3643o3404j36075J18133Q4532P2484K680l1229
7189E8748N6038l5015k0222K5906L1229K5034p6054o1018j0395O6299P8466m4071
$$ y = [168292, 227212, 178372, 63637, -678, 40789, 88863, 58252, -3056, 47728, 51673, -24193, -51720, 13234, -69806, 45768, 66835, -64539, -69615, -95879, -101184, -47718, -44450, 67450, 60539, 64707, 101644, 86314, 53619, 150568, 177189, 162159, 56544, 140854, 81612, 42673, 63798, 41074, 43771, 21836, -3485, -65669, 68895, 47054, -41282, -98608, -73703, -49229, -81941, -43099, -19748, 16057, 29923, 10696, -7570, 3740, -121550, -86725, -15079, -24775, -41737, -122055, 4299, 19658, 40694, 45842, 4235, -46670, -28204, -77789, -67734, 59130, 40282, -8292, -42983, -111409, -22016, 11627, -51777, -187852, -69719, 14813, 87297, 89977, 58748, 114786, 79771, 59549, 85455, 116684, 141718, 65664, 4646, -5749, 60550, 139016, 94945]
7177I4945n7714o073M4076N9952r5754L7405Q3967q9576p4497J23677Q2862J313
7165B04583N6632q8869O4268l8038K0128P5507p9227J6874j03360p8383N3257
7154A03372J80450j01593n8118r96L8427j0001m6280l9855J09585l3527k3054
7143A18410J7793p6467N9308l6420L4952o8871j0691J5301l7547K5973O0416R9641
7131B01798P6667N952j8268L1833J3007p3274R2041o6607k2278M4460M2775n6256
7119B71850m044m1074j77013o3283O4927j5629Q2820J8431j21787K0241M0042
7108G5481r3767K1947N4363p3428Q8946O7056N965L7983N5915q7996j4590P8415
7096B16290j22090n9732m7255J7926L4086l8384k2967k8383O901o0432K2416J42442
$$ y = [94945, 37231, 31158, 75234, 135186, 39432, 76837, 160804, 71228, -3269, 120408, 203270, 204583, 261215, 172346, 236614, 198576, 218704, 294211, 214984, 231858, 128498, 50115, 103372, 283822, 182229, 124111, 123115, 161542, 151541, 105261, 65406, 174991, 141464, 118410, 136203, 59736, 119044, 82624, 117576, 48705, 38014, 53315, 15768, 41741, 102157, 201798, 278465, 284417, 266149, 297982, 310989, 237715, 329756, 263149, 240871, 285331, 328106, 271850, 267806, 226732, 49719, -13564, 51363, 35734, 118554, 136985, 15198, 35439, 75481, -18286, 3661, 58024, -15404, 73542, 140598, 146563, 184546, 240461, 152465, 137875, 216290, 94200, 34468, -12787, 5139, 39225, 841, -22126, -50509, -43608, -104040, -81624, 60818]
7084F0818j5633j667r4222Q2728q4295N5625n8898m6981j2438K3793P6502n808
7072b0476p7455O9791K4974j72307O1924P7265o8453j60436J34079P2864Q5726
7061B7496p2452q4901j9196N8029O4712j21386k4642J90657k8432L4923J056p2336
7049d6472q4510m0056m5108j7704Q9679l18K9079J9549O5590L4818L0087l6754
7037b120k14442n1301M0326J77421M1586J0937M9114O334l6062l48R752N2043
7025H3240j16225P16n4491k2074j3773J98988K1447j39881M0907l4444m2669k4832
7013a03091J34145L0720l4156j5278l1857n6392l3736K7651J61287k5012j29076
7002g4795J08780n8814l8902j2727j762L3603k1172M30J5164N1939o0209J1910
$$ y = [60818, 45185, 43518, -50704, 32024, -52271, 3354, -55544, -102525, -114963, -91170, -14668, -20476, -97931, -28140, -3166, -175473, -113549, -36284, -104737, -265173, -131094, -58230, 27496, -44956, -129857, -149053, -91024, -26312, -147698, -172340, 18317, -10115, 24808, 25864, -46472, -130982, -171038, -216146, -233850, -144171, -144489, -115410, -95861, -30271, 4547, 34634, -2120, -216562, -267863, -227537, -50116, -8530, 2407, 51521, 57855, 21793, 21445, 31197, 83240, -32985, -32269, -86760, -108834, -122607, 76381, 97828, -42053, -1146, -35590, -78259, -103091, 31054, 61774, 27618, 12340, -19517, -75909, -109645, -81994, 79293, 54281, -74795, 33985, -24829, -63731, -76458, -78220, -44617, -65789, -65359, -50195, 1744, -58465, -46555]
6990d6555j28151J9915P1594M5948n0598O4591N9567m2816m7199K7957m1103J5333
6978e1517k664n2160o9589l8295K7157O4123J0879m316m901j5057J61274l3943
6966i009r3476m9917q2216R6980M218j9715m7487J08723P2983N8226M629j05154
6954f1215L3565J05844j58533n1648P9809J6012Q7952r3227R1737N8155M4453
6943A52904r1787j07133l0478Q6067L014J47638J13420j76054L5802j19814k9940
6932a6361p3665j757K8663j13020J6922j7225K0533R7338J0620j10563N0010M6729
6920f1776K8114k5837L8813m402k5442k3499j72308M089M4108J43043K6330o5298
6908i4065n8554M498J5322J13499o9624m020L7289m3129M8049j0341j14159j108
$$ y = [-46555, -174706, -154791, -83197, -37249, -87847, -23256, 36311, -6505, -53704, -25747, -66850, -51517, -54181, -106341, -175930, -214225, -187068, -122945, -112066, -116382, -121283, -136340, 24934, -9009, -102485, -152402, -234618, -137638, -133420, -153135, -200622, -91899, -18916, 39310, 43939, -61215, -27650, 78194, -80339, -131987, -52178, -36166, 51786, -41441, 50296, 108451, 152904, 61117, -46016, -76494, 9573, 12587, 160225, 273645, 97591, 133393, 13579, -16361, -90026, -91783, -63120, -176140, -159218, -176443, -155910, -58572, -47952, -158515, -108505, -61776, -33662, -59499, -20686, -25088, -50530, -74029, -246337, -242248, -198140, -55097, -28767, -94065, -152619, -148121, -132799, -19300, -88924, -92944, -55655, -98784, -50735, -61076, -175235, -176343]
6896a76343J45011j29937o611k5335m7523P3125L228m7611J53753J9941r267L2435
6884a5134P1483J532o6795K5691m7096j6558j5974O5029p3062m7696j02072n9249
6872b79901J41530P0169k657J4771k5570r8486J74013k5018j30188J1253O6146
6861h3938J02571m1435L3467j07810k1676P9172K8521q2523J6149p2203n2058
6850b01763J52790R7869o518j38690K4152k4410N9765L0588p510k4920J1378O8008
6838D0739j05124J975J9275j28698J3910j05180J36151J79309m1464r5957J02689
6827A7625O6622o7696q1001K0834n8377J505K8793p3240l2357N4215J27596o6632
6815f2113j5076O9621K259j7596o159P9887L2344J1345L5411n4636l9247J24552
$$ y = [-176343, -31332, -161269, -167880, -193215, -240738, -167613, -164385, -211996, -58243, -38302, -47569, -15134, 56349, 57881, -8914, 16777, -30319, -46877, -62851, 2178, -70884, -118580, -220652, -279901, -138371, -68202, -70859, -56088, -81658, -180144, -6131, -31149, -161337, -150084, -83938, 18633, -22802, 10665, -97145, -118821, -39649, -11128, -93651, -77502, -149705, -201763, -48973, 48896, 42378, -96312, -72160, -96570, -36805, -6217, -13727, -38647, -27269, 40739, -64385, -62410, -43135, -171833, -157923, -263103, -126952, 52357, 10893, -85064, 17625, 84247, 16551, -64450, -43616, -101993, -100488, -71695, -144935, -177292, -123077, 4519, -62113, -77189, -7568, -5309, -22905, -29064, 50823, 83167, 94512, 129923, 75287, 36040, 160592]
6803A60592J6912n2708L5676j82904k2793K8752q8601N2703K0489q6733r872K2263
6791a06224J5862n9896m6178j1861K0325P3843J72066n2769p2394K9727L7297
6780b02l7328j4936R2602j2112o3439M1104m373n0745J30898l1083o9284r01J25811
6767A06012m9162K9195j03843n2766R3901j45178k9527N3361r8482N963R0585
6756i9941L6943M8086o5841K2875M5685K0402N8469k0728o7349N5647Q5424K691
6744A22363K7265M3826m9496k0500l9409j07742n5529O8037J0386j1330p1653
6733h3782m5407q3904J83551l9044r0916Q2137q3997j3514K781O5320M7977P419
6721e1379k9336J02936J9236l2188R1192J5896n018n8812M7800n5904k0784N5909
$$ y = [160592, 177504, 124796, 160472, -22432, -45225, -16473, -105074, -52371, -31882, -118615, -128487, -106224, -90362, -150258, -196436, -208297, -187972, -114129, 57937, 5168, -67226, -37499, -202, -37530, -52466, 40136, 28024, -35415, 5689, 1316, -49429, 81469, 50386, -18898, -19799, 106012, 56850, 86045, -17798, -70564, 23337, -121841, -151368, -98007, -196489, -190526, -99941, -62998, -14912, -80753, -57878, -12193, 8209, 66678, 45950, -21399, 34248, 119672, 122363, 149628, 193454, 143958, 123458, 84049, -23693, -79222, -11185, -799, -12129, -83782, -129189, -213093, -29542, -68586, -159502, -77365, -161362, -174876, -172095, -106775, -58798, -51379, -80715, 22221, 41457, 9269, 100461, 116357, 111339, 52527, 100327, 44423, 23639, 79548]
6709G9548l240j53663M0307O2472q163J03719l1543j09656k6869l7095J01153
6698A6970L8677P3712k9377n9384J0783j5121N6422n9631q9613m736J22422N6219
6686A17343j90688N8091J19816k5333j7496l2527m8610K919o1020m7212L2226
6675i2491J17427Q1656p6708L1571P0440o5526J20792M5262j10671p3004l1715
6664A7033L7121K0213K9168r906k0284m1384K2169L1366O9347q6535K991j02760
6652c1461m5190R422O5567J5672r5081j31807J60248J45824r4393j506Q5928k8330
6640E4893k2097R7643Q7922r0427K5328L492K7792o2922N900N7647j13851M8677
6628A19997L9901j7108K584n4932o346k1674m968l4314L3137o7376K8610O8597
$$ y = [79548, 76308, -77355, -37048, 25424, 17261, 120980, 89437, -20219, -47088, -84183, 16970, 55647, 129359, 99982, 40598, 51381, 36260, 92682, 33051, -56562, -61298, 61124, 117343, -73345, -15254, 104562, 79229, 61733, 29206, -19404, -16485, -77505, -124717, -92491, 24936, 106592, 29884, 61455, 131895, 66369, 187161, 232423, 121752, 48748, 17033, 54154, 74367, 103535, 93629, 73345, 31961, 54130, 85496, 154843, 68308, 71299, -31461, -76651, -67229, -1662, 14010, -81071, -212878, -52630, 93194, -1199, -2705, 83223, 54893, 32796, 130439, 218361, 127934, 153262, 156754, 184546, 121624, 127524, 185171, 71320, 119997, 159898, 142790, 145374, 90442, 84096, 62422, 57454, 23140, 56277, -11099, 17511, 86108]
6616H6108k5291l9357R971l0833J09626Q3026j27448J20736J04370j70597n7321
6605F2990l7783Q5167M2621j82211L2473M6415m121k8531N7467J43100k5719r9206
6593I2662j28626J46365P0469r1877o938j06956L9516L2921J05139P0773q0893
6582A42555k4318j2253p0614m3354K0342M1258L9875l9591L7511l6581J2624p744
6570E9710J22651Q3377j36636R2794k584j27312m4153R3855J9343p896n2712k9262
6558G1175J12678l1225k0352r042l0147M2688j20555R4662l8522l6785p4247l4997
6546g4669M5577J05628K6826j05224Q3853k806j31758R0005J21697P722m2284
6535A24567J8671R9468L7135m1586J40207l7592j11419p4265L3828l5164M6983
$$ y = [86108, 60817, 21460, 31431, 598, 110224, 193250, 65802, 186538, 290908, 120311, 62990, 25207, 110374, 152995, -29216, 3257, 49672, 45551, 17020, 74487, 217587, 191868, 92662, -35964, 110401, 180870, 88993, 82055, -24901, 14615, 47536, 152675, 223448, 142555, 118237, 105984, 35370, -7984, 12358, 53616, 93491, 53900, 91411, 54830, 67454, 59710, 182361, 265738, 129102, 221896, 219312, 92000, 47847, 141702, 161045, 153149, 100437, 71175, 183853, 152628, 132276, 123234, 93087, 135775, 15220, 109882, 71360, 34575, -39672, -74669, -29092, 76536, 103362, -1862, 81991, 79185, -52573, 37432, 159129, 166851, 124567, 143238, 242706, 279841, 238255, 378462, 340870, 229451, 155186, 189014, 153850, 200833]
6524B00833p5729l2166M6290j00618P1191r103k6580O6901j3977K9659r471j15145
6512C2085R674Q0513l2827n7296J6570K0469Q2043q7747L245J08265J82854p3575
6500B84273l8291k0225j28157O181L8056J14341j4298l9472N4079l5164j01589
6489A19734m8615p745O3654j1571J4287o5879J4683l6229L4296k8010K3455M3706
6477A15766J6584o96j2645l1864O4936M8662l9113j60Q6443j6470q6174P4966
6465B20235j333o7821l0882O7982j8456k7635j4499L7197m2229k2560M3926j2428
6453A31497N9865R0062p1438m7232n5301l6522L550O5323Q7916j0912j63018k8589
6441B5201Q8415P7069k5011K3818q1144P0319J5429m0054j0882L4268m6097j1099
$$ y = [200833, 125104, 92938, 139228, 38610, 109801, 100698, 74118, 141019, 127042, 156701, 147230, 32085, 41759, 122272, 89445, 32149, 48719, 69188, 151231, 63484, 66729, 174994, 357848, 284273, 245982, 225757, 97600, 103781, 141837, 256178, 241880, 202408, 256487, 221323, 119734, 71119, 63374, 127028, 115457, 129744, 63865, 78548, 42319, 76615, 48605, 72060, 115766, 132350, 131654, 119009, 87145, 152081, 200743, 161630, 161470, 247913, 231443, 145269, 220235, 218902, 151081, 120199, 188181, 169725, 142090, 127591, 164788, 122559, 99999, 143925, 131497, 191362, 281424, 209986, 162754, 107453, 70931, 74481, 139804, 227720, 216808, 53790, 25201, 113616, 190685, 165674, 189492, 108348, 178667, 194096, 154042, 143160, 177428, 131331, 120232]
6429A20232K8746k5719k0173J22487k5614m4974M4694K0582j36038L9794N1170
6418A75187j9010J49547l5460N130O5096J09J6021j44058R5878l6276o0749o06
6406B10809k0877R8015p1774q1120k8172J2626P0381j9680m441P0903O4472J75811
6394D76953p6194n2308k3854N5641p4386o3455Q0503R4715n6118j35706L5028
6383B60819M1841q8979J8053j11947r707M889k8530O1372p1099k4031K8346J26847
6371B07874M5635m5435m1181O6404N1556r8369l7533J01392J04427K1160Q463
6360C84393j60230O317J10482P838P9702l0740j12604N5402o1270m949M8400r3323
6348B29418q8473J99L4284k8553J21984m1498r5583R7329K5341p8369p702M909
$$ y = [120232, 148978, 123259, 103086, 225573, 199959, 154985, 199679, 220261, 84223, 124017, 175187, 156177, 305724, 270264, 275394, 340490, 340599, 356620, 212562, 308440, 272164, 211415, 210809, 189932, 287947, 216173, 135053, 106881, 119507, 189888, 170208, 165767, 236670, 301142, 476953, 400759, 348451, 324597, 380238, 305852, 242397, 322900, 417615, 361497, 225791, 260819, 302660, 213681, 231734, 119787, 110080, 114969, 86439, 147811, 76712, 52681, 81027, 207874, 253509, 208074, 166893, 233297, 284853, 186484, 148951, 250343, 354770, 375930, 384393, 224163, 230480, 340962, 348800, 428502, 397762, 285158, 340560, 279290, 274341, 322741, 229418, 140945, 141144, 175428, 146875, 268859, 227361, 131778, 229107, 254448, 176079, 168377, 173286]
6336A73286m8711J08310L9183m0978r304J9835R9885J08331k6303m4413r6784
6325B82337Q5396J18971m6511m7033n3586N6559l443j3050j04527r1126L474L2097
6313B19558j23962L4324Q7332j6207L444l0418J47705K3881p4554m6202L9203
6302B64104p5495O6214N7825M6170P0662m8085j1080k2799j8484l2361J02704
6291C99375n2806J460l3408N418j5229M9248J1134m6078k3982m6445J03040M2549
6279C94276q8033j00660J03094j36157j5881N8482K6092J28341M9329j10987l0550
6268B77346P3433M6510o8292L3402k4876N6873n6413o7533Q004L4181P6563p1185
6256C18013m2309o7002p2801R4429J32825l5972p1069R4928L5070N7520j42994
$$ y = [173286, 124575, 232885, 272068, 231090, 221786, 241621, 341506, 449837, 423534, 379121, 282337, 367733, 486704, 440193, 393160, 339574, 396133, 392690, 379640, 275113, 183987, 187461, 219558, 95596, 129920, 217252, 201045, 204489, 174071, 321776, 345657, 271103, 224901, 264104, 188609, 254823, 312648, 358818, 429480, 381395, 370315, 347516, 329032, 296671, 399375, 346569, 348029, 314621, 320039, 304810, 354058, 365192, 319114, 295132, 248687, 351727, 394276, 306243, 205583, 308677, 172520, 156639, 215121, 241213, 369554, 418883, 307896, 277346, 350779, 397289, 328997, 362399, 337523, 394396, 337983, 270450, 278454, 312635, 389198, 318013, 275704, 208702, 135901, 230330, 363155, 327183, 256114, 351042, 386112, 443632, 300638]
6245C00638r913j15110r0950J21163j3529N0850j0361M8423j37199P5092L6171
6234B55275J1232p877J29999r9741o0582P4540M8332N52O2819q2035m4731R3058
6222C80841j467J0011K2793n7867r878j3627K3033J02663L0725j8332j70893k9611
6210B68391M3550K3551L8021n5066J2597k9912l7115n9192j7102L7041J3248O8807
6198C06819J5124L4203L5444L3833M4338k5208k2946j7861q2170M2877K4312N9982
6186D48747k4163p8853N9916N6200L7386J5553j3702n3197o4761r9505Q3542K5141
6174C92304n1799l8101N0179m249l4610L04K4157O1557k3972K6481J2249m0798
6162C73702L5195J13581Q750r0395j3717K4634L0135J93519p0446k9280K179R914
$$ y = [300638, 290725, 175615, 84665, 205828, 192299, 243149, 232788, 281211, 144012, 219104, 255275, 266507, 258630, 388629, 288888, 228306, 302846, 351178, 351730, 414549, 332514, 287783, 380841, 379374, 389385, 412178, 354311, 344433, 330806, 353839, 456502, 487227, 468895, 298002, 268391, 311941, 335492, 373513, 318447, 331044, 301132, 264017, 204825, 187723, 224764, 238012, 306819, 321943, 356146, 391590, 425423, 469761, 444553, 421607, 403746, 321576, 364453, 388765, 448747, 424584, 345731, 405647, 461847, 499233, 514786, 501084, 447887, 383126, 283621, 367163, 392304, 340505, 302404, 352583, 348334, 313724, 314028, 338185, 399742, 375770, 402251, 414500, 373702, 408897, 522478, 531228, 440833, 427116, 451750, 481885, 675404, 604958, 575678, 577857, 587771]
6150E87771M6829k626q0627M3138j35638p4594N6335K0301j27491o1249J02430
6139C74579j90m7390j4570J86227q20J7017O5581r9790K0111J46215j02312M4002
6127E88660l0489o7637Q0475J9027k1497L8440N3948r4395N2971O0944J2099K78
6115F92824o4353o5800j46625m7389R9767J08796p6646j52944n2470P403L6098
6104C38661J16424l8919M0109o7025J16665Q4582l3129o0840m5354M1102m9149
6093D43127L4992L7110L3826N4483L9140J8447n6569j35679L768L4496O3023M99
6081E70663J0151p013k780j374l2035j0349Q7594O333o0729m1649p4978J6503
6069D60337L339j04856R7386L1405l5101K8758L0504L0975J4735j2577J01926
$$ y = [587771, 634600, 631974, 551347, 594485, 458847, 384253, 440588, 460889, 333398, 272149, 374579, 374389, 326999, 312429, 498656, 497836, 514853, 580434, 480644, 500755, 646970, 544658, 588660, 558171, 490534, 571009, 590036, 568539, 606979, 660927, 566532, 619503, 680447, 692546, 692824, 628471, 562671, 416046, 368657, 468424, 577220, 500574, 347630, 295160, 302563, 338661, 455085, 416166, 456275, 389250, 505915, 590497, 557368, 496528, 451174, 492276, 443127, 478119, 515229, 549055, 603538, 642678, 661125, 604556, 468877, 472645, 507141, 570164, 570663, 580814, 573801, 571021, 569647, 537612, 527263, 614857, 621190, 560461, 518812, 443834, 460337, 463676, 358820, 456206, 487611, 452510, 481268, 511772, 542747, 557482, 544905, 646831]
6058F46831M999j3202o3007p5229M1180Q0673P078J3656K0246p9614n6667J02491
6046F29435l7073q9476J1584P8997L684K821O0864n543J3315l2411L3571n6525
6034F13243n7746k0991J3505j4488L1870J4858P5312k931j00472J21781N4336
6023G28277J558k1920o7897K0169J0955r864L6059r9142Q588M6560j7681J1859
6011F47521m4159J18751m0600o0950J22953j8806o1253k7756L0866J13556p931
6000G72192q4223n5870l8538J5456J21477q361n5782J00278J11832m4814j620
5989H32027o841q1555K9488N778l0765o3286K8673n278M0631N8389j0099l4060
5977G63102r7615N3509R3453q1541J14711j1810n809O8959j47431J00043O1029
$$ y = [646831, 651830, 638628, 575621, 500392, 541572, 622245, 629323, 642979, 663225, 583611, 526944, 629435, 592362, 502886, 514470, 593467, 597151, 599972, 660836, 655293, 668608, 636197, 669768, 613243, 555497, 534506, 548011, 533523, 565393, 580251, 655563, 652632, 552160, 673941, 728277, 729835, 707915, 640018, 660187, 671142, 661278, 697337, 598195, 606783, 653343, 635662, 647521, 603362, 722113, 681513, 620563, 743516, 724710, 663457, 635701, 666567, 780123, 772192, 687969, 632099, 593561, 609017, 730494, 722133, 666351, 766629, 878461, 833647, 832027, 825186, 743631, 773119, 778897, 748132, 684846, 713519, 708241, 748872, 807261, 797162, 763102, 665487, 718996, 812449, 730908, 845619, 833809, 828000, 896959, 749528, 849571, 910600]
5966I10600q5249P9808J8170k4567j1657l4818p2520r5799J10413L9922r739j4862
5954H09702J44797M8648j9078o5240j37037n9700M6913N8221J16462l175q4329
5943H56184m4673J3193P7061m227j5950o1414J6208P1544m4163n658O2501L5308
5931I55914n8067n0859m0292l4134o6486l9641R8816Q5519j29751l3318J01756
5920G89457N3686P9756k0474j5551M6274o147R7259R3743k9247l1915p5231j43054
5908H38556J26883j2910j37346J45432P900j47094l499R1704j14535J091J9875
5897H16057J7790N912Q9301J5267q6541R4196K6843o9513O5439J4480l0864K43131
5885A201498k4471q3720Q3237R197j15878L8651J01402j25277j64143O9234N0509
$$ y = [910600, 825351, 905159, 923329, 898762, 887105, 852287, 779767, 683968, 794381, 834303, 824564, 809702, 954499, 1003147, 984069, 918829, 781792, 722092, 769005, 827226, 943688, 940513, 856184, 811511, 824704, 901765, 897538, 881588, 820174, 836382, 907926, 863763, 858105, 920606, 955914, 897847, 846988, 806696, 772562, 706076, 666435, 765251, 850770, 721019, 687701, 789457, 843143, 922899, 902425, 886874, 933148, 927001, 1024260, 1118003, 1088756, 1056841, 981610, 838556, 965439, 952529, 815183, 960615, 968515, 821421, 817922, 909626, 795091, 796182, 816057, 833847, 839759, 929060, 944327, 857786, 951982, 978825, 909312, 974751, 989231, 958367, 1201498, 1177027, 1093307, 1176544, 1185741, 1069863, 1108514, 1209916, 1084639, 920496, 989730, 1040239]
5874A040239k9945n2537K4053J4929L6905J1945q8670M171L8312L8447j4067J71349
5862A195131m7312K0734P3852L7686n8802R070J15037j4290p1336O390K0464q628
5850A277996N9180m3105n4070M5550J2499k2699j4736j12758m1397J28418N2913
5839A287791l8544j1140M8365L2214L8319k6360L421n849R8013l376J2954l6203
5827A399605j05525O1530l156L8627O1495n225m5010m8170k7991L8382P6192O4813
5815A505567k19192m9369J38893L4756J6373j08871L120R0305P3618p2169o2388
5804A350643K2010o162n4315Q6721j26878j4266j1789J29191K3535j45938M0236
5793A292988J37055m9153p1496Q2178M2585N1594r6290j6066n6812r628J11307
$$ y = [1040239, 1010294, 957757, 981810, 996739, 1033644, 1045589, 956919, 961090, 999402, 1037849, 1023782, 1195131, 1147819, 1168553, 1242405, 1280091, 1221289, 1230359, 1345396, 1331106, 1259770, 1266160, 1286624, 1277996, 1337176, 1294071, 1240001, 1285551, 1298050, 1275351, 1260615, 1147857, 1106460, 1234878, 1287791, 1249247, 1238107, 1286472, 1318686, 1357005, 1330645, 1334066, 1328217, 1426230, 1422854, 1435808, 1399605, 1294080, 1355610, 1352454, 1391081, 1452576, 1447351, 1402341, 1354171, 1326180, 1364562, 1440754, 1505567, 1286375, 1237006, 1375899, 1410655, 1427028, 1318157, 1321277, 1411582, 1485200, 1413031, 1350643, 1372653, 1366491, 1312176, 1398897, 1272019, 1257753, 1245964, 1375155, 1398690, 1252752, 1292988, 1430043, 1380890, 1309394, 1391572, 1434157, 1485751, 1389461, 1373395, 1316583, 1306955, 1418262]
5782A418262n985r3712p904j06591j1434N8966P2996l8423J36401k967k9057p341
5770A383211P981p685j26345Q6297q593k5079M2425K9442l6065k0251L6791L5945
5758A398074l4919n3036L328J22694j0005m6324o8672M5612J20930j30465p1685
5747A275532N9108K6032q6348l5818J796J47876l6537o6928J0995k2200N0040
5736A323548o7440M4316Q3415o3863Q3126M9089J675o5335J09933k0076l0826
5725A447562L9579m4030Q7951M8138o1646j9390l9647r3411k2926J03930M8912
5714A495022m2636N0257K8536L2134k0850k6657M4533l7879n2349R60M2381O8659
5702A582111N5242J82427j4648r4713j7388Q4770O3405r1510O8970Q50n6199p7358
$$ y = [1418262, 1412277, 1318565, 1310661, 1204070, 1192636, 1251602, 1324598, 1286175, 1422576, 1419609, 1390552, 1383211, 1391192, 1383507, 1257162, 1343459, 1334866, 1309787, 1352212, 1381654, 1345589, 1325338, 1362129, 1398074, 1363155, 1310119, 1313447, 1436141, 1426136, 1379812, 1311140, 1356752, 1477682, 1347217, 1275532, 1334640, 1360672, 1274324, 1238506, 1240302, 1388178, 1351641, 1284713, 1295708, 1273508, 1323548, 1256108, 1300424, 1383839, 1319976, 1403102, 1452191, 1453866, 1388531, 1498464, 1478388, 1447562, 1487141, 1443111, 1531062, 1579200, 1517554, 1498164, 1458517, 1365106, 1342180, 1446110, 1495022, 1452386, 1502643, 1531179, 1563313, 1542463, 1515806, 1560339, 1522460, 1470111, 1471071, 1513452, 1582111, 1637353, 1819780, 1805132, 1710419, 1693031, 1777801, 1841206, 1749696, 1818666, 1819516, 1763317, 1685959]
5690A685959m0554L5681m6738j8219P3158o2354l9303J05658o295K297P5757j25039
5678A640008L2568m8104Q1616M765J60432J39516M8929Q389q4315n9187P6145
5667B000762J52128N8359K7020j9265J11370P4519K5396Q3202J24293j50885r0813
5656B396086O2371J23411K9663j05616j43638r570l6624J19782j5156o2220j4393
5645B344096m6688K4713J7844m4676k9992j2917p7213J06422J4905M0350J14253
5634B451097N946K839j50323N2237l1301J10142J06987K5341o1021R6271J0300
5623B618515L1079p5912p5368J10554L3817j04594J04910O0122j43059Q5841j4350
5612B631555K9601P5281j3844q6994N7983L9147J19131P5641P695M3358O6127
$$ y = [1685959, 1645405, 1681086, 1634348, 1616129, 1689287, 1626933, 1587630, 1693288, 1686993, 1689290, 1765047, 1640008, 1672576, 1624472, 1706088, 1710853, 1871285, 2010801, 2059730, 2068119, 1983804, 1924617, 2000762, 2152890, 2211249, 2238269, 2219004, 2330374, 2404893, 2430289, 2513491, 2637784, 2486899, 2396086, 2458457, 2581868, 2611531, 2505915, 2362277, 2352707, 2316083, 2435865, 2420709, 2358489, 2344096, 2297408, 2322121, 2339965, 2295289, 2265297, 2252380, 2175167, 2281589, 2296494, 2336844, 2451097, 2457043, 2459882, 2309559, 2361796, 2330495, 2440637, 2547624, 2572965, 2511944, 2608215, 2618515, 2649594, 2573682, 2498314, 2608868, 2642685, 2538091, 2643001, 2703123, 2560064, 2645905, 2631555, 2661156, 2736437, 2722593, 2635599, 2693582, 2732729, 2851860, 2927501, 2935196, 2978554, 3044681]
5601C044681J8076M0212J90730J04898O6225K2143K8406J64296M1413j4309J14709
5590C821480J16771J27786n086J6666K8773o662q1135j02647j68129K2289J09818
5579C879924n0435j73072p0004m6857p3731j28735o2275m2074J6010N6229j81408
5568C123572j5496m8581P8460K6841J3818K1780j8424O3345p6545K2536j355o1516
5556C128435R4536Q9638n869q9082j00197R1780P5073l3929J3235n9893J131L6321
5544C241179Q468L2313K7203O007J05624J28340J35949o0794R1624J39182J70722
5533D025817P7565r1751R9046N486J7229K2319L1005N5794l65r835J8225n6175
5521D194360k25465j41609K3073J1637j35415j37889J6137Q4859k11573j58499
$$ y = [3044681, 3062757, 3102969, 3293699, 3398597, 3464822, 3486965, 3515371, 3679667, 3721080, 3706771, 3821480, 3938251, 4066037, 4060951, 4077617, 4106390, 4099728, 4018593, 3915946, 3747817, 3770106, 3879924, 3829489, 3656417, 3586413, 3539556, 3465825, 3337090, 3274815, 3232741, 3248751, 3304980, 3123572, 3108076, 3059495, 3137955, 3164796, 3178614, 3200394, 3181970, 3245315, 3168770, 3191306, 3189951, 3128435, 3222971, 3312609, 3306740, 3217658, 3117461, 3209241, 3284314, 3250385, 3263620, 3203727, 3204858, 3241179, 3249647, 3281960, 3309163, 3315170, 3420794, 3549134, 3685083, 3624289, 3715913, 3855095, 4025817, 4103382, 4011631, 4110677, 4116163, 4133392, 4155711, 4186716, 4242510, 4242145, 4232310, 4250535, 4194360, 3968895, 3827286, 3850359, 3861996, 3726581, 3588692, 3604829, 3689688, 3478115, 3319616]
5511C319616J9777L9064k13197n3303Q0919J17062o1541n2519r8632k5769M2895
5500C114372J10051j5583n1884N1608K4430n8076l6673L94q1726P5227j08881
5489C023259p9450J31984k6786k6939k2483k1791J04706J0199n5557j4870O2244
5478C084516K9024O6945j4851M2486j01777O6761J75601q9480o9324L1601J14469
5467C335971K6883m0729J9541p676l0411K0675j3938R0915k1529K8086K0088l5557
5455C392319l6024j20313R110K4308N7505L9122n7139q8576Q5732m3457Q1512
5444C344099j8205L1861R0596l6705m4767J0363j4503J4759o8529M4205l0656
5433C322518K5012N9808r9791R601J2296p312k6656O9734R7665n3419n9907l0332
$$ y = [3319616, 3339393, 3378457, 3165260, 3111957, 3192876, 3309938, 3248397, 3195878, 3097246, 3071477, 3114372, 3224423, 3208840, 3156956, 3208564, 3232994, 3174918, 3138245, 3138639, 3056913, 3132140, 3023259, 2943809, 3075793, 3049007, 3022068, 2999585, 2977794, 3082500, 3092699, 3037142, 3022272, 3084516, 3113540, 3180485, 3165634, 3208120, 3106343, 3173104, 3348705, 3259225, 3189901, 3221502, 3335971, 3362854, 3322125, 3341666, 3333990, 3303579, 3324254, 3310316, 3401231, 3379702, 3407788, 3427876, 3392319, 3356295, 3235982, 3245092, 3269400, 3326905, 3366027, 3308888, 3220312, 3306044, 3262587, 3344099, 3325894, 3357755, 3448351, 3411646, 3366879, 3377242, 3362739, 3377498, 3308969, 3353174, 3322518, 3347530, 3407338, 3307547, 3317148, 3329444, 3322132, 3295476, 3365210, 3462875, 3409456, 3349549, 3319217]
5421C319217P5735L9464j28844K1005k1521R2582J00807k20007n4493P1446P4910
5410C370301L3051K382O3719l0285n5967j6313M294L9398L0059m5305J5337J5749
5398C426420j6932k3849j0464M6831l7628L3089M2207N3088o9733m7233J19399
5387C515195k1850J07548k3868K5983m1924J9101l5578j44756Q1185n3362J62899
5376C590573J10042n5341J8267r5194o8546K1216P926p5923N5214N1005j20009
5365C439230m02N7633Q5516j46080k0164Q2358K110R1688O3675J9199l4564r7592
5353C542607L203O9846j4045q2589M5322j9689J12082k618j4212m0427K9009M7666
5341C676155j07239P3444k615M0114M5271M4731j4063K5797K7236R8065M4465
$$ y = [3319217, 3394952, 3434416, 3305572, 3326577, 3305056, 3397638, 3498445, 3278438, 3223945, 3295391, 3370301, 3403352, 3405734, 3469453, 3439168, 3383201, 3366888, 3371182, 3410580, 3440639, 3395334, 3410671, 3426420, 3409488, 3385639, 3375175, 3422006, 3384378, 3417467, 3459674, 3512762, 3443029, 3395796, 3515195, 3493345, 3600893, 3577025, 3603008, 3561084, 3580185, 3544607, 3399851, 3481036, 3427674, 3590573, 3700615, 3645274, 3663541, 3568347, 3499801, 3521017, 3528943, 3453020, 3508234, 3559239, 3439230, 3438828, 3496461, 3581977, 3435897, 3415733, 3498091, 3500201, 3591889, 3655564, 3674763, 3640199, 3542607, 3545810, 3615656, 3601611, 3519022, 3564344, 3544655, 3656737, 3654119, 3639907, 3599480, 3628489, 3676155, 3568916, 3642360, 3639745, 3679859, 3725130, 3769861, 3755798, 3781595, 3808831, 3906896, 3951361]
5330C951361o9905k5076p285N6505K7262K4500M0106p1443Q5335M6257l6063m4321
5318C977233n2109R4244P4784p6248r3301l7812N1303k595K3632L1033J56412
5307D146576m788k9412P3356k945P0686L2974m4770J80577l6807n7018Q8695M8751
5295D465875n148J02958j9534l1068q5555N0909O2651m4874L7051M9001Q8360
5284D670626j13003M82j13624M4586J29308N8793m589K4357k1926O9399R1533
5273D835942n7881L2584j2526Q8147l8562m1268N5251M8178l5466L980j198M6274
5261D923455k978R8706R4432q8997q1277M4547j325P591J29036j13718p3511k2708
5249D913253R7846Q9551Q3911M4577p1052k6131k1509O7130k1434k9647J44276
$$ y = [3951361, 3881456, 3856380, 3849095, 3905600, 3932862, 3957362, 3997468, 3926025, 4011360, 4057617, 4021554, 3977233, 3925124, 4019368, 4094152, 4017904, 3924603, 3886791, 3938094, 3935499, 3959131, 3990164, 4146576, 4141788, 4112376, 4185732, 4182787, 4253473, 4286447, 4241677, 4422254, 4385447, 4328429, 4417124, 4465875, 4460727, 4563685, 4544151, 4513083, 4427528, 4478437, 4541088, 4496214, 4533265, 4582266, 4670626, 4557623, 4558105, 4444481, 4489067, 4618375, 4677168, 4672579, 4696936, 4675010, 4744409, 4835942, 4778061, 4810645, 4798119, 4886266, 4847704, 4806436, 4861687, 4909865, 4874399, 4878379, 4877181, 4923455, 4920477, 5019183, 5113615, 5024618, 4943341, 4987888, 4986563, 4994154, 5123190, 5009472, 4935961, 4913253, 5011099, 5100650, 5184561, 5229138, 5158086, 5131955, 5110446, 5177576, 5156142, 5126495, 5270771]
5238E270771J6364o971J57679l3554O7671M8001j12751n3864M4704R5034N3275
5227E546359Q4760n1284J27242n4613l7351k6792M8703J8915j12533K679N1102
5216E597187Q5618j0530o8574N0835p1447R8301P3241J45791J06765O1932K4383
5205F093502q6118J7857J12899l9889o4686J03226J53474P4468p3722j6514q0923
5194F193574m479O075j6932J53615J32191j11351Q7099K8878j09855j9365K0750
5183F360200N0173Q0403O4265J10694n6881N0201J4596k0405O284P2731K4747
5172F757008J6035J60043l9260R3050Q8898L6317M2742M1221N8445R4462j42072
5161G206889Q5918k2955L6968N9300n5214O6135j5862P3581m382J4724J3399N3951
$$ y = [5270771, 5287135, 5280164, 5437843, 5404289, 5471960, 5519961, 5407210, 5353346, 5398050, 5493084, 5546359, 5631119, 5579835, 5707077, 5652464, 5615113, 5588321, 5637024, 5655939, 5543406, 5546085, 5597187, 5682805, 5672275, 5603701, 5654536, 5583089, 5681390, 5754631, 5900422, 6007187, 6069119, 6093502, 6007384, 6025241, 6138140, 6098251, 6033565, 6136791, 6290265, 6364733, 6291011, 6274497, 6193574, 6189095, 6195170, 6178238, 6331853, 6464044, 6352693, 6439792, 6468670, 6358815, 6339450, 6360200, 6410373, 6490776, 6555041, 6665735, 6608854, 6659055, 6673651, 6653246, 6659530, 6732261, 6757008, 6773043, 6933086, 6893826, 6986876, 7075774, 7112091, 7154833, 7196054, 7254499, 7348961, 7206889, 7292807, 7269852, 7306820, 7366120, 7310906, 7377041, 7361179, 7434760, 7430378, 7445102, 7458501, 7512452]
5149G512452l9450r5773J54456J18173M9664p614J24839o4346O2101R6555L0667
5138G941724O4550N1578J80881j654N2035Q3789J06260K0415j6097L3536J04261
5127H621278o6782N204J3014M140m9808R1956M9579m8729o0876K3890j4514J94809
5115H763161K2647o6822N2478N2562J49259M1093j4318N7785J11142Q5749R8770
5104I353506j4326Q3823L8025Q6097O5428L281J25194l1262n9190Q4674Q3868
5093I819118K0835R512j0007k3308n4107Q6018J03142L9991J3240J22861Q6258
5082A0213553K8007k0931J16218J39173O5173J32791l3864N7132J10105j0300
5072A0797057Q1065Q4216R5189o776K569J59643K6133L9492q415R1724k2784K9844
$$ y = [7512452, 7473002, 7377229, 7531685, 7649858, 7699522, 7691908, 7816747, 7752401, 7814502, 7911057, 7941724, 8006274, 8057852, 8238733, 8237079, 8289114, 8372903, 8479163, 8499578, 8483481, 8517017, 8621278, 8554496, 8559700, 8572714, 8576854, 8527046, 8619002, 8668581, 8619852, 8558976, 8582866, 8568352, 8763161, 8785808, 8718986, 8771464, 8824026, 8973285, 9014378, 9000060, 9057845, 9168987, 9254736, 9353506, 9339180, 9423003, 9461028, 9547125, 9612553, 9615834, 9741028, 9709766, 9650576, 9735250, 9819118, 9839953, 9849465, 9839458, 9816150, 9762043, 9848061, 9951203, 9991194, 10004434, 10127295, 10213553, 10241560, 10220629, 10336847, 10476020, 10541193, 10673984, 10640120, 10697252, 10807357, 10797057, 10878122, 10962338, 11057527, 11050751, 11053320, 11212963, 11239096, 11278588, 11270173, 11361897, 11339113, 11368957]
5060A1368957Q9782k0457L7765O9994N1040N770P7315Q1145o1197J15567J30068
5049A1945749J53379M5553P7339M4807L2674J15340J32427J21586O864Q7219J69118
5038A2932055J46162m8695q7127K14823Q4342J4747R2939j3965p3689N6798J11848
5027A3430238J59820J0678O6619J65101k5524J21716J9384P9408o51J18902K31790
5016A4377481J59748N4202M3715J05600P8785J24291N8849J23377J78964L7486
5006A5342498l911r928R0459J43114J34890J90634O4628N5344M3642J48270K07868
4995A6407508j0862P3941J47582J48839J02653J88316P9707k9452J53959M9678
4985A7311869K19924Q126P0877L33791J05478J41885J91263Q8624P0020J71344
$$ y = [11368957, 11458739, 11438282, 11476047, 11546041, 11597081, 11602851, 11680166, 11761311, 11700114, 11815681, 11945749, 12099128, 12144681, 12222020, 12266827, 12299501, 12414841, 12547268, 12668854, 12675718, 12762937, 12932055, 13078217, 13029522, 12942395, 13157218, 13241560, 13256307, 13349246, 13335281, 13261592, 13318390, 13430238, 13590058, 13600736, 13667355, 13832456, 13806932, 13928648, 13948032, 14027440, 14026789, 14145691, 14377481, 14537229, 14591431, 14635146, 14740746, 14819531, 14943822, 15002671, 15126048, 15305012, 15342498, 15338587, 15328659, 15419118, 15562232, 15697122, 15887756, 15952384, 16007728, 16051370, 16199640, 16407508, 16396646, 16470587, 16618169, 16767008, 16869661, 17057977, 17137684, 17108232, 17262191, 17311869, 17531793, 17539919, 17610796, 17944587, 18050065, 18191950, 18383213, 18471837, 18541857, 18713201]
4975A8713201J86930J24471R7111J77856J35401M9042Q054K11130R3860J36011
4965A9933067K03883K08293J24741R3481J69130J73233J09028J69515J14148J26175
4955B1424694J97857J73969J76934J93144J68821J76917K09263K11451J51612
4946B3084662J23141K27026J11006J13786K25829J50543M8401J42551J37908J32788
4936B4497641K60408L15975J71135J69308J62728K82985N5316K428Q2745J28855
4926B6129524K51791K05242J27669K83132J51506J11419J72399K77451J94171
4917B7904304J96336K95090J68292L36160K45904K10419K46793J48042J29906
4908B9881246K34545K75582K76689K83462K57422K70839J88890Q6258K54597L18150
$$ y = [18713201, 18900131, 19024602, 19121713, 19299569, 19434970, 19484012, 19492066, 19703196, 19797056, 19933067, 20136950, 20345243, 20469984, 20563465, 20732595, 20905828, 21014856, 21184371, 21298519, 21424694, 21622551, 21796520, 21973454, 22166598, 22335419, 22512336, 22721599, 22933050, 23084662, 23207803, 23434829, 23545835, 23659621, 23885450, 24035993, 24084394, 24226945, 24364853, 24497641, 24758049, 25074024, 25245159, 25414467, 25577195, 25860180, 25915496, 25917924, 26000669, 26129524, 26381315, 26586557, 26714226, 26997358, 27148864, 27260283, 27432682, 27710133, 27904304, 28100640, 28395730, 28564022, 28900182, 29146086, 29356505, 29603298, 29751340, 29881246, 30115791, 30391373, 30668062, 30951524, 31208946, 31479785, 31668675, 31754933, 32009530, 32327680]
4898C2327680K65224K30053J38005J71839L29719K25435J36900K88926J85598
4889C4299379L41613L75750M04971K39394J99712L15202L45702M12357L42451
4880C7276531M30856K19183L65636M66200L67617K69965K99976L72786L00884
4871D0369634L60231L00022L31124K74521L31551L17697L34091L77530M61891
4862D3458292M00587L44995L57281M86653M91784L80517M69434L85893M81999
4853D7257435M12665N13791N26349N36133M09553M20981N42990L95337N39076
4844E1554310N76106O04410M49304M34718N26762N06770N47063N76690L60555
4835E6136688N01206O27299N53377N78232O39534O62730N19656O05809N24797
$$ y = [32327680, 32592904, 32822957, 32960962, 33132801, 33462520, 33687955, 33824855, 34113781, 34299379, 34640992, 35016742, 35421713, 35661107, 35860819, 36176021, 36521723, 36934080, 37276531, 37707387, 37926570, 38292206, 38758406, 39126023, 39395988, 39695964, 40068750, 40369634, 40729865, 41029887, 41361011, 41635532, 41967083, 42284780, 42618871, 42996401, 43458292, 43858879, 44203874, 44561155, 45047808, 45539592, 45920109, 46389543, 46775436, 47257435, 47670100, 48183891, 48710240, 49246373, 49655926, 50076907, 50619897, 51015234, 51554310, 52130416, 52734826, 53184130, 53618848, 54145610, 54652380, 55199443, 55776133, 56136688, 56637894, 57265193, 57818570, 58396802, 59036336, 59699066, 60218722, 60824531, 61349328]
4826F1349328P11626P77981O83818O75395O17724O85921O38247P19378Q52851
4817F7712269Q34885O45818P80599Q22915P23576Q23019O54467Q48014Q15091
4808G4660653Q07235Q22155R01814Q03514Q35018R49436R24439J023907Q42194
4799H2570365Q23508J025071R31156J127038J025232J137436J090735J113798
4791I0844339J014069J007580J111756J078858J116109J303730J320921J154854
4783I9952216J168755J211855J334367J214297J294705J300996J403199J420829
4775A10301219J386714J526273J517992J365342J480026J577096J582890J452358
4767A22189910J602475J683496J674008J705545J693283J684000J848181J761136
$$ y = [61349328, 62060954, 62838935, 63522753, 64198148, 64815872, 65501793, 66140040, 66859418, 67712269, 68547154, 69192972, 69973571, 70796486, 71520062, 72343081, 72997548, 73845562, 74660653, 75467888, 76290043, 77191857, 77995371, 78830389, 79779825, 80704264, 81728171, 82570365, 83393873, 84418944, 85350100, 86477138, 87502370, 88639806, 89730541, 90844339, 91858408, 92865988, 93977744, 95056602, 96172711, 97476441, 98797362, 99952216, 101120971, 102332826, 103667193, 104881490, 106176195, 107477191, 108880390, 110301219, 111687933, 113214206, 114732198, 116097540, 117577566, 119154662, 120737552, 122189910, 123792385, 125475881, 127149889, 128855434, 130548717, 132232717, 134080898, 135842034]
4759A35842034J812774J982641J809038J933943J943461J948126J970363K020579
4751A51262959K104056K041252K176785K165137K249961K227205K226473K347203
4743A68801031K339634K473308K452392K494032K372395K513373K610790K647960
4735A88704915K705731K638211K884331K732984K845230K847574K905685K909871
4727B11174532L115235L209858K982583K941310L016748L295816L301238L220529
4719B36257849L295730L320743L379342L537767L436943L425826L467354L463893
4711B63585447L600992L468845L680551L623432L646308L675803L665828L697725
4703B92644931L634620L681531L765613L806857L640034L752031L674874L465218
$$ y = [135842034, 137654808, 139637449, 141446487, 143380430, 145323891, 147272017, 149242380, 151262959, 153367015, 155408267, 157585052, 159750189, 162000150, 164227355, 166453828, 168801031, 171140665, 173613973, 176066365, 178560397, 180932792, 183446165, 186056955, 188704915, 191410646, 194048857, 196933188, 199666172, 202511402, 205358976, 208264661, 211174532, 214289767, 217499625, 220482208, 223423518, 226440266, 229736082, 233037320, 236257849, 239553579, 242874322, 246253664, 249791431, 253228374, 256654200, 260121554, 263585447, 267186439, 270655284, 274335835, 277959267, 281605575, 285281378, 288947206, 292644931, 296279551, 299961082, 303726695, 307533552, 311173586, 314925617, 318600491, 322065709]
4695C22065709L494319L627718L514220L434930L375025L347054L311646L193339
4687C49363960L096885K954575K961868K935831K837446K587102K564247K376933
4679C71678847K302380K176561K121541J928090J786958J633437J521933J420359
4671C86570106J125818R67566P81298P93616N32529L40242K24393L92j25384l51844
4661C90858732m21224o02098q93903j036621j095801j263384j454385j567360
4653C82523956j788557j921855k061196j934684k156119k336676k487596k496200
4645C65341073k481549k508113k678156k702356k795017k723654k794758k728425
4637C43929045k721555k785762k790616k786561k714149k614432k483398k596501
$$ y = [322065709, 325560028, 329187746, 332701966, 336136896, 339511921, 342858975, 346170621, 349363960, 352460845, 355415420, 358377288, 361313119, 364150565, 366737667, 369301914, 371678847, 373981227, 376157788, 378279329, 380207419, 381994377, 383627814, 385149747, 386570106, 387695924, 388663490, 389444788, 390238404, 390770933, 391111175, 391335568, 391335960, 391210576, 390858732, 390437508, 389835410, 388941507, 387904886, 386809085, 385545701, 384091316, 382523956, 380735399, 378813544, 376752348, 374817664, 372661545, 370324869, 367837273, 365341073, 362859524, 360351411, 357673255, 354970899, 352175882, 349452228, 346657470, 343929045, 341207490, 338421728, 335631112, 332844551, 330130402, 327515970, 325032572, 322436071]
4629C22436071k603144k372656k288766k250874k011114j956149j816153j771024
4621C05366191j616284j533832j511144j357741j213709j209211j297235j165158
4613B94461877j249198j248616j359181j531610j577180j883490k208885k609252
4605B80794465k885547l161003l706255m101126m278238m517312m922675m998830
4597B48223479n123111n078467n038914n035294n028185m868813m837904m770069
4589B08442722m463365m188278m082618m030839l821218l717032l445036l399926
4581A77294410l398966l236395k974114l044977k939295k789077k688405k650455
4573A53572726k596046k514734k412499k409267k318491k241058k210629k054534
$$ y = [322436071, 319832927, 317460271, 315171505, 312920631, 310909517, 308953368, 307137215, 305366191, 303749907, 302216075, 300704931, 299347190, 298133481, 296924270, 295627035, 294461877, 293212679, 291964063, 290604882, 289073272, 287496092, 285612602, 283403717, 280794465, 277908918, 274747915, 271041660, 266940534, 262662296, 258144984, 253222309, 248223479, 243100368, 238021901, 232982987, 227947693, 222919508, 218050695, 213212791, 208442722, 203979357, 199791079, 195708461, 191677622, 187856404, 184139372, 180694336, 177294410, 173895444, 170659049, 167684935, 164639958, 161700663, 158911586, 156223181, 153572726, 150976680, 148461946, 146049447, 143640180, 141321689, 139080631, 136870002, 134815468]
4565A34815468k048607j999343j820930j891505j973565j802402j699461j778515
4557A19801140j770573j755077j621425j559303j566525j526273j456620j480454
4549A07064890j527220j507457j538114j372959j455008j438919j361441j261463
4541I5602309j354304j315600j237224j296305j201152j159349j051290j160234
4533H5826851j032030j016431j105885j062280r79424r76476r08267j072875r47806
4524G6725377r73720r59576q67371r79907p97319r18139r00157r24355q40517
4515F8564316p70066p21259q53261p31322p31867p07060q39811o50303o14944
4506F1944423p25819o65736p70643p19811p32458o03537o31092o43374n24315
$$ y = [134815468, 132766861, 130767518, 128946588, 127055083, 125081518, 123279116, 121579655, 119801140, 118030567, 116275490, 114654065, 113094762, 111528237, 110001964, 108545344, 107064890, 105537670, 104030213, 102492099, 101119140, 99664132, 98225213, 96863772, 95602309, 94248005, 92932405, 91695181, 90398876, 89197724, 88038375, 86987085, 85826851, 84794821, 83778390, 82672505, 81610225, 80630801, 79654325, 78746058, 77673183, 76725377, 75751657, 74792081, 73924710, 72944803, 72147484, 71229345, 70329188, 69404833, 68564316, 67794250, 67072991, 66219730, 65488408, 64756541, 64049481, 63209670, 62559367, 61944423, 61218604, 60552868, 59782225, 59062414, 58329956, 57726419, 57095327, 56451953, 55927638]
4497E5927638n91828p14853n87216o86021m57814n57846n14968n03003n14957
4488E0799132n47357n51382n09656n04218m88606o13038o01227m81779m26692
4479D6075177m71951m16669l07479n31498m25944m32387m40913l60565n59675
4470D2128096m17363l09244k63846n43264n14323m63943l96057k85594j75597
4461C8758865m27718n00125m34352l76879l18368l77537m47707k91713k57762
4452C5326704k36149k08845k75505k02674k17687k93596l54833l47738k31531
4443C2958146k23981k40047k16702m00900k95292l85533k94525l19475j04121
4434C0477570k30151k22040j75111k37551k56762j89232k94580k79370j58635
$$ y = [55927638, 55335810, 54620957, 54033741, 53347720, 52889906, 52332060, 51817092, 51314089, 50799132, 50251775, 49700393, 49190737, 48686519, 48197913, 47584875, 46983648, 46501869, 46075177, 45603226, 45186557, 44879078, 44347580, 43921636, 43489249, 43048336, 42687771, 42128096, 41710733, 41401489, 41137643, 40594379, 40080056, 39616113, 39220056, 38934462, 38758865, 38331147, 37831022, 37396670, 37019791, 36701423, 36323886, 35876179, 35584466, 35326704, 35090555, 34881710, 34606205, 34403531, 34185844, 33892248, 33537415, 33189677, 32958146, 32734165, 32494118, 32277416, 31876516, 31581224, 31195691, 30901166, 30581691, 30477570, 30247419, 30025379, 29850268, 29612717, 29355955, 29166723, 28872143, 28592773, 28434138]
4425B8434138l02223j83391j75967k18920k27292p9349k09399k50576j15719k40517
4415B6430785j88830j97853k84420j86170k02970j02179j37360j57273j91185
4406B4782545k19478j70042j16905m0540j0903l19093k34908k56626k61064j69170
4396B2983816l0076j10152j20608j86195j47398j35927j50835j41669q1520j29682
4386B1749754k00845j16407j30391n1160j61885j21045j21242o9356k49768j67245
4376B0360410N362j52178l05343q7594j00789k32841k085m7184j06311p7431l3949
4365A9220067k6489j75825r2632j28952j10284r4837k0907k0199j2783q3191p6955
4354A8377013j62855j20082n1441r1771L1503N276j4592j98651P986Q5857n5408
$$ y = [28434138, 28131915, 27948524, 27772557, 27553637, 27326345, 27246996, 27037597, 26787021, 26671302, 26430785, 26241955, 26044102, 25759682, 25573512, 25370542, 25268363, 25131003, 24973730, 24782545, 24563067, 24393025, 24276120, 24235580, 24224677, 23905584, 23670676, 23414050, 23152986, 22983816, 22953740, 22843588, 22722980, 22536785, 22389387, 22253460, 22102625, 21960956, 21879436, 21749754, 21548909, 21432502, 21302111, 21250951, 21089066, 20968021, 20846779, 20777423, 20527655, 20360410, 20365772, 20213594, 19908251, 19820657, 19719868, 19487027, 19484942, 19437758, 19331447, 19254016, 19220067, 19193578, 19017753, 18925121, 18796169, 18685885, 18591048, 18570141, 18549942, 18537159, 18453968, 18377013, 18214158, 18094076, 18042635, 17950864, 17982367, 17987643, 17973051, 17774400, 17782386, 17868243, 17812835]
4343A7812835M083K8808j00507L3076n4728o0813k3760P2542J06968j009K0376
4332A7837871N5998M1180J32464J54449J60272J41659j7276J86210J48656R7672
4322A8939155J92945L5185P9106J92323R7971K18199Q6250n041J07250j20120
4312A9823223k26830p6850j27719j48582k96860k67293j42841n08436l30832l61376
4302A7335604m20423k14139l48826l78928k07434k49856l83060k13616j43668
4293A4775654k44039k45783j91650k76695p9093p8383j51664p0459q050j05466
4283A3324372j55407j51319j38846p6531j41714q3823k8338r8149j12313j08524
4273A2229408j29949q9853p1896j30534m0670o942j74170k32673k07846j69895
$$ y = [17812835, 17816918, 17845726, 17745219, 17778295, 17723567, 17662754, 17638994, 17711536, 17818504, 17817495, 17837871, 17893869, 17935049, 18067513, 18221962, 18382234, 18523893, 18506617, 18692827, 18841483, 18939155, 19132100, 19167285, 19246391, 19438714, 19536685, 19754884, 19841134, 19836093, 19943343, 19823223, 19596393, 19519543, 19391824, 19243242, 18946382, 18679089, 18536248, 18027812, 17696980, 17335604, 16915181, 16701042, 16352216, 15973288, 15765854, 15515998, 15132938, 14919322, 14775654, 14531615, 14285832, 14094182, 13817487, 13738394, 13660011, 13508347, 13437888, 13429838, 13324372, 13168965, 13017646, 12878800, 12802269, 12660555, 12576732, 12548394, 12450245, 12337932, 12229408, 12099459, 12009606, 11937710, 11807176, 11766506, 11759564, 11585394, 11352721, 11144875, 10974980]
4263A0974980q7934P0093K1047j55753j45223O1131j69229j90682p8441j10155
4253A0189834j16092j8840J27573n5948o8720L6965M0957r4658j03159j36631
4243I801281j7755k1035p1827p0844K702K5312j81903k05829j7108p6478j42192
4232I024324k6300j28829M1739l3803p4091k2420k2242o2893m3120k7482r0761
4221H534122k3044J10758q0687m3590P916o6176l349p2565M894O5569R4817j17720
4209H410945k087j56120J51916m4074M0709j29455k3344P3193r5934J0113k9019
4198H206843k097j05113q5746l0032q0490k7684O4146l2788O8189K3203j77828
4187G820603n6619k3979o7628N4592m764o2125k0650M1703O615n5004K69K0787
$$ y = [10974980, 10887046, 10957139, 10978186, 10822433, 10677210, 10738341, 10569112, 10378430, 10299989, 10189834, 10073742, 10054902, 10182475, 10126527, 10057807, 10094772, 10135729, 10041071, 9937912, 9801281, 9783526, 9762491, 9690664, 9619820, 9622522, 9647834, 9465931, 9260102, 9242994, 9166516, 9024324, 8998024, 8869195, 8910934, 8877131, 8803040, 8780620, 8758378, 8695485, 8652365, 8624883, 8534122, 8511078, 8621836, 8541149, 8497559, 8505475, 8439299, 8435950, 8363385, 8368279, 8433848, 8528665, 8410945, 8408858, 8252738, 8404654, 8360580, 8401289, 8271834, 8248490, 8321683, 8225749, 8235862, 8206843, 8204746, 8099633, 8013887, 7983855, 7903365, 7875681, 7939827, 7907039, 7975228, 7998431, 7820603, 7763984, 7740005, 7672377, 7726969, 7722205, 7660080, 7639430, 7681133, 7687748, 7632744, 7633013, 7653800]
4175G653800j7455o673Q383m551o8921k5413l2329j43677k02218L2084K4109j23584
4163G093555n2758Q062k00200m9027Q0543k8248q3931L4387o3570m3714M7440
4152F742539j15168j38134M7908J2357R869j57288J12046j7677m7390R372R584
4141F468018k0965j42428l1026J27154Q7287m7670j72605K3261j42795N4013n7781
4130F144463K1345j11569n6047l1656j01200j7742k3074M2797m7550m4851n3049
4119E721867J46391r8228L1607j9639O191l6594m7986J0677j2805o3099J1117
4108E649499Q5853J45411r8920j67298N0811R3204N2307l3943j11552p094j2454
4097E645824J7073O3339P4039j44857o3992P2846m0294N0645l7741r9025j1130
$$ y = [7653800, 7636345, 7629672, 7638055, 7633504, 7564583, 7539170, 7506841, 7363164, 7160946, 7193030, 7217139, 7093555, 7040797, 7048859, 6848659, 6799632, 6880175, 6851927, 6767996, 6802383, 6738813, 6695099, 6742539, 6627371, 6489237, 6537145, 6549502, 6559371, 6402083, 6514129, 6496452, 6449062, 6458434, 6468018, 6447053, 6304625, 6273599, 6400753, 6488040, 6440370, 6267765, 6291026, 6148231, 6202244, 6144463, 6165808, 6054239, 5998192, 5966536, 5865336, 5847594, 5824520, 5867317, 5819767, 5774916, 5721867, 5868258, 5770030, 5801637, 5781998, 5788189, 5751595, 5703609, 5714286, 5701481, 5638382, 5649499, 5735352, 5880763, 5781843, 5614545, 5665356, 5758560, 5810867, 5776924, 5665372, 5658278, 5645824, 5662897, 5726236, 5800275, 5655418, 5591426, 5664272, 5623978, 5674623, 5636882, 5537857, 5526727]
4086E526727M8372Q1366O2695l9723K837l2834j3391R28n433R878M2109L5n8218
4073E625348o6806N9155q606k9977K14704Q43l9211J700J38345o2088N3967n1141
4061E836233R4506o444l503N6904k8498m4891J06141J63932j5781o0977M2707
4050F140329J8546q3707M6159N5192m0450k880j7543M8407K5735O0335r4074p0910
4038F085139Q7495J8944O2369Q8522k7414p1560m27P8877J33672j034P8510k6706
4026F506387J59568P2517m9477R7285q499R7512P0579j1315Q042J00147R981K3684
4014G076411J83458N8751P6898J81674J92577J7824n031M4726J45546L4509J98601
4003H205944J12358O7481J29938J00016J02426R1973q6984j65734k17603k79780
$$ y = [5526727, 5575099, 5656465, 5719160, 5679437, 5682274, 5649440, 5636049, 5636977, 5631544, 5641422, 5683531, 5683566, 5625348, 5558542, 5617697, 5609091, 5579114, 5793818, 5794661, 5755450, 5757150, 5895495, 5833407, 5887374, 5836233, 5930739, 5924295, 5920792, 5977696, 5949198, 5904307, 6010448, 6174380, 6158599, 6097622, 6140329, 6158875, 6075168, 6121327, 6176519, 6136069, 6133189, 6115646, 6164053, 6189788, 6250123, 6156049, 6085139, 6172634, 6191578, 6253947, 6342469, 6315055, 6243495, 6243068, 6321945, 6455617, 6454583, 6533093, 6506387, 6665955, 6738472, 6688995, 6786280, 6777781, 6875293, 6945872, 6934557, 6942599, 7042746, 7052727, 7076411, 7259869, 7318620, 7395518, 7577192, 7769769, 7787593, 7782562, 7827288, 7972834, 8007343, 8205944, 8318302, 8385783, 8515721, 8615737, 8718163, 8810136, 8723152, 8557418, 8339815, 8060035]
3993H060035j73054j38479n9010j12246j15235R312j06904j10848r7490j21097
3983G034984M5821L3415k6900O3086n7018j9647j804j13618q031J7137o061j0839
3971F950525n524N1414m7917j999P3110M9683K7897P0384k3311L7706O155M6566
3959G234689p752O9760K11904Q9642J38756j35102O122J56887M1637L6213J13360
3948G956116J34161R7798j32309p2412J27982J28138J39803J87562Q6314Q5522
3938H738675J84087K2832L1469L5600M8841J78742J77519J98433J03527J00220
3928I819945J69608Q1496K33061J53984K4699M0339L3280J41056J77341J97829
3918A1072638N0676P8613J43498J75925R1648K18237J55754P4397K38116J79617
$$ y = [8060035, 7886981, 7748502, 7689492, 7577246, 7462011, 7471323, 7364419, 7253571, 7156081, 7034984, 7080805, 7114220, 7087320, 7150406, 7093388, 7073741, 7071937, 6958319, 6950288, 6967425, 6961364, 6950525, 6945001, 6996415, 6948498, 6946499, 7019609, 7069292, 7097189, 7167573, 7144262, 7181968, 7188123, 7234689, 7226937, 7296697, 7508601, 7598243, 7736999, 7601897, 7608019, 7764906, 7806543, 7842756, 7956116, 8090277, 8188075, 8055766, 7983354, 8111336, 8239474, 8379277, 8566839, 8653153, 8738675, 8922762, 8945594, 8977063, 9012663, 9061504, 9240246, 9417765, 9616198, 9719725, 9819945, 9989553, 10071049, 10304110, 10458094, 10482793, 10523132, 10556412, 10697468, 10874809, 11072638, 11123314, 11201927, 11345425, 11521350, 11612998, 11831235, 11986989, 12061386, 12299502, 12479119]
3908A2479119K15606J28963K84844K55090L03515L30308L53113L00382K63268
3899A4914208K81802M28456L86182K96107M55697M90701K57163L60640N51031
3890A8421987N80088M78313M88658N18949P00095N90483N11123N92337N42629
3881B3424662O71966P00934O00591O03332N81624M52312N48691N36884N57759
3872B8678755O31199O78968N76581N97327O45138N69157O41312P41642Q04764
3863C4564843Q22200O44175Q64746Q61979J009406R37984Q68545J032164J015990
3854D2622032Q46559Q18383R71295R32273P56505P90313O14737P07811M25038
3845D9484946K78292K46041K4406j8679n2208j60341l80144m34216j49799j04666
$$ y = [12479119, 12694725, 12823688, 13108532, 13363622, 13667137, 13997445, 14350558, 14650940, 14914208, 15196010, 15624466, 16010648, 16306755, 16762452, 17253153, 17510316, 17870956, 18421987, 19002075, 19480388, 19969046, 20487995, 21188090, 21778573, 22289696, 22882033, 23424662, 24096628, 24797562, 25398153, 26001485, 26583109, 27035421, 27584112, 28120996, 28678755, 29309954, 29988922, 30565503, 31162830, 31807968, 32377125, 33018437, 33760079, 34564843, 35387043, 36031218, 36895964, 37757943, 38767349, 39705333, 40573878, 41606042, 42622032, 43468591, 44286974, 45258269, 46190542, 46947047, 47737360, 48352097, 49059908, 49484946, 49763238, 50009279, 50033685, 50015006, 49962798, 49802457, 49422313, 48988097, 48838298, 48733632]
3835D8733632n3463o4381r0840M0358O9023J37688J08053J66454K5392r1179j35741
3824D8844996j40408k70011k07462l81775n39510n68909o86308q42630q69381
3815D4338602q72157j020634r90306r88226q49406r19178q20368o57466q44340
3806C6376521o28189p31102o60859n29056l91831l14872j91318k85666l68435
3797C2275193j68738j31175M9016J6446O1196L2856Q1294K93001K35835L85668
3787C3130592L91116L73779M55706N01257O22168O41393P02409O12539Q81628
3778C8312587Q23765P97563Q39864Q29054P14044P49088Q72237P01918O84953
3769D5325073N82916M83702M55340M51952M11041K60491L29381J49286O7846J79960
$$ y = [48733632, 48680169, 48615788, 48524948, 48565306, 48634329, 48772017, 48880070, 49046524, 49071916, 48980737, 48844996, 48704588, 48434577, 48227115, 47845340, 47305830, 46736921, 46050613, 45207983, 44338602, 43466445, 42445811, 41455505, 40467279, 39617873, 38698695, 37878327, 37220861, 36376521, 35748332, 35017230, 34356371, 33827315, 33435484, 33120612, 32929294, 32643628, 32275193, 32106455, 31975280, 32024296, 32040742, 32101938, 32134794, 32216088, 32509089, 32744924, 33130592, 33521708, 33895487, 34351193, 34852450, 35474618, 36116011, 36818420, 37430959, 38312587, 39136352, 39933915, 40773779, 41602833, 42316877, 43065965, 43938202, 44640120, 45325073, 45907989, 46391691, 46847031, 47298983, 47710024, 47970515, 48299896, 48449182, 48517028, 48696988]
3759D8696988J53705J20159m1585R1125J02478R8743J74918K14315L26234K49969
3749E0187049K52060L04004L51493J34387J75551L46103R4607J03719J74952J23906
3739E2247831J4473j14448j23658q1291p1795n8596k28865q8881k8566J50341
3729E1616545R9520O9089O6916J17925J22173K70496K90804J04989J58459j27725
3719E2789191n69234j220257j614379j741995k090409k116891k046479j867360
3711C9522187j628306j589483j421130j221077j356128j165576j101743j065836
3703B8972908r78149r67511q86580r53207q16943q16443q72233p58076o98175
3694B1225591p26772o08567o69230n72928m91508n97715m75962m19168l31388
$$ y = [48696988, 48850693, 48970852, 48929267, 49020392, 49122870, 49221613, 49396531, 49610846, 49937080, 50187049, 50439109, 50743113, 51094606, 51228993, 51404544, 51750647, 51845254, 51948973, 52123925, 52247831, 52262304, 52147856, 52024198, 51942907, 51871112, 51812516, 51583651, 51494770, 51466204, 51616545, 51716065, 51785154, 51852070, 51969995, 52092168, 52362664, 52653468, 52758457, 52916916, 52789191, 52219957, 50999700, 49385321, 47643326, 45552917, 43436026, 41389547, 39522187, 37893881, 36304398, 34883268, 33662191, 32306063, 31140487, 30038744, 28972908, 27994759, 27027248, 26140668, 25187461, 24370518, 23554075, 22681842, 21923766, 21225591, 20498819, 19890252, 19221022, 18648094, 18156586, 17558871, 17082909, 16663741, 16332353]
3685A6332353m86104m97509l58753l49975l15788k77117m23225m08944k74054
3676A2940884j55004l33945j11204j65797k21918j94384j04510j99866l04814
3667A1149442j60018r4237j04642l73938q4274j29558k56789k5992o9680k26821
3657I623493q7774j22308k2222j13051o6668p2419q6839j93384j08210j31327
3647H619291m3381j38455L5615m891L7877j7467j65470r9743j29141L6663J7916
3636H148814L9769k0199p2746n4749J7486N4591k0552M0427l9385K4356p5165
3625H042647p6914N7423j9492n2490O9365Q6317N7742j53961L1156O1447l1696
3614H071544J45290R9554P3735J6526l8409K6941J58550P2906J22562r411J17245
$$ y = [16332353, 15846249, 15348740, 14989987, 14640012, 14324224, 14047107, 13623882, 13214938, 12940884, 12785880, 12451935, 12340731, 12174934, 11953016, 11758632, 11654122, 11454256, 11149442, 10989424, 10895187, 10790545, 10416607, 10332333, 10202775, 9945986, 9919994, 9850314, 9623493, 9535719, 9413411, 9391189, 9278138, 9211470, 9139051, 9052212, 8858828, 8750618, 8619291, 8575910, 8437455, 8473070, 8468179, 8506056, 8488589, 8323119, 8223376, 8094235, 8130898, 8148814, 8188583, 8168384, 8095638, 8040889, 8058375, 8112966, 8092414, 8132841, 8093456, 8117812, 8042647, 7965733, 8023156, 8003664, 7951174, 8020539, 8106856, 8164598, 8010637, 8041793, 8103240, 8071544, 8216834, 8316388, 8390123, 8406649, 8368240, 8395181, 8553731, 8626637, 8749199, 8739788, 8857033]
3603H857033J28385R9843K24699K42786J47468J64551J80877K80703J89984R6604
3593A0612933L03038L12430L27603M07585L17585M83983M17084N74476P08193
3584A4464910O11619O16283O90899P99235R67545Q32482Q21123R46484R70955
3575B1721535J071647J025806J040878R25302P75617N58105K67532l87546n98912
3566B6399964q18693j276146j267956j293927j253976j071728j017251q24318
3558A7575969q43307o89959m43104m33959m09666k82658l78149l69365k45373
3549A3480429j39918k21613j14090j67340j16945l8196J2338l8504n7931l5207
3539A2563023j23502R2168O3505K0084p5745J34271R5242M1249P2799J46188K1161
$$ y = [8857033, 8985418, 9085261, 9309960, 9552746, 9700214, 9864765, 10045642, 10326345, 10516329, 10612933, 10915971, 11228401, 11556004, 11963589, 12281174, 12765157, 13182241, 13756717, 14464910, 15076529, 15692812, 16383711, 17182946, 18150491, 18982973, 19804096, 20750580, 21721535, 22793182, 23818988, 24859866, 25785168, 26560785, 27118890, 27386422, 26998876, 26399964, 25581271, 24305125, 23037169, 21743242, 20489266, 19417538, 18400287, 17575969, 16732662, 16042703, 15599599, 15165640, 14755974, 14473316, 14095167, 13725802, 13480429, 13340511, 13118898, 13004808, 12837468, 12720523, 12682327, 12694665, 12656161, 12598230, 12563023, 12439521, 12531689, 12595194, 12615278, 12539533, 12673804, 12769046, 12810295, 12883094, 13029282, 13050443]
3528A3050443J16009J53622J8674N4144M2090J32088K29320J93487J26137P6134
3518A4192148K20374K27559J61261J08606K94179K2792J68055J61399J23955L19290
3508A5999618J80433J65607L46822K80267K80912L69473L53859M16674L60210
3499A8753875L17255L58947M42249L54812M22073N03688N45949N58319M11265
3490B2668432M63288N96997N91104O88514P29806O96487P26383P59126R34322
3481B8854459J040757R21480J054734J069965J185728J211351J337123J468974
3473C8144571J627036J639629J769575K025905K124968K089562K335402K710993
3465E4467641K872758L115069L236080L409123L622018L915975M008922M131533
$$ y = [13050443, 13166452, 13320074, 13338748, 13392892, 13434982, 13567070, 13796390, 13989877, 14116014, 14192148, 14412522, 14640081, 14801342, 14909948, 15204127, 15226919, 15394974, 15556373, 15680328, 15999618, 16180051, 16345658, 16692480, 16972747, 17253659, 17623132, 17976991, 18393665, 18753875, 19071130, 19430077, 19872326, 20227138, 20649211, 21152899, 21698848, 22257167, 22668432, 23131720, 23728717, 24319821, 25008335, 25738141, 26434628, 27161011, 27920137, 28854459, 29895216, 30816696, 31871430, 32941395, 34127123, 35338474, 36675597, 38144571, 39771607, 41411236, 43180811, 45206716, 47331684, 49421246, 51756648, 54467641, 57340399, 60455468, 63691548, 67100671, 70722689, 74638664, 78647586, 82779119]
3457H2779119M341257M389831M510639M429310M457898M528445M309972M023194
3449A17769665L601954K764277J814069P03335o39294k020714l272348m071737
3441A16649207m691798n073889m938608m709046m702940m374110l824125l465022
3433H0869669l177578k894721k472634k350213j985784j598496j659705j244303
3425F3486235r15024r50704n98334l26635j42477L5658K84541N43631P14159J025025
3415F3156075J320269J548959J577721J945447K294655K388047K631961K829192
3407G9692326L052463L233818L529407L594660L677943L688912L901908L587192
3399A07958629K369320N40585j595189l267109m038286m262484m253012l920310
$$ y = [82779119, 87120376, 91510207, 96020846, 100450156, 104908054, 109436499, 113746471, 117769665, 121371619, 124135896, 125949965, 126653300, 126014006, 123993292, 120720944, 116649207, 111957409, 106883520, 101944912, 97235866, 92532926, 88158816, 84334691, 80869669, 77692091, 74797370, 72324736, 69974523, 67988739, 66390243, 64730538, 63486235, 62571211, 61620507, 61022173, 60695538, 60553061, 60588719, 60873260, 61416891, 62131050, 63156075, 64476344, 66025303, 67603024, 69548471, 71843126, 74231173, 76863134, 79692326, 82744789, 85978607, 89508014, 93102674, 96780617, 100469529, 104371437, 107958629, 110327949, 110868534, 109273345, 106006236, 101967950, 97705466, 93452454, 89532144]
3391H9532144l316817k654051k241672j859564j325340q76712n94229k81492r7308
3382G6284959N3563L19085N14392N70162N74890O56921N82904P65631Q55211P43551
3372H1921269Q52689P96117N77087K84770N9355n5525j44086k69477l42756p51090
3362H2928353j100931j467909j655621j941271k175158k064107k158539k208464
3354F8156353k089062k117451k029149k147873k248585k292981k243721k290988
3346E0696543k198264k064157k056172j900775j860395j860617j760592j628124
3338C5367447j702613j557790j430540j351287j162399j020312j096456r83416
3330B5062634q51443p80508p24017q44167o81253p30839n81377n43711m70632
$$ y = [89532144, 86215327, 83561276, 81319604, 79460040, 78134700, 77257988, 76663759, 76382267, 76284959, 76338522, 76657607, 77171999, 77742161, 78317051, 78973972, 79556876, 80322507, 81177718, 81921269, 82773958, 83570075, 84147162, 84431932, 84491287, 84435762, 84291676, 84022199, 83679443, 82928353, 81827422, 80359513, 78703892, 76762621, 74587463, 72523356, 70364817, 68156353, 66067291, 63949840, 61920691, 59772818, 57524233, 55231252, 52987531, 50696543, 48498279, 46434122, 44377950, 42477175, 40616780, 38756163, 36995571, 35367447, 33664834, 32107044, 30676504, 29325217, 28162818, 27142506, 26046050, 25062634, 24211191, 23430683, 22706666, 21862499, 21181246, 20450407, 19869030, 19325319, 18854687]
3321A8854687m95921n59559n71853m55148l31146m76865m46806m24576m15242
3312A4677571l00378k33238l68700n08446m57747k10176l28896l79279k61559
3303A1629152j40178j89174l29259k53551k20273k02661k31911j73835o7432l28104
3293I492774j96153j93852j59799j84740j66068k04403k38620r4707j82383p1481
3283G800568j53804j67529k25233j66032j02707o1052j16660o8403p0035j0054
3273F659059j00085p5940q3099p6695k23822j49207O7319j90417o7666j31047
3263E628400l7417j95905j75548l1919j20816m6249p4297N2067n6432q0829j48755
3252D712300j63117q592p6927n4670o3894Q6352K6930j52814Q9261q881j05899
$$ y = [18854687, 18358766, 17799207, 17227354, 16772206, 16441060, 15964195, 15517389, 15092813, 14677571, 14377193, 14143955, 13775255, 13266809, 12809062, 12598886, 12269990, 11890711, 11629152, 11488974, 11299800, 10970541, 10716990, 10496717, 10294056, 10062145, 9888310, 9820878, 9492774, 9296621, 9102769, 8942970, 8758230, 8592162, 8387759, 8149139, 8054432, 7872049, 7800568, 7646764, 7479235, 7254002, 7087970, 6985263, 6924211, 6807551, 6739148, 6669113, 6659059, 6558974, 6483034, 6399935, 6323240, 6099418, 5950211, 6017530, 5827113, 5759447, 5628400, 5590983, 5395078, 5219530, 5187611, 5066795, 5020546, 4946249, 4998316, 4941884, 4861055, 4712300, 4549183, 4540591, 4463664, 4408994, 4345100, 4431452, 4458382, 4305568, 4394829, 4385948, 4280049]
3241D280049L5234J9533o123j56078j13415k2729j25534Q521j10652o2790j4293
3230C731723l6848M643j74516p6645j37363K5006o9368k257m4256O080L5694J4631
3218C276524k657J0358j1273n4308j9282J8651n1991j02346M2825M6149j02885
3207C049765q4497o80n6570p2224m7681O8814L8424m5780j03674q5152L826J763
3195B666334k7101J08435j09099r4095j71513j1234p2695j11692M0180P8634m1627
3184B254527j18712Q057o9749R9192L6349k7576K5479K682K1119q8478O2834N7256
3172B262980Q9624p7j01721O3415p1329j9106q2316q5533k0888m1669j559n8090
3160A933731l1885K4287n0624P737M382m6694O1716p140N060m3293q205J56827
$$ y = [4280049, 4315283, 4334816, 4328693, 4172615, 4059200, 4036471, 3910937, 3919458, 3808806, 3746016, 3731723, 3694875, 3699518, 3525002, 3448357, 3310994, 3336000, 3266632, 3264375, 3220119, 3226199, 3261893, 3276524, 3273867, 3284225, 3272952, 3218644, 3199362, 3218013, 3166022, 3063676, 3106501, 3152650, 3049765, 2965268, 2964588, 2908018, 2835794, 2788113, 2856927, 2895351, 2849571, 2745897, 2660745, 2664571, 2666334, 2639233, 2747668, 2638569, 2544474, 2372961, 2361727, 2289032, 2177340, 2217520, 2296154, 2254527, 2135815, 2143872, 2074123, 2173315, 2209664, 2182088, 2207567, 2210249, 2231368, 2142890, 2205724, 2262980, 2352604, 2352527, 2250806, 2314221, 2242892, 2223786, 2141470, 2055937, 2035049, 1993380, 1991821, 1933731, 1901846, 1926133, 1875509, 1883246, 1887628, 1840934, 1902650, 1895510, 1900570, 1857277, 1849072, 2005899]
3148B005899K2910j49853R0707N0098J3622R9605p9732k4037r8339J74811L4537
3137B140228q6443j9009o5695M8029P0525m3179j85846K1666L6337N4447R9164
3126B070224n5678M721j66769L4290J117n1315J0730P1581L8761l6527k0489k6477
3114A874169J43844l8929L5682M8675j28415j06016n8477l6898n0058K1831j5508
3103A689900j06631J6959j4801P486j14951j11815l0453r3967J346N303j09510
3092A138866R3423j9265j5134O5398n1323p1671P4190N5968j05772L290M0907
3081A208877M093J0750L3822N1235N0154k0182j08982l9003L3992J10688N1337
3070A386781p1939q4996L6689R0431j29406m9708j15819L613J70720j4646m1713
$$ y = [2005899, 2028809, 1878956, 1969663, 2019761, 2033383, 2132988, 2053256, 2029219, 1930880, 2105691, 2140228, 2053785, 2034776, 1969081, 2017110, 2087635, 2044456, 1858610, 1880276, 1916613, 1971060, 2070224, 2014546, 2019267, 1852498, 1886788, 1887905, 1836590, 1847320, 1918901, 1957662, 1921135, 1900646, 1874169, 2018013, 1979084, 2014766, 2063441, 1935026, 1829010, 1770533, 1733635, 1683577, 1705408, 1689900, 1583269, 1600228, 1585427, 1592913, 1477962, 1366147, 1335694, 1241727, 1243073, 1248376, 1138866, 1232289, 1213024, 1197890, 1263288, 1211965, 1140294, 1214484, 1270452, 1164680, 1167970, 1208877, 1212970, 1223720, 1257542, 1308777, 1358931, 1338749, 1229767, 1190764, 1224756, 1335444, 1386781, 1314842, 1229846, 1266535, 1356966, 1227560, 1177852, 1062033, 1065646, 1236366, 1221720, 1180007]
3059A180007m4592n9561O601m2818j06655J17439m850j241n5636K2877O862j5473
3047A002960N1506j27215N2316K8659M4049j2950p5378m284N7330l1384O5088
3036A050697p3281J9874N5430k4848L2296j05510J247P6021M1634j04294m6274
3025I22992K282P4708n0956P531O8485R6656j74593j32714J8474j2260N6131o466
3013H70270R0289r5359o3221m4515M7507J02079k0709N8136j73677k3211R2152
3002H39741M1931o8335j46588k654l333R9016K4315p6582l6846l3383o5557R6399
2990F68124l3594r3153j7095N2079l1065K7625M09m3339O9386l6390j21571O319
2978D47735J14062M3283o7522n949q719k8837q9334K1671J73574l9419r6209O7271
$$ y = [1180007, 1135415, 1075854, 1082455, 1039637, 932982, 1050421, 1045571, 1044330, 988694, 1011571, 1018433, 1002960, 1054466, 927251, 979567, 1008226, 1052275, 1039325, 963947, 959663, 1016993, 985609, 1050697, 977416, 997290, 1052720, 1027872, 1060168, 954658, 955905, 1031926, 1073560, 969266, 922992, 925274, 999982, 949026, 956557, 1025042, 1121698, 947105, 814391, 832865, 820605, 876736, 870270, 960559, 865200, 801979, 757464, 804971, 907050, 886341, 944477, 770800, 747589, 839741, 881672, 813337, 666749, 664095, 660762, 759778, 784093, 707511, 670665, 637282, 571725, 668124, 634530, 541377, 524282, 576361, 545296, 572921, 573330, 529991, 599377, 562987, 441416, 447735, 561797, 605080, 537558, 531609, 522890, 494053, 404719, 426390, 599964, 560545, 464336, 531607]
2966E31607J15515P4602l4659m1697j56922r2228J7796j6002m7856j26159J4462
2955B38459L0807p2877Q909N3184N315N4865O8656K5132m9970J14349j02213M6015
2943D20631L2374j11893j25379O9324k3921M0888K0441J4003j4794l1134O3807
2932C54347k13769p8443q333J54371J27451R3073j97872L1048m5599O2171J16280
2921C94725j03609J7403K7743m2122j1141k9116N293K0834m287k0897n8909R7877
2909B93794J45547q2416q6908n1141k2500O3853l4511k2144k391R9836j29087
2898A71932l1863J93148j69334j1638M2798M1802j02013r9930K09765j8699j9504
2887B06464L7265N8630r8315m1725n4080K4798L9445L8729O9820o1482L3401o6718
$$ y = [531607, 647122, 721724, 687065, 645368, 488446, 396218, 414014, 398012, 350156, 223997, 238459, 269266, 196389, 205298, 258482, 263797, 318662, 387318, 412450, 362480, 476829, 374616, 420631, 453005, 341112, 215733, 285057, 261136, 302024, 322465, 336468, 321674, 290540, 354347, 140578, 62135, 53802, 208173, 335624, 428697, 230825, 261873, 216274, 278445, 394725, 291116, 308519, 336262, 294140, 282999, 253883, 259176, 280010, 275723, 254826, 195917, 293794, 439341, 356925, 270017, 218876, 196376, 260229, 225718, 203574, 201183, 301019, 171932, 140069, 333217, 163883, 152245, 195043, 236845, 134832, 34902, 244667, 225968, 206464, 243729, 302359, 204044, 162319, 108239, 133037, 172482, 211211, 281031, 219549, 252950, 186232]
2875A86232j6213q1859j08839J54836O0169M986m8528K3202N4108p9742n0238
2864I8114P8011R8513p7652J6049j9743q3366J30303k0363N0650M4994j28242
2853A87268j9634J1237o4460l5187P8946k0083J2440O4887r9888N840k7459J29170
2841B23077M5284K8954P3203p2926j19953J02087R0761n2736k7323o2557L0007
2830B57878O1561J5743j40052P1090P8466j6029L3455r7181o5231N9939J3288
2819B72927j4395q1732m6427r629J11586P8449n2609J02843P2153P4240l4851
2808D72555m2712M3568o9810J7492O677k635P0269Q008N5973p5495K2579P6430
2796E82899o5737R3483O2909k9332o7955r2878K6527J10281n9860Q7747Q4276
$$ y = [186232, 170019, 88160, -20679, 134157, 194326, 199312, 150784, 173986, 228094, 148352, 98114, 176125, 274638, 196986, 213035, 193292, 109926, 240229, 219866, 270516, 315510, 187268, 167634, 178871, 114411, 79224, 158170, 138087, 150527, 215414, 115526, 121366, 93907, 223077, 268361, 297315, 370518, 297592, 177639, 279726, 370487, 317751, 290428, 227871, 257878, 319439, 335182, 195130, 266220, 344686, 328657, 362112, 264931, 199700, 259639, 272927, 258532, 176800, 130373, 120744, 232330, 310779, 258170, 361013, 433166, 507406, 472555, 429843, 473411, 403601, 421093, 427770, 425135, 495404, 503412, 559385, 483890, 506469, 582899, 517162, 610645, 673554, 644222, 576267, 483389, 509916, 620197, 560337, 648084, 732360]
2785G32360k4466r985J25243K6871q1188R6975O6234l6509K4635J42575J23058
2774A185803O5927R7686N7167K0020K29948J28185J74084R6248J65435J13396
2764B333899k649l3491n5060J341R7793q7569j77641p3754j58098n1601l79242
2753A413928k65694o6654p5154o4821r2381n6080J47683r3716r13p3837j88002
2742E84359N657k8845L1616l5391p0234M5251m1599k282q6496l0437O7488P126
2730D46213o3725k6531l1443j09161O0396r6573N719Q745o0381q915J8533l7842
2718A05035k5303q9939P23J04099m4629R043N4098r5546m1607Q6027r0247j501
2706b9747n007K0643R9600N4513k8400r189p424K8859n2769j9512q9354p0855
$$ y = [732360, 707894, 697909, 823152, 850023, 768835, 865810, 932044, 895535, 920170, 1062745, 1185803, 1251730, 1349416, 1406583, 1426603, 1656551, 1784736, 1958820, 2055068, 2220503, 2333899, 2331250, 2297759, 2242699, 2244040, 2341833, 2254264, 2076623, 2002869, 1844771, 1793170, 1413928, 1148234, 1081580, 1006426, 941605, 849224, 793144, 940827, 847111, 846198, 772361, 584359, 590016, 561171, 592787, 557396, 487162, 532413, 490814, 488532, 402036, 371599, 439087, 446213, 382488, 355957, 324514, 215353, 275749, 179176, 184895, 193640, 133259, 124344, 142877, 105035, 79732, -10207, -9484, 94615, 49986, 59029, 113127, 17581, -24026, 62001, -28246, -29747, -34754, -14111, 85489, 140002, 111602, 102413, 94989, 123848, 71079, 51567, -37787, -108642]
2694a08642J25241M9429K8647j05433J06297L5662o0789o7450l3338J2817o578
2683b4137q9259L8608Q2616k3141J16553o4115L0271Q613M059K177j17509J6590
2671a8674J02744R8183L7010n7938L1618J4268J4566N6744j67924K0634j0472
2660A20759l8621j0180j4114j3787j25079J65375J85253j49345n7479o7343K6796
2649B2235N8921N8296M4617M3974l9301j14390k0988j6506q6120J08174J40903
2638A99815j47025m0691M4190O3572M9719L4747j73369J8876O1101N1310j9659
2627A42586j07401j0783J2628M9008j17880J33213L7146j62965m6086M7383J0603
2616a2548O6731Q4406n0841M4680R1852n7700o9343L852K4770M505K1862m2428
$$ y = [-108642, 16599, 66028, 94675, -10758, 95539, 131201, 70412, 2962, -30376, -17559, -24137, -113396, -74788, 7828, -15313, 101240, 37125, 67396, 76009, 80068, 82245, -35264, -18674, 84070, 182253, 219263, 161325, 192943, 207211, 221777, 278521, 110597, 131231, 120759, 82138, 71958, 57844, 44057, -81022, 84353, 269606, 120261, 62782, -4561, 22235, 81156, 139452, 184069, 228043, 188742, 74352, 53364, 36858, -49262, 58912, 199815, 52790, 12099, 56289, 119861, 169580, 204327, 30958, 49834, 110935, 162245, 142586, 35185, 24402, 37030, 86038, -31842, 101371, 138517, -24448, -70534, -23151, -12548, 54183, 138589, 87748, 132428, 224280, 166580, 97237, 101089, 125859, 130364, 152226, 109798]
2604A09798n909m945j7048j21940L4569L9068j0798m4029M8739M1694J7836K0191
2592A07226L416k4560o2534M047M062m962m0200M3981O5246O516J3870J00892
2580B17000m6890q9334q8555K4434m1067O880K5554j18408J25219J10425l5737
2569H9521K2002j41416j2839Q97Q7877M6402l8519J59681M7824o2406n6098j67744
2557b4818K9491j4960m7515P1311j6706L1508L6494q3304l4652J5626r477q084
2545e5086j133J3248K6240q8344N1602J6818j04676R3166J52517o1242j20781
2534g7671K1340M7586r910Q9180r5936l2816J22648m5877O9997J5073p7094Q0100
2522A06620k45504j54546J78760J61779j1072j55726n8720Q1972R283n0464J4263
$$ y = [109798, 103889, 98944, 81896, -40044, -5475, 33593, 22795, -21234, 27505, 69199, 87035, 107226, 110642, 86082, 23548, 27595, 31657, 26695, -13505, 30476, 95722, 102238, 116108, 217000, 170110, 80776, -7779, 16655, -24412, -17532, 8022, -110386, 14833, 125258, 89521, 111523, -29893, -42732, -41835, 46042, 92444, 53925, 213606, 261430, 199024, 142926, -24818, 4673, -10287, -57802, 13509, -3197, 28311, 64805, -18499, -53151, -37525, -47002, -55086, -56219, -42971, -16731, -105075, -53473, -36655, -141331, -48165, 104352, 43110, -77671, -56331, -8745, -18655, 70525, -25411, -58227, 64421, 18544, 88541, 103614, 26520, 106620, -138884, -293430, -114670, 47109, 36037, -119689, -178409, -96437, -87154, -137618, -123355]
2511a23355K5288J09073l8880j35823N87O8724J66166J5968k120P734k9387l6548
2499B7427j0693L5842k3264o064p0654K4657n6715N1752l4283n6119k0913J6310
2487a22717q9925j2817P8921R0609m9324M7553L283L3096N1312L7543J27075l6262
2475A58347j60292O1762L5242o8964K5237M3446r8324K0518J16921j25993l6876
2464b8976K5103N6915M0135L3539k6671m9404m3438R7476n339j18572N3286L4712
2452F8766N8512Q1777j84867n6952O1678Q3429k6087l7458J45130j5515n2444
2441A25969k8498k8352q9218O1798m2480N87R500M5528O7330j8976J14581q4956
2429A32813J8665Q776N567j48652j8665N8685m3144j934Q9620q2248l8055J03332
$$ y = [-123355, -98067, 11006, -27874, -163697, -163110, -94386, 71780, 87748, 85628, 93362, 63975, 27427, 16734, 52576, 29312, 23248, -47406, -22749, -79464, -27712, -61995, -118114, -139027, -122717, -212642, -225459, -146538, -55929, -105253, -57700, -54417, -21321, 29991, 67534, 194609, 158347, -1945, 59817, 95059, 26095, 51332, 94778, -3546, 16972, 133893, 7900, -28976, -3873, 53042, 93177, 126716, 100045, 50641, 7203, 104679, 99340, -19232, 34054, 68766, 127278, 209055, 24188, -32764, 28914, 112343, 86256, 48798, 193928, 178413, 125969, 97471, 69119, -20099, 41699, -781, -194, 9306, 54834, 122164, 103188, 217769, 132813, 151478, 160254, 165821, 17169, -1496, 57189, 14045, 12111, 101731, 19483, -18572, 84760]
2417H4760O3201m0662p269j17303j41819N4952p3733J04813L9495K786j2982J0395
2405c3366o4788M2398O4966o1580p410R1364K0867l7633P9861l9349k2839J14115
2393A46606l0504j03249m04R9810o0598m4326L074L9569K4305K579j00740j00285
2381a24163M2961q7167N525L5639j2170n8944J3137j7861K5419q1584j05457R7248
2369b67417J49065Q1145r198O1345J20140K7379j95439l0358p6310P2565N9715
2358g368p2828K5228O8464n115r173J18761j56934j44273P4134j7852r138J9998
2346a16096n8519l4301o1716L1356P0049M653M9524j08704j1703J51702j0064
2335i3819K2377J3106N3198J1134k3931n9204N8426M012k4103M5966j2077q6328
$$ y = [84760, 147961, 107299, 100030, -17273, -159092, -104140, -177873, -73060, -33565, -30779, -43761, -33366, -98154, -55756, 9210, -52370, -59780, 31584, 52451, 14818, 94679, 55330, 32491, 146606, 116102, 12853, 12449, 112259, 51661, 7335, 10409, 49978, 74283, 76862, -23878, -124163, -81202, -168369, -162844, -127205, -139375, -198319, -185182, -203043, -177624, -259208, -364665, -267417, -118352, -37207, -46405, 14940, 135080, 162459, -32980, -63338, -139648, -67083, -7368, -80196, -54968, 13496, 8381, -792, 117969, -38965, -183238, -109104, -126956, -136094, -116096, -174615, -208916, -270632, -239276, -169227, -164574, -115050, -223754, -235457, -83755, -93819, -71442, -58336, -5138, 5996, -17935, -77139, -18713, -14701, -38804, 7162, -4915, -91243]
2323i1243n4896p3621K3298J47019j46840j897J20424m0921P8420r5516l2815
2312a68588M8727Q4808O1650m0880n1305n5868O0817M9837O4450M7084o6589l2441
2300A702j2080J5897k5505l5922L4104J08594j53333m9998j5896N2421N4036m1068
2288f7048m6037j2399P8756R2937M5131r5170n9339j87314J20136l787P793J56601
2276C0260m967J09316k1503R634k3955K9300n0924r8537L7760j9435o3848O4778
2264b121N2921n3576J39831K9159j29158n318n8363J06751K0533p7198j1402m9460
2252c7401K4056j0734P3617O9121O0826j86162K5519L6017o3406J14813J48146
2241B54412q2821L5167j54076k2427K0962R6020L8954o2064j4436M1505L8415
$$ y = [-91243, -146139, -219760, -196462, -49443, -196283, -198180, -77756, -118677, -40257, -135773, -168588, -119861, -35053, 26597, -14283, -65588, -121456, -60639, -10802, 53648, 100732, 34143, 1702, -10378, 5519, -19986, -55908, -21804, 86790, -66543, -116541, -132437, -80016, -25980, -67048, -113085, -125484, -46728, 46209, 91340, -3830, -63169, -250483, -130347, -134134, -126341, 30260, 25293, 134609, 113106, 122740, 98785, 128085, 77161, -21376, 16384, -3051, -66899, -2121, 50800, -2776, 137055, 166214, 37056, 31738, -26625, 80126, 100659, 23461, 12059, -37401, -13345, -24079, 49538, 118659, 179485, -6677, 18842, 54859, -8547, 106266, 254412, 171591, 206758, 52682, 30255, 51217, 147237, 186191, 124127, 109691, 151196, 189611]
2230A89611n2711n6005N8607p0823J01068J43333j17626j06972K6278J37317o1192
2219A90885l8312R0673M1362j97105l1004N6201P0168p3429L7842R7236m8847
2208A95670m6083K476p4421p4515J7427M6105P5570j3573P5032M3987O2893k11
2196C10357J3609k0020r4834j17643K424J74810J6052j12902K0386N7324r2939
2185A56624P295j8114n3996j1457R7821j26893O3133m252L9635O4232K138P486
2173B23652j5239J24286R179j12793j04587J86155J1892r2121J28403L6098o3797
2162C31128J13870N5409k60385N832J57744p060j1488n212L1093l4270P280o6394
2150C17547o8152P0651j1321K80K1690J2039q2268q2725o9455J00548M3814J21122
$$ y = [189611, 136900, 80895, 139502, 68679, 169747, 313080, 195454, 88482, 114760, 252077, 190885, 152573, 243246, 284608, 87503, 56499, 112700, 182868, 109439, 147281, 244517, 195670, 149587, 152063, 77642, 3127, 20554, 66659, 142229, 128656, 203688, 247675, 310568, 310357, 323966, 303946, 209112, 91469, 93893, 268703, 284755, 171853, 192239, 249563, 156624, 163919, 145805, 91809, 80352, 178173, 51280, 114413, 110161, 149796, 214028, 216166, 223652, 208413, 332699, 341878, 229085, 124498, 310653, 322545, 230424, 358827, 394925, 331128, 444998, 500407, 240022, 245854, 403598, 396538, 385050, 379838, 410931, 376661, 383941, 317547, 249395, 320046, 308725, 309005, 330695, 342734, 260466, 177741, 108286, 208834, 252648, 373770]
2138C73770J5139K2628J8104K4993N9790o5474n988m936L8119L3475j03357k9337
2126C76926k7787P2108l9913l756j32152N6052J5048r447J35346j64068j8816
2115B59541R2891L9814o5339M7176N6753Q0165q3702J7543n2125n5736l2733K5831
2103C30079j00279n074O5378K4014K9040j3844K7675r1244Q458L0607J180l2539
2091B73451r7178J8423l4735k8210K3186R7010j941j7619J0299J1596q592n618
2079B40072o4360k860j1003J9478M9215k9261P232L9688P4307j68327l7459M3827
2067A60549p275l2044K886M192R714q3639Q5228J56729q9511n2795m1624J0240
2055A22650M3080N1461n7181O4526r4266m9958k9177J06020M2654k9820j14422
$$ y = [373770, 388909, 411537, 429641, 454634, 514424, 448950, 442962, 438026, 476145, 509620, 406263, 376926, 349139, 421247, 381334, 377578, 245426, 301478, 316526, 307079, 442425, 278357, 259541, 352432, 392246, 326907, 374083, 430836, 511001, 427299, 444842, 392717, 336981, 304248, 330079, 229800, 224726, 290104, 314118, 343158, 329314, 356989, 265745, 274203, 304810, 305990, 273451, 176273, 194696, 159961, 131751, 154937, 251947, 250006, 232387, 242686, 254282, 245690, 240072, 175712, 172852, 161849, 181327, 230542, 201281, 208513, 248201, 322508, 154181, 116722, 160549, 153274, 121230, 124116, 128308, 138022, 54383, 139611, 296340, 206829, 154034, 112410, 122650, 165730, 217191, 160010, 224536, 130270, 80312, 51135, 157155, 199809, 169989, 55567]
2044E5567k1062K5026j03642P2296J58398O7965r2794N3192m124j31485J71871
2033B51208Q5302o6405q9606m5316J42933M98M025L304p7473o9009j4800J9115
2021A43776K6817J7740M2350o3751J3155P4676o1503q4652J16317j04724M7801
2010A68002M7187J9995K7844j1573m1066n162Q9227M1638N8461j52228p2359J30295
1998C00261P3097p872L7939j64479J3066o2020m042M2070o7914K5332m2595J563
1986A44406Q0950L954m2170l4387o1742O9851M1332J7317n0025k5615m7517n7398
1974C8956M0580Q0149p8882N2080Q0010k690L8024L3733o8061j03403k0994K9383
1962A18885n6439N1182L8328P1101m1436j2511L8045j03729j11756J05630J30481
$$ y = [55567, 34505, 59531, -44111, 28185, 186583, 254548, 161754, 214946, 210822, 79337, 251208, 336510, 270105, 180499, 135183, 278116, 278614, 282639, 285943, 208470, 139461, 124661, 143776, 170593, 188333, 230683, 166932, 180087, 254763, 193260, 108608, 224925, 120201, 168002, 215189, 235184, 263028, 251455, 210389, 205227, 294454, 336092, 394553, 242325, 169966, 300261, 373358, 365486, 403425, 238946, 252012, 189992, 185950, 228020, 160106, 185438, 142843, 144406, 225356, 229310, 187140, 152753, 91011, 160862, 202194, 219511, 169486, 143871, 96354, 38956, 79536, 159685, 80803, 132883, 212893, 210203, 248227, 281960, 213899, 110496, 89502, 118885, 62446, 113628, 151956, 223057, 181621, 169110, 207155, 103426, -8330, 97300, 227781]
1951B27781j202j02248r4788o4089o581l4919M603m978M2090q1791o4538P6386
1939a04274O8718P8111R7162j3123o9586N1301o2426P7344j2546j07078r510O0667
1927E4760j10807R161k4291J33645j8333p9425j13374k8800N5748m5654q542M785
1915a71127J1963q4739O3988K4362k5602m0486P3616m0376k0911N0012p629Q0270
1903h6659K3309M7492q4946P8160J44065j9155J8128r6222m859J27703M7981o8818
1891A26179j70320m8348j02886N3579J7602j6963q7440q6737l4134J32316k0861
1880b38013j21252J21267o4181k0308N8270O2217L4620j6902M5808R5721N3768
1869A1015Q6920J8626q7194K5245j01127l9275m9081Q597J38176Q641m3906k2768
$$ y = [227781, 226579, 124331, 29543, -34546, -41127, -76046, -71443, -76421, -34331, -116122, -180660, -104274, -35556, 42555, 139717, 126594, 57008, 108309, 45883, 123227, 110681, 3603, -5907, 54760, -56047, -46886, -71177, 62468, 44135, -35290, -148664, -177464, -121716, -167370, -175912, -171127, -159164, -243903, -179915, -155553, -181155, -221641, -148025, -188401, -209312, -159300, -166929, -86659, -63350, -15858, -100804, -22644, 121421, 102266, 120394, 24172, 19313, 147016, 194997, 126179, -44141, -92489, -195375, -141796, -124194, -141157, -228597, -315334, -349468, -217152, -238013, -359265, -237998, -302179, -322487, -264217, -202000, -167380, -184282, -138474, -42753, 11015, 97935, 116561, 29367, 54612, -46515, -85790, -134871, -126274, 11902, 20543, -23363, -46131]
1857d6131M4716q9047m7875L8238m9578l2333J02318J7668k502K3770p4983n5856
1845a71595K6587j02012j0373J49032M4477k3779J1468J36685O8818J5013j00720
1834D3601j3231O1441N1363K3367l8676l0232M6036N2244L5019p5024k546q6253
1822F7109j10710m687M9467k3810n432J1669j60054J5079J14302j772k3187Q3638
1810A1612M518J22845L0263J04813N6905O0526P4492L1344k189m5643M2194J14722
1798F06402m0131o170J2370J49785L757r5012L7022r054N991L0026l7844n8587
1786E98555K0183Q6301j24389l8111m303Q4287j53526N6440J22108O5466R2656
1775H05667o3033j8438P9021K8021J5299J98840j6074m9700M5634J68005L2248
$$ y = [-46131, -1415, -90462, -138337, -100099, -149677, -182010, -79692, -62024, -64526, -40756, -115739, -171595, -145008, -247020, -257393, -108361, -63884, -87663, -76195, 60490, 129308, 144321, 43601, 30370, 91811, 143174, 166541, 127865, 97633, 143669, 195913, 230932, 155908, 153362, 67109, -43601, -48288, 1179, -22631, -28063, -16394, -176448, -161369, -47067, -48839, -72026, 11612, 16130, 138975, 169238, 274051, 330956, 391482, 465974, 497318, 495129, 449486, 491680, 606402, 566271, 560101, 572471, 722256, 726013, 631001, 668023, 658969, 664960, 694986, 657142, 598555, 618738, 705039, 580650, 542539, 538236, 622523, 468997, 525437, 647545, 713011, 805667, 742634, 724196, 803217, 831238, 846537, 1045377, 1029303, 979603, 1025237, 1193242, 1225490]
1764A225490l3035L3705L7219p9916j3753N2697o8903n6783N5744j7232p2911
1753A062322p2955m9712l668p5263r8698O4248M73r2192o0700J45025p6664j07776
1741F34440J10378O122P2980o425m3428R1888R948k6918j57587L3689P6413n9237
1729G42263k3739j20696o3314M092o6110M8865j08549K2357M9786N2362q556l4422
1717D94339k0256K3074p821m3154k5506p2245n103r9340J0135R1836M4170n3132
1705C36997Q2063p1617o9181M271p3882j09859m7704J46242Q9703k9299M963l4418
1693B28279j83J07708r3074j20700N3049R4833o5546k9890r3581m6761M3531K7106
1681A04771J2817k12906k7785J47134m0416K3911M9980N961j7905r4668K2090
$$ y = [1225490, 1192455, 1226160, 1263379, 1183463, 1169710, 1222407, 1153504, 1096721, 1152465, 1135233, 1062322, 989367, 939655, 935987, 860724, 762026, 826274, 826747, 734555, 673855, 818880, 742216, 634440, 744818, 750940, 823920, 817495, 774067, 865955, 875903, 848985, 691398, 725087, 801500, 742263, 718524, 597828, 534514, 538606, 472496, 521361, 412812, 435169, 484955, 537317, 528761, 494339, 474083, 497157, 489336, 446182, 420676, 348431, 343328, 243988, 254123, 345959, 390129, 336997, 419060, 347443, 278262, 282533, 208651, 98792, 51088, 197330, 287033, 257734, 262697, 228279, 228096, 335804, 242730, 122030, 175079, 269912, 204366, 174476, 80895, 34134, 77665, 104771, 117588, -95318, -123103, 24031, -16385, 7526, 57506, 63467, 45562, -49106, -27016]
1670b7016L6911p4669N3428N1582P241p6303O3817J698J9449n6559j1067J27199
$$ y = [-27016, 9895, -64774, -11346, 40236, 47477, -28826, 34991, 36689, 56138, -421, -11488, 115711]
$$ [...]
##END NTUPLES=NMR SPECTRUM
##END=
