##TITLE=1H_CA-8848-1
 DMSO, 8 sc, 
 27.04.2021
##JCAMPDX= 6.0         $$ Bruker NMR JCAMP-DX V2.0
##DATA TYPE= NMR SPECTRUM
##DATA CLASS= NTUPLES
##ORIGIN= UXNMR, Bruker Analytische Messtechnik GmbH
##OWNER= root
$$ XWIN-NMR		Version 3.5
$$ Tue Apr 27 15:27:10 2021 Russian Standard Time (UT+4h)  she@DPX200
##.OBSERVE FREQUENCY= 200.131506
##.OBSERVE NUCLEUS= ^1H
##.ACQUISITION MODE= SIMULTANEOUS
##.ACQUISITION SCHEME= undefined
##.AVERAGES= 8
##.DIGITISER RES= 18
##SPECTROMETER/DATA SYSTEM= spect
##.PULSE SEQUENCE= zg30
##.SOLVENT NAME= DMSO
##.SHIFT REFERENCE= (INTERNAL, DMSO, 0, 16.0134)
##AUDIT TRAIL= $$ (NUMBER, WHEN, WHO, WHERE, WHAT)
$$ ##TITLE= Audit trail, XWIN-NMR		Version 3.5
$$ ##JCAMPDX= 5.01
$$ ##ORIGIN= Bruker BioSpin GmbH
$$ ##OWNER= she
$$ F:/spectra/data/she/nmr/H-F/1/pdata/1/auditp.txt
$$ ##AUDIT TRAIL=  $$ (NUMBER, WHEN, WHO, WHERE, WHAT)
(   1,<2021-04-27 15:26:12.56 +0400>,<she>,<DPX200>,
      <created by zg, POWCHK disabled, PULCHK disabled
       configuration hash MD5:
       00 E9 B6 7A A2 85 ED C7 34 08 36 98 17 FE 4E 26
       data hash MD5: 16K
       B2 16 FF BE A1 0E EA 16 EF C7 00 19 28 ED 52 06>)
(   2,<2021-04-27 15:26:15.68 +0400>,<she>,<DPX200>,
      <Start of raw data processing
       efp BC_mod = 2 LB = 0.24 FT_mod = 6 PKNL = 1 PHC0 = -11121.84 PHC1 = 10.40096 SI = 16K 
       data hash MD5: 16K
       84 51 4F B3 95 93 73 21 F7 AA 05 0A 67 3F B2 23>)
(   3,<2021-04-27 15:26:32.09 +0400>,<she>,<DPX200>,
      <pk PHC0 = 0.7918759 PHC1 = -0.4 
       data hash MD5: 16K
       08 B7 4E D0 AB 05 38 BD 29 3C C9 2C BA 4F 5B E3>)
(   4,<2021-04-27 15:26:35.01 +0400>,<she>,<DPX200>,
      <abs ABSG = 5 
       data hash MD5: 16K
       F9 9D 94 BD AA 18 5F C1 8E 02 02 E0 B6 14 AD 5B>)
$$ ##END=
$$ 
$$ hash MD5
$$ 0F 92 9A 9A 3E 7F F4 11 01 62 B6 78 D7 24 57 33
##$RELAX= 
##$RELAX= 
##$RELAX= 
##$RELAX= 
##$RELAX= 
##$RELAX= 
$$ Bruker specific parameters
$$ --------------------------
##$DU= <F:/spectra>
##$EXPNO= 1
##$NAME= <H-F>
##$PROCNO= 1
##$TYPE= <nmr>
##$USER= <she>
##$AMP= (0..31)
100 100 100 100 100 100 100 100 100 100 100 100 100 100 100 100 100 100 
100 100 100 100 100 100 100 100 100 100 100 100 100 100 
##$AQSEQ= 0
##$AQ_mod= 1
##$AUNM= <au_zg>
##$AUTOPOS= <>
##$BF1= 200.13
##$BF2= 200.13
##$BF3= 200.13
##$BF4= 200.13
##$BF5= 200.13
##$BF6= 200.13
##$BF7= 200.13
##$BF8= 200.13
##$BYTORDA= 1
##$CFDGTYP= 0
##$CFRGTYP= 5
##$CHEMSTR= <none>
##$CNST= (0..31)
1 1 145 1 1 1 1 1 1 1 1 1 1 1 1 1 1 1 1 1 1 1 1 1 1 1 1 1 1 1 1 1 
##$CPDPRG= <>
##$CPDPRG1= <>
##$CPDPRG2= <>
##$CPDPRG3= <>
##$CPDPRG4= <mlev>
##$CPDPRG5= <mlev>
##$CPDPRG6= <mlev>
##$CPDPRG7= <mlev>
##$CPDPRG8= <mlev>
##$CPDPRGB= <>
##$CPDPRGT= <>
##$D= (0..31)
0 1.2 0 0 0 0 0 0 0 0.06 0 0.03 0 0 0 0 0.0002 0 0 0 0 0 0 0 0 0 0 0 0 
0 0 0 
##$DATE= 1619522771
##$DBL= (0..7)
120 120 120 120 120 120 120 120 
##$DBP= (0..7)
150 150 150 150 150 150 150 150 
##$DBP07= 0
##$DBPNAM0= <>
##$DBPNAM1= <>
##$DBPNAM2= <>
##$DBPNAM3= <>
##$DBPNAM4= <>
$$ [...]
##$SUBNAM3= <"">
##$SUBNAM4= <"">
##$SUBNAM5= <"">
##$SUBNAM6= <"">
##$SUBNAM7= <"">
##$SUBNAM8= <"">
##$SUBNAM9= <"">
##$SW= 16.9725357007746
##$SWIBOX= (0..15)
0 0 2 0 0 0 0 0 0 0 0 0 0 0 0 0 
##$SW_h= 3396.73913043478
##$TD= 16384
##$TD0= 1
##$TE= 0
##$TE2= 300
##$TE3= 300
##$TEG= 300
##$TL= (0..7)
0 120 120 120 120 120 120 120 
##$TP= (0..7)
150 150 150 150 150 150 150 150 
##$TP07= 0
##$TPNAME0= <>
##$TPNAME1= <>
##$TPNAME2= <>
##$TPNAME3= <>
##$TPNAME4= <>
##$TPNAME5= <>
##$TPNAME6= <>
##$TPNAME7= <>
##$TPOAL= (0..7)
0.5 0.5 0.5 0.5 0.5 0.5 0.5 0.5 
##$TPOFFS= (0..7)
0 0 0 0 0 0 0 0 
##$TUNHIN= 0
##$TUNHOUT= 0
##$TUNXOUT= 0
##$USERA1= <user>
##$USERA2= <user>
##$USERA3= <user>
##$USERA4= <user>
##$USERA5= <user>
##$V9= 5
##$VALIST= <valist>
##$VCLIST= <CCCCCCCCCCCCCCC>
##$VD= 0
##$VDLIST= <DDDDDDDDDDDDDDD>
##$VPLIST= <PPPPPPPPPPPPPPP>
##$VTLIST= <TTTTTTTTTTTTTTT>
##$WBST= 1024
##$WBSW= 4
##$XGAIN= (0..3)
0 0 0 0 
##$XL= 0
##$YL= 0
##$YMAX_a= 678506
##$YMIN_a= -582550
##$ZGOPTNS= <>
##$ZL1= 120
##$ZL2= 120
##$ZL3= 120
##$ZL4= 120
##$ABSF1= 16.01339
##$ABSF2= -0.9592743
##$ABSG= 5
##$ABSL= 3
##$ALPHA= 0
##$AQORDER= 0
##$ASSFAC= 0
##$ASSFACI= 0
##$ASSFACX= 0
##$ASSWID= 0
##$AUNMP= <proc_1d>
##$AZFE= 0.1
##$AZFW= 0.1
##$BCFW= 0
##$BC_mod= 2
##$BYTORDP= 0
##$COROFFS= 0
##$CY= -3
##$DATMOD= 1
##$DC= 0
##$DFILT= <>
##$DTYPP= 0
##$F1P= 0
##$F2P= 0
##$FCOR= 1
##$FTSIZE= 16384
##$FT_mod= 6
##$GAMMA= 0
##$GB= 0
##$INTBC= 1
##$INTSCL= 1.334414e-10
##$ISEN= 128
##$LB= 0.24
##$LEV0= 0
##$LPBIN= 0
##$MAXI= 10000
##$MC2= 0
##$MEAN= 0
##$ME_mod= 0
##$MI= 1.114404
##$NCOEF= 0
##$NC_proc= -7
##$NLEV= 6
##$NOISF1= 3.799351
##$NOISF2= 2.8
##$NSP= 0
##$NTH_PI= 0
##$NZP= 0
##$OFFSET= 16.01339
##$PC= 1
##$PHC0= -11121.05
##$PHC1= 10.00096
##$PH_mod= 1
##$PKNL= yes
##$PPARMOD= 0
##$PSCAL= 0
##$PSIGN= 0
##$REVERSE= no
##$SF= 200.129999609843
##$SI= 16384
##$SIGF1= 3
##$SIGF2= 2
##$SINO= 5.538805
##$SIOLD= 16384
##$SREGLST= <1H.CDCl3>
##$SSB= 0
##$STSI= 16384
##$STSR= 0
##$SW_p= 3396.73913043479
##$SYMM= 0
##$S_DEV= 0
##$TDeff= 16384
##$TDoff= 0
##$TI= <>
##$TILT= no
##$TM1= 0
##$TM2= 0
##$TOPLEV= 0
##$USERP1= <user>
##$USERP2= <user>
##$USERP3= <user>
##$USERP4= <user>
##$USERP5= <user>
##$WDW= 1
##$XDIM= 16384
##$YMAX_p= 363090608
##$YMIN_p= -628977
$$ End of Bruker specific parameters
$$ ---------------------------------
##NTUPLES= NMR SPECTRUM
##VAR_NAME=  FREQUENCY,     SPECTRUM/REAL,   SPECTRUM/IMAG
##SYMBOL=    X,             R,               I
##VAR_TYPE=  INDEPENDENT,   DEPENDENT,       DEPENDENT
##VAR_FORM=  AFFN,          ASDF,            ASDF
##VAR_DIM=   16384,         16384,           16384
##UNITS=     HZ,            ARBITRARY UNITS, ARBITRARY UNITS
##FACTOR=    0.207333158178282, 1,           1
##FIRST=     3204.7596518791, 0,             0
##LAST=      -191.979478555695, 0,           0
##MIN=       -191.979478555695, -628977,     0
##MAX=       3204.7596518791, 363090608,     0
$$ Real data points
##PAGE= N=1
##DATA TABLE= (X++(R..R)), XYDATA
$$ [...]
8324 783737 769335 697471 653394 651191 691440 957076 972655 976720 851627 897955 958286 856874
8312 856874 978025 1128278 1032215 1032328 1179224 1172802 1164444 1214500 1211490 1132956 959235 792225
8300 792225 801329 812733 820071 577512 571782 646546 747014 701050 582483 430708 328935
8289 328935 384170 448957 650679 424244 577164 1004100 894211 818615 1026969 1173954
8279 1173954 1225895 1049362 1009928 1022742 1038609 1110375 1164055 1294355 1193970 991520 1060354
8268 1060354 1116185 893443 878590 1093722 1000388 763768 756954 863012 751185 670371 486599
8257 486599 633231 708807 625887 516124 578011 719687 711196 902977 799495 815121 815853
8246 815853 884292 763539 706931 887313 963248 1025165 1005970 986876 1027301 840755 773650
8235 773650 955323 1010104 760647 719455 822681 689967 666703 790320 871201 857843 939735
8224 939735 884655 834761 896852 848627 884055 1069732 966121 839618 967297 955883 859833
8213 859833 727065 795172 1087612 1103574 1225983 1094674 1220563 1310975 1398862 1473226 1567588
8202 1567588 1537954 1460547 1469060 1381318 1184358 1065015 982036 1167139 1129652 1441671 3380574
8191 3380574 2660923 1604066 1568637 1410502 1494156 1343600 1191610 1000966 1054305 1113277
8181 1113277 1294534 1252624 1178242 1373122 1503772 1445519 1400467 1540157 1681063 1466840
8171 1466840 1393595 1517401 1535777 1621923 1575944 1707822 1863529 1960478 1955544 1820675 1872487
8160 1872487 1786893 1854583 1758257 1649544 1627036 1574132 1448119 1412680 1580139 1706051 1716575
8149 1716575 1530863 1683129 1583326 1519075 1601643 1563294 1625475 1696556 1749789 1709108 1669299
8138 1669299 1780334 1911472 1960008 2000462 2060918 2261707 2214279 2239696 2044390 1945410 2196537
8127 2196537 2160831 2043632 1886393 1765849 1875448 1946013 1932933 1778579 1780690 1877621 1991599
8116 1991599 2145777 2155580 2141079 2159908 2152456 2029726 2223026 2378333 2376511 2485270 2492056
8105 2492056 2549136 2706133 2805828 2674970 2793330 2885898 2711373 2508306 2722937 2822404
8095 2822404 2907143 2836487 2761984 2919360 2946273 2789486 2820336 2955748 2856983 2932287 3087214
8084 3087214 3076105 3124250 3245717 3325363 3341523 3341274 3520552 3600184 3741660 3773967 3674759
8073 3674759 3530584 3646465 3718919 3929380 3903403 4105941 4169390 4161031 4197222 4466099 4580822
8062 4580822 4485799 4435627 4353292 4425624 4496556 4559363 4495846 4656884 4855815 4981061 5083326
8051 5083326 5201548 5385297 5488419 5485795 5556313 5782335 6082975 6211336 6217498 6409033
8041 6409033 6768779 6962238 7138276 7349007 7514066 7647834 7901348 8155306 8351639 8423046
8031 8423046 8560674 8862989 9355253 9756091 9934741 10298575 10550754 10974402 11546800 11840720
8021 11840720 12311903 12903895 13568284 14181881 14937171 15782128 16707283 17758120 18893362
8012 18893362 20236685 21804051 23566381 25495496 27765924 30491946 33199621 35920698
8004 35920698 38766307 41028090 42551958 42755584 41888046 39925844 37261725 34798970
7996 34798970 32892396 31552764 30623015 30019799 29662580 29968507 30485565 31203873 32238511
7987 32238511 33707202 35451280 37620643 40033903 42374564 45000722 47705278 49276764
7979 49276764 49690746 48756619 46741042 44169543 41538252 39437813 37711392 36755817 36280481
7970 36280481 36407481 37059351 37894850 39137290 40730638 42965934 45519277 48293750 51012889
7961 51012889 53363233 55122124 55434457 54146530 51504482 48192832 44697565 41389081
7953 41389081 38870163 36890256 35585392 34675052 34409189 34630150 35028797 35595500 36542233
7944 36542233 38257668 40231576 42138081 44422377 46683816 48903351 50542964 50620417
7936 50620417 49281042 46556313 42988734 38845808 35105661 31859483 29170292 27109958
7928 27109958 25431086 23931036 22642121 21389517 20046583 18899383 18058057 17293422
7920 17293422 16601330 15767733 15377621 15053355 14617766 14301660 14034872 13843596 13519207
7911 13519207 13180630 12846438 12367368 11980078 11530988 11137882 10932908 10663932 10489169
7902 10489169 10468208 10442288 10279762 10082873 10048447 10110548 10104681 10053969 9904612 9774771 9842116
7891 9842116 9832147 9951616 10143699 10244937 10448341 10594950 10605554 10514810 10469764 10473864 10285368
7880 10285368 10305651 10347466 10342206 10493855 10522702 10695031 11082866 11332669 11441895 11545765
7870 11545765 11726950 12063385 12037285 11915405 12023007 12224893 12507657 12645149 13091292 13473125
7860 13473125 13888853 14100265 14468315 15054646 15450866 15987552 16713955 17613848 18410837
7851 18410837 19366648 20404943 21834319 23193902 24537885 26376843 28346867 30531818
7843 30531818 33174580 35999250 39217104 42546738 45986637 49165644 51593999 52747828
7835 52747828 52862967 51936646 50637227 49489413 48868197 48994321 49540188 50691464 52097257
7826 52097257 53514022 54397923 54399306 52891545 49962044 46212881 42244355 38570492 35406699
7817 35406699 32722682 30553123 28833018 27570029 26674904 25929065 25344484 24727148 24483972
7808 24483972 24407679 24298772 24253108 24382065 24542334 25007561 25749883 26590477 27391026 28644850
7798 28644850 30067067 31562600 33564524 35845578 38578827 41525726 44494941 47663362
7790 47663362 50619667 52810147 54132645 54104299 52747386 51076860 49427477 48426547
7782 48426547 48051573 48584916 49443015 50345678 51415166 52125312 51594013 49748377 46813278
7773 46813278 42782112 38609459 34526892 30984563 28191085 25553717 23191103 21466894
7765 21466894 19985060 18871712 17858556 16751313 15798729 15017689 14292278 13398509 12723062
7756 12723062 12219628 11844507 11361321 10856794 10479762 9855915 9667189 9272244 8974515
7747 8974515 8753253 8622458 8303134 8059090 7897257 7792242 7506592 7253687 6965098 6881330
7737 6881330 6663278 6352477 6381734 6229849 6054489 5952990 5763704 5701904 5482942 5390698
7727 5390698 5393530 5389993 5325401 5207738 5144952 5163252 5023476 4767614 4832665 4773825 4641029
7716 4641029 4540402 4445812 4304345 4164551 4258816 4144555 4037387 4210791 4205539 4126650
7706 4126650 4207114 4270505 4277475 4284321 4091251 4178263 4144850 4131563 4107972 3839082 3955925
7695 3955925 4149984 4182439 4052564 3792182 3816660 3761628 3636582 3620398 3723256 3724224 3976103
7684 3976103 3847287 3729811 3671886 3607757 3780028 3768893 3712297 3820118 3938342 3950445
7674 3950445 3921098 3891722 3951052 3955619 3983891 4138895 3989817 3999232 3984308 3915038 4054817
7663 4054817 4072873 4181921 4192233 4249398 4382966 4520687 4599246 4492555 4596176 4574958
7653 4574958 4738601 4685127 4532173 4568730 4753325 4849069 4722396 4851811 5057375 5182958
7643 5182958 5277787 5588192 5547916 5578384 5565701 5718862 5946989 6186471 6253663 6381775
7633 6381775 6636160 6871683 7202935 7467818 7701928 8039446 8394797 8528918 8676979 9277905
7623 9277905 9660316 10034442 10529523 10709037 11236646 11961902 12858209 13660270 14450385 15548415
7613 15548415 16643534 17795354 19178613 20747945 22724772 24751043 26845429 29117112
7605 29117112 31342385 32915167 33525538 33043809 31800869 30364735 29467532 29174534 29278841
7596 29278841 29570098 30345203 31382151 32353601 33096906 33371351 32757855 30743536 28624762
7587 28624762 26621945 24882421 23744491 22805211 22024044 21692827 21409165 21003582 20840390
7578 20840390 20849722 21155319 21388414 21847970 22450220 23153170 24179605 25180262 26332104
7569 26332104 27833710 29758694 31816723 34329390 37025694 39991080 43179328 46248814
7561 46248814 48767369 50497437 51524090 52150326 52516016 52095007 50734012 49326192 48279992
7552 48279992 47796367 47932567 48484999 48806204 48485626 47803215 46423727 44765414 42635898
7543 42635898 40085041 36559170 33370611 30583675 28199980 26236126 24464684 23135017
7535 23135017 22052072 21265339 20413174 19734692 19362660 18966377 18604616 18458015 18510304
7526 18510304 18718405 18982240 19322665 19922946 20844073 21711923 22865288 24046554 25290223
7517 25290223 26779719 28161645 29109215 29334669 28640422 27042313 25388372 24375744 23659574
7508 23659574 23441619 23379190 23581350 24035047 24543157 24780285 24402581 23216773 21444933
7499 21444933 19185924 17185004 15362458 13978632 12734058 11788693 10943011 10339052 9792176
7490 9792176 9373865 8963532 8506508 7852342 7386639 6807654 6728375 6800126 6466600 6221009
7480 6221009 5880703 5694071 5443517 5294659 5386911 5171239 4714388 4638236 4359428 4265580
7470 4265580 4377471 4187213 4048763 4144752 3925935 3834992 3882330 3625211 3341849 3424304
7460 3424304 3236245 3311406 3149243 3042161 2950031 2827120 2805004 2732283 2660529 2686600 2782966
7449 2782966 2802608 2524917 2518488 2465495 2379809 2336216 2354332 2323669 2481084 2309292 2218382
7438 2218382 2428323 2357219 2157538 2058680 1995183 1905231 1825919 1707917 1895342 1965058 2010350
7427 2010350 1798433 1645702 1655296 1613529 1712417 1597076 1648940 1550692 1366710 1107931 966885
7416 966885 1089179 1252616 1379514 1434448 1336746 1387318 1241937 1139408 1125260 1255629
7406 1255629 1293154 1082635 1220268 1129035 1388323 1385558 1313898 1227715 1333754 1224055 1108325
7395 1108325 1047564 1020125 890221 763586 922153 886098 874075 913064 1051677 1012145 836889
7384 836889 772882 933632 926204 943772 864048 711345 661668 536610 487883 503301 646724
7373 646724 795115 658958 456415 463607 487172 630856 635492 504549 434902 265377 400418
7362 400418 358204 356505 612484 503393 412404 342878 399253 394570 492291 414482 166605
7351 166605 164795 77895 140445 302044 202610 96988 111926 152064 198391 264323 199392
7340 199392 361929 227787 278751 329985 289734 416688 341417 237661 139912 349952 545698
7329 545698 436212 264215 174983 -42337 -133621 86457 118725 260871 377203 344587
7319 344587 320053 246445 227766 169138 376624 280152 80812 119379 271374 216352 -15596
7308 -15596 163266 246263 100845 -4448 32494 16779 98540 -108739 -74502 29266 90454
7297 90454 160384 239202 190339 48142 -150643 -251242 122550 50918 67759 282275 -41781
7286 -41781 -61298 42670 -19520 151216 71451 152952 38024 15391 7487 97270 152289
7275 152289 131785 84754 218303 164231 77313 -6854 26787 -59311 -151363 -98075 -36191
7264 -36191 56000 59372 78259 -114650 -28026 -13843 31362 -72983 -84880 9244 -147506
7253 -147506 -70118 72537 -52047 -136401 -342438 -161747 138628 88270 -48019 -151378
7243 -151378 -182311 -89399 31485 -138841 -260757 -198889 7048 -179618 -292107 -29256
7233 -29256 -8994 -21244 -53854 -77493 75105 143809 223798 223541 251474 135587 113101 143294
7221 143294 134656 154070 107639 -2755 72858 -26481 -266934 -213995 -149385 -72060 49346
7210 49346 118552 27011 78500 98682 212946 131542 29934 88182 179826 182338 187397 344647
7198 344647 379504 436025 277276 203134 145177 66087 32722 85344 162973 31093 76078
7187 76078 235253 188011 261583 300077 232285 174272 180232 178629 116145 218397 370027 384548
7175 384548 324056 535095 547879 415731 408468 422424 546718 558142 454152 318850 226499
7164 226499 260586 388945 533547 520303 543250 441945 329867 280987 323101 209509 185748
7153 185748 213399 261595 248194 229794 312407 247993 86799 118413 225593 206941 152590
7142 152590 82866 36287 101121 130631 -1440 140339 339866 307587 106335 214398 117316
7131 117316 26407 93775 92440 259708 136307 42936 163361 222714 400042 342814 414894
7120 414894 362386 355892 279452 433637 557289 411864 565501 482982 232037 307748 256443
7109 256443 20723 177486 289595 545682 419786 322002 257193 187103 31121 69221
7099 69221 90968 236029 352945 376914 301791 123869 -40359 102078 154311 -26519 -35897
7088 -35897 124537 42801 -28933 7767 197059 157841 102111 211960 -56544 -79032 -81611
7077 -81611 112626 133776 187919 176627 204367 103853 62097 -110961 102262 191027 74209
7066 74209 94948 89080 197265 221025 130489 123465 128776 62615 97922 132543 -28744 132381
7054 132381 284018 38002 151370 169384 51141 88526 74330 86435 79224 38476 -10770
7043 -10770 94189 116485 -80950 -20634 -46798 -74487 -5147 51053 191547 70547 -216611
7032 -216611 -301012 -187446 -148798 -114128 -117009 -95277 -27420 -227965 -61522 139811 -21064
7021 -21064 -107356 -8544 -20528 -96724 -62916 36960 156143 188169 165443 45465 -30041
7010 -30041 -104574 1688 269453 173999 140469 108166 54800 -60356 -2931 126312 103750
6999 103750 -45851 12328 70465 110873 93872 -45928 145380 62222 -211071 -134569 216373
6988 216373 288191 66981 55904 126689 8657 -75227 -109952 -47069 -44113 81529 6307
6977 6307 -146241 -51724 124333 167514 54076 96602 19273 105247 280768 155983 78349
6966 78349 32419 -15906 -52558 -20530 -98260 -242544 -228071 -234827 -19223 -45044 -71831 -118997
6954 -118997 -126859 -123596 -60105 212106 27464 11971 -184700 4258 11536 -52310 -54202 63900
6942 63900 123296 -5003 -7567 97104 20354 -18194 37632 -196457 -180531 -218207 -18947
6931 -18947 -89167 37240 21416 -202268 -181386 -22050 -45291 -181518 -364270 -71150 -42543
6920 -42543 -162828 31102 -678 148296 75163 -156363 -99045 -20648 -92331 -83311 -176844
6909 -176844 -218328 -165993 -177037 -229690 -172235 -80544 156936 -123622 -290906 -72530 -71000
6898 -71000 -133195 -138702 -182659 -1486 101559 29333 -41296 93460 -47567 -71764 -80430
6887 -80430 -61252 -78452 37075 170317 127528 89299 -17150 -156452 -121127 -34241 -55186
6876 -55186 166190 228956 188834 48557 -75524 -122644 3058 -109553 -60024 -66865 -83536
6865 -83536 -88949 57382 -136239 -38785 -182066 -9289 19335 -35200 42501 27012 21744
6854 21744 39037 -113877 49712 229351 237824 87444 24495 5687 155128 50814 129309
6843 129309 103472 -56174 4516 -144985 103500 91050 5396 -110838 -102037 -56160 -55704
6832 -55704 -27172 98257 123709 202846 72270 73440 -69806 146836 251560 495918 346144
6821 346144 140681 81609 -16540 -102114 16439 19187 44175 -154460 -80427 -105066 -227662
6810 -227662 -103208 -54578 70662 149376 -71 56279 -116601 -121033 -81294 -226576 -205054
6799 -205054 -232103 -237823 439 79343 92304 171472 -68640 4898 283713 264202 184672
6788 184672 292508 305702 269853 91733 133972 89290 243847 204125 272281 214446 106706
6777 106706 -112815 35603 115710 322458 266889 132368 242055 295025 254119 272914 104770
6766 104770 -20985 86294 115733 190085 139569 89519 209092 213996 58591 203698 167605
6755 167605 270446 172820 173056 115005 130085 180442 301938 322340 309670 302162 378260 366535
6743 366535 214358 224992 282301 359096 149287 313217 267482 30300 -61082 -105708 -16293
6732 -16293 -12151 99718 304023 212215 212343 96175 247595 427435 418963 370096 262910
6721 262910 272567 344889 253583 9732 194684 311811 551910 433831 358658 209721 67388
6710 67388 77703 223726 176916 149929 126378 127539 235880 143232 207714 254947 341180 139886
6698 139886 224571 239154 305517 153964 245029 283761 225618 238599 273203 343840 91061
6687 91061 18220 33884 228841 239936 327443 183144 182950 288704 402770 385045 184137
6676 184137 281908 275159 342727 342822 320471 306942 168772 77024 55328 170466 363691 443912
6664 443912 585338 500550 441504 333151 301714 483614 447926 348960 344919 457994 326646
6653 326646 283912 349815 364216 157003 212228 487968 504599 466543 321247 442123 525128
6642 525128 432337 361269 335902 217160 353280 367173 417672 481431 399147 411671 480250
6631 480250 656427 474368 577544 535854 446050 406719 516324 608433 444015 424605 407423
6620 407423 372695 541364 617499 673093 506554 336522 392173 275132 390619 415765 501514
6609 501514 593850 473999 443259 580911 580639 594231 625084 474445 445163 445335 430000 677926
6597 677926 685410 504817 370806 359422 659245 604641 510347 514090 547758 599414 667871
6586 667871 679904 733054 645518 648974 715432 578305 596552 638356 778742 622779 616974
6575 616974 692408 492387 513612 625055 459038 484757 610190 706160 659269 654531 656878
6564 656878 599350 580515 705973 556056 530172 824179 865621 761571 602579 488331
6554 488331 615960 548856 500805 560216 497739 510247 619329 840366 824306 761750 892832
6543 892832 902031 852141 853624 662147 684276 550422 600464 669685 609669 502605 397932
6532 397932 417412 429017 376135 504567 676998 925002 902221 702587 782111 732642 598055
6521 598055 682205 700748 686678 803904 855563 772959 704842 685712 668737 660895 781311
6510 781311 655663 533775 714669 768416 886146 863413 741258 686391 656692 844933
6500 844933 872817 818839 841064 743461 688957 769167 775918 688042 689851 709244 669215 658354
6488 658354 726302 764499 702997 731161 783931 704870 693831 827514 766167 655595 730943
6477 730943 710496 762429 509779 542707 556690 650111 833395 869214 832371 765047 733071
6466 733071 710862 767006 864011 753393 835902 798906 685654 844264 792440 899835 930681
6455 930681 936816 892375 902000 900958 810217 738547 1016575 1066628 921244 893815 713214 805261
6443 805261 987366 958205 1039448 1078822 922055 896005 1051494 1058823 864535 878987 907725
6432 907725 861887 1018211 1160866 1037781 1045910 1098937 1087279 1086548 1012054 990315 927530 979951
6420 979951 1032414 1031271 1210820 1465687 1271750 1038578 1026008 1044106 1136572 1135008 1072229
6409 1072229 1057707 1155848 1115428 1257733 1242420 1286417 1307966 1307937 1413625 1319932 1433835
6398 1433835 1440227 1180055 1012771 1212354 1264355 1193312 1283237 1362715 1513666 1303999 1194406
6387 1194406 1160640 1160310 1197410 1318547 1162103 1022982 1120859 1127627 1215980 1228902 1127134
6376 1127134 1384448 1303979 1150095 1201977 1101015 1341375 1216225 1089920 1065495 1333853
6366 1333853 1216898 1277162 1354650 1216868 1202710 1200521 1271128 1257464 1132654 1173156 1085089
6355 1085089 1130213 1137989 1259590 1219984 1188203 1217894 1248391 1185113 1284302 1350727 1160997
6344 1160997 1379647 1338100 1446279 1347840 1321879 1262546 1359583 1249181 1147756 1181262 1253456
6333 1253456 1313481 1312894 1214490 1160791 1318383 1219463 1245349 1081363 1198131 1373615 1277750
6322 1277750 1217096 1170188 1189683 1412022 1480228 1273039 1257216 1514923 1549401 1363161 1401024
6311 1401024 1445662 1417153 1319314 1211651 1144448 1328768 1238815 1192944 1233967 1283132 1182836
6300 1182836 1373728 1490762 1450952 1381919 1482194 1402154 1353172 1503183 1371601 1608272
6290 1608272 1710407 1671735 1581171 1501956 1654842 1527044 1385876 1642366 1586182 1686007
6280 1686007 1687312 1570435 1491000 1580365 1557366 1693189 1731304 1484594 1600996 1577988 1667835
6269 1667835 1629705 1404789 1424340 1532562 1585163 1746001 1734249 1696709 1775710 1794347 1723742
6258 1723742 1570771 1715151 1738060 1626398 1804322 1768234 1619237 1672292 1677526 1627023 1707285
6247 1707285 1813729 1732140 1713591 1768723 1769325 1619291 1475914 1532571 1589365 1608596 1805242
6236 1805242 1786639 1643902 1516791 1661712 1666087 1766503 1978409 1940572 1774026 1584260
6226 1584260 1718914 1782728 1670739 1655244 1825352 1838443 1869310 1932061 1822189 1845767 1902407
6215 1902407 2026392 2185897 1982129 1759264 1744712 1838633 1864763 1873940 1667083 1847198
6205 1847198 1974771 1887446 1964768 2014887 1930581 1669683 1589899 1712901 1928910 1877296 1657632
6194 1657632 1695134 1761824 1762751 1930517 1964216 1997223 1949455 1809777 1973762 2095164 2102239
6183 2102239 1929302 1874436 1993332 2009738 1890544 1837007 2002658 2064620 2078059 2082327 2181142
6172 2181142 2094037 2111011 2259442 2246964 2168114 2121295 1967671 1937360 1996783 2084333 2038202
6161 2038202 2014079 2101420 2015199 1912192 1881926 1999213 2033383 2106097 2268001 2303139 2328866
6150 2328866 2165417 2198621 2217652 2080248 2056064 2030157 2060974 2118050 2083131 1966139 2013909
6139 2013909 2018224 2332592 2321931 2204504 2149420 2304162 2340095 2305032 2394817 2345761 2271114
6128 2271114 2487319 2551733 2383321 2512973 2595403 2589092 2554012 2648968 2568387 2375009 2402890
6117 2402890 2413005 2322178 2326067 2355844 2273657 2233476 2347660 2475372 2591319 2495973 2434847
6106 2434847 2608387 2660868 2554342 2628676 2447317 2606543 2678196 2455264 2427093 2462950
6096 2462950 2421999 2552243 2504177 2613006 2806420 2668148 2769341 2649542 2628033 2623260
6086 2623260 2573912 2784897 2696688 2660291 2565893 2579368 2857903 2731098 2685593 2803666 2944239
6075 2944239 2844593 2819550 2876374 2938335 2921866 2942944 2986318 2997298 2818501 2781145 2752397
6064 2752397 2755333 2747767 2620492 2696332 2798073 3095201 3073560 2850775 2861267 2733976 2766229
6053 2766229 2959666 2852535 2913531 3043559 3064931 2988774 2907785 2929578 2932116 3013780 2891518
6042 2891518 2697798 2907473 3087969 3107868 3056901 2906437 3034223 2938211 2880437 3074486
6032 3074486 3129630 2912317 2907500 3191283 3202228 3175487 3095011 3233101 3025286 3031832 3061934
6021 3061934 2951177 2990119 3055487 3113982 3307098 3401971 3246178 3372407 3283553 3181694
6011 3181694 3205324 3408576 3359902 3208930 3236756 3259871 3393245 3549639 3459355 3416192 3412808
6000 3412808 3406635 3356049 3441958 3705595 3695539 3635435 3489502 3443963 3654830 3696177 3722106
5989 3722106 3579897 3492178 3499865 3578030 3605445 3543063 3547029 3511475 3738815 3717977 3689404
5978 3689404 3618057 3820767 3610146 3346416 3480896 3591141 3647678 3590817 3524247 3629076
5968 3629076 3659871 3713177 3811398 3798002 3594673 3483692 3714747 3820331 3852667 3798777 3655370
5957 3655370 3751409 3828143 3847722 4047538 3991306 4005879 3927141 3884338 3906442 3933755 3940164
5946 3940164 3936872 3967531 4140282 4151625 4070260 4137150 4149982 4029309 3968919 4019667 4180429
5935 4180429 4224427 4370926 4294630 4340047 4226457 4266608 4201696 3962799 4012469 4009986 4109566
5924 4109566 4228956 4155346 4348069 4404943 4189800 4493868 4503148 4362717 4239580 4358455
5914 4358455 4421657 4621501 4549242 4530030 4487657 4505960 4482405 4348437 4131343 4376037 4586485
5903 4586485 4643125 4719041 4721166 4715992 4747870 4702439 4612266 4679490 4743761 4685448 4528054 4655746
5891 4655746 4777484 4916778 4843594 4815783 4998207 4953217 4889702 4940972 4764976 4952524
5881 4952524 4954675 5055210 5257275 5072006 4856967 4775511 4887027 5045959 5071542 5177691
5871 5177691 5242048 5284577 5054090 5229139 5178208 5162703 5248031 5279199 5411444 5412885 5473770
5860 5473770 5510902 5569600 5578346 5548315 5641448 5447114 5505242 5467613 5282057 5460594 5555757
5849 5555757 5522651 5592610 5648856 5676814 5887293 6027103 6074213 5861299 5695443 5858662
5839 5858662 6042804 6300839 6331949 6188704 6058010 5738342 6015571 6048209 5985457 5963253
5829 5963253 6031005 6147154 6174657 6172488 6096673 6257551 6250250 6334193 6107471 6172479 6560634
5818 6560634 6541282 6531267 6630914 6627746 6535887 6609418 6491178 6395355 6368541 6456419 6315428
5807 6315428 6370733 6444042 6405686 6315455 6472651 6424078 6402260 6500464 6636426 6542478 6499129
5796 6499129 6514332 6522969 6579475 6732170 6710277 6681098 6625409 6643420 6637362 6633421 6720394 6624792
5784 6624792 6587550 6630945 6536435 6462338 6719002 6750807 6716024 6745702 6666793 6748093 6905237
5773 6905237 6912652 6907150 6928733 6976746 6835761 6806653 6851077 6945369 6920849 6921107 7035577 6954517
5761 6954517 6999357 7093530 7172061 7169478 7112339 7211035 7209004 7242564 7169131 7338579 7369725 7339781
5749 7339781 7514917 7638117 7590771 7529775 7454515 7528377 7552836 7654288 7453093 7573902
5739 7573902 7561360 7493258 7587444 7668449 7647703 7746730 7764025 7936180 8092139 7855750 7820255
5728 7820255 7816027 7891752 7980619 7916820 8012390 8020090 7812278 7919559 7914333 8033550 8072288
5717 8072288 8228044 8333797 8297959 8470811 8349979 8179104 8365137 8636001 8800627 8625412
5707 8625412 8378475 8693948 8664837 8508731 8614071 8645213 8827064 8977690 8944117 8818143
5697 8818143 8985486 9010513 8982608 9145192 9240528 9046994 8766790 8706867 9005614 9167653
5687 9167653 9187317 9145803 9264286 9248408 9160889 9183023 9394280 9406826 9401657 9479501 9405616
5676 9405616 9519719 9532762 9621053 9654341 9632076 9639953 9841563 9895959 9772767 9915409 9926178
5665 9926178 9895343 9779405 10033950 9937290 9920864 10050340 9919787 10093007 10111846 10173435
5655 10173435 10079486 10101959 10208224 10275726 10454722 10481515 10439320 10415990 10383709 10368898 10399517
5644 10399517 10528052 10454376 10529641 10684776 10668273 10643192 10709380 10896867 10985488 10965712 10988508
5633 10988508 10870666 10957654 11281871 11200920 11266596 11157054 10966154 11322473 11449939 11454027
5623 11454027 11589094 11667085 11691815 11759639 11766947 11518872 11503628 11708548 11852136 11778322 11775844
5612 11775844 11931741 11858362 11946817 12062601 12087039 12151912 12303822 12292022 12296123 12374794 12674726
5601 12674726 12704770 12616890 12791698 12912142 12811629 12841199 12959221 12880304 12759693 13003669
5591 13003669 13184173 13144307 13088411 13183303 13326379 13312213 13400633 13238201 13174391 13441569
5581 13441569 13668101 13524326 13605742 13654692 13694276 13832537 13743191 13733246 13865698 13845725 13997174
5570 13997174 13996697 13852653 14027513 14258020 14301930 14377077 14278243 14234313 14206487 14272482 14607544
5559 14607544 14764981 14639907 14807639 14825858 14878169 15051513 15084638 15192040 15265748 15294122
5549 15294122 15403777 15617529 15625722 15571283 15620928 15699391 15720788 15794718 15831167 15764256 15903777
5538 15903777 16101389 16070917 15919166 16041463 16263414 16352670 16498608 16515496 16624966 16787624
5528 16787624 16770953 16753522 16702598 16682310 16966669 17068161 17091290 17106801 17266970 17462639
5518 17462639 17551001 17472166 17455721 17471061 17608623 17770885 17909216 18153986 18384355 18272814
5508 18272814 18237039 18334465 18222601 18420558 18579372 18560045 18645768 18824082 18748801 18753224 19157851
5497 19157851 19309287 19292620 19249435 19443548 19718753 19672204 19695739 19833387 19941174 19904596
5487 19904596 19976693 20043510 20034770 20171015 20375239 20332369 20383770 20448905 20620492 20884992 20930207
5476 20930207 21014956 21246055 21328350 21496268 21574195 21533925 21863927 21965579 22033159 22020988
5466 22020988 22108874 22401421 22439385 22494013 22645336 22756394 22949223 23162327 23151521 23107096
5456 23107096 23308549 23420515 23455873 23478961 23725035 23973758 24044187 23982616 24204569 24434846
5446 24434846 24427118 24520832 24646022 24684707 24783757 24945261 25152960 25192384 25184203 25320290 25531525
5435 25531525 25581431 25628868 25839218 25946037 26148766 26410753 26541171 26461592 26745284 26951913
5425 26951913 26961526 27183925 27201706 27232717 27451164 27475696 27677311 27988437 28121152 28271175
5415 28271175 28449206 28528283 28538968 28622918 28818010 28959431 29013611 29062220 29197446 29438468
5405 29438468 29705271 29890011 30109273 30316536 30437352 30510554 30522442 30960241 31066277 31101086
5395 31101086 31400403 31649230 31620672 31782557 32038172 32221950 32412438 32483825 32635862 32755238
5385 32755238 32955284 33102974 33320745 33285968 33538380 33786785 33945094 33890905 34212239 34560795
5375 34560795 34715177 34849989 35023965 35285757 35460711 35661275 35818724 35888324 36182448 36402038
5365 36402038 36649557 36993682 37149589 37255432 37435327 37632713 37740315 37987689 38179813
5356 38179813 38395930 38593207 38688491 38809652 39100770 39418847 39571556 39888448 40209012 40534651
5346 40534651 40710921 40887040 41021592 41239045 41476311 41710148 42077076 42362293 42551680
5337 42551680 42783432 42901177 43112854 43360974 43700374 44159172 44438829 44720885 44944598
5328 44944598 45190018 45482007 45777404 45946603 46293758 46729268 47112559 47257261 47376585
5319 47376585 47547365 47906404 48096943 48400816 48762953 49204342 49499452 49687542 49831615
5310 49831615 50131989 50533890 51010954 51490139 51716127 52123748 52336944 52395115 52710958 52922611
5300 52922611 53377425 53855244 54215383 54564128 54780424 55041935 55425835 55757284 56031684
5291 56031684 56483532 56995436 57184560 57576223 57931831 58253747 58617186 58889751 59234514
5282 59234514 59651157 59904923 60462015 60957315 61312443 61706194 62290871 62808454 63142498
5273 63142498 63415869 63739777 64273339 64637175 65015093 65367190 65911428 66372905 66723367
5264 66723367 67130633 67908221 68422103 68635537 69050674 69562186 69864537 70225947 70706344
5255 70706344 71237750 71850868 72314111 72896118 73342177 73746719 74284587 74849036 75228757
5246 75228757 75515263 76387914 77037659 77419372 78002351 78467387 78959585 79509995 80053571
5237 80053571 80718428 81318291 81826866 82259859 83037912 83801026 84389130 84933215 85538311
5228 85538311 86025175 86723169 87233689 87748877 88510000 89156695 89701206 90356070 90959613
5219 90959613 91772921 92271182 92961580 93592541 94094153 94984440 95641368 96434344 97087753
5210 97087753 97646204 98328452 99057385 99922984 100710953 101661636 102391271 103079553 103762954
5201 103762954 104622029 105281786 106160194 107188903 107928365 108733494 109396780 110310498 110965194
5192 110965194 111804593 112702718 113627432 114567254 115427602 116184977 117036332 117988957 118798068
5183 118798068 119802771 120734189 121430817 122388211 123290681 124367499 125387454 126297806 127021407
5174 127021407 128106082 129229770 130218801 131172160 131956923 133038397 134182153 135119595 136163331
5165 136163331 137022669 138205508 139291234 140448411 141523809 142573920 143823992 144958846
5157 144958846 146219176 147356977 148377673 149408769 150608330 151857350 152931265 154183877
5149 154183877 155443461 156496835 157697034 158968168 159973644 161228724 162611278 163949311
5141 163949311 165153859 166350219 167712962 168823773 170034290 171451173 173059699 174382061
5133 174382061 175653875 176969540 178170159 179605849 181093316 182371327 183903340 185316759
5125 185316759 186697915 188063613 189433079 190797482 192290632 193674869 195128082 196695977
5117 196695977 198073017 199601883 201012277 202277704 203997155 205516987 207014338 208558772
5109 208558772 210110033 211647966 213185069 214722875 216152806 217482967 219039513 220704757
5101 220704757 222463118 224151452 225547360 227051286 228455513 230088909 231734698 233136813
5093 233136813 234867308 236421085 238007408 239636253 240981549 242707818 244468054 246102231
5085 246102231 247482956 249252366 250903021 252307785 253999130 255607696 257083900 258505172
5077 258505172 260049580 261622035 263165904 264758613 266265199 267663180 269088217 270517321
5069 270517321 271932509 273508839 275072235 276447652 277905208 279510865 280963207 282387656
5061 282387656 283592370 284954967 286241692 287439941 288773207 290067881 291271005 292507435
5053 292507435 293950786 295137721 296365203 297415626 298476274 299582669 300626204 301808198
5045 301808198 302879787 303959724 304845121 305881327 306774584 307595694 308394881 309233841 310091661
5036 310091661 310849240 311523152 312481865 313494455 314054697 314534273 315014359 315666646 316052622
5027 316052622 316576028 316987054 317422178 317737068 318041693 318304308 318524605 318727343 319030911
5018 319030911 319371053 319503441 319387034 319311170 319356067 319272401 319224745 319145758 319047475 318916272
5008 318916272 318479298 318172258 318161295 317736441 317400904 317216934 316623458 316053183 315695392
4999 315695392 315028412 314447703 313698609 313071689 312535527 311728977 311116444 310491664 309778065
4990 309778065 308827297 307763311 306803949 306011350 305223258 304167851 303095491 302005205 300826844
4981 300826844 299927274 298855364 297705219 296586841 295315726 294262144 293085608 291805667
4973 291805667 290274495 289205714 288008832 286498997 285140997 283780902 282549810 281049111
4965 281049111 279823352 278494819 276937581 275563118 274120064 272653370 271173091 269592074
4957 269592074 268053969 266585217 265145729 263792858 262328631 260797346 259192343 257591007
4949 257591007 256100203 254582003 252966622 251586626 250159174 248641646 247106439 245317161
4941 245317161 243859038 242250048 240580119 239147556 237633878 236048828 234625887 233171902
4933 233171902 231643122 230109582 228532710 226998070 225318150 223907892 222476819 220717204
4925 220717204 219177068 217602000 216057860 214566310 212779573 211268585 209762444 208172090
4917 208172090 206691450 205250827 203692723 202117289 200618826 199228003 197789636 196335794
4909 196335794 194685141 193192059 191868812 190607700 189266035 187682994 186184659 184913840
4901 184913840 183474688 181975864 180834571 179476768 178119368 176807324 175460927 174095633
4893 174095633 172644406 171450153 170142257 168801813 167623597 166384944 165112808 163967683
4885 163967683 162678620 161350364 160255520 158906325 157663746 156627936 155486357 154277558
4877 154277558 153093912 151809167 150517413 149486575 148435431 147384037 146223484 145143418
4869 145143418 144215337 143175761 142193287 141006432 139841584 138815567 137854383 136822475
4861 136822475 135658562 134695921 133776973 132513576 131522782 130508730 129648045 128635907 127626495
4852 127626495 126795536 125810700 124815442 123914585 123140711 122256702 121143725 120307580 119467747
4843 119467747 118713918 117888592 116863673 116040055 115089830 114300204 113587866 112526094 111738991
4834 111738991 111131371 110295392 109506459 108771001 107998418 107245013 106411218 105589486 104864525
4825 104864525 104045594 103508476 102917495 101997550 101482418 100601137 99846330 99320841 98617256
4816 98617256 97864396 97325594 96504315 95628522 95163622 94515328 93898535 93043769 92396922
4807 92396922 91539000 91143779 90615808 89935850 89325137 88966892 88422070 87809465 87367383
4798 87367383 86878176 86290955 85649499 85159699 84464930 83884031 83449672 82901610 82192345
4789 82192345 81494564 81011582 80520032 80162500 79591835 79061542 78532565 78122266 77778797
4780 77778797 77338016 76945822 76257558 75688840 75179065 74853650 74500518 74185897 73673749
4771 73673749 73182038 72893814 72240041 71668284 71396883 70931113 70458455 69967115 69671738
4762 69671738 69242199 69185555 68644542 68178461 67962673 67266244 67084078 66868341 66292834 65830283
4752 65830283 65453301 65041756 64932626 64418106 64002145 63762222 63345375 63220090 62917694
4743 62917694 62598425 62293019 62087861 61730726 61471011 61158103 60871100 60368347 59889457
4734 59889457 59697602 59337055 59152843 58759089 58520191 58069093 57729312 57336116 57120860
4725 57120860 57017361 56847281 56532663 56161404 55891458 55645373 55424167 55187530 54940404
4716 54940404 54705366 54379381 54441317 54373313 54007508 53584627 53550649 53491882 53460165 53362473
4706 53362473 52987217 52619880 52453749 52560754 52406863 52221326 52277128 52165560 51969763 51842312
4696 51842312 51788319 51704287 51393094 51256307 51139780 50962842 50874620 50652255 50387086 50417093
4686 50417093 50466836 50442868 50420433 50330850 50184966 50102012 49725756 49573322 49764969 49808470
4676 49808470 49790572 49981501 49940658 49728183 49608198 49794654 49821807 49860975 49939548 50058803
4666 50058803 50074665 50221373 50261654 50400939 50402832 50433078 50562859 50777346 50996966 51144352
4656 51144352 51271369 51455918 51866950 51959186 52486945 52852098 53293022 53795212 54187327 54831584
4646 54831584 55207462 55802843 56138346 56705440 57156270 57690909 58640038 59550646 60485289
4637 60485289 61598631 62748031 63695633 64937508 66255102 67608924 68898864 70714743
4629 70714743 72555190 74481989 76728719 79010218 81439169 84119396 86972532 90361188
4621 90361188 94018220 97638330 102093358 106728892 111862649 117448903 123450508 129893734
4613 129893734 136644933 144027010 151796540 159859450 167962925 175820631 183575833 191107132
4605 191107132 197908311 203625569 208046837 210715589 211796288 210912473 207759068 202650176
4597 202650176 196125764 188353753 179879653 171037147 161876713 153033706 144523714 136397523
4589 136397523 128658620 121416519 114553291 108495891 102941682 97712440 92895334 88559651
4581 88559651 84632530 81112353 77896608 74919825 72283435 69744731 67116144 64950114
4573 64950114 63169771 61260794 59438625 57861801 56334103 54877433 53424197 52274793
4565 52274793 51298689 50273869 49114290 48055808 47182934 46296095 45330019 44502213 43603587
4556 43603587 42934655 42361197 41902771 41363324 40871482 40421297 39857088 39388456 38897833
4547 38897833 38425154 38114681 37760430 37038998 36419940 35899124 35421273 34774537 34346116
4538 34346116 33948920 33546130 33175329 32708845 32230931 31892735 31571940 31335397 31083277
4529 31083277 30724461 30695330 30423577 29930820 29474753 29408694 29087917 28693318 28532222 28249359
4519 28249359 28083127 27886998 27691464 27582164 27367030 26972870 26813741 26646910 26515286
4510 26515286 26233574 25842376 25628355 25479206 25018727 24692671 24754926 24703549 24571617 24348748
4500 24348748 24064865 24023845 23870514 23848428 23746770 23532730 23670410 23507798 23532290 23333960
4490 23333960 23023127 22704102 22540957 22330858 22056981 21711294 21693749 21748506 21432615 21353388
4480 21353388 21304433 21042491 20945522 20905418 20710133 20538812 20565051 20365255 20333037 20199484
4470 20199484 19754212 19785455 19760862 19691654 19494346 19469220 19451936 19397221 19156844 19084754 18912434
4459 18912434 18909682 18846769 18745097 18704096 18509486 18533744 18295265 18021417 17987496 18056566 17838233
4448 17838233 17816560 17706934 17590462 17625877 17376640 17250264 17199839 17264964 17217983 17215186 17059506
4437 17059506 16831650 16696247 16686726 16500336 16472803 16333453 16339289 16324541 16357974 16300506 15975480
4426 15975480 15868765 15810559 15911230 15929797 15619617 15387616 15168553 15141520 15195424 15282426
4416 15282426 15132538 15255228 15002597 14998908 15071728 15010622 14896096 14829264 14644292 14430911
4406 14430911 14470560 14296159 14521424 14420910 14378220 14382846 14338131 14263444 14260355 14355487 14251814
4395 14251814 14163626 14081266 13808840 13746176 13870661 13806243 13611196 13671654 13686134 13655923 13571050
4384 13571050 13385279 13253626 13377831 13309565 13256378 13090096 13093224 13039264 13143476 13178182
4374 13178182 13149858 13052119 12979755 12857683 12680979 12816859 12901703 12934972 12707171 12633455
4364 12633455 12770889 12713708 12834914 12630873 12606990 12614910 12555109 12570727 12425337 12389104 12307664
4353 12307664 12394319 12348203 12349429 12349239 12405272 12265182 12273839 12326172 12298184 12432161 12390501 12338404
4341 12338404 12245544 12198784 12077714 11911161 11877213 11874565 11991223 12139838 12029745 12034580 12012952
4330 12012952 11877580 11765881 11627341 11558552 11610120 11345185 11488825 11487539 11429055 11435562 11423008
4319 11423008 11217874 11108448 11109384 11122387 11105267 11114592 11011556 10919349 10810659 10652230 10604666
4308 10604666 10707379 10796449 10607973 10405850 10319832 10357541 10233673 10280664 10322121 10229336
4298 10229336 10132583 10122314 10000451 10101818 10287002 10306235 10196813 10218486 10166305 10172283 10158353
4287 10158353 10115883 10060706 10150381 10201268 10110602 9981646 10009263 10141870 10039891 9949112 10067940
4276 10067940 9977434 10109586 10005039 10036443 9981293 9964338 9857251 10014357 10136067 9916530
4266 9916530 9715166 9882573 9874864 9788766 9901188 9893626 9665380 9636879 9684119 9434108 9318808
4255 9318808 9434550 9403880 9237522 9207514 9068471 9035598 8938309 8912689 8816025 8795258 8855041
4244 8855041 8896872 8751195 8811113 8828481 8797944 8784900 9011091 8862625 8785152 8779483 8834029
4233 8834029 8850720 8687628 8532842 8347654 8444212 8619580 8579312 8393677 8381423 8566870
4223 8566870 8353347 8336572 8252589 8161502 8127594 7962036 8030450 8095424 8291742 8336070 8236118
4212 8236118 8061625 7983184 7933488 8041969 8112842 8156740 8064051 8156011 8007159 7792494 8019220
4201 8019220 8049634 8140735 8209317 8030037 8090745 8195715 8097490 7928544 8062288 8080338 7958994
4190 7958994 7910739 7937162 7857039 7871233 7812625 7853682 7628973 7609265 7629189 7658933 7583106
4179 7583106 7654340 7845548 7675170 7596322 7702680 7775347 7690742 7547940 7544409 7578147 7547549
4168 7547549 7622339 7568087 7438809 7360759 7221061 7026563 7286491 7475368 7498424 7239843
4158 7239843 7292899 7277311 7210043 7142151 7246485 7294880 7253252 7139000 7150121 7112574 7135985
4147 7135985 7092820 7008222 6831681 6856550 6815011 6675624 6805704 6927880 7096484 7065585
4137 7065585 6885267 6835255 6746713 6723821 6671065 6685962 6741628 6679745 6624525 6551465 6613688
4126 6613688 6759988 6698612 6571421 6630856 6656280 6681223 6668552 6482452 6387561 6468981 6295492
4115 6295492 6178335 6266953 6342715 6351615 6677199 6552344 6488160 6517176 6343967 6422996 6416170
4104 6416170 6354520 6411462 6539403 6644314 6591350 6384700 6474852 6596306 6463095 6462236 6538026
4093 6538026 6606537 6688617 6744932 6565939 6473728 6455775 6629772 6677294 6608649 6627090 6588672
4082 6588672 6635793 6469112 6557062 6588848 6623603 6663945 6683964 6635355 6648156 6750147 6825915
4071 6825915 6774505 6658889 6730085 6862903 6812755 6948083 7105511 6939241 6965067 6989469
4061 6989469 6881980 6778148 6854038 7098669 7050853 7172676 7071407 7085644 7301969 7260335
4051 7260335 7453658 7427889 7512698 7475908 7391146 7318614 7444521 7389150 7384910 7466306 7322360
4040 7322360 7301243 7393188 7361362 7474721 7574744 7541829 7658000 7627749 7596189 7516172 7687972
4029 7687972 7787353 7725075 7850522 7875838 7957255 7985506 8031154 8129660 7950258 7986242 8144391
4018 8144391 8255456 8371665 8298041 8408028 8623994 8590911 8752407 8954012 8967065 9140354
4008 9140354 9305440 9468738 9750578 9978302 10138986 10329747 10681642 11170331 11747239 12356284
3998 12356284 12945914 13800592 14694243 15355849 15872197 15691772 14321106 13119220 12233563
3989 12233563 11390881 10765148 10501311 10151287 10032775 9945064 9779294 9522464 9417708 9336695
3979 9336695 9316472 9354022 9309639 9220331 9125916 9210769 9109694 9032212 9080373 9354265 9393431
3968 9393431 9461108 9486262 9331701 9475515 9528342 9593068 9627246 9571333 9707262 9746192 9936521
3957 9936521 10039369 9999633 10000140 10204888 10137838 10051060 10204972 10341506 10483985 10668090 10821197
3946 10821197 10830755 11099164 11299147 11388767 11421089 11509862 11673666 11915672 11857956 11976187
3936 11976187 12304273 12233523 12412483 12563426 12762649 13015135 13125857 13183224 13207014 13234466
3926 13234466 13492209 13678652 13950177 14213877 14614513 14715143 14877763 15084638 15462756
3917 15462756 15672037 15880747 16120475 16311544 16753747 17067999 17402260 17772577 18183196
3908 18183196 18672517 18939640 19132218 19456086 19955894 20282447 20836759 21368090 22038903
3899 22038903 22872444 23664870 24254996 24823497 25505774 26129804 26693745 27551729 28424477
3890 28424477 29169873 30306211 31465345 32895642 34125652 35345212 36693860 38054087
3882 38054087 39551851 41042528 42570725 44496337 46143306 47671993 49186470 50685379
3874 50685379 52122962 53615030 54961474 56355797 57507289 58521829 59985249 61158562
3866 61158562 62265323 63517228 64590242 65614624 66990563 68606635 70068181 71742486
3858 71742486 73697291 75718582 78073587 80390494 82755214 85364236 87857935 90812632
3850 90812632 93776062 96740044 99638565 102799830 105783038 108679970 111345409 113891417
3842 113891417 115791249 116948590 117403120 117109146 116268950 114781682 112903320 111038453
3834 111038453 109532659 108401654 107600336 107139337 106786407 105915629 104979813 104583637 104651693
3825 104651693 105334126 106342996 107104739 108185538 109137029 109917678 110275120 110222934 109530334
3816 109530334 108188988 106635166 104521745 102107820 99240922 96254938 93119693 89962536
3808 89962536 87058771 84026291 81518870 79280766 77280355 75359662 73803539 72082898
3800 72082898 70602020 69248203 68170904 67332798 66748521 66227609 65843299 65581157 65368274
3791 65368274 65326583 65667610 66143398 66639756 67346089 68088533 69245594 70613858 71962269
3782 71962269 73216432 74887689 76552192 78393896 80743339 83123099 85370676 87966124
3774 87966124 90488299 92985868 95503621 97953416 100150509 102432602 104393983 106001519
3766 106001519 107079138 108067300 108792221 109048013 109097909 109016053 108811571 108400333 107978903
3757 107978903 107728140 107587208 107368871 107264286 107386488 107744693 108462726 109374940 110259446
3748 110259446 111216086 112174593 113394173 114407009 114949103 115386147 115661744 115630145 115137652
3739 115137652 114175809 112969102 111812608 110286357 108546968 107092447 105434542 103875556
3731 103875556 102398140 100970271 99609473 98652094 98023312 97481167 97467495 97964077 99304831
3722 99304831 101419877 103941900 107287353 111199501 115585590 119774550 121860380 119771574
3714 119771574 114430434 106379345 96728640 88445111 81874489 76532473 72267310 68728972
3706 68728972 65422693 62501629 59714449 56942647 54490918 51906461 49648920 47516492
3698 47516492 45529169 43780898 42117301 40512430 39055579 37759982 36271924 34992623
3690 34992623 33828875 32774676 31702359 30852311 30064409 29168872 28396278 27529130 26678054
3681 26678054 25994679 25507165 24911438 24322399 23725761 23165716 22827794 22259487 21775159
3672 21775159 21366196 20897404 20439787 20206097 19939104 19407058 19047036 18813336 18511282
3663 18511282 18087424 17884576 17707820 17448980 17390810 17150407 16898243 16754167 16339294 15985498
3653 15985498 15865793 15812484 15533195 15341215 15060069 14974443 14794254 14683088 14751782 14704671
3643 14704671 14394010 14348844 14356320 14327068 14140803 13835789 13658869 13551225 13717406 13764535
3633 13764535 13649022 13454901 13345794 13195483 13330035 13188733 13065965 13058066 13036335 12961170
3623 12961170 13018899 13042317 12947731 12787627 12978018 13132544 13286182 13204364 13054726 13107366
3613 13107366 13162597 13171314 13109220 13142437 13203162 13215977 13334263 13455351 13593393 13830154 14107220
3602 14107220 14166530 14400301 14557529 14413713 14723952 14885571 14962357 15401668 15625902 15860317
3592 15860317 16199664 16501194 16792716 17078841 17585269 18007267 18407314 19047989 19534203
3583 19534203 20216874 20958076 21596480 22628982 23889181 25245750 26691706 28571155 30639764
3574 30639764 33111430 36013965 39452464 43582367 48393350 53436268 58886732 64280612
3566 64280612 67807346 67802831 65648623 62238792 56128833 48562923 42436623 37808515 34429190
3557 34429190 31945414 29928290 28369158 26973661 25786352 24708743 23717846 22954118
3549 22954118 22373581 21709204 21348596 20936674 20619849 20372109 20216792 20249314 19934183 19724961
3539 19724961 19730682 19785402 19984133 19855413 19853090 19908531 19958391 20304824 20261035 20297448 20651259
3528 20651259 20725419 20766623 20990703 21061426 21112020 21218557 21572509 21714186 21851804 22402933
3518 22402933 22674395 23011379 23208419 23296070 23463819 23874552 24183745 24472362 24700145 25088714
3508 25088714 25622662 26245962 26722129 26956907 27444068 27946229 28584640 29148318 29799370
3499 29799370 30091898 30747705 31221191 31727464 32676311 33542167 34321749 34947421 35771005
3490 35771005 36690957 37461621 38569952 39753726 40823054 41748808 42572313 43902577 45228580
3481 45228580 46598646 47984417 49504154 51235804 53005527 54814263 56831859 58770810
3473 58770810 60736905 63017461 65341454 68033782 70819922 73694850 77004983 80607572
3465 80607572 84210444 87987419 92275709 97021781 102160138 107571151 113778387 120543262
3457 120543262 128040474 136504650 145937106 156118421 167448015 179866255 193698443
3450 193698443 209218830 226459510 244921770 264794928 285775416 306665119 326473515
3443 326473515 343740591 356856126 363090608 360483436 348674620 329754927 306713173
3436 306713173 282733152 259953226 239237858 220996786 205181773 191636008 179865238
3429 179865238 169380706 160608121 152814168 145877850 139923631 134669473 130482097 126606929
3421 126606929 123321941 120638465 118437682 116822819 116103363 115994243 116347493 117599345
3413 117599345 120059827 122842480 125948348 129700720 134806438 141303151 149606069 160351686
3405 160351686 174058122 189865175 206594396 225034297 246886620 269204439 286847186
3398 286847186 282916067 251895623 219253026 193582257 174308621 160258712 150322542
3391 150322542 143345704 138308123 135039732 132404418 130224968 128703745 127993813 128345726
3383 128345726 129476060 131244169 133511142 135242069 136331541 137004968 137987860 139379378
3375 139379378 141458087 144508753 148052095 151551205 154274982 155187120 154899127 154211171
3367 154211171 153942092 154634914 156679165 159271276 161806438 163308632 162663521 160040885
3359 160040885 156714591 153310849 150229958 146564668 142268366 137481635 131885305 125207686
3351 125207686 117658629 110124955 103564971 97670202 92724061 88352338 84291813 80350002
3343 80350002 75740133 70992600 66365362 62063474 58107359 54614788 51660571 48917062
3335 48917062 46788959 44790960 42872913 41088802 39444405 37928277 36714770 35304255
3327 35304255 34222333 33289250 32304941 31221838 30165611 29286415 28726250 27909558 27214295
3318 27214295 26604807 25778914 25257017 24805816 24313548 23804748 23207715 22656158 22312123
3309 22312123 22109575 21649926 20845224 20435497 20019927 19673782 19380995 18912771 18674156
3300 18674156 18319316 17902844 17491560 17169014 16890728 16566577 16275443 16042940 15822561
3291 15822561 15450041 15249782 14716926 14638898 14646340 14551760 14168474 13998370 13664693 13378164
3281 13378164 13262736 13028134 12854981 12790194 12607885 12321791 12143048 12075397 11892294 11849572
3271 11849572 11605293 11388868 11122035 11119793 10963959 10806429 10805075 10685285 10475675 10427640
3261 10427640 10272089 9977462 10016119 9907755 9766512 9495012 9430978 9431404 9332621 9395691 9128911
3250 9128911 9091183 8960821 9023897 9035319 8780652 8607170 8645739 8776121 8545650 8495373
3240 8495373 8372220 8305639 8308124 8403574 8072236 7955995 7919617 7914194 7840720 7949886 7855466
3229 7855466 7732876 7680541 7585210 7635032 7560884 7479826 7454483 7278488 7406817 7359119 7305652
3218 7305652 7167414 7077422 7096241 6964802 6909999 6910414 6938811 6884154 7100637 7019793 6926014
3207 6926014 6765050 6758397 6856855 6948759 6822033 6492969 6422850 6526301 6411431 6308127
3197 6308127 6396116 6430551 6561835 6548751 6273199 6079703 6101850 6336934 6357263 6347498 6503354
3186 6503354 6673439 6560085 6407738 6272015 6213969 6163814 6009147 5805215 5591148 5724081
3176 5724081 5637465 5614171 5466478 5606999 5680664 5674628 5545623 5699838 5658923 5540541 5470005
3165 5470005 5367694 5359144 5328142 5114864 4976944 4908385 4709007 4767909 4780963 4759532 4706229
3154 4706229 4731474 4862325 4766366 4742201 4880218 4901341 4982294 5132293 5154508 5201890 5164322
3143 5164322 5013100 5055684 5405040 5486226 5524472 5806393 5788309 5892445 5869125 5792302 5698247
3132 5698247 5530537 5091670 5001156 5028341 5060818 5117407 5033147 4889564 4795062 4595959 4601196
3121 4601196 4618067 4571077 4543035 4737065 4827442 4806396 4835306 4804033 4823127 4782884 4734456
3110 4734456 4731804 4924142 4718520 4482410 4368822 4293862 4330903 4127979 4119588 4137382 3963681
3099 3963681 3685223 3608402 3561770 3480799 3410708 3318666 3245695 3250824 3155485 3324464 3128042
3088 3128042 2994794 2917811 2943583 3037277 3024065 3144531 3023998 2858926 2968479 3078975
3078 3078975 2994139 3033095 3011198 3145326 3060804 3157299 3147891 3098978 3032224 3080362 3218239
3067 3218239 3412564 3683054 3688661 3662877 3516722 3385780 3344098 3113247 2970075 2913156
3057 2913156 2870217 2842964 2867818 2828115 2710994 2689964 2917872 2847653 2628297 2575620 2636919
3046 2636919 2495372 2537995 2723622 2594106 2619638 2683484 2833853 2762681 2713293 2654438 2474387
3035 2474387 2526237 2700134 2703095 2687393 2680897 2622271 2655390 2652601 2766737 2720102 2661111 2486584
3023 2486584 2613496 2593748 2632589 2716220 2828701 2852429 2612673 2547431 2612750 2565425 2273589
3012 2273589 2331162 2386299 2166158 2093476 2144438 2228931 2091461 2126524 2058756 1967199 2285329
3001 2285329 2196470 2021462 1922201 2019018 2159662 2022357 1858900 1854897 1987610 1958844 1955957
2990 1955957 1892614 1848049 1710232 1586418 1681079 1744310 1904936 1908572 1851953 1746761 1706996
2979 1706996 1585618 1464192 1482193 1586742 1507717 1525019 1576896 1718134 1686431 1657588 1428123
2968 1428123 1308455 1432132 1293478 1336393 1592451 1622899 1566770 1414938 1273303 1249451
2958 1249451 1363121 1299831 1196824 1220592 1264906 1342707 1327998 1411099 1317957 1323531 1258291
2947 1258291 1444257 1552483 1433685 1244029 1436861 1442701 1245548 1245140 1236759 1195131 1190867
2936 1190867 1203195 1196042 1251836 1180642 1227988 1114347 1136545 1420651 1326300 1131812 1210121
2925 1210121 1287915 1410235 1147095 1194611 1313444 1060070 996962 1009256 1095369 1172834 1169138
2914 1169138 1125178 1140798 1170304 1290913 1325262 1190268 1264049 1118550 1105491 1286636 1270008
2903 1270008 1149319 1147059 1165320 1059291 1140572 1233574 1157357 1191433 1052981 936827 1058505
2892 1058505 1139957 1193463 1166827 1263268 1257332 1298134 1331744 1238277 1202814 1238996 1211760 952106
2880 952106 1080423 1296431 1288464 1376688 1253545 1068050 994326 1102834 1316074 1274052 1331956
2869 1331956 1243420 1251748 1247277 1308414 1369758 1346644 1357454 1443465 1439858 1495276 1650144 1719862
2857 1719862 1653284 1435105 1582040 1430056 1208362 1350799 1585448 1540284 1566221 1492127
2847 1492127 1442923 1414414 1654109 1677555 1603677 1735470 1690560 1668848 1868631 1683605 1638743
2836 1638743 1843108 1642347 1499794 1685335 1792297 1864779 1762607 1557445 1673911 1774824
2826 1774824 1670072 1761083 1892119 1890261 1773355 1738975 1755496 1729265 1753677 1799542 1750646
2815 1750646 1684568 1811409 1732976 1698297 1856428 1774349 1851797 2061320 2012514 1923546 2024889
2804 2024889 2018423 2069271 2099938 2150669 2085458 2184736 2259516 2232300 2306952 2181716 2290883
2793 2290883 2414149 2642401 2678384 2790523 2690033 2775880 2953556 3058131 3093226 3092229 3158598
2782 3158598 3095027 2976392 3124208 3133195 3303483 3376573 3316907 3301160 3511057 3708192 3548762
2771 3548762 3724911 3906827 3803569 4049035 4274062 4276239 4737362 5191634 5579111 5837962
2761 5837962 6397205 6910108 7467077 7940677 7482395 6693654 5660443 4756867 4314357
2752 4314357 3820242 3288162 3142403 2911936 2767400 2762435 2490010 2233391 2213256 2291038
2742 2291038 2090994 2026265 1949817 1783759 1655632 1602557 1627787 1597729 1376694 1401829 1387350
2731 1387350 1252875 1223565 1355654 1493839 1642965 1495101 1236275 1142554 1034312 994173
2721 994173 1007345 1167959 1317449 1235218 1002617 1168654 1145532 1062940 1057409 1069034 1005900
2710 1005900 1093883 959579 960809 1081320 1155613 1180792 1229028 1176262 1068121 1013157 930376
2699 930376 877315 827003 846722 753097 787788 733490 747148 860300 909093 941734 917463
2688 917463 1007527 984800 877787 1041289 973564 631522 681878 798381 768815 772002 928713
2677 928713 943674 857447 998972 1013353 961885 1057890 835097 521952 668960 689059 741067
2666 741067 809612 832949 621323 780685 730338 704967 825139 748030 791243 809456 598810
2655 598810 484366 542015 521087 573950 533190 493472 404887 329341 518351 663742 543025
2644 543025 464341 523341 423512 237133 289335 348157 345261 212135 339898 431958 510243
2633 510243 374931 333029 280740 325424 547168 514963 426620 383809 468955 422035 225678
2622 225678 171531 134387 301220 378709 317017 382438 331712 444340 473919 550385 454386
2611 454386 434767 450640 685520 546061 466120 405552 322941 176089 319512 229337 222451
2600 222451 294643 304103 373299 405376 436247 529071 517746 442068 451218 370353 350186 176807
2588 176807 203861 314923 557405 392994 476414 366863 383723 429653 418617 455189 454261
2577 454261 320930 356396 398243 405886 454592 330908 363209 374331 333484 155528 164130
2566 164130 264645 393197 473461 471761 340425 312180 498956 473895 459582 393013 322359
2555 322359 280854 301271 351309 520493 422344 391562 368982 331559 310477 395886 374633
2544 374633 479732 620196 682757 335567 392904 437737 340595 356704 237380 288710 369835
2533 369835 408711 454283 564082 641283 711169 546188 724279 500617 529429 462029 475809
2522 475809 576498 623858 658885 495018 501305 623967 696733 578374 541805 603626 588872
2511 588872 615724 433238 510843 577527 585696 522771 627564 703228 476423 492592 787362
2500 787362 720326 617948 689083 727532 709441 615316 727228 849939 897509 912652 809957
2489 809957 862400 1091381 1095940 1183004 1192246 1080148 1123573 1216838 1220267 1376345 1389590 1395187
2477 1395187 1172700 1264433 1306686 1352297 1324233 1554006 1631785 1702386 1660782 1737441 1779070
2466 1779070 1877766 1693061 1692463 1701507 1562505 1893730 1866921 1930557 1804609 1770780 1533081
2455 1533081 1558720 1558719 1611471 1415607 1216687 1380331 1523899 1480372 1333614 1184730 1099857
2444 1099857 1085233 1038145 887285 854648 771176 775698 809855 791910 718287 636250 626759 622617
2432 622617 577317 697873 672625 490096 561711 528548 476804 515544 638038 482008 348756
2421 348756 554695 508002 356119 311041 243762 284135 259176 501942 669140 374324 229524
2410 229524 458178 486815 443804 451021 324200 428537 611698 601267 484591 367260 284235
2399 284235 163966 190111 153621 110407 96019 40147 229426 243212 340226 274203 202946
2388 202946 22717 101945 224842 303547 402218 386769 181428 350845 238334 44410
2378 44410 188861 121450 53921 66668 200706 154800 256999 410567 192349 198206 422995
2367 422995 315075 223140 65644 132889 82188 111969 216071 337683 285702 59850 -92084
2356 -92084 -50941 81772 118198 246257 290336 223919 221498 169076 326413 412939 222373
2345 222373 223841 164241 45826 21393 121012 276529 70952 26055 69231 223984 54746
2334 54746 252866 226049 180013 279942 189062 259127 150483 -42872 -112648 293302 502364
2323 502364 184577 -57005 86732 339601 172348 44342 26213 -86285 53761 34777
2313 34777 130864 194191 -31391 38251 162780 223489 49208 -28619 -97176 34921 12569
2302 12569 -90639 -74123 -138003 -162081 -10115 174577 120633 96853 13530 334042 255395
2291 255395 192269 261550 393907 223111 162862 275599 381521 428566 389404 286019 286767
2280 286767 288801 297879 323955 256005 263129 292578 332860 293833 232723 425854 309412 369929
2268 369929 382829 529965 576420 515051 523891 277385 103815 91514 251664 269468 407516
2257 407516 403102 439848 554912 540564 646735 426186 405642 419890 286743 353866 452554
2246 452554 697406 508039 401986 154568 240846 386377 406581 222618 167837 135220
2236 135220 496093 430735 239609 357770 321507 388873 282310 164253 179387 369620
2226 369620 524534 447277 599116 559759 445328 350800 465407 531163 396044 335383 382851
2215 382851 529519 223318 320587 477266 654225 617796 620718 456531 525615 677907 562120
2204 562120 679764 763796 591508 586155 624395 388227 428910 411476 620650 590673 551994
2193 551994 716807 747782 663602 582643 620233 672846 616267 643275 815505 909590 774518
2182 774518 708803 735802 578779 730949 695767 587897 526626 688328 741113 759672 605966
2171 605966 608544 408769 305467 400686 389721 602968 767561 539423 592130 591385 429362
2160 429362 463924 754636 627341 712294 621030 626284 847772 921874 978645 874029 876852
2149 876852 918910 1034322 892707 808926 816429 927309 870403 848380 661611 655133 759025
2138 759025 845990 900177 758792 646008 851980 833416 753238 884043 789961 603768 755924
2127 755924 766935 773236 646388 647502 772112 879469 817899 869203 823628 640173 666722
2116 666722 853648 959869 1077642 925184 976329 958353 896602 1038696 997719 907146 1005605
2105 1005605 984814 735993 787341 876883 913048 804919 614607 696227 760210 697117 712015
2094 712015 618152 672944 664807 666098 476897 359995 260420 199565 236669 145563 260831
2083 260831 227110 241295 202425 338318 315685 303445 359609 265703 14914 235027 296396
2072 296396 91003 244412 279626 409441 309936 262979 302043 243062 243205 388954 331831
2061 331831 258347 251546 182637 220564 198641 183245 198950 336386 470713 389744 424761
2050 424761 192142 79586 312594 410282 392281 349182 313405 568065 377743 253925
2040 253925 183702 239671 251616 270525 470634 271533 227714 348170 234937 307434 358589
2029 358589 347272 202169 382360 416711 364772 345706 302578 265676 299559 198389 173781
2018 173781 296838 179234 170740 114943 205253 119535 -15480 -124058 -33269 -10491 175474
2007 175474 284001 330840 146546 303894 317757 204557 336811 251846 371837 476335
1997 476335 591198 608251 479743 560665 710859 690513 674477 635007 535584 402285 469000
1986 469000 393192 178367 319201 441969 428386 370033 226892 371432 476631 356723
1976 356723 220206 253861 195584 111279 -30956 -12358 83323 170999 161780 201276 326091
1965 326091 224079 111192 107850 239638 -38219 103355 307766 281460 299563 148434
1955 148434 165374 152713 292096 271764 147753 274542 130869 220211 268507 330149 235415
1944 235415 133930 323219 193172 48762 -14336 86368 13825 -9691 7939 4933 -37882
1933 -37882 39369 28803 -40007 -94797 -223329 -147632 -98919 6740 -253595 -151597 -31375
1922 -31375 -51946 -148337 -24093 -78637 37052 99790 -173836 -83003 -76493 -28880 -66566
1911 -66566 -269244 -250079 -60609 46252 187966 -24461 -12974 -164673 -349377 -329887
1901 -329887 -306192 -259814 -379503 -366659 -313487 -116509 -59162 -67524 43687 -9687 -136631
1890 -136631 -154968 -214090 -167637 -68467 -190961 -283778 -193622 -202913 -191839 -162070 -36114
1879 -36114 -70247 -31502 -53653 -158155 -216758 -351260 -347598 -187113 -225325 -204166 -39635
1868 -39635 -153394 -89348 -289916 -323634 -153379 9719 49561 116 -86968 -136391 63176
1857 63176 40630 -89077 -201152 -145166 -85143 -185259 -163878 -27759 -35407 -298253 -155800
1846 -155800 31858 -88971 -84776 16824 -40302 5713 6862 13954 -35302 56297 39213 154136
1834 154136 110065 178255 19373 -132539 -5594 185899 219836 197904 212418 256809 162138
1823 162138 55579 -52768 -125096 30618 344517 383710 250768 283027 248667 83142
1813 83142 227994 268608 83524 84217 98251 401775 284161 310386 293433 405814 146293
1802 146293 255188 463009 527230 610183 548525 556157 688149 675534 722478 867743 847620
1791 847620 827657 886866 916289 1068541 1257742 1158202 1027263 970120 1058579 1176751 1337041
1780 1337041 1253598 1251159 1298145 1225754 1398512 1366126 1552582 1539243 1449377 1357969 1211682
1769 1211682 1182011 1309184 1449660 1506961 1658876 1805912 1806513 1904048 1927965 2019508 2137538
1758 2137538 2202174 2222863 2270936 2262495 2354432 2584592 2730806 2694585 2843427 2587267 1994910
1747 1994910 1962471 1769448 1637342 1596243 1486055 1268279 1323969 1479576 1307064 1174439
1737 1174439 1209118 1172613 1115494 1113936 1023463 1131069 1326813 1239534 1228615 1397575 1302499
1726 1302499 1108131 1252142 1527498 1460706 1146610 1222399 1170844 1385465 1217436 1188037
1716 1188037 1160191 970177 964305 1007025 675081 578435 527185 568488 635226 554226 573921
1705 573921 519101 471319 394282 512250 480874 291626 237512 178367 127680 117320 197031
1694 197031 187152 215661 227315 243218 281933 131244 109452 96915 127579 118367 48621 -20460
1682 -20460 45401 -106067 13535 155636 150356 148570 -81680 -34585 -13666 -35719 26057
1671 26057 72896 54566 -2545 16060 -90703 -114061 -71999 15053 6106 -95393 81573
1660 81573 44871 139265 133260 -51999 -67924 33881 -29158 -133829 -182680 -188224 -233475 -117610
1648 -117610 -121010 -294399 -345757 -385075 -401919 -524362 -340360 -342638 -227311 -93292 -21992
1637 -21992 -22128 -117258 -187262 63182 -3477 -119739 -174491 -105919 -206522 -126515 -166132 -230678
1625 -230678 -127819 -107645 -239000 -335467 -202506 -296938 -491012 -382303 -215443 -240608
1615 -240608 -264338 -161107 -282499 -355878 -234921 -182405 -233625 -336218 -354878 -424953 -263618
1604 -263618 -186139 -212359 -198839 -281632 -292969 -270250 -169177 -168330 -166246 -159063 -218324 -254744
1592 -254744 -418932 -350413 -131282 -170059 -177716 -116390 -32281 -76104 -147884 90041 -26219
1581 -26219 -62925 -52516 -117322 -227997 -230815 -145927 -85976 -149208 -215437 -171573 -195408 -301214
1569 -301214 -214034 -101225 -109732 -107140 -23895 -60107 -189432 -112462 -334503 -392247 -425617
1558 -425617 -395662 -356134 -355341 -401103 -327478 -152699 -162425 -223753 -241637 -228511 -45466 -73100
1546 -73100 -231493 -223082 -435971 -489983 -492264 -260920 -155712 -253612 -161027 -103459 -122420
1535 -122420 -78701 -313522 -245529 -192223 -135538 -175399 -262292 -430162 -333598 -279829 -187143
1524 -187143 -213147 -443520 -305397 -324408 -401481 -253919 -322502 -226853 -263406 -192490 -412791
1513 -412791 -596881 -502269 -628977 -482599 -223196 -74825 -256456 -334947 -193921 -199775
1503 -199775 -144557 -211353 -306409 -389194 -381141 -359239 -330934 -315974 -306557 -135475 -247338 -206102
1491 -206102 -432009 -495151 -279007 -171610 -144097 -318558 -545065 -505901 -541819 -466606 -418800
1480 -418800 -520426 -385132 -107544 -219926 -212991 -29993 -62732 -343931 -379554 -242155
1470 -242155 -277993 -491126 -453999 -317506 -320201 -295561 -298465 -267888 -400045 -382510 -403607
1459 -403607 -521118 -417251 -231439 -169177 -265277 -430891 -406996 -208902 -223976 -252459 -288604
1448 -288604 -288136 -302002 -224832 -352200 -342357 -248968 -273005 -312430 -212183 -192791 -356050 -300725
1436 -300725 -134456 -222406 -214033 -186217 -181705 -248171 -432347 -490932 -518516 -419725 -119323
1425 -119323 -151883 -220917 -304674 -234422 -156848 -299573 -193203 -50321 -61686 -139848 -137302
1414 -137302 -110793 -242746 -311511 -382722 -559419 -275024 -192770 -223038 -302189 -243709 -89189
1403 -89189 -356781 -256876 -264375 -369754 -396483 -434123 -240912 -352310 -295030 -415448 -323729
1392 -323729 -268192 -438409 -390760 -288260 -141095 -243226 -519574 -460665 -252771 -243382 -333087
1381 -333087 -284404 -264750 -338686 -252194 -419654 -350499 -197334 -171718 -227942 -425768 -267356
1370 -267356 -293834 -142510 -261458 -125420 -79333 -229540 -317389 -332356 -373662 -343123 -347395
1359 -347395 -304090 -227501 -239345 -248223 -195827 -303418 -346730 -195901 -261658 -332265 -212704
1348 -212704 -218450 -337877 -325825 -320194 -124037 -175270 -86959 -64608 -233142 -302072 -198764
1337 -198764 -276064 -341526 -488637 -446690 -154698 -156433 -298047 -331290 -336405 -362396 -297127
1326 -297127 -377123 -462050 -385010 -324084 -257331 -187090 -283294 -328203 -280109 -355543 -299687 -444537
1314 -444537 -531611 -241863 -262620 -160120 -43612 -267506 -75979 -112702 -102843 -260172 -468450
1303 -468450 -472249 -270751 -151222 -175681 -123636 -163520 -209817 -209944 -135002 -167419 -147233 -267580
1291 -267580 -344719 -461181 -486801 -438074 -297711 -230633 -200797 -75132 -180142 -227031 -262592
1280 -262592 -273867 -227418 -264730 -255885 -191213 -160219 -298599 -210980 -147672 -300091 -341635
1269 -341635 -234517 -161310 -153120 -134375 -177122 -120105 -156374 -202852 -243723 -277171 -179241 -131820
1257 -131820 -85856 -96201 -148691 -188773 -135354 -12020 -272451 -381926 -246193 -204286 -157252
1246 -157252 -256434 -288181 -518047 -448122 -279961 -130433 -10150 -60131 -82994 -66023 -86137
1235 -86137 -159326 -246353 -202044 -102639 -246441 -234243 -163022 -38510 -128363 -220627 -45055
1224 -45055 -138021 -357024 -265167 -192502 -329084 -327341 -141671 -137507 -174197 -103978 -230359
1213 -230359 -272877 -142165 -211381 -340115 -291774 -200815 -369802 -225856 -82732 -154414 -222187
1202 -222187 -105212 -430214 -392352 -34632 -99189 -111260 -145585 -58164 -194480 -333160 -213609
1191 -213609 -168535 -172354 -80621 -116410 -208458 -150230 -188227 -253247 -286319 -207966 -122382 -321851
1179 -321851 -214966 -234749 -217344 -417412 -259807 2371 -174821 -344785 -254755 -315917
1169 -315917 -343913 -129097 -277852 -294536 -378132 -281110 -257923 -361279 -303590 -202135 -207665
1158 -207665 -265344 -156669 -228097 -318505 -232052 -134221 -186526 -181067 -286523 -297210 -278348
1147 -278348 -274965 -101078 -333028 -387582 -332503 -390887 -201367 -260480 -293852 -245050 -335538
1136 -335538 -197462 -146944 -29998 -21322 42519 17694 -55623 -198279 -200017 -184697 -153778
1125 -153778 -167522 -309098 -179570 -294167 -372451 -189743 -232995 -247911 -140159 -234220 -417947
1114 -417947 -416702 -312628 -356364 -175878 5331 -64306 -126043 -103081 -108843 -126209 -107149
1103 -107149 -139219 -293820 -196220 -191195 -246021 -157560 17855 -68118 -173774 -255259 -177466
1092 -177466 -114755 -63649 67986 95716 -117002 -160290 -340 -104945 -59263 -143333 -256816
1081 -256816 -289168 -227814 -185280 -128938 -143009 -427013 -501263 -450591 -283916 -333525 -289662
1070 -289662 -191329 -223687 -458667 -285408 -64755 114382 202912 95454 24974 -47790 -173377
1059 -173377 -124557 133525 115690 -37719 -164295 -137213 -201324 -231487 -198017 66844 -197915
1048 -197915 -208065 -106979 -184104 -183252 -190163 86340 175902 1577 -112791 -50223 14182
1037 14182 -89155 -112064 -163574 -272566 -261600 -162770 -223650 -139493 -13130 -36204 -111408
1026 -111408 -30131 -29568 -116399 -247078 -228573 -122371 -129515 -269347 -207870 -166261 39558
1015 39558 -99522 -274134 -241376 -220993 -155798 -199496 15998 -90721 -241815 8131 73247
1004 73247 -123605 -273601 -197861 74717 39446 -28459 -100933 -44098 60515 -46388 -237458
993 -237458 -100370 39100 -93189 -253716 -216107 -199574 -38119 138208 -140647 -168373
983 -168373 35601 -82768 -224797 -272150 -317434 -353871 -251391 -96853 -17556 105053 155914
972 155914 -2816 62300 103950 -135734 -112351 -112203 -206448 -178909 -48554 -110795 -24818 -73579
960 -73579 36276 901 -41821 153453 14513 -65506 -106243 25351 20763 92179 224355
949 224355 345166 150168 8610 -78737 -34062 135951 256350 209658 83582 52043 -91712
938 -91712 -207210 -101804 -59105 -74306 34900 37012 -213211 -141983 -15150 -71357 -19377
927 -19377 188564 229786 78151 24640 64397 6537 -114424 37706 14659 -205601 -212488
916 -212488 34515 46130 -82821 54868 -56113 -65750 9790 -77230 -245106 -145157 -116127
905 -116127 -138042 -60357 -12236 -21756 -37291 -37980 -33044 -54785 -73026 125324 89134 98130 128757
892 128757 173413 252998 126564 1608 91161 40998 63674 57437 -151707 -148427 32406
881 32406 5264 -47437 -74757 -106106 -191911 -145453 -180353 -138597 -313078 -178054 -171513 -78026
869 -78026 -59293 -2727 -10970 -169006 -112532 -22528 15806 -57814 -116954 -167487 -124819 44612
857 44612 73522 -861 -14409 -29161 4287 -71221 -57029 -41885 -24201 -135047 59350 -44632
845 -44632 -66452 -22679 -103991 -56540 15439 -73607 -151514 -130564 -157670 -163175 -229843 -3175
833 -3175 -109514 -86911 57097 55797 145964 103808 236233 276091 297237 102527 166400 119106
821 119106 11767 -22862 -124518 -116088 -121715 -157406 -54136 116756 83107 44909 8199
810 8199 -59245 -32996 -5798 -86056 -198957 -30847 -234682 -116629 116252 -61383 -79176
799 -79176 -54189 -84610 -26853 -1260 -2611 -51505 -186568 -107298 33769 -65148 -96097 -96080
787 -96080 28413 32805 123069 130966 100890 98953 -185556 -148670 -262238 -216446 -11841 -32928
775 -32928 13495 223961 57716 -31490 -129066 -226038 -185851 7894 138132 104510 -123172
764 -123172 -93963 25006 13703 -146944 -109585 -23185 141744 105673 25118 19765 10278 -40071
752 -40071 -44914 216281 146220 32487 83736 185459 67864 216026 268624 110992 145122
741 145122 61801 -21058 56105 136810 21853 -46012 34044 25067 99052 163259 174769 -47343
729 -47343 -159389 -64876 -54901 130345 15501 -69814 -53044 97679 68024 85933 88025 194390
717 194390 214391 238180 253395 108714 66732 230553 84301 -104107 -139147 -104359 -44061
706 -44061 -21873 134533 -27291 -57890 12190 39511 22993 113608 132320 135877 192043 179742
694 179742 37518 -8907 -62873 73299 35505 118287 244813 252378 352078 158592 118063
683 118063 42084 85267 283671 135515 202805 88455 142122 112778 116561 78815 -134680
672 -134680 -152942 -1805 -50826 85878 274203 65357 -66459 -14666 53865 -63568 -24273
661 -24273 115679 154371 284724 110131 81335 246084 200500 82572 122546 230032 42599
650 42599 -25945 137934 153264 41761 -34321 111205 -34041 -102729 -219868 -125518 140416
639 140416 52109 -37926 -45467 140211 -7858 103608 150930 23205 76920 118933 40998
628 40998 102358 98150 -25784 47375 -13781 231463 313009 248566 172194 130199 93702 42646
616 42646 72019 148185 239558 241459 342904 229340 114669 87877 248861 151510 229232
605 229232 292407 324433 253613 131900 35011 -26859 44396 174611 319055 314785 367567
594 367567 264474 29582 15281 39491 94260 49117 -33170 92434 129965 108060 44233
583 44233 122974 4567 -20652 115068 260020 241110 174570 128972 184739 350867 276714
572 276714 341088 295743 297842 133030 228038 306623 394966 398922 246992 141627 265982
561 265982 319248 216028 162122 17939 154510 315766 219994 164298 281515 305263 277948
550 277948 207977 200096 136857 141260 253675 252831 290197 117865 106274 90702 155667 261250
538 261250 336664 119779 155501 173366 106557 76538 149695 136922 58687 100679 178939 301081
526 301081 428493 327302 211662 284957 203243 255540 286913 396882 417519 436828 315945
515 315945 337308 270684 277319 282960 371397 299453 355035 322718 71978 183136 422726 276754
503 276754 124576 107476 236097 434448 240199 195459 347874 367776 383256 332493 310358
492 310358 222170 229781 239564 361636 242622 53534 78420 63090 81475 79303 204013 265610
480 265610 264273 369408 319848 283991 249058 248285 268856 385950 504807 326564 318181 468566
468 468566 412052 431714 335750 373678 388971 466754 462491 434345 330766 419437 464941 386340
456 386340 302036 263166 174567 387589 354326 431228 545981 441386 79730 5542 121529
445 121529 91232 224624 274600 564312 295872 245853 189659 290144 365327 339172 327542
434 327542 461023 553145 453136 278060 177928 114557 224776 354458 245862 184436
424 184436 303344 498337 378915 529463 570380 349403 336928 163077 116555 100616 65231
413 65231 -14815 90222 105938 187939 213579 231636 219168 190078 300157 290117 260802 181327
401 181327 184729 226045 312565 355956 212788 245107 298383 398441 202039 118959 103797
390 103797 220460 476161 497720 288650 294542 356010 108083 194738 319928 237559 385306
379 385306 249853 150325 85823 93436 226247 367609 318621 332117 453499 527237 523455
368 523455 428036 356058 422280 474712 357941 235490 113508 141950 171683 346469 340299
357 340299 299078 289756 234678 342154 391033 301291 413927 492150 626525 610077 391697
346 391697 275156 233956 185991 187630 154550 83381 147890 186209 483063 479511 269215 306215
334 306215 302263 315762 314242 337228 623454 607691 464443 448117 296596 467949 337592
323 337592 483397 422959 353995 348460 306578 440263 441783 308935 239871 17605 117178
312 117178 381447 559166 530455 313281 212136 291972 135349 70685 186589 183898 276965
301 276965 318990 336514 268377 83069 123120 244005 341580 323891 178533 253233 297288
290 297288 264293 142550 72390 160779 186362 252241 347716 479277 365622 312376 243374
279 243374 164184 178167 250108 349155 362255 404569 347635 504642 377665 469950 514170
268 514170 497677 430039 482944 505329 365183 276322 275041 339771 344344 364298 363273 460711
256 460711 583636 438349 366841 259297 253416 441803 516957 441554 546395 498039 494668
245 494668 504636 403570 388282 296402 459188 457894 447475 518008 474737 617072 526686 467677
233 467677 569179 471631 427127 285848 382803 462618 303619 318210 391201 419035 537053
222 537053 590895 383656 295945 360035 353355 509155 378274 276772 419193 390312 304054
211 304054 327306 324367 398426 389217 344526 280099 233756 245075 293085 371973 435171 634979
199 634979 649155 519118 518524 590982 676932 410539 348741 562277 627240 597509 535482 483965
187 483965 349295 344094 460774 380344 404884 469631 385642 250233 139455 392173 519361
176 519361 291081 300108 320001 100366 316175 487422 502465 435993 432723 283030 283158 373835
164 373835 324487 387669 313342 304830 454098 405515 437047 405157 566747 620532 530620 493016
152 493016 440231 297130 238981 262833 388126 593628 420107 361260 499220 686629 750209
141 750209 703068 468472 465281 439796 387862 523501 550822 484375 571835 697169 677402
130 677402 619690 588029 548018 512590 597813 562021 534542 624536 589279 654538 495516 226920
118 226920 305667 410583 227276 401097 562741 575609 557944 389868 456498 552453 482232
107 482232 457047 517102 492135 313426 339392 467963 550607 601905 482871 495739 462909
96 462909 465227 306176 335878 408608 547041 573681 421623 374899 420738 439349 420126 429396
84 429396 475213 388043 420007 494058 471778 440499 367027 373234 251712 468999 442403 575051
72 575051 633056 617826 498106 409753 438631 471408 601195 581258 602379 684285 523208
61 523208 560977 568763 446712 528916 487295 513487 613462 689884 662598 685204 628811 619041
49 619041 652815 669157 651693 705501 602171 527584 470767 424023 527152 438836 436313 443169
37 443169 410655 487555 481690 435005 398046 543390 593436 495296 507390 766954 783839 662127
25 662127 579156 571512 508424 495079 504311 571855 536911 534760 591137 590975 594713 475197 496985
12 496985 405037 517194 538265 539009 582303 497489 559320 558183 443933 663828 631707 591697
0 591697
$$ Imaginary data points
##PAGE= N=2
##DATA TABLE= (X++(I..I)), XYDATA
16383 -3844905 -3831340 -3706359 -3628353 -3745224 -3542682 -3443724 -3415064 -3320493 -3242306 -3187751 -3124829
16372 -3124829 -3040967 -2854210 -2887804 -2734784 -2799775 -2851021 -2677885 -2624827 -2496784 -2407495
16362 -2407495 -2420834 -2407766 -2348596 -2389561 -2261896 -2281809 -1997924 -1819863 -1840060 -1731224
16352 -1731224 -1762558 -1773041 -1756462 -1634348 -1606074 -1561136 -1459425 -1316637 -1281514 -1258520 -1162444
16341 -1162444 -1248747 -1297119 -1222549 -1051692 -932357 -870174 -758670 -754514 -712308 -722330 -575239
16330 -575239 -424043 -348838 -239749 -215788 -185445 -168129 21647 -46120 -108579 -5792 61055
16319 61055 175067 342904 271240 262494 181711 307652 534794 518532 448027 438802 534857
16308 534857 819290 894200 830883 1019667 1091706 1039802 1076939 1064876 1140305 1414543 1351931
16297 1351931 1355289 1334246 1520510 1438174 1432809 1611881 1598419 1461453 1565274 1714282 1674741
16286 1674741 1895653 1963303 1945053 1875763 1817927 2045875 2171086 2182075 2119720 2107029 2328862
16275 2328862 2335449 2443193 2580269 2632037 2625380 2694055 2686631 2576226 2620106 2582970 2799822
16264 2799822 2944687 2862085 2999186 3054740 3033259 3088398 3200369 3348237 3480045 3580271
16254 3580271 3480332 3365558 3148360 3180105 3407902 3457702 3514200 3712853 3688302 3661933
16244 3661933 3628597 3772044 3941437 3877992 3923300 3898877 3922995 3733898 3878404 3923076
16234 3923076 3903769 4077158 3999026 4162057 4057614 3926794 4144829 4213961 4197395 4176805
16224 4176805 4207654 4196815 4175953 4344602 4511174 4451420 4380396 4391827 4546290 4705228
16214 4705228 4682338 4626184 4830007 4727412 4777695 4742026 4725703 4731981 4835705 4841161 4937167
16203 4937167 5062288 5085649 5123457 5108008 5097471 5107886 5179309 5215359 5030732 5080774 5253604
16192 5253604 5110695 4999798 5036279 5129015 5017808 5186938 5257810 5327640 5237856 5068035
16182 5068035 5335367 5400685 5188054 5250004 5272012 5269195 5155362 5207465 5190197 5297017 5330718
16171 5330718 5248740 5261260 5293372 5385742 5412680 5360082 5542310 5642880 5706599 5582675 5635796
16160 5635796 5750039 5794363 5785442 5693626 5727443 5799380 5829533 5681606 5575516 5465764 5617609
16149 5617609 5828591 5911348 5919353 5901300 5860047 5840209 5803342 5905832 5858534 5926511 5890639
16138 5890639 5837848 6089931 6141317 6049972 5967065 5962849 6081566 6107188 5943684 5837694 6065206
16127 6065206 6172647 6191261 6020470 6075555 5928565 5889290 5920500 5859341 5982605 6070600
16117 6070600 6109545 5873947 5723230 5786801 5915306 6121406 6213062 6120764 5974093 5807013
16107 5807013 6051628 6049388 6177736 6467893 6174422 6185836 6280860 6360476 6382958 6135862
16097 6135862 6005812 5997859 6199243 6087793 6218226 6430337 6477110 6382905 6430634 6319616
16087 6319616 6195031 6090458 6029278 6130996 6236782 6292135 6217306 6199584 6291268 6364699
16077 6364699 6350099 6306612 6285351 6311428 6179316 6118101 6322712 6340331 6436336 6412347 6308592
16066 6308592 6113735 6118527 6323765 6326037 6356402 6448721 6375773 6123381 6069566 6037042 6150017
16055 6150017 6274754 6309688 6343075 6163508 6342098 6252199 6215680 6146110 6336053 6528276
16045 6528276 6308591 6356725 6499910 6476306 6360809 6575230 6545031 6444780 6280008 6297590
16035 6297590 6185901 6279003 6202353 6091606 6249298 6299731 6247847 6446373 6588939 6644498
16025 6644498 6256999 6253202 6196548 6287993 6440160 6342205 6234724 6306740 6429608 6278838
16015 6278838 6224130 6180592 6224848 6279922 6248223 6345291 6182556 6183785 6184407 6069431 6215245
16004 6215245 6378162 6459977 6402449 6396269 6303662 6212431 6355696 6420661 6262307 6311263 6337418
15993 6337418 6262608 6169935 6307356 6228996 6289078 6262922 6286637 6161992 6188228 6202101 6289276
15982 6289276 6485926 6292095 6248108 6325987 6387824 6460380 6395740 6286588 6285851 6298835 6337159
15971 6337159 6257065 6268259 6316442 6447543 6332413 6313297 6249295 6256179 6194830 6130728 6313770
15960 6313770 6438243 6509799 6594858 6764937 6725819 6537328 6358548 6410396 6263340 6156046
15950 6156046 6268133 6189294 6202340 6404801 6358460 6439283 6487293 6653586 6689501 6497366
15940 6497366 6620740 6600953 6461673 6667722 6688665 6457467 6500646 6546322 6523339 6542808
15930 6542808 6507921 6460679 6396519 6597090 6518480 6432032 6585857 6415169 6507890 6388908
15920 6388908 6323843 6404265 6356971 6339362 6551317 6628126 6519310 6468056 6492550 6513009 6387405
15909 6387405 6568352 6508004 6539498 6554162 6456121 6345129 6420385 6367054 6373331 6415308 6373074
15898 6373074 6285368 6374851 6351998 6370457 6453964 6664410 6467107 6394314 6478667 6474774 6367936
15887 6367936 6242712 6208006 6282065 6431401 6433544 6370522 6586579 6516206 6462500 6473872 6355135
15876 6355135 6423960 6268455 6212477 6451032 6460975 6361651 6625392 6436166 6547660 6483975
15866 6483975 6542566 6490384 6541184 6585248 6765949 6657136 6603135 6650130 6615630 6465654 6308826
15855 6308826 6313503 6459922 6572941 6646993 6591490 6529099 6441144 6383056 6393932 6479184 6414301
15844 6414301 6276027 6395020 6532979 6493721 6527571 6399045 6331319 6523209 6440080 6490019
15834 6490019 6606638 6578942 6545898 6483794 6528233 6566229 6546876 6676229 6519237 6384330
15824 6384330 6465248 6390807 6474621 6439214 6508294 6447978 6473127 6335052 6267018 6321612 6268147
15813 6268147 6408170 6395308 6619794 6648632 6656958 6548807 6504860 6521473 6555202 6601376 6504761
15802 6504761 6476348 6582934 6485132 6519114 6653657 6700424 6447725 6420237 6490373 6395663 6444170
15791 6444170 6418027 6343098 6472014 6517067 6678001 6654074 6762411 6653305 6556635 6499116
15781 6499116 6428693 6481256 6591398 6606554 6554161 6515362 6549649 6660507 6787033 6793189 6496836
15770 6496836 6436683 6581954 6748626 6464131 6426672 6379764 6396052 6410526 6300164 6418940
15760 6418940 6495246 6296213 6375053 6561218 6705815 6627431 6536543 6559214 6322904 6372443
15750 6372443 6468273 6393704 6403285 6590698 6568153 6610849 6619676 6579582 6556053 6529951 6429286
15739 6429286 6514440 6478794 6520218 6653145 6648964 6723022 6699550 6697532 6539360 6406906 6515523
15728 6515523 6529597 6431125 6578160 6444792 6470262 6634359 6613929 6475742 6276742 6478845
15718 6478845 6584549 6471432 6362249 6476439 6726603 6748259 6651214 6642254 6740139 6711973
15708 6711973 6622226 6656449 6768919 6619341 6743879 6733154 6665649 6622531 6596847 6647947 6631629
15697 6631629 6727919 6639447 6565964 6572347 6567725 6545697 6602525 6645840 6686637 6571013 6524420
15686 6524420 6728907 6792072 6652920 6705003 6670850 6430729 6558242 6467150 6464887 6533069 6642537
15675 6642537 6643499 6689057 6620149 6654857 6591393 6690163 6839183 6753023 6714083 6508480 6494341
15664 6494341 6483012 6494690 6498107 6580992 6431101 6589182 6685551 6606964 6548024 6656372 6771487
15653 6771487 6746704 6683919 6703019 6752356 6656698 6838487 6892510 6846466 6619950 6681860 6732031
15642 6732031 6547804 6581813 6620772 6711284 6807567 6884805 6836099 6694120 6435909 6545885
15632 6545885 6603791 6629407 6495687 6491923 6417473 6609943 6818988 6676889 6385366 6509107
15622 6509107 6564694 6641992 6740817 6583483 6731480 6778531 6685034 6768445 6705897 6710625 6676118
15611 6676118 6547196 6509406 6552435 6639862 6565806 6588076 6498739 6500456 6633501 6718978 6702501
15600 6702501 6696554 6623931 6638434 6579477 6639824 6583259 6433940 6416164 6554620 6696441 6886144
15589 6886144 6737419 6426785 6349076 6483219 6536895 6584299 6529686 6505622 6581119 6651657 6516678
15578 6516678 6485552 6477817 6569296 6625866 6697085 6789346 6748832 6828810 6806065 6650799 6764708
15567 6764708 6712082 6564198 6677592 6715028 6758099 6680200 6573881 6487394 6393097 6494946
15557 6494946 6620284 6775256 6594195 6502567 6671036 6742252 6699591 6704392 6748015 6637590
15547 6637590 6700131 6797523 6622289 6757097 6894145 6774408 6765638 6694565 6679145 6558816
15537 6558816 6715983 6666834 6773158 6903051 6825720 6874946 6701573 6730723 6911201 6602262
15527 6602262 6726439 6740782 6745584 6680691 6527265 6568826 6719815 6774917 6663824 6443584
15517 6443584 6315846 6447349 6562578 6568811 6504367 6574398 6683540 6574086 6610949 6666925
15507 6666925 6904853 6734239 6546574 6696699 6690863 6736249 6806569 6820416 6698315 6836813
15497 6836813 6750213 6774153 6808480 6715132 6709326 6614953 6740859 6931523 6729559 6605952 6571092
15486 6571092 6802475 6698356 6730270 6761961 6820961 6673671 6677244 6539491 6472984 6471918 6417299
15475 6417299 6367141 6536180 6704813 6702054 6676439 6714839 6655443 6625455 6930693 6894121 6764278
15464 6764278 6699421 6638116 6702841 6917095 6734113 6737653 6628714 6637199 6596503 6768675 6698908
15453 6698908 6641301 6657766 6585171 6665958 6757572 6743914 6828351 6731102 6579425 6675561 6682591
15442 6682591 6654429 6773112 6714430 6635905 6619959 6803050 6911585 6863417 6707162 6709242 6835055
15431 6835055 6752128 6787784 6780404 6759601 6772485 6714898 6786403 6762678 6807864 6849490 6763964
15420 6763964 6989139 7056309 6869089 6889051 6927027 6702781 6696013 6923318 6940704 6875833 6877688
15409 6877688 6951566 7040245 6981865 6849608 6740408 6773132 6696978 6660917 6721303 6752008 6884107
15398 6884107 6900820 6880410 6830424 6790368 6790405 6736076 6746548 6735726 6704660 6791553 7000254 6751646
15386 6751646 6846183 6784259 6715677 6772455 6764333 6787405 6808293 6786987 6968318 6859437 6702335
15375 6702335 6690748 6832618 6876979 6831712 6838043 6699646 6721726 6867318 6873909 6928421 6955894
15364 6955894 6699828 6781626 6904933 6907985 6857087 6730256 6542809 6716005 6752993 6627806
15354 6627806 6828942 6982206 6828869 6785222 6909308 6960906 7095292 7164492 7031202 6796144
15344 6796144 6732445 6719981 6877100 7024704 6996500 6818489 6837900 6924911 6822310 6750045
15334 6750045 6641789 6697759 6914401 6965012 7041348 7110856 6933950 6847189 6799684 6805991 6597900
15323 6597900 6780845 6864257 6729199 6945476 6975836 6817693 6655416 6701069 6830634 6854762
15313 6854762 6914319 6850271 6721751 6612775 6809488 6856128 7055238 7033500 6830947 6807061
15303 6807061 6935555 6847692 6760195 6853715 6989938 6939907 6913917 7083182 7178573 7142528 7077016
15292 7077016 7124816 7112735 6924660 6738951 6760558 6965744 6980896 6951581 7089314 7163911
15282 7163911 7161235 7073019 6940179 6729239 6915450 7051735 6839270 6738789 6714053 6699908
15272 6699908 6926394 7011189 7044358 6893609 6915554 7042823 6983854 6939394 6993683 7051142 7015172
15261 7015172 6738572 6880289 7016071 7045493 6989388 6989139 7015374 6977642 6972113 7021690 6887192
15250 6887192 6890063 7033406 7044817 7063031 6949209 7046808 7217376 7109617 7087610 7049418 6858391
15239 6858391 6747938 6911932 7135196 7052282 6925819 6785402 6676928 6679989 6994159 7047384
15229 7047384 6881381 6757867 6792064 6904541 7034905 7091024 7004886 7008803 7022962 7006256 6892763
15218 6892763 6796502 6804237 6726502 6811532 6732084 6790324 6825867 6791071 6967642 6887335 6822132
15207 6822132 6950675 6886428 6803836 6976089 7101386 6935948 6864758 6823324 6758503 6755649 6830167
15196 6830167 6962180 7033242 6964879 6960928 7033924 7033281 7058386 7128876 7135120 7098303 7051842 7102687
15184 7102687 7089376 6900809 6926876 6898163 6764124 6760622 6854449 6835601 6847038 6907425 6954139
15173 6954139 7036444 6930815 6990653 6866625 6865453 6955238 6938581 6837524 6792389 6918001 6971555
15162 6971555 7008132 7005229 7086328 7087182 7157185 7156242 7008844 6951706 6983937 6847020 6849275 7023955
15150 7023955 6991876 7040811 7139568 6999663 7033203 7002876 6930970 6885046 6849068 6965880 7017600
15139 7017600 7084549 7036111 7040763 7251141 7145902 7053700 6993924 7012005 7143219 7151247 6996792
15128 6996792 6991521 7098490 7111159 6912518 6980891 7088876 7113312 7138744 7094838 7073387 6922720
15117 6922720 7057631 7034909 7098056 7115165 7026957 7238234 7150696 7009577 6982646 7127089
15107 7127089 7171803 6999190 6923654 7058637 7173558 6998752 6832149 7034936 7176873 7108145
15097 7108145 7232146 7230315 7187040 7094794 7152126 7042342 6893364 6960329 6877900 6912600 7129808
15086 7129808 7342683 7382203 7277610 7303254 7328405 7281984 7187859 7167159 7145923 6985095 7121859
15075 7121859 7108892 7100102 6972847 7078495 7061192 7089517 7205848 7154510 7014710 6827702
15065 6827702 6992460 6958411 6967741 6931176 7097760 7217924 7070119 7109134 7276247 7240922
15055 7240922 7224916 7129331 7126837 7050839 7047490 7171792 7224329 7099943 6942339 6991399 6966223
15044 6966223 6930239 7084552 7128613 7122374 7157189 7112757 7174978 7213045 7193328 7248742 7201895
15033 7201895 7298880 7207181 7274807 7129158 7094759 7163725 7175950 6975337 7016704 7257200 7205003
15022 7205003 7117711 6908877 6831029 6973906 7044956 7023107 6994110 6881390 7067457 7086000
15012 7086000 7186874 6960203 7184746 7137571 6990510 7047482 7234631 7038944 6823983 6835343
15002 6835343 6910104 7032399 7068210 7089226 6881234 7016905 7149067 7074239 6949013 7078188
14992 7078188 7006160 6997912 6900924 6788828 6911603 7004113 7104833 7205826 7227082 7113646
14982 7113646 7114217 7070462 6993373 7201403 7056204 7123738 7196552 7123879 7085994 7009913 7140580
14971 7140580 6938656 7025090 7089628 7140194 7121035 7141885 7283011 7167082 7176080 7197483 7164270
14960 7164270 6991524 6967630 7065246 7279376 7246954 7076688 7105690 7175301 7297531 7205965
14950 7205965 7054025 7122195 7083970 7267792 7264510 7201837 7292859 7394038 7379914 7177522 7095297
14939 7095297 7061576 7034936 6901190 7063334 7017206 7113527 7175550 7264647 7320766 7186973 7142551
14928 7142551 7181341 7175339 7257087 7161954 7056886 7217355 7234637 7311461 7330281 7258526 7190044
14917 7190044 7415042 7396148 7377144 7423568 7281275 7210278 7183532 7265743 7329401 7354312 7366106
14906 7366106 7190569 7137674 7259426 7211848 7277056 7029765 6898627 6959664 7121879 7060310
14896 7060310 7081824 7046130 7182420 7348320 7263544 7348244 7080978 7061021 7043339 7050432 7156823
14885 7156823 7188160 7263933 7359409 7333882 7318085 7211943 7201442 7189960 7283526 7308501 7322435
14874 7322435 7364002 7237070 7230212 7304104 7414878 7436215 7392167 7319882 7332043 7357185 7375373
14863 7375373 7532220 7594521 7400437 7265210 7204410 7189477 7210241 7038396 7091724 7271168
14853 7271168 7187823 7156798 7304834 7238434 7139538 7085868 7100270 7124079 7116450 6982707 7233639
14842 7233639 7509880 7283105 7183819 7133823 7194999 7048660 7028864 7156355 7086569 7227902
14832 7227902 7305224 7395817 7373778 7403344 7258256 7126221 7202914 7174106 7188110 7192070 7270907
14821 7270907 7261648 7253317 7204798 7278842 7289278 7183869 7173590 7246971 7329775 7293899 7232242
14810 7232242 7241447 7205620 7233776 7291388 7217674 7148377 7376596 7439082 7293973 7220430 7212023
14799 7212023 7074819 7143810 7278171 7281897 7343834 7315597 7427380 7328095 7267461 7423975 7449272
14788 7449272 7266800 7337653 7352052 7374248 7460378 7228779 7171373 7228955 7271232 7190362 7193408
14777 7193408 7307921 7288004 7421233 7424218 7379082 7337436 7218538 7258661 7267341 7455023 7515877
14766 7515877 7345253 7388335 7331237 7284991 7282170 7149610 7085509 7105795 7458783 7496436 7510780
14755 7510780 7221081 7051868 7323667 7242985 7255341 7279985 7326934 7306991 7220968 7128927 7242583
14744 7242583 7462220 7436893 7498677 7297297 7216249 7246930 7146990 7211782 7350247 7284161 7082600
14733 7082600 7138636 7227708 7174711 7162451 7260778 7205918 6978231 7040957 7350816 7348063 7268696
14722 7268696 7158584 7294698 7248628 7181389 7260013 7337594 7282009 7519348 7651953 7548965
14712 7548965 7535679 7344319 7133292 7240587 7359826 7245275 7442898 7280214 7360495 7705492
14702 7705492 7570677 7458630 7386855 7270747 7350539 7323267 7452073 7494387 7341209 7293808
14692 7293808 7304574 7446393 7532909 7426467 7331402 7316643 7361954 7324682 7330590 7269157 7518954
14681 7518954 7251033 7086482 7347485 7288197 7418043 7288056 7483451 7473913 7238904 7333516
14671 7333516 7611712 7637518 7450132 7528951 7355945 7174932 7365157 7454831 7462056 7518334
14661 7518334 7534741 7505374 7588590 7537867 7591936 7589169 7620119 7582860 7657751 7515023 7437351
14650 7437351 7379383 7192627 7385528 7504603 7579962 7569260 7526981 7392705 7189320 7411538
14640 7411538 7526696 7321940 7236916 7497216 7575666 7435989 7367546 7514838 7505158 7318054
14630 7318054 7492971 7516031 7615980 7570413 7552051 7558852 7566039 7711972 7700611 7577630 7663862
14619 7663862 7580871 7417826 7614712 7748407 7644014 7624606 7619636 7563214 7724544 7719488 7662519
14608 7662519 7681860 7573807 7388972 7404711 7611988 7528462 7448535 7561845 7578731 7561437
14598 7561437 7570382 7418986 7341695 7107486 7195994 7244759 7440922 7431304 7376148 7585332 7453396
14587 7453396 7538536 7461150 7514010 7536754 7586552 7679759 7524145 7646402 7609698 7576156 7574056
14576 7574056 7497411 7340881 7272937 7298319 7350258 7368823 7446407 7484542 7583866 7553154 7484646
14565 7484646 7542792 7689889 7650644 7574532 7688109 7542720 7403388 7479860 7467797 7620055
$$ [...]
##END NTUPLES=NMR SPECTRUM
##END=
