##TITLE=1H_CA-8844-1
 CDCl3, 8 sc, 
 9.04.2021
##JCAMPDX= 6.0         $$ Bruker NMR JCAMP-DX V2.0
##DATA TYPE= NMR SPECTRUM
##DATA CLASS= NTUPLES
##ORIGIN= UXNMR, Bruker Analytische Messtechnik GmbH
##OWNER= root
$$ XWIN-NMR		Version 3.5
$$ Fri Apr  9 11:10:31 2021 Russian Standard Time (UT+4h)  she@DPX200
##.OBSERVE FREQUENCY= 200.131506
##.OBSERVE NUCLEUS= ^1H
##.ACQUISITION MODE= SIMULTANEOUS
##.ACQUISITION SCHEME= undefined
##.AVERAGES= 8
##.DIGITISER RES= 18
##SPECTROMETER/DATA SYSTEM= spect
##.PULSE SEQUENCE= zg30
##.SOLVENT NAME= CDCl3
##.SHIFT REFERENCE= (INTERNAL, CDCl3, 0, 15.9958)
##AUDIT TRAIL= $$ (NUMBER, WHEN, WHO, WHERE, WHAT)
$$ ##TITLE= Audit trail, XWIN-NMR		Version 3.5
$$ ##JCAMPDX= 5.01
$$ ##ORIGIN= Bruker BioSpin GmbH
$$ ##OWNER= she
$$ F:/spectra/data/she/nmr/H-F/1/pdata/1/auditp.txt
$$ ##AUDIT TRAIL=  $$ (NUMBER, WHEN, WHO, WHERE, WHAT)
(   1,<2021-04-09 11:09:20.95 +0400>,<she>,<DPX200>,
      <created by zg, POWCHK disabled, PULCHK disabled
       configuration hash MD5:
       00 E9 B6 7A A2 85 ED C7 34 08 36 98 17 FE 4E 26
       data hash MD5: 16K
       82 85 75 8F 1E FA 7B 40 A9 FE 1D 48 33 11 FA 56>)
(   2,<2021-04-09 11:09:23.25 +0400>,<she>,<DPX200>,
      <Start of raw data processing
       efp BC_mod = 2 LB = 0.24 FT_mod = 6 PKNL = 1 PHC0 = -11119.46 PHC1 = 11.00092 SI = 16K 
       data hash MD5: 16K
       E1 FA 87 6D 53 F9 25 D9 56 69 68 F7 95 85 EB BA>)
(   3,<2021-04-09 11:09:44.06 +0400>,<she>,<DPX200>,
      <pk PHC0 = -4.572664 PHC1 = 5.6 
       data hash MD5: 16K
       07 7B 2C E9 45 DC 76 E0 B1 CD 21 E2 FF 65 CC F7>)
(   4,<2021-04-09 11:09:47.25 +0400>,<she>,<DPX200>,
      <abs ABSG = 5 
       data hash MD5: 16K
       20 35 0A A2 BC AF 40 3A 0E AA 92 B2 E0 96 19 6B>)
$$ ##END=
$$ 
$$ hash MD5
$$ 0A 00 5C 6C C6 17 AE 9F E1 E7 2D CE 13 FC EA 5E
##$RELAX= 
##$RELAX= 
##$RELAX= 
##$RELAX= 
##$RELAX= 
##$RELAX= 
$$ Bruker specific parameters
$$ --------------------------
##$DU= <F:/spectra>
##$EXPNO= 1
##$NAME= <H-F>
##$PROCNO= 1
##$TYPE= <nmr>
##$USER= <she>
##$AMP= (0..31)
100 100 100 100 100 100 100 100 100 100 100 100 100 100 100 100 100 100 
100 100 100 100 100 100 100 100 100 100 100 100 100 100 
##$AQSEQ= 0
##$AQ_mod= 1
##$AUNM= <au_zg>
##$AUTOPOS= <>
##$BF1= 200.13
##$BF2= 200.13
##$BF3= 200.13
##$BF4= 200.13
##$BF5= 200.13
##$BF6= 200.13
##$BF7= 200.13
##$BF8= 200.13
##$BYTORDA= 1
##$CFDGTYP= 0
##$CFRGTYP= 5
##$CHEMSTR= <none>
##$CNST= (0..31)
1 1 145 1 1 1 1 1 1 1 1 1 1 1 1 1 1 1 1 1 1 1 1 1 1 1 1 1 1 1 1 1 
##$CPDPRG= <>
##$CPDPRG1= <>
##$CPDPRG2= <>
##$CPDPRG3= <>
##$CPDPRG4= <mlev>
##$CPDPRG5= <mlev>
##$CPDPRG6= <mlev>
##$CPDPRG7= <mlev>
##$CPDPRG8= <mlev>
##$CPDPRGB= <>
##$CPDPRGT= <>
##$D= (0..31)
0 1.2 0 0 0 0 0 0 0 0.06 0 0.03 0 0 0 0 0.0002 0 0 0 0 0 0 0 0 0 0 0 0 
0 0 0 
##$DATE= 1617952160
##$DBL= (0..7)
120 120 120 120 120 120 120 120 
##$DBP= (0..7)
150 150 150 150 150 150 150 150 
##$DBP07= 0
##$DBPNAM0= <>
##$DBPNAM1= <>
##$DBPNAM2= <>
##$DBPNAM3= <>
##$DBPNAM4= <>
$$ [...]
##$SUBNAM3= <"">
##$SUBNAM4= <"">
##$SUBNAM5= <"">
##$SUBNAM6= <"">
##$SUBNAM7= <"">
##$SUBNAM8= <"">
##$SUBNAM9= <"">
##$SW= 16.9725357007746
##$SWIBOX= (0..15)
0 0 2 0 0 0 0 0 0 0 0 0 0 0 0 0 
##$SW_h= 3396.73913043478
##$TD= 16384
##$TD0= 1
##$TE= 0
##$TE2= 300
##$TE3= 300
##$TEG= 300
##$TL= (0..7)
0 120 120 120 120 120 120 120 
##$TP= (0..7)
150 150 150 150 150 150 150 150 
##$TP07= 0
##$TPNAME0= <>
##$TPNAME1= <>
##$TPNAME2= <>
##$TPNAME3= <>
##$TPNAME4= <>
##$TPNAME5= <>
##$TPNAME6= <>
##$TPNAME7= <>
##$TPOAL= (0..7)
0.5 0.5 0.5 0.5 0.5 0.5 0.5 0.5 
##$TPOFFS= (0..7)
0 0 0 0 0 0 0 0 
##$TUNHIN= 0
##$TUNHOUT= 0
##$TUNXOUT= 0
##$USERA1= <user>
##$USERA2= <user>
##$USERA3= <user>
##$USERA4= <user>
##$USERA5= <user>
##$V9= 5
##$VALIST= <valist>
##$VCLIST= <CCCCCCCCCCCCCCC>
##$VD= 0
##$VDLIST= <DDDDDDDDDDDDDDD>
##$VPLIST= <PPPPPPPPPPPPPPP>
##$VTLIST= <TTTTTTTTTTTTTTT>
##$WBST= 1024
##$WBSW= 4
##$XGAIN= (0..3)
0 0 0 0 
##$XL= 0
##$YL= 0
##$YMAX_a= 429352
##$YMIN_a= -459048
##$ZGOPTNS= <>
##$ZL1= 120
##$ZL2= 120
##$ZL3= 120
##$ZL4= 120
##$ABSF1= 15.97403
##$ABSF2= -0.9986324
##$ABSG= 5
##$ABSL= 3
##$ALPHA= 0
##$AQORDER= 0
##$ASSFAC= 0
##$ASSFACI= 0
##$ASSFACX= 0
##$ASSWID= 0
##$AUNMP= <proc_1d>
##$AZFE= 0.1
##$AZFW= 0.1
##$BCFW= 0
##$BC_mod= 2
##$BYTORDP= 0
##$COROFFS= 0
##$CY= -3
##$DATMOD= 1
##$DC= 0
##$DFILT= <>
##$DTYPP= 0
##$F1P= 0
##$F2P= 0
##$FCOR= 1
##$FTSIZE= 16384
##$FT_mod= 6
##$GAMMA= 0
##$GB= 0
##$INTBC= 1
##$INTSCL= 3.559346e-10
##$ISEN= 128
##$LB= 0.24
##$LEV0= 0
##$LPBIN= 0
##$MAXI= 10000
##$MC2= 0
##$MEAN= 0
##$ME_mod= 0
##$MI= 1.114404
##$NCOEF= 0
##$NC_proc= -6
##$NLEV= 6
##$NOISF1= 3.799351
##$NOISF2= 2.8
##$NSP= 0
##$NTH_PI= 0
##$NZP= 0
##$OFFSET= 15.99578
##$PC= 1
##$PHC0= -11124.03
##$PHC1= 16.60092
##$PH_mod= 1
##$PKNL= yes
##$PPARMOD= 0
##$PSCAL= 0
##$PSIGN= 0
##$REVERSE= no
##$SF= 200.130003134333
##$SI= 16384
##$SIGF1= 3
##$SIGF2= 2
##$SINO= 5.538805
##$SIOLD= 16384
##$SREGLST= <1H.CDCl3>
##$SSB= 0
##$STSI= 16384
##$STSR= 0
##$SW_p= 3396.73913043479
##$SYMM= 0
##$S_DEV= 0
##$TDeff= 16384
##$TDoff= 0
##$TI= <>
##$TILT= no
##$TM1= 0
##$TM2= 0
##$TOPLEV= 0
##$USERP1= <user>
##$USERP2= <user>
##$USERP3= <user>
##$USERP4= <user>
##$USERP5= <user>
##$WDW= 1
##$XDIM= 16384
##$YMAX_p= 301096497
##$YMIN_p= -268040
$$ End of Bruker specific parameters
$$ ---------------------------------
##NTUPLES= NMR SPECTRUM
##VAR_NAME=  FREQUENCY,     SPECTRUM/REAL,   SPECTRUM/IMAG
##SYMBOL=    X,             R,               I
##VAR_TYPE=  INDEPENDENT,   DEPENDENT,       DEPENDENT
##VAR_FORM=  AFFN,          ASDF,            ASDF
##VAR_DIM=   16384,         16384,           16384
##UNITS=     HZ,            ARBITRARY UNITS, ARBITRARY UNITS
##FACTOR=    0.207333158178282, 1,           1
##FIRST=     3201.23549976493, 0,            0
##LAST=      -195.503630669858, 0,           0
##MIN=       -195.503630669858, -268040,     0
##MAX=       3201.23549976493, 301096497,    0
$$ Real data points
##PAGE= N=1
##DATA TABLE= (X++(R..R)), XYDATA
$$ [...]
6540 69197 -17243 -56438 -54080 62567 57457 91759 142699 77072 52882 -59079 2753 82210
6528 82210 29722 3371 54532 -29488 26354 16720 -102106 -117813 -60884 64930 79409 -23469
6516 -23469 38568 32 48896 -2658 12936 53488 48956 -4109 9603 46778 86545 172663
6504 172663 108779 28218 35428 27982 -6714 -21856 -21343 -28866 15336 107769 11891 -50735 -68954
6491 -68954 -13830 70472 26600 -29419 -47523 144720 202473 95032 86440 -57521 -88639
6480 -88639 -55057 -76459 -58617 52363 141098 101349 30182 -34003 24369 114669 13693
6469 13693 -55670 -24155 59266 59537 91476 39405 -12159 37699 -40896 -40119 -40876 82562 80907
6456 80907 106891 164779 66272 112298 136982 74289 48341 8020 36771 108434 -6837 -78304
6444 -78304 62371 89490 38394 5085 -66213 -34541 84204 55349 -51456 73569 36882
6433 36882 102127 154833 96853 -23543 -23530 22883 -82050 -17823 35672 15588 69154 -5421
6421 -5421 -101975 14388 17908 -15915 -5210 -45497 -63295 -38587 -38828 -100570 -117885 51737
6409 51737 126720 -28200 -7874 23110 11838 23491 28916 -7915 -63286 -43040 12261 12540
6397 12540 -38010 35357 116486 156559 160555 65346 114762 166869 180259 76119 42915 254634
6385 254634 174381 119254 87911 186457 167363 148117 263476 220736 83210 121721 98204
6374 98204 116838 179670 124489 178059 167677 263227 236833 175226 316555 340809 309247 265708
6362 265708 238957 356661 313469 230589 311992 229285 184494 198741 124552 115618 110817 -12410
6350 -12410 91662 189292 152088 331389 243757 121329 139642 177415 98980 105574 116704
6339 116704 56838 27738 77839 67132 120689 56356 -8181 49748 78949 3067 67194 75939
6327 75939 109154 98710 54178 70222 124315 128533 -1937 42047 97272 43284 62306 107462
6315 107462 101143 182817 158370 148191 141063 99734 100097 41939 13644 99194 65349 132678
6303 132678 90426 91286 110676 155669 158489 83426 77605 160592 84213 54964 86423 143107
6291 143107 160602 220645 232857 139589 63591 144444 195142 256375 276307 284652 184706 169643
6279 169643 144110 54503 106587 109007 136026 55600 115645 104214 126790 106225 51672 65815
6267 65815 79243 106540 223038 212755 206112 193348 203154 127890 40308 64422 33582 155003
6255 155003 177961 91360 128166 204999 223102 184080 65430 81968 185176 57167 62219
6244 62219 77624 93274 242336 271961 290380 278220 323489 360535 293755 221888 351698
6233 351698 401412 296915 328169 326416 210898 122884 304113 308946 286531 375003 364580
6222 364580 311265 357719 307499 328227 282871 248360 220844 251889 244002 282899 330050 278391
6210 278391 311467 387543 331921 272457 282404 207734 253273 283273 282597 208688 267940 278782
6198 278782 236298 263882 222524 200672 286222 362127 358901 304666 238732 270211 332862 305199
6186 305199 246574 205524 293832 284289 315109 281779 314551 314687 259251 291078 271805 302698
6174 302698 326571 320529 308865 276779 196564 240011 310779 355613 393142 406750 388460 349327
6162 349327 345721 426279 430084 458375 608452 539285 499257 474523 523807 532680 492873 526315
6150 526315 556852 599476 566708 627198 684320 649594 774626 808969 834007 810234 803557 849356
6138 849356 912836 947451 930927 979865 970164 939984 871819 862525 934969 865668 836758 840528
6126 840528 748839 700096 753318 671304 565857 629307 733493 675802 642544 623605 602944
6115 602944 585306 565110 584559 596053 627476 703367 669640 568855 610692 594904 401792
6104 401792 496867 531576 461065 579389 527672 450038 438780 522240 478694 482561 409843 290024
6092 290024 345645 470397 467990 473673 485234 403871 439084 451856 377747 451738 405881 396497
6080 396497 502610 606005 504129 465662 516899 523575 528759 546548 534864 574947 491290
6069 491290 547201 499311 462178 458326 518781 564562 423522 483678 560569 498275 502187 488169
6057 488169 456603 442550 483866 446389 476695 588107 545542 593720 632084 637418 606572 555332
6045 555332 534196 549497 600349 560942 485215 573102 454272 538499 567059 582931 686221
6034 686221 777550 753466 574717 547031 576683 597377 671189 716472 674041 631816 586794
6023 586794 584416 600018 706228 765725 751547 609005 606467 712924 733056 754922 741540
6012 741540 672412 745632 765868 756677 763516 767099 749447 820964 806568 806644 831895 744343 702354
5999 702354 745903 776211 703920 738630 693299 813187 870344 933683 948205 960198 907588
5988 907588 823186 843368 939683 980102 961319 958929 963042 981157 1055554 1106996 1087862 1019962
5976 1019962 1031452 1104120 1175152 1163417 1200995 1233208 1266297 1199549 1253573 1258904 1170927 1157478
5964 1157478 1088300 1213256 1339172 1355508 1326454 1387838 1586011 1533508 1557131 1626111 1574589
5953 1574589 1617115 1681739 1830861 1826254 1887830 1872236 1923891 1953913 1892781 2000982 1996558
5942 1996558 1997703 2084098 2160063 2192144 2176754 2260395 2301331 2252500 2293249 2353757 2421481 2507958
5930 2507958 2620970 2650976 2580369 2688693 2779651 2945416 3084184 3158497 3147268 3207460 3343909
5919 3343909 3331953 3439661 3498399 3659683 3748698 3850647 3949314 3947523 4073602 4206691 4361816
5908 4361816 4464998 4468805 4677890 4694383 4861199 5034507 5027057 5251365 5474878 5689838
5898 5689838 5934254 6155512 6269981 6448520 6737165 7046753 7332154 7535900 7867062 8293240
5888 8293240 8582704 8859035 9007315 9422277 9844078 10264683 10807188 11358004 11977244 12454918
5878 12454918 12997896 13576687 14285557 15025739 15696029 16540087 17477900 18318034 18957812
5869 18957812 19788785 20630122 21498792 22210394 22782031 23447625 23911820 24172556 24386959
5860 24386959 24294456 24050849 23736077 23319654 22718244 21881173 21073758 20191827 19299645 18473784
5850 18473784 17522606 16601042 15813727 15063736 14261147 13526943 12798357 12247690 11571896
5841 11571896 11027355 10555804 10114512 9703438 9194642 8811856 8414115 8047541 7810169
5832 7810169 7457043 7149303 6873438 6628296 6452575 6136581 5909997 5726254 5620750 5325155
5822 5325155 5137885 4892489 4726451 4679685 4533664 4454982 4370637 4243019 4080400 3973331
5812 3973331 3822196 3639276 3655890 3592164 3512980 3445188 3348700 3376183 3221625 3147045 3021914
5801 3021914 2895173 2921349 2849929 2783973 2608097 2611408 2577242 2487384 2512542 2335924 2271256
5790 2271256 2280695 2294033 2250671 2147238 2150597 2122176 2076495 1928560 1811606 1811479 1809205 1895665
5778 1895665 1982440 1893453 1810914 1723111 1623145 1641399 1776987 1679440 1574298 1509716 1414139
5767 1414139 1506861 1557574 1468367 1447990 1486806 1470101 1468738 1459531 1266789 1313080 1274599 1243164
5755 1243164 1126609 1182537 1265429 1252254 1373986 1305220 1306265 1195164 1185530 1233137 1193787
5744 1193787 1200272 1212829 1253477 1238131 1295243 1270975 1156252 1162742 1073764 1014141 1081184 970080
5732 970080 1016788 1039154 1028337 1023690 975632 971571 1087110 1029939 968612 1103787 1051583 1105224
5720 1105224 1159311 1138764 1209838 1214731 1254124 1269129 1256343 1200664 1061456 1131744 1111338
5709 1111338 1051511 1026956 921863 869449 857198 808704 829603 811473 810646 775003 846270 923102
5697 923102 1084440 1056378 941677 951861 928540 969525 1015424 1032609 1085076 1138932 1066496
5686 1066496 941402 897541 874227 917061 864913 950747 1025211 987627 897988 837032 846318
5675 846318 867332 712457 758029 804515 794271 831811 849311 870316 971284 945203 903865
5664 903865 1028789 966730 1057608 1071452 1003436 1036746 1062609 1071471 1035728 1013198 1058399 1049493
5652 1049493 1060977 1080190 993530 987455 992978 994755 990051 935027 850534 853739 868302 906724
5640 906724 877174 739520 731909 671609 865845 808001 672539 620080 530852 552807 462928
5629 462928 516367 622169 630869 617128 567951 663080 703699 633889 655569 721465 576956
5618 576956 583000 631946 513964 567944 612447 587122 654797 556916 553192 564299 670184 688545
5606 688545 659448 707449 659211 710761 618102 524157 648606 591701 653869 717284 705728
5595 705728 770758 697995 702895 767809 804703 865389 905585 754837 663445 799130 829428
5584 829428 846542 882396 891434 831648 858479 969892 811799 840910 819201 798386 723687
5573 723687 754989 726190 683830 696024 704200 765876 752746 739170 836950 685154 687899 772929
5561 772929 846765 874102 873340 808792 769738 879780 912679 921707 963153 879500 833350 832251
5549 832251 768911 838184 869315 920291 877511 873436 799560 785560 839282 858992 855806 853672
5537 853672 929288 989378 900949 882276 951910 962775 988144 1069166 983546 867819 928009
5526 928009 1015824 875361 935736 987239 1042042 1051368 947252 934762 984543 1041744 1084003
5515 1084003 1041842 1004526 1027222 1039175 1037876 1063032 1021301 929806 907605 1007301 936014 876138
5503 876138 908385 888263 876730 893080 954814 1002982 1116857 1138182 1077108 950042 982271
5492 982271 1022206 942244 995154 1067463 1122681 1194304 1204970 1268272 1154449 1140811 1166838
5481 1166838 1201542 1229835 1241816 1356925 1316784 1273113 1232162 1232760 1228041 1297640 1445141 1314717
5469 1314717 1279144 1368043 1286330 1214279 1312098 1332347 1335694 1417390 1415616 1440004 1383077 1456211
5457 1456211 1563856 1518374 1532335 1650672 1583754 1489896 1569306 1586060 1504200 1595919 1637030
5446 1637030 1613751 1765757 1871288 1886808 1897579 1983240 2022920 1985865 2073241 2135100 2149421
5435 2149421 2159743 2159521 2314840 2329479 2348729 2398062 2330064 2342383 2267812 2195148 2215657 2212687
5423 2212687 2168974 2225899 2376205 2419177 2527604 2545961 2604218 2693874 2742994 2793731 2844099
5412 2844099 2830033 2885973 2921938 2919667 2993806 3104490 3204307 3323163 3360158 3436285 3619254
5401 3619254 3684544 3751941 3786838 3896050 4011628 3977316 4014485 4088348 4249197 4369832 4432827
5390 4432827 4545206 4615709 4642618 4696902 4782753 4800534 4821100 4815698 4896637 4821971 4921329
5379 4921329 5075576 5088768 5219632 5232392 5366697 5445778 5559242 5727081 5760674 5967684
5369 5967684 6206742 6383628 6475626 6585674 6783682 6839368 7041688 7178500 7349349 7448189
5359 7448189 7533645 7830458 8071872 8223722 8604109 9003379 9333614 9628497 10068288 10578325
5349 10578325 11034462 11553111 12130010 12711209 13327776 13815303 14333893 15041712 15796349
5340 15796349 16677750 17477199 18413624 19414659 20666172 22092278 23683316 25503568 27525928
5331 27525928 29692766 32321752 35058932 38208042 41792286 46011325 50908322 56652864
5323 56652864 63389379 70854028 78942897 87286634 94929847 100155342 101594612 98652844
5315 98652844 91370819 81288325 70843369 61407880 53493113 47082073 41872718 37738181
5307 37738181 34386422 31511477 28973558 26803488 24785463 23009363 21468968 19957553
5299 19957553 18617531 17407676 16289330 15220120 14389606 13611617 12821183 12271729 11742984
5290 11742984 11252730 10867782 10413144 9943963 9613667 9374497 8943836 8553840 8265353
5281 8265353 7947276 7669414 7475962 7172582 6864988 6630332 6411036 6189972 5839292 5604973
5271 5604973 5348619 5139668 5008544 4892129 4889587 4754157 4644204 4540900 4408754 4202139
5261 4202139 4196000 4051238 3913672 3840770 3748868 3701635 3677242 3532205 3484227 3445707 3352128
5250 3352128 3269708 3171243 3132679 3052205 2985638 2892301 2872219 2903881 2837899 2831402 2800618 2725627
5238 2725627 2651652 2659815 2646184 2593513 2563765 2482286 2451844 2409944 2414956 2269900 2174465 2140650
5226 2140650 2089780 2149125 2110967 2040644 2074189 2002925 1924959 1856755 1834782 1738898 1797045
5215 1797045 1863000 1773528 1709650 1738200 1686092 1739972 1673603 1563439 1607102 1629490 1632793
5204 1632793 1568652 1545358 1520821 1427444 1354948 1356946 1357310 1266253 1174032 1205380 1141717 1140667
5192 1140667 1167242 1182029 1177590 1159879 1182862 1088498 1171123 1161789 1131520 1194602 1033969 1085802
5180 1085802 1147417 1038861 958542 894531 850239 843395 1037046 996296 1005862 1072114 1061379
5169 1061379 920479 800925 853229 894246 970062 890104 942381 984002 881617 909137 937706
5158 937706 936468 863145 901764 893134 825854 896902 815387 808656 762677 800162 822108 817944
5146 817944 848116 801304 788419 763930 784237 915499 828087 823427 836098 775424 761094 831920
5134 831920 897435 869649 820581 760882 758772 762100 668651 730003 699920 654633 644446 565616
5122 565616 591004 640203 709285 627099 630444 602827 592832 659014 587103 577806 495531 500182
5110 500182 641282 737301 729178 668493 648629 711463 666025 730100 732071 739482 689356 645043
5098 645043 660070 627963 586742 627638 687671 691001 670580 630996 684943 666213 692794 613325
5086 613325 551329 630550 658791 603402 641839 626021 715686 720051 671501 614487 563595 640155
5074 640155 611932 673281 652304 573410 584232 527039 628787 629111 650882 646845 610391 690037
5062 690037 712740 691821 765666 724793 699085 622726 660050 745110 720551 596799 554866
5051 554866 601086 654022 733487 739922 731502 760252 797338 713999 736007 777560 773179 797552
5039 797552 809133 777682 690439 705758 723614 801932 790726 690861 647633 681362 685459 723980
5027 723980 703777 754919 791478 749160 703593 658761 770902 799468 745785 809131 877747
5016 877747 884660 866750 958854 929813 893071 906827 838904 798279 748291 812149 868481 971503
5004 971503 898600 964193 946353 887793 1013845 1032878 1002575 958013 942945 987244 1118088
4993 1118088 1090228 1040659 1139189 1235190 1228113 1253623 1238003 1221905 1252482 1304982 1327061 1279127
4981 1279127 1283616 1422769 1680909 1566580 1480364 1551458 1410779 1410302 1379629 1383524 1331783
4970 1331783 1408567 1443798 1371288 1385332 1325360 1432062 1418031 1348569 1374460 1487124 1290351
4959 1290351 1219430 1338510 1386774 1452208 1525756 1468413 1487381 1335553 1462917 1559989 1622545
4948 1622545 1592014 1705353 1829790 1753274 1903847 1937954 1964848 2063491 2051385 2134785 2170781
4937 2170781 2189850 2161672 2251856 2298588 2051059 2045580 2008583 2002865 2046967 2035829 2037475 2093327
4925 2093327 2011108 1957663 2012639 1977169 2057071 2052207 1975405 2032171 1936834 1995636 2066125 2089947
4913 2089947 2183152 2202600 2231866 2275111 2419633 2561484 2735132 2853063 2847299 2907242 2872699
4902 2872699 2789365 2710407 2615384 2457207 2305937 2252134 2210500 2302900 2384552 2199064 2179266
4891 2179266 2106219 2074144 2119991 2012651 1976316 2036380 2026250 1974679 2001022 2014386 1928852
4880 1928852 1922988 1926070 1962311 1877877 1897585 1920635 1937156 1992181 1984256 1960885 1854117 1851292
4868 1851292 1921683 1741077 1687147 1734707 1708643 1697953 1708356 1620555 1575694 1593926 1543724
4857 1543724 1593562 1655251 1715351 1604088 1517078 1610740 1686900 1727621 1699773 1793674 1786717
4846 1786717 1647380 1689590 1714943 1665474 1712332 1785951 1864573 1998775 1965803 1948984 1982100
4835 1982100 1941473 1949232 2047753 2058388 2084282 2116062 2100824 2122626 2270666 2217653 2285139
4824 2285139 2297464 2247001 2321902 2295764 2207414 2226029 2323332 2313279 2300891 2313026 2209344
4813 2209344 2241324 2324265 2284059 2314871 2202217 2223522 2268124 2256478 2215865 2216541 2281399 2262232
4801 2262232 2335658 2361452 2380886 2421164 2390100 2461001 2393916 2535291 2482901 2405277 2539733
4790 2539733 2526140 2546009 2601429 2600961 2619057 2626288 2746250 2680173 2732664 2814234 2683526 2870228
4778 2870228 2891727 2901868 2890703 2918222 2826740 2940880 2972685 3011212 3014604 2909787 2990690
4767 2990690 3013272 3021725 2957414 3013004 3034770 3073911 3170222 3179308 3282989 3279515 3321419 3337862
4755 3337862 3283307 3426064 3447830 3538837 3621746 3611138 3677678 3776649 3768485 3830950 3940136
4744 3940136 3940965 3995956 4139397 4127328 4157881 4203023 4237300 4280226 4324537 4452601 4510986
4733 4510986 4604408 4632548 4642900 4691315 4727201 4818116 4846490 4793621 4947485 5135085 5211935
4722 5211935 5245422 5450198 5501774 5607842 5559906 5540479 5748236 5966890 6072943 6159007
4712 6159007 6249869 6347704 6636606 6885447 7074020 7202513 7457344 7781073 8096400 8328740
4702 8328740 8779714 9307678 9853926 10259571 10783754 11169061 11287513 11184750 10841489 10389032
4692 10389032 9895826 9665161 9395707 9251687 9242914 9109252 9114414 9288849 9367456 9502271
4682 9502271 9563890 9739787 9849492 10038813 10254394 10442299 10772407 10994047 11308055 11488795
4672 11488795 11716389 11947618 12068517 12074627 12011169 12023670 12066168 12096819 12213704 12467180
4662 12467180 12642621 12789019 12995508 13207509 13408944 13694108 13893734 14189816 14535816
4653 14535816 14873759 15288760 15783848 16257815 16704630 17095467 17303749 17554788 17815504
4644 17815504 18080541 18422187 18740973 19079492 19383616 19825178 20257030 20580725 20914576
4635 20914576 21286140 21735420 22147582 22670581 23155294 23607394 24140445 24571917 25127057
4626 25127057 25749684 26430233 27309956 28192334 29155292 30147686 31404790 32721306 34125625
4617 34125625 35362601 36457584 37743438 38881040 39952230 41180621 42424971 43760403
4609 43760403 45280298 46978732 48622610 50314254 52103196 53939439 55975578 58275674
4601 58275674 60861778 63808248 67078867 70846991 75147191 79716863 84550983 89703422
4593 89703422 95234921 101667088 109358803 117823024 125230308 130977598 134346490 134541472
4585 134541472 133238965 131809622 130630879 129267536 128275064 128281981 129586228 132206587 135435215
4576 135435215 139018572 142466667 145411951 148513808 152294495 156940417 161656637 166411152
4568 166411152 171120445 175194723 178926539 183181968 188856008 196140262 205139296 215120159
4560 215120159 225503916 236768235 248136941 256515264 260204115 258179381 248640729 234587854
4552 234587854 221155784 209906300 200396219 192095423 185429761 180259053 176268779 172825701
4544 172825701 169408898 165323609 160487416 155663543 151634317 148472183 145813898 143518603
4536 143518603 141396736 139203126 136970422 135259553 134644150 135512326 137559771 139972162
4528 139972162 142064292 143840962 145017858 144671690 142708798 139057538 132634802 124662189
4520 124662189 117554165 112593651 109470056 107762333 106680821 105966160 105494245 105319855
4512 105319855 105585094 106292405 107319111 108505669 109599440 110539683 111385901 111867195 111755202
4503 111755202 110679495 108374534 105132654 101328870 97098548 92901991 88588941 84252582
4495 84252582 80062673 75808380 71331764 66886027 62774417 58978112 55682211 52668386
4487 52668386 49833761 47330560 45067828 43040525 41144981 39554015 38066987 36592742
4479 36592742 35471928 34230013 33054099 31877078 30861716 29960463 29105304 28302909 27526528
4470 27526528 26992107 26492327 26002957 25529875 25078238 24687990 24336435 23870115 23411017
4461 23411017 22922156 22434509 22058578 21752656 21470448 21478561 21483822 21501780 21585994 21538432 21537939
4450 21537939 21377506 21049163 20570109 20057666 19697279 19308194 19136203 18958846 18926444 18876523
4440 18876523 18861546 18882247 19011414 19013601 18935559 19004794 18974737 18969426 19096643 19225187 19315804
4429 19315804 19589006 20002335 20412131 20989190 21576263 21983847 22207564 22055637 21522113
4420 21522113 20613138 19440265 18531232 17819159 17216555 16625163 16303442 16128064 15689508
4411 15689508 15398625 15154524 14879141 14503449 14252831 13861057 13533887 13245899 13024621
4402 13024621 12751769 12607175 12519437 12532760 12477214 12475040 12378445 12315556 12089100 11600642 11006169
4391 11006169 10278532 9827664 9252544 8852966 8575540 8311360 8045542 7769761 7560478
4382 7560478 7426644 7296631 7261769 7204802 7122099 7012960 6981634 6775184 6653977 6542150
4372 6542150 6265496 6136799 5964143 5844399 5768786 5549195 5390621 5280160 5177631 5086844
4362 5086844 5014049 4917236 4820529 4858518 4803475 4625511 4590377 4700353 4687979 4738816 4706713
4351 4706713 4579512 4648653 4614284 4485893 4405044 4377880 4355506 4339977 4195726 4103476 4004810
4340 4004810 3903211 3813478 3767237 3578383 3484737 3554030 3523755 3493566 3527916 3535776 3486100
4329 3486100 3541270 3508899 3423584 3365411 3487264 3467952 3515530 3579174 3646418 3800616 3928747
4318 3928747 4028342 4100278 4116604 4052820 3925678 3718489 3512738 3330264 3223421 3130934
4308 3130934 3141629 3096194 3054908 3009631 2983361 2884743 2841733 2870242 2802640 2764977 2832984
4297 2832984 2744580 2751061 2856516 2830482 2847844 2743158 2778547 2909523 2969709 3060180 3153847
4286 3153847 3182490 3358874 3508069 3656696 3663215 3458671 3379653 3211183 3029758 2962192
4276 2962192 2818068 2600876 2542702 2528636 2431837 2560851 2525891 2516249 2486731 2308275 2279796
4265 2279796 2389779 2420742 2376264 2338328 2376986 2389591 2420257 2404925 2368980 2354299 2373182
4254 2373182 2424489 2431573 2550145 2541438 2635281 2764428 2726774 2622452 2529150 2518335 2477210
4243 2477210 2510763 2472834 2395168 2495305 2543812 2574637 2604510 2608931 2581046 2576389 2583692 2574043
4231 2574043 2564697 2404796 2349456 2522395 2526118 2534304 2582718 2585803 2565175 2465907 2450415 2511086
4219 2511086 2521522 2527411 2650961 2644930 2647046 2659170 2695385 2787827 2797025 2780635 2865189 2897839
4207 2897839 2996848 3157081 3189648 3252870 3258744 3204777 3145583 3184624 3055962 2874879 2785776
4196 2785776 2814915 2795389 2810522 2781913 2752244 2709220 2731539 2772953 2796518 2820822 2718979
4185 2718979 2724583 2791803 2779675 2823917 2892375 2840057 2941535 2922766 2918608 2907282 2811509 2748558
4173 2748558 2763729 2765347 2656247 2659073 2606081 2570248 2479019 2415586 2372171 2266600 2311762
4162 2311762 2336648 2219988 2137113 2060556 2139308 2145288 2099771 2126514 2051410 2067816 2028522
4151 2028522 1994402 2011095 2129388 2029399 2004714 2050106 2045636 1932065 1923805 1901761 1869682
4140 1869682 1948628 1954763 1935284 1971418 1833940 1805104 1881140 1843592 1938294 1981299 2041944
4129 2041944 1907121 1925994 1887184 1843045 1956656 2049924 1925202 1851870 1975222 1984705 1955656
4118 1955656 1985576 1879278 1874862 1936725 1976099 2054847 2076595 2025060 1993928 1972922 1989234
4107 1989234 1948047 2028872 2020587 2018473 2056402 1959369 1880890 1928466 2047766 2087719 1993677 1999259
4095 1999259 2016866 2105270 2007464 1968662 2094946 2012597 2034276 2039455 2051514 2055917 2099231 2011858
4083 2011858 1989441 1997709 2047381 2041251 1978656 1989134 2064751 2044478 1944292 1992423 2052808 1961853
4071 1961853 1961590 2077203 2070722 2108813 2231964 2224725 2129042 2030673 1927043 2058808 2120281
4060 2120281 2127008 2102817 2101561 2196961 2094082 2067740 2073353 2065632 2153328 2205402 2189763 2102466
4048 2102466 2070697 2162628 2227460 2175158 2115380 2227411 2279422 2335998 2295213 2295644 2242223 2233957
4036 2233957 2308797 2328211 2470421 2458878 2307625 2375182 2440554 2389011 2456164 2388638 2282595
4025 2282595 2404993 2489167 2450066 2374950 2400212 2401394 2531574 2575892 2439542 2382165 2471077
4014 2471077 2385538 2313271 2456448 2517386 2530685 2590322 2620464 2529295 2471307 2525726 2573565
4003 2573565 2638255 2555871 2586030 2516087 2547757 2677399 2648502 2640478 2555353 2551258 2508264 2550591
3991 2550591 2651620 2714025 2755405 2714901 2770415 2793504 2732398 2698919 2678960 2813960 2824986
3980 2824986 2710253 2552928 2642110 2739310 2751903 2744811 2818202 2812677 2829284 2866456 2897142
3969 2897142 2829741 2787055 2788794 2801986 2842869 2825312 2866638 2907180 2959077 2933928 2978572 2884758
3957 2884758 3045053 3075486 3028563 2999192 3039268 3107746 3132594 3044494 2955925 3041256 3062828
3946 3062828 3219940 3223845 3361237 3298452 3199512 3209536 3218947 3167810 3055535 3046411 3094744
3935 3094744 3135145 3135786 3230808 3116049 3105296 3259765 3259428 3274849 3279076 3319611 3456302 3437518
3923 3437518 3357706 3305320 3147439 3210173 3200643 3159053 3195700 3226774 3257831 3344431 3322874
3912 3322874 3378767 3413704 3320641 3318447 3349550 3301336 3237618 3328060 3382201 3275877 3209099
3901 3209099 3245445 3306738 3251275 3358067 3491544 3464370 3402118 3384845 3339100 3385386 3457543
3890 3457543 3355300 3361375 3462575 3461713 3399656 3323937 3391534 3365590 3306271 3347393 3347640 3331590
3878 3331590 3352752 3430375 3488018 3425754 3390714 3474474 3503395 3422623 3450456 3501603 3461226
3867 3461226 3532100 3600796 3646313 3623445 3581848 3519591 3546230 3612314 3614713 3683390 3705942 3709356
3855 3709356 3763490 3636238 3638158 3644195 3762065 3822742 3824747 3766232 3763590 3856034 3923187 3885992
3843 3885992 3901848 3875864 3891932 3942215 4017647 4110385 4197635 4233524 4200382 4196016 4204862 4343623
3831 4343623 4511847 4467701 4386517 4515681 4660118 4700674 4728807 4709930 4848970 4906397 4917509
3820 4917509 4850182 4805900 4820130 4746527 4809346 4861933 4860663 4835357 4838835 4898180 4870994 4911435
3808 4911435 4997546 5112885 5061599 5102281 5169992 5196097 5301138 5302142 5321194 5413016 5563581
3797 5563581 5677122 5756244 5786359 5841482 5889537 5890261 5884386 6082047 6135562 6302295 6437272
3786 6437272 6501847 6543787 6660057 6797044 6877081 6960199 7081649 7229263 7466453 7487995
3776 7487995 7560330 7690350 7840083 7996619 8095292 8236236 8390883 8571907 8681187 8913808
3766 8913808 9205337 9402520 9587068 9769922 10026402 10293526 10542557 10771856 11016100 11462631
3756 11462631 11867185 12399002 12805366 13344438 13783077 14121904 14746334 15215253 15748983
3747 15748983 16285607 16901413 17562630 18002562 18403623 18866810 19151484 19449903 19890219
3738 19890219 20367217 20835621 21475732 22105456 22767374 23440356 24103002 24640908 25070372
3729 25070372 25684924 26128798 26687044 26982087 27307840 27821051 28300661 28830551 29391678
3720 29391678 29950513 30622314 31568273 32707600 33878391 35278619 36881624 38688161 40706128
3711 40706128 43067385 45293512 47462597 49717180 51239511 52000316 51847318 51020843 49571738
3702 49571738 47889554 46448944 45323320 44517064 44378468 44698809 45208101 46153398 47517499
3693 47517499 49214562 51010510 53053692 55164200 56872256 58379338 59593788 60094957
3685 60094957 60005689 59576402 58486946 56837124 54947477 53050309 51213030 49569390 48335847
3676 48335847 47407845 46707683 46389407 46451148 46649213 47011831 47565829 48212246 48980929 49841319
3666 49841319 50719503 51441156 52199766 52726473 52997121 53108987 53140163 52733180 52066305 51470815
3656 51470815 50811578 50007417 49166941 48403090 47595942 46904671 46247271 45796865 45313520
3647 45313520 44706923 44269366 43938086 43589782 43315412 43138587 42928137 42602656 42129322
3638 42129322 41472955 40539791 39375222 38300504 37118835 36036190 34957954 33935941
3630 33935941 32950582 31928871 31080799 30146533 29189165 28475550 27737971 27004838 26328522
3621 26328522 25685727 25082221 24514702 23918520 23298391 22844142 22417791 21945540 21393395
3612 21393395 20893974 20393525 19901702 19370255 18958312 18651967 18132227 17835022 17473836
3603 17473836 17065612 16627548 16243224 15757633 15215283 14852901 14427775 14048407 13532691
3594 13532691 13038674 12621140 12232292 11876195 11531144 11160463 10837687 10496656 10157749
3585 10157749 9840818 9532297 9355673 9190981 8995443 8762374 8615116 8500645 8360924
3576 8360924 8235824 8020641 7865269 7963237 7787836 7631938 7554200 7389817 7295008 7131117
3566 7131117 7059047 7022733 6908255 6959158 7092324 7104516 6996863 6911835 6953111 6851571 6890095
3555 6890095 6945982 6932250 6916274 6952916 6953871 6776313 6714582 6728569 6534967 6428533 6343604
3544 6343604 6228842 6203831 6147133 6162926 6075434 5935421 6000921 6068952 5903331 5861530 6014393
3533 6014393 5977379 6029440 6101184 6159061 6226676 6237491 6234025 6217318 6255819 6341163 6460161
3522 6460161 6481268 6525980 6548250 6577242 6650418 6704585 6771609 6842308 6884831 6934814 6928846 7033026
3510 7033026 7083258 7121253 7195116 7247030 7263077 7314554 7446353 7562010 7705236 7847799 8021792
3499 8021792 8045510 8026247 8118626 8285874 8463615 8589890 8694998 8846990 9056209 9141200
3489 9141200 9149397 9224093 9361435 9662893 9831791 10019580 10186867 10435292 10665840 10821254
3479 10821254 11043100 11290877 11635524 11898713 12168596 12549225 12888439 13300191 13617544
3470 13617544 14099820 14496654 14956300 15655359 16352417 17026447 17769672 18550981 19466626
3461 19466626 20305674 21033275 21892269 22805297 23812750 24895833 26160259 27414686 29014728
3452 29014728 30742486 32563348 34568891 37027708 39735048 42583368 45925316 49515393
3444 49515393 53532123 57948885 63126800 69330848 76348654 84650804 94353255 105260646
3436 105260646 116988481 129014921 139932309 147705138 150467487 146795081 136940613 123241491
3428 123241491 108666909 95417822 84320913 75354312 68040130 62172518 57398678 53493011
3420 53493011 50094514 47163077 44536099 41902818 39670984 37500096 35512406 33862577
3412 33862577 32242163 30931492 29711351 28417160 27063510 25701794 24540831 23353837
3404 23353837 22296617 21336120 20400960 19659925 19024270 18310062 17694640 17152982 16469502
3395 16469502 15838907 15228016 14564527 14012677 13558945 13092587 12813390 12346718 11955755
3386 11955755 11720262 11573951 11269844 11074363 10902782 10459646 10396378 10447278 10338564 10138193
3376 10138193 9964155 9598502 9468949 9176183 8833833 8628636 8269938 7963670 7763184
3367 7763184 7543883 7405170 7190088 7031985 6877198 6697910 6576394 6410034 6361627 6295255
3357 6295255 6283500 6056182 5803746 5711425 5605546 5619452 5573680 5392442 5240223 5286375
3347 5286375 5235730 5226029 5090119 4947500 4895877 4772795 4687926 4683581 4666651 4626189 4523922
3336 4523922 4412412 4337493 4348160 4360221 4316972 4392502 4317752 4230227 4177417 4170079 4025745
3325 4025745 4001636 3945938 3922011 3939325 3879517 3760275 3808521 3760698 3694800 3647627 3554853
3314 3554853 3516892 3589693 3589569 3343665 3332399 3323242 3255836 3288556 3318218 3198265 3139100 3229557
3302 3229557 3199399 3160129 3050606 3053074 3108030 3066778 3040411 2940311 2860623 2845247 2881207
3291 2881207 2812540 2777302 2822057 2793999 2779207 2791733 2662227 2661014 2827146 2896429 2937939
3280 2937939 2956613 2888871 2833858 2870871 2796516 2753745 2754142 2793956 2748271 2712705 2730563 2741202
3268 2741202 2693452 2581491 2475072 2457737 2344294 2270177 2304059 2320161 2309061 2206974 2235422
3257 2235422 2276084 2353754 2300354 2308248 2306655 2371714 2448977 2383006 2346243 2331470 2264879 2243038
3245 2243038 2294018 2313447 2416252 2361668 2317096 2361448 2267060 2304501 2311980 2220694 2209783
3234 2209783 2244810 2227433 2197557 2266440 2197668 2118623 2161798 2048771 2036578 2128764 2120964
3223 2120964 2076111 2145694 2088447 2053387 2104022 2132343 2136119 2205375 2101440 1985509 1965880
3212 1965880 1926082 2044709 2070379 2076500 2142836 2175881 2211374 2186578 2349563 2350388 2396335 2455099
3200 2455099 2547657 2636023 2751663 2676805 2522728 2556512 2508744 2448358 2450193 2458245 2425863
3189 2425863 2319686 2202812 2239010 2252258 2240317 2211713 2236348 2223675 2221600 2175781 2212652
3178 2212652 2125104 2147602 2098951 2126084 2049941 1913449 1974357 2041029 2064100 2009173 2027685
3167 2027685 2047989 2095705 2063747 1952010 1944170 1998697 2006220 2007278 2067953 2027878 2077914 2066702
3155 2066702 2092033 2161223 2200698 2210739 2223766 2243546 2315235 2446252 2495373 2584805 2693008
3144 2693008 2751971 2895735 3010547 3151764 3181950 3195513 3242311 3096512 2915688 2920591 2958907
3133 2958907 2865879 2850878 2865294 2873684 2935301 2910460 2929685 2982429 3000802 3051868 3000712 3041746
3121 3041746 3134132 3208161 3137591 3142334 3272881 3251689 3281644 3259873 3353537 3350036 3325192 3378046
3109 3378046 3345733 3367073 3298241 3246478 3223807 3161332 3034161 3008878 3062118 3148156 3097036
3098 3097036 3136554 3130661 3166319 3155395 3040187 3170966 3157148 3063592 3198714 3301561 3207780
3087 3207780 3321851 3413527 3402815 3388189 3511566 3600338 3527659 3508440 3520960 3527489 3425360
3076 3425360 3324295 3256141 3278329 3286856 3443438 3422493 3370056 3464686 3519413 3488240 3541394
3065 3541394 3578340 3575300 3564727 3608004 3710045 3790500 3953011 4005950 3996090 4068348 4188249
3054 4188249 4424122 4631652 4709475 4779565 5002153 5117699 5075906 5013164 4953982 4931303 4950484
3043 4950484 4987543 4846660 4779915 4843661 4881857 4869555 4950968 5060391 5067418 5072689 5198370
3032 5198370 5124536 5117722 5150086 5081718 5050035 5092627 5128773 5183154 5167525 5214970 5433550
3021 5433550 5486938 5554239 5606381 5790377 5885817 6002163 5951765 5936740 6036301 6092408 6034930
3010 6034930 6101908 6217153 6198361 6174962 6192833 6194327 6188861 6235856 6213225 6198545 6199966 6174911
2998 6174911 6287832 6321647 6277533 6365837 6342828 6458972 6419471 6421263 6599755 6651338 6731435
2987 6731435 6876906 6928660 7035284 7068380 7221225 7372211 7495871 7646947 7845089 8067498
2977 8067498 8315440 8403903 8504695 8771171 9075450 9218403 9385349 9639087 9953356 10239976
2967 10239976 10525730 10898799 11204354 11596282 12034904 12323150 12666271 13137369 13586614
2958 13586614 13966160 14241342 14583810 14866832 15146888 15379427 15522055 15799228 16099234
2949 16099234 16576606 17144609 17544012 18156893 18958533 19650485 20466093 21219890 21774197
2940 21774197 22151261 22449673 22554327 22437579 22292646 22322940 22487475 22708717 23091229 23628333
2930 23628333 24313831 24978417 25667759 26323172 26647835 26694762 26556708 26026255 25510243 24829360
2920 24829360 24163932 23668672 23336247 23223540 23220336 23331071 23529763 23705364 23749799 23653353
2910 23653353 23493832 23058653 22497412 21714380 20839019 20093467 19309682 18544968 17981565
2901 17981565 17544287 17152161 16829301 16595062 16395217 16177753 15768628 15337131 14913288
2892 14913288 14397670 13801055 13318532 12809877 12341547 12005957 11686282 11465398 11299979
2883 11299979 11040043 10825038 10767706 10492515 10361826 10216092 9986009 9864139 9750077 9607737
2873 9607737 9422790 9429947 9400921 9290793 9146753 9061651 9073329 9024935 9062772 9025580 8930926
2862 8930926 8958515 9027098 9077411 9152979 9300985 9295407 9254264 9402805 9419082 9435560 9554145
2851 9554145 9721608 9777161 9900113 10010530 10079735 10232168 10316881 10404096 10572276 10820107
2841 10820107 10796988 10825725 11088835 11193307 11517347 11649992 11768256 12077210 12213586 12407395
2831 12407395 12655449 12924222 13265825 13620871 13882122 14158384 14552639 14923215 15373541
2822 15373541 15946487 16317965 16692647 17080730 17513365 17947673 18427851 18912834 19251905
2813 19251905 19674371 19939497 20154575 20403808 20577485 20967548 21294540 21591274 21995593
2804 21995593 22614278 23255340 23815154 24489643 25305472 26406570 27422223 28613161 29820572
2795 29820572 30902384 31936661 32659063 33124678 33481891 33718882 33870479 34099111 34548716
2786 34548716 35091918 35819331 36552237 37510144 38676106 39921707 41348077 43093373 44847664
2777 44847664 46914137 49290912 51878165 54688615 57991274 61551911 65431061 69581606
2769 69581606 73809795 78262722 82940022 87989647 93538146 100078790 107678097 115902697
2761 115902697 123063606 128677000 131572654 130793007 128058082 125257389 123195943 122060195
2753 122060195 122729921 125340533 129838926 135859245 142904152 150526642 157632207 163738640
2745 163738640 168391495 171475685 172883091 173198974 173216249 173248128 173766208 175222071 177926513
2736 177926513 181969762 187849369 196199821 206856011 220419774 236209343 251946569
2729 251946569 263339822 267660422 262538309 246981651 226143040 206715781 191664872
2722 191664872 180943318 173996774 169941680 167661440 166456635 165700024 165115973 164974616
2714 164974616 164959433 164311250 162590828 159167010 154057767 147210919 139218608 131295400
2706 131295400 124051644 118332128 114834960 113305150 113741772 115451375 117619426 119805186
2698 119805186 121413893 121111155 118535012 113765548 106228349 97254838 89171054 82599652
2690 82599652 77279357 72834590 68868058 65230559 61706376 58184501 54748851 51826703
2682 51826703 49252818 46987156 45132408 43365558 41749052 40346743 39059817 37779484
2674 37779484 36679103 35891297 35137742 34650680 34195012 33778619 33402291 33219836 33038797
2665 33038797 32822114 32493959 32148404 31418345 30359883 29059509 27887237 26725194 25760404
2656 25760404 24961803 24217444 23539583 22933643 22622012 22284707 21869140 21562245 21268572
2647 21268572 20941459 20798693 20702471 20618188 20476087 20060432 19870460 19640666 19285083 19027866
2637 19027866 18876315 18533480 18210072 18001141 17556118 17143799 16863157 16599839 16271302
2628 16271302 15949319 15667224 15585568 15425803 15223406 15020053 14972685 14831931 14708219 14652686
2618 14652686 14470712 14413175 14353806 14410862 14480446 14476707 14370093 14312333 14326844 14335021 14306892
2607 14306892 14223087 14164781 14092131 14110328 14193207 14059586 13990109 14052148 14199202 14191293 14167022
2596 14167022 14219305 14346390 14541402 14563167 14613592 14718392 14818797 14938165 15176047 15336163
2586 15336163 15496102 15615556 15721950 15956989 16320502 16567469 16843946 17110049 17427918
2577 17427918 17750523 18128218 18577795 19016733 19489271 19954222 20444168 21124842 21747876
2568 21747876 22365749 22972233 23564908 24296303 24892892 25553050 26381898 27123624 27761751
2559 27761751 28471884 29297603 30067533 31041950 32171648 33202931 34498850 35800473 37247600
2550 37247600 38988905 40860887 42929999 45264902 47844783 50724716 53889210 57012882
2542 57012882 60103119 63170491 65951759 68241554 69919459 71115868 71976906 72409331
2534 72409331 72436639 72129481 71894520 71526952 71341529 71321271 71387404 71518858 71735123 71815801
2524 71815801 71811422 71754825 71238554 70422796 69359281 68022430 66380497 64493471 62538373
2515 62538373 60607759 58647447 56593774 54335561 51994213 49445500 46732282 44030703
2507 44030703 41616046 39779779 38236607 36874360 35621795 34599592 33600412 32793181
2499 32793181 32006806 31206163 30500872 29571802 28759114 27912903 27056981 26224014 25416839
2490 25416839 24813371 24283877 23913148 23689486 23434353 23183760 22710264 22201794 21580346
2481 21580346 20892857 20143250 19438043 18725431 18117138 17691957 17249195 16842736 16459995
2472 16459995 16129373 15815214 15577310 15269316 14981353 14763182 14581867 14351020 14217163
2463 14217163 14030410 13944944 13808810 13538894 13470035 13402831 13340072 13359953 13397494 13370301 13282128
2452 13282128 13176353 13128468 13160686 13213930 13186414 13249471 13291990 13405276 13491954 13558887 13529283
2441 13529283 13598216 13574777 13584717 13636315 13601872 13658248 13617425 13626426 13618409 13682718 13761236 13828558
2429 13828558 13978978 13972987 14048530 14240602 14383466 14556215 14771307 14968258 15282247 15730953
2419 15730953 16045595 16282512 16813916 17336017 17993830 18586353 19062893 19691685 20183451
2410 20183451 20554678 20892771 21030255 21194699 21224588 21121557 21053665 20863258 20626370 20405922
2400 20405922 20202927 19864373 19719907 19523801 19435969 19537493 19641892 19719871 19891424 20172213
2390 20172213 20493318 20757444 21157710 21551724 22037869 22622394 23240561 23830404 24515789
2381 24515789 25242833 26010080 26851445 27776934 28838135 29967558 31104370 32298302 33678237
2372 33678237 35113628 36819253 38554204 40611670 42821606 45211281 47942263 51086795
2364 51086795 54642687 58611780 62947770 67887922 73232899 79009853 85184000 91496530
2356 91496530 97799257 103970831 109826575 115089245 119534543 123088917 125750010 127277611
2348 127277611 127681690 127086159 125638552 123404608 120572565 117261194 113609964 109587256
2340 109587256 105359909 100934848 96368977 91602995 86787103 82061072 77373440 72758386
2332 72758386 68251546 63783131 59736311 55970270 52497027 49259375 46422909 43837622
2324 43837622 41493315 39386468 37463304 35859041 34385409 33051891 31799153 30741220
2316 30741220 29638452 28650939 27846723 27027008 26275036 25601291 25048093 24493288 24035120
2307 24035120 23594752 23071948 22726758 22348127 22070976 21857930 21687332 21423090 21221684
2298 21221684 21218075 21102558 21152138 21214568 21273594 21403940 21531510 21752215 22004891 22118374
2288 22118374 22281158 22427662 22539394 22629112 22680903 22624153 22555824 22354802 22111070 21934636
2278 21934636 21647923 21291539 21034561 20704649 20363326 20044091 19718610 19523207 19235954
2269 19235954 18954731 18865177 18882039 18754555 18623849 18544371 18598610 18692741 18664266 18636549 18688458
2258 18688458 18815165 18821046 18923109 19092607 19214587 19303310 19498965 19751166 20040180 20385877
2248 20385877 20631231 21038463 21330269 21782343 22440010 22982695 23518321 24054093 24623758
2239 24623758 25152938 25676082 26298949 26872025 27303795 27635674 27976138 28284821 28483194
2230 28483194 28618236 28792388 28875482 28889027 28955739 29093824 29181329 29317148 29430876 29423608
2220 29423608 29503454 29515683 29406095 29204933 29023617 28841926 28705425 28500698 28208715 28025582
2210 28025582 27761744 27767773 27718588 27721871 27840980 28097701 28353918 28571443 28903357 29113836
2200 29113836 29248435 29284730 29499795 29965009 30371510 30902435 31561146 32354826 33227509 34228991
2190 34228991 35371524 36501952 37951225 39663551 41415806 43483509 45548978 47880290
2182 47880290 50454790 52985375 55525995 58007845 60326056 62534153 64570840 66239470
2174 66239470 67641300 68758087 69608012 70250504 70909803 71393570 71697796 72207011 72944876
2165 72944876 73501103 74161186 74906475 75659071 76342448 76873960 77246279 77602509 77879584
2156 77879584 77923874 77841476 77508937 77092252 76751401 76213815 75846896 75614222 75416721 75238934
2146 75238934 75063646 74831041 74533788 74263348 73730258 73067628 72271056 71411223 70494905
2137 70494905 69680913 68775856 67906221 67108465 66010164 64856770 63533092 62097071 60464067
2128 60464067 58712158 56840388 54799182 52685013 50538824 48373960 46219772 44049805
2120 44049805 41961620 40038678 38282003 36470893 34813454 33561066 32464044 31519564
2112 31519564 30652497 30001573 29447598 28971753 28571133 28019042 27217049 26455376 25879270
2103 25879270 25353056 24992225 24665796 24400012 23985609 23700585 23527342 23488512 23434916 23462856
2093 23462856 23474474 23774896 24086148 24257604 24573007 24771127 25057671 25382410 25634413 25762751
2083 25762751 26014527 26143225 26194713 26327392 26388075 26412461 26550291 26744767 26785130 26704969
2073 26704969 26690503 26422454 26060390 25584693 25203542 24712129 24266330 23887289 23312606 22638753
2063 22638753 22136974 21510624 20918727 20353011 19878737 19476907 19067965 18851792 18534554
2054 18534554 18372780 18251090 18161735 18105376 17985521 17810738 17806211 17746935 17636633 17552374
2044 17552374 17319894 17217358 17189128 17066835 16935010 16760779 16609093 16434285 16382710 16254474
2034 16254474 16140267 16156380 15952666 15875688 15765102 15672124 15637423 15602241 15528190 15614108 15702401
2023 15702401 15700306 15844737 15965273 16151238 16285227 16424736 16626468 16840440 17171324 17480757
2013 17480757 17884841 18385708 18835009 19449167 20024310 20610386 21350591 22074717 22887439
2004 22887439 23928027 24978420 26209734 27628486 29177680 30862575 32768119 34840797
1996 34840797 37259692 39877817 42669394 45636602 48696679 51811846 54992680 58200356
1988 58200356 61305552 64413137 67352908 70016392 72450941 74296524 75699832 76397823
1980 76397823 76285993 75377484 73684775 71385696 68506195 65142872 61301339 57362225
1972 57362225 53439999 49511319 45867965 42404375 39138141 36330554 33772286 31531330
1964 31531330 29438779 27611575 25942099 24417836 23105372 21886735 20737668 19787095
1956 19787095 18850137 17997576 17291875 16617945 15944165 15302805 14685453 14185667 13786975
1947 13786975 13343373 13022530 12597917 12155329 11820402 11492057 11221552 10938908 10683280
1938 10683280 10299762 10141203 9922181 9715947 9562298 9336481 9188213 9068275 8934681
1929 8934681 8806072 8809022 8709187 8620560 8574931 8419140 8320110 8260841 8220226 8214861 8026584
1918 8026584 7953579 7891678 7812457 7663495 7549987 7483655 7312652 7209880 7098307 6991147
1908 6991147 6868232 6746681 6583830 6444102 6501619 6410144 6236371 6108462 5993733 6036046
1898 6036046 5936819 5928317 5834362 5690373 5558295 5489176 5539808 5472915 5365014 5313894 5244808
1887 5244808 5206318 5099636 5053080 5162848 5188289 5149387 5140745 5105786 5106904 5114125 5192949 5254420
1875 5254420 5296807 5394668 5381421 5516141 5480892 5445557 5543859 5628677 5845964 5932890 5955050
1864 5955050 5922240 5889397 5900536 5863129 5924271 5968148 5932384 5844755 5878483 5948271 5992167
1853 5992167 6005564 6070055 6092010 6125726 6050153 6105555 6171039 6170812 6360255 6448746 6408634 6466454
1841 6466454 6500469 6534608 6651359 6700423 6847713 7082472 7063616 7152943 7367591 7466273 7571537
1830 7571537 7721089 7798478 7922644 8075322 8118138 8186114 8223323 8164502 8290786 8350263 8335586
1819 8335586 8507940 8546202 8754280 8917256 9058658 9174567 9314356 9512880 9687998 9898879
1809 9898879 10083235 10366535 10610407 10835589 11025733 11272240 11586493 11798971 12051156 12345086
1799 12345086 12634845 12991365 13403586 13910457 14398198 14931145 15546258 16373523 17053502
1790 17053502 17794525 18583284 19310060 20184016 21084760 22046135 23160720 24236031 25636755
1781 25636755 27088007 28585767 30296773 31872781 33119610 33706855 33868475 33455443 32801439
1772 32801439 32023972 31220702 30569635 30123998 29826724 29746852 29713729 29628155 29717065 29877345
1762 29877345 29883923 29928836 29875270 29846019 30045120 30251690 30499555 30871590 31340221 31744814
1752 31744814 32049717 32331059 32456846 32539762 32275915 31782611 31376437 31077562 31046770 30947268
1742 30947268 31009812 31330828 31894767 32477009 33137113 33957461 34790021 35597940 36387171 37255713
1732 37255713 38068099 38893418 39819414 40998324 42366468 43780685 45334764 47115842 48976178
1723 48976178 50983089 53142930 55335464 57551573 59936096 62250809 64756359 67500932
1715 67500932 70516793 74040149 78119542 82893495 88391703 94418459 101140455 108536735
1707 108536735 116881295 126252768 136913508 149376527 163912475 180806204 200176168
1700 200176168 221918671 245177454 268137609 287698542 299801082 301096497 290215033
1693 290215033 268920080 241778615 213920555 188717096 167299411 149747118 135409974
1686 135409974 123493384 113386481 104635989 96774822 89751190 83418749 77680639 72506486
1678 72506486 67740649 63420875 59465347 55879652 52760706 49770864 47261857 44999930
1670 44999930 42975376 41131516 39486674 37991465 36528145 35134952 33722127 32529855
1662 32529855 31360736 30271365 29244908 28179126 26999594 25952551 24968170 24101161
1654 24101161 23103339 22210954 21510966 20755666 20082784 19336946 18744930 18247175 17596271
1645 17596271 17036787 16601659 16208496 15758055 15329529 14949390 14659410 14354038 13936918
1636 13936918 13511303 13274520 13014649 12630632 12334890 12015887 11752945 11415025 11153294
1627 11153294 10872040 10721713 10557630 10371441 10140314 9940191 9669509 9510830 9250823
1618 9250823 9011222 8881414 8741692 8634507 8469569 8401428 8216879 8027414 7896859 7647081
1608 7647081 7573465 7387861 7220819 7238710 7067470 6937044 6843054 6708382 6589196 6462535
1598 6462535 6381757 6224689 6207257 6207122 6092846 5928774 5748485 5646450 5662604 5647793 5488040
1587 5488040 5381884 5235562 5062839 4993062 4874690 4826325 4668706 4555160 4567510 4470806
1577 4470806 4467851 4273874 4195150 4143616 4139165 4087588 3999819 3921399 3835547 3855129 3726636
1566 3726636 3515240 3468861 3500743 3584933 3565147 3559234 3493046 3364684 3308254 3224992 3207985
1555 3207985 3115900 3104336 2970305 3032377 3041667 2942853 2826011 2758235 2725413 2654833 2781119
1544 2781119 2692067 2569036 2538841 2536823 2479055 2387747 2391630 2397831 2392756 2358554 2425968 2437179
1532 2437179 2295237 2262969 2248944 2225751 2206709 2143086 2212469 2250352 2219107 2199467 2104075
1521 2104075 2159848 2179540 2136662 2155656 2239432 2201279 2140443 2129399 2190602 2208406 2172649
1510 2172649 2124272 2171430 2172283 2073387 1950986 2056417 2089116 2007919 1961066 1934293 1854752
1499 1854752 1797595 1840610 1819853 1691847 1770143 1725890 1645397 1570566 1696380 1627778 1602029
1488 1602029 1522247 1431466 1606788 1612968 1625834 1637059 1591876 1523974 1499394 1559473 1559686 1443925
1476 1443925 1456622 1436220 1424625 1376708 1480668 1456644 1445160 1403864 1467936 1448550 1418011
1465 1418011 1487787 1374452 1391784 1388785 1289844 1262336 1240482 1264287 1252991 1276851 1309194
1454 1309194 1302120 1275060 1334841 1350478 1277231 1288201 1256878 1214532 1299426 1245447 1239779 1245961
1442 1245961 1265510 1273758 1262224 1275071 1336263 1358510 1294806 1197477 1145628 1047293 985135 981515
1430 981515 1017934 1041108 1036093 1019927 1013107 1060279 1031147 1071357 1141869 1203511 1255642 1260668
1418 1260668 1250585 1347597 1373793 1247705 1305331 1381711 1378156 1375381 1326322 1338072 1425766 1432618
1406 1432618 1388403 1412898 1496674 1496282 1631106 1747031 1704677 1841151 2036303 2105175 2148216
1395 2148216 2305895 2369535 2260338 2132457 2114466 1913003 1797621 1729414 1625637 1568246
1385 1568246 1538155 1462480 1377179 1263901 1247994 1221460 1232777 1298622 1086586 990296 1074887
1374 1074887 1153586 1068467 1047249 1024449 918598 912336 859220 804448 867343 878368 889121
1363 889121 814239 914454 804542 817449 894439 853615 806355 774097 741790 651766 676165
1352 676165 682642 637448 683472 739873 782187 750696 675705 716983 764486 804876 753523 748162
1340 748162 717492 695706 653174 566393 648002 644703 621900 553350 575635 677307 634459 692142
1328 692142 606712 596826 553205 570408 568717 586466 585601 604753 615903 585405 548257 581503
1316 581503 576043 589893 572549 508438 527983 484574 465667 500668 554964 486413 472392 481734
1304 481734 460504 517106 463540 576542 560156 442917 432712 446823 461999 471983 534371
1293 534371 485022 408962 489586 455207 376462 419160 491677 400581 456556 357671 421867 542359
1281 542359 541712 575701 437080 437881 444663 385008 412061 468140 487816 456484 420062 503871
1269 503871 565058 626172 484151 428411 358426 387246 490803 422171 436541 507889 514466
1258 514466 431948 442165 476199 404027 405507 447597 427220 304127 307404 391208 478406 533899
1246 533899 430453 387817 366505 371941 463173 514111 522576 400677 485643 514182 508311 561238
1234 561238 469156 550173 550898 511978 602364 640539 596829 607357 612371 577785 621943 526538
1222 526538 422716 453622 452648 506502 440162 417570 435072 368409 402754 346883 334296 303104
1210 303104 417173 327374 322755 407970 401011 438138 319011 355650 314236 312139 381456 340163
1198 340163 358195 302117 304095 340824 418591 420228 359331 303855 292136 361466 249074 317561
1186 317561 419580 306699 397908 426350 322530 310296 328707 285069 295129 328382 376627
1175 376627 385334 408804 438134 444529 396459 335702 365318 415998 429479 380298 413543 451823
1163 451823 478640 442740 467293 490580 359881 369868 409830 349594 345848 446880 356492 301936
1151 301936 300642 241478 327589 439447 440774 446196 415856 382449 382595 418078 373671 333596
1139 333596 406077 282500 214469 136213 187256 327803 390427 326963 252162 195303 254009
1128 254009 285810 315244 366082 476944 319819 268594 331889 307087 263161 245537 349095
1117 349095 369453 320793 358920 479642 364993 246882 236038 262798 309779 246189 274962
1106 274962 322014 322409 279871 270240 408536 359293 318226 326934 276832 418498 420174 392944
1094 392944 378630 309494 385530 450642 567766 478778 365588 413446 392462 457261 388592
1083 388592 422803 422991 371812 364032 388078 442797 404382 502375 521322 409396 339210 392090
1071 392090 448163 470099 420399 303676 368392 497245 480579 505471 475101 451790 490959
1060 490959 427844 401252 426956 481332 419401 417262 543816 513277 538683 424493 465001
1049 465001 486031 490976 510743 551263 554921 625694 652939 715486 645783 703705 783832 686847
1037 686847 747272 763321 811521 853945 838191 775116 768378 778704 766650 781112 787937 824320
1025 824320 844056 935422 943263 902910 896402 819823 884342 890935 937976 993916 974127 978758
1013 978758 1050973 1042062 1059480 1081952 1094286 1081280 1161625 1194022 1119567 1045170 1188281 1291742
1001 1291742 1300399 1341210 1472219 1510000 1523918 1551121 1523202 1494589 1465392 1627933 1661157
990 1661157 1711816 1770990 1812168 1776588 1791750 1906316 1913434 2092803 2081370 2117867 2298681
979 2298681 2442063 2520538 2682529 2875773 3039458 3220475 3336590 3426957 3573742 3760527
969 3760527 3879284 4124214 4424041 4591194 4780215 5090826 5444918 5842009 6376900 6859407
959 6859407 7466064 8080729 8593415 9144926 9682530 10436009 11312220 12515521 14099107
950 14099107 15964537 18221424 20977526 24199785 27983683 32498129 36401884 38600828
942 38600828 38634499 35093244 29233499 23721308 19619217 16679201 14456101 12808778 11471944
933 11471944 10464498 9617713 8974050 8438086 8048175 7672259 7244862 6883818 6371809
924 6371809 5861652 5343512 4959537 4597541 4287155 4082043 3939404 3670304 3541625 3507720
914 3507720 3408463 3278641 3131173 2987835 2894513 2718429 2662881 2562444 2473694 2434911 2312183
903 2312183 2207499 2054393 1994470 1923233 1851087 1848190 1756581 1740886 1701505 1689552 1623248
892 1623248 1566376 1569090 1440928 1398014 1411768 1335431 1262235 1198483 1190423 1222755 1189667 1140331
880 1140331 1170281 1111096 1128900 1090604 1032438 1003778 1085163 1043202 1022568 1009610 879212
869 879212 879519 933522 899615 852631 822848 835852 827339 734923 738386 719262 765599 678367 675121
856 675121 683995 723131 689657 678506 647460 641589 590083 619889 600691 578487 521457 604066
844 604066 627408 651590 542182 520689 577095 589376 496086 582728 478411 381438 434530
833 434530 426558 515401 480994 413923 446576 483646 478139 401246 325418 252233 288166 348224
821 348224 474479 441413 343498 361140 373352 424189 367020 303106 249548 276661 239142 285394
809 285394 291980 306407 252204 263236 165686 216117 317023 343049 277901 242651 271467 393866
797 393866 333305 255348 187705 187073 278521 233532 249159 315881 285819 259989 266677 230669
785 230669 293623 429720 430867 409341 293320 263595 254894 131603 184516 150048 119955 156307
773 156307 104568 219800 210416 96139 185346 125697 139485 158856 105837 93926 191347 146616
761 146616 137245 183566 185623 148521 260269 261756 267289 238892 169608 265422 145538 113866
749 113866 179979 170038 102012 135621 184249 106780 39165 40837 151225 197350 119048 103052
737 103052 100696 163645 50808 14571 57777 18439 39940 103815 35842 78996 130571 77443
725 77443 100830 116264 26553 87694 165153 208994 128530 -4140 114874 197646 92115
714 92115 133625 217821 268893 162324 89028 132427 105381 60761 48085 7378 -11258 64301
702 64301 -45231 -13141 15904 -29396 34622 43779 -88510 -111350 90358 121947 72183 78108
690 78108 65541 101373 85582 77335 93440 83792 98443 73042 21512 -18415 -67370 -42660
678 -42660 39322 13566 85867 192446 213455 244556 163333 184075 128709 171013 232730 255272
666 255272 133850 156387 189838 132566 193313 150932 237286 322349 319243 239627 258068 227734
654 227734 90457 141161 114569 28904 -24884 2313 -29164 9732 24021 57422 124724 25836
642 25836 378 68307 81652 47557 73556 -50436 -90460 35400 63809 -46694 -19306
631 -19306 -55584 35922 22114 -36304 -94388 -63485 -20994 6836 116524 119276 162229 97258
619 97258 15552 -18555 58544 126186 154661 104527 65293 106761 118087 62448 99613 78666
607 78666 96695 53903 97598 19009 -28208 128300 134013 -15031 -80260 -5841 -27986 -103124
595 -103124 6164 50903 -53122 -103179 -99580 -79013 -40578 6776 3880 -63916 -7691 31779
583 31779 -86590 -73754 31384 31019 -49121 -98493 -62060 6076 28680 12618 -68425 -29345
571 -29345 10614 -3768 29791 64026 -24172 -79023 -89457 3668 -38697 -141022 44110 -16799
559 -16799 36833 10158 27782 51896 -11715 -81990 6587 80370 43030 -24513 -75090 -13065
547 -13065 31539 130249 104834 156849 30931 -60191 -101544 -104541 -81098 5496 29720 44470
535 44470 69040 20478 21352 6798 -65888 -33385 79123 14606 -79052 1902 -35351 -60007
523 -60007 19558 93300 14000 32841 -43884 -4849 61227 -34493 -63789 -115199 -130742 -154258
511 -154258 -65339 18871 89352 24800 -119719 -79854 -90744 -135568 -168370 -45077 551
500 551 4296 45464 69015 -53835 -70825 -51512 -77611 -49848 798 67111 85712 7470
488 7470 -56357 -44130 -116215 -80169 -27469 -12582 -11105 -117593 -72030 -80458 -141073 -71860
476 -71860 -114660 -121740 -75974 -27150 -21265 -63943 -27462 -13507 -48332 -67646 -1786 63939
464 63939 77138 101149 -22928 -64371 -59988 -18030 8225 -4934 -68807 -43398 -167688 -200832
452 -200832 -118220 -70631 -99800 4262 49446 21101 -72626 -100567 -50380 -69178 -128182 -170127
440 -170127 -54598 -47923 -165156 -192213 -201847 -164087 -127959 -83803 -89306 -67126 -120683 -158969
428 -158969 -60445 1254 -7809 -71483 -57953 -19138 -159010 -192908 -83910 -90626 -40798 -56974
416 -56974 -102657 -44747 11256 -57221 -29254 18715 14090 -22251 -23147 51572 -25430 -117211 -148475
403 -148475 -91054 -109975 -87462 -18752 -101061 -159806 -271157 -311047 -239963 -138764 -70798
392 -70798 -161252 -67752 -37267 -151152 -97575 -100818 -34942 -54773 -112849 -153457 -154044 -148510 -131467
379 -131467 -122137 -155432 -170222 -129829 -233688 -240151 -179045 -165984 -153267 -79255 -67006 -139089
367 -139089 -116673 -153950 -113120 -121533 -168593 -140648 -90293 24950 11754 -92598 -138143 -85812
355 -85812 -61057 -144980 -184775 -155766 -104680 -102947 -125214 -85970 -11058 -49853 -67644 12444
343 12444 -26042 -151397 -101583 -156070 -182100 -124101 -80352 -90449 -13586 157361 -48506
332 -48506 -28755 -16374 -109247 -142532 -112570 -97161 -129853 -172234 -157101 -151048 -235071 -175270
320 -175270 -104365 -90687 -102572 -68592 -181099 -248682 -279828 -234215 -124051 -102525 -189139
309 -189139 -200919 -151298 -112002 -31589 -24931 -97801 -122982 -101063 -184951 -152067 -120598 -148992
297 -148992 -92628 -95119 -122477 -64253 -162661 -200174 -225092 -207441 -156904 -116694 -123356 -233732
285 -233732 -201097 -242550 -176790 -175280 -227981 -162055 -61348 -92882 -160945 -18934 -54031 -84786
273 -84786 -59423 -86297 -162448 -86982 -43631 -194832 -203249 -101843 -38681 -54918 -95088 -148712
261 -148712 -126844 -247889 -216477 -84829 -109345 -217028 -87711 -76763 -120188 -105152 -177777
250 -177777 -195983 -136135 -133539 -152033 -59617 -173189 -98240 -122639 -96445 -104655 -156580 -162482
238 -162482 -143823 -121703 -213760 -186834 -199121 -176868 -184324 -187260 -157147 -54116 -98340 -146262
226 -146262 -188369 -80497 -60700 -101585 -43837 -136781 -144093 -170068 -183250 -93649 -145766 -232038
214 -232038 -200773 -208383 -259082 -270078 -196861 -204137 -96316 -67250 -145492 -152066 -184069 -215407
202 -215407 -214335 -117115 -178855 -202292 -65201 -78118 -147183 -133413 -146916 -139201 -108375 -83061
190 -83061 -134032 -91379 -171774 -229745 -206493 -255664 -321583 -332196 -256826 -279100 -201249 -185598
178 -185598 -195330 -155462 -131021 -102231 -138700 -261604 -241576 -153108 -178284 -203925 -169917 -143321
166 -143321 -132475 -135854 -259114 -242854 -107406 -136318 -135403 -123355 -136877 -223091 -206916 -147833
154 -147833 -171974 -117159 -121825 -167251 -207249 -145434 -216187 -235594 -173364 -170072 -154179 -222991
142 -222991 -199335 -238924 -245672 -263176 -192377 -107751 -134086 -180999 -183798 -177103 -186832 -176024 -180771
129 -180771 -200837 -164220 -123177 -90838 -62635 -76971 -112676 -161254 -158933 -98754 -143372 -168486
117 -168486 -100164 -32661 -41723 -81301 -77870 -134314 -142224 -136922 -210502 -206793 -164512 -159018 -192710
104 -192710 -185236 -260164 -252946 -202201 -213771 -181931 -130555 -77854 -141032 -151108 -173925 -161460
92 -161460 -207100 -211262 -209540 -234438 -100566 -80640 -149964 -177381 -260855 -203943 -212337 -233243
80 -233243 -213046 -206162 -172684 -154444 -97488 -89456 -103268 -174775 -212764 -186036 -207525 -244875
68 -244875 -168340 -155645 -168503 -168034 -201179 -247698 -237365 -243681 -258495 -181507 -194691 -266263 -276885
55 -276885 -187654 -171479 -155240 -219407 -229913 -224727 -241745 -190798 -185645 -200665 -194185 -154343 -203942
42 -203942 -304244 -281329 -206065 -156519 -246329 -285963 -223613 -200552 -114364 -133303 -226524 -226604
30 -226604 -227599 -231644 -244908 -143570 -110278 -185234 -234332 -273465 -271596 -277792 -261869 -187688 -194959
17 -194959 -184669 -225051 -186910 -213471 -216982 -253745 -265738 -181268 -161539 -153070 -163710 -105628
5 -105628 -126250 -219236 -180050 -157044 -159294
0 -159294
$$ Imaginary data points
##PAGE= N=2
##DATA TABLE= (X++(I..I)), XYDATA
16383 -3979524 -3906886 -3917357 -3805870 -3792857 -3780449 -3627075 -3634526 -3704139 -3694147 -3572121 -3555601
16372 -3555601 -3417266 -3356538 -3341343 -3284428 -3276133 -3191314 -3097873 -3022958 -3042152 -2998058 -2954727
16361 -2954727 -2945877 -2844149 -2850207 -2812139 -2769568 -2787264 -2771116 -2643697 -2601525 -2581576 -2501615
16350 -2501615 -2532640 -2426052 -2349734 -2393991 -2325766 -2355029 -2320424 -2256538 -2209309 -2162649 -2123841
16339 -2123841 -2035069 -1948355 -1937084 -1877609 -1930940 -1936256 -1869639 -1835359 -1782512 -1731362 -1628413
16328 -1628413 -1647633 -1534602 -1581120 -1575974 -1484995 -1456448 -1443716 -1406560 -1288841 -1237115 -1189077
16317 -1189077 -1292351 -1227321 -1116480 -1095732 -1052539 -1054202 -964693 -975015 -959548 -885803 -1004085
16306 -1004085 -813169 -720809 -714464 -622589 -581731 -615667 -596088 -552771 -587502 -483730 -465306
16295 -465306 -423191 -361816 -368312 -311049 -271932 -223922 -245385 -367665 -276116 -301860 -188666
16284 -188666 -96721 -182110 -71876 -47417 -65182 20644 26965 15139 118399 209587 161716
16273 161716 263741 350496 359886 318910 314430 388945 395491 446096 334503 441296 494281
16262 494281 529812 577670 593270 627820 716771 690909 610187 703420 739778 728131 884866
16251 884866 1010501 942584 968195 951861 960293 971920 980343 993001 983468 1006041 987552 997130
16239 997130 1055637 1129054 1062952 1185712 1315638 1281605 1303125 1195786 1291195 1282166 1257441
16228 1257441 1292289 1267132 1336422 1355783 1405241 1476058 1487714 1516127 1515446 1513207 1525072 1477079
16216 1477079 1467408 1454793 1581996 1610337 1657059 1626246 1676995 1680689 1685058 1793273 1822106
16205 1822106 1836728 1788039 1842581 1831087 1775420 1761879 1771176 1775296 1877191 1837166 1818863
16194 1818863 1843446 1881565 1945725 1937931 1904139 1861666 1888738 1846520 1865821 1924433 1931932 1961364
16182 1961364 2017779 2080389 2126996 2162337 2030614 2069816 2049868 2102075 2231973 2191635 2070575
16171 2070575 2137255 2151093 2135709 2142487 2109535 2134661 2222385 2217770 2193231 2188267 2221863 2268358
16159 2268358 2214455 2205081 2296671 2251867 2206655 2246025 2244525 2255947 2249942 2374102 2379765 2311641
16147 2311641 2390477 2439015 2443233 2412499 2391762 2360157 2376743 2377819 2400895 2373307 2322570 2414144
16135 2414144 2395458 2367669 2362983 2419132 2440920 2436004 2349534 2388732 2446768 2442107 2461283 2556294
16123 2556294 2587679 2577841 2540043 2502214 2470090 2348933 2400948 2461269 2402252 2434120 2429468
16112 2429468 2524236 2573586 2597998 2575702 2586588 2609662 2573551 2506099 2446139 2501121 2515056
16101 2515056 2562419 2626439 2581785 2567719 2473388 2482354 2578328 2558194 2574245 2660874 2526759
16090 2526759 2474060 2576761 2560199 2508818 2541051 2602978 2643471 2723316 2702986 2664609 2661915
16079 2661915 2608961 2572248 2648443 2647677 2738411 2725605 2640911 2742016 2667179 2592400 2566646
16068 2566646 2656862 2677196 2548507 2697552 2620404 2593358 2659870 2627858 2655367 2657758 2569013
16057 2569013 2605261 2623316 2596679 2637874 2644200 2637384 2736456 2712563 2683517 2648696 2660671 2687577
16045 2687577 2675279 2731107 2729594 2709973 2653879 2694678 2658847 2675075 2680502 2777081 2820458 2824784
16033 2824784 2854988 2820007 2734871 2753330 2749072 2709415 2703940 2650284 2624238 2602413 2766174
16022 2766174 2822095 2730605 2720324 2679559 2643456 2681675 2791823 2775057 2645039 2715429 2687300
16011 2687300 2616008 2641019 2716835 2705768 2695027 2794403 2743971 2789646 2764863 2662547 2680186
16000 2680186 2734913 2764833 2668228 2629893 2703884 2757372 2688462 2638422 2697477 2712906 2663740
15989 2663740 2678005 2683202 2711839 2763753 2831987 2735158 2765374 2754983 2654363 2671746 2606333
15978 2606333 2690882 2736895 2704333 2784293 2757623 2605066 2600413 2645430 2652371 2681412 2682589 2657308
15966 2657308 2697711 2719011 2701392 2599968 2576060 2653891 2639254 2767733 2739485 2660279 2661018
15955 2661018 2694071 2769616 2734963 2678532 2634456 2666564 2645777 2647497 2660631 2693481 2664646
15944 2664646 2713676 2757638 2799563 2696364 2668820 2710425 2680554 2706104 2694331 2688089 2703930
15933 2703930 2728795 2724748 2826668 2803690 2707546 2716112 2736054 2777718 2763301 2791311 2713442
15922 2713442 2732959 2764585 2726400 2829670 2711965 2703265 2777073 2729323 2660993 2729817 2757637
15911 2757637 2684305 2780047 2840473 2851318 2823118 2695253 2764396 2756619 2667897 2701573 2734640
15900 2734640 2696833 2737689 2766311 2596590 2608076 2758854 2732956 2723402 2773896 2707554 2702723
15889 2702723 2797089 2809981 2743754 2688418 2566881 2620157 2897715 2818464 2790899 2777209 2736197
15878 2736197 2766767 2863268 2812082 2702174 2685604 2646201 2816206 2836070 2816784 2833196 2789704
15867 2789704 2774759 2816592 2897064 2944146 2898915 2790246 2740910 2813457 2797269 2795765 2759512
15856 2759512 2704154 2680460 2781161 2755751 2691528 2764351 2761152 2765370 2845075 2835534 2874965 2892270
15844 2892270 2835689 2777280 2715392 2754405 2742411 2793408 2733701 2736237 2748972 2739098 2733205 2747895
15832 2747895 2752322 2735228 2745564 2670555 2591869 2572828 2541355 2479524 2565068 2592613 2626441
15821 2626441 2709012 2760772 2826602 2845183 2758109 2704257 2734345 2730514 2747480 2672940 2700138
15810 2700138 2662659 2652492 2673120 2743891 2752984 2822485 2796705 2701661 2720192 2658151 2701181
15799 2701181 2795503 2802023 2804672 2868777 2821649 2731970 2799647 2868060 2786566 2765809 2681157 2746862
15787 2746862 2696028 2633708 2619648 2722932 2775108 2712235 2718440 2729925 2673082 2751551 2764846
15776 2764846 2751806 2799007 2764392 2782999 2834176 2827884 2806112 2847950 2867375 2822917 2839404
15765 2839404 2741901 2721322 2737941 2760528 2783548 2859179 2829491 2790538 2793839 2694442 2759449
15754 2759449 2828289 2776442 2867634 2923532 2854858 2800883 2775728 2744725 2724194 2694200 2663704
15743 2663704 2793745 2796092 2747599 2811973 2802975 2788583 2752267 2815303 2846838 2810836 2836422
15732 2836422 2806507 2847692 2782787 2746527 2806108 2833738 2772220 2791916 2752668 2749789 2690086
15721 2690086 2777964 2754448 2752498 2799194 2874755 2871388 2788570 2771641 2816016 2747395 2803139 2753211
15709 2753211 2655002 2740446 2753013 2770044 2795727 2766256 2808894 2758713 2687079 2699412 2808197
15698 2808197 2758172 2687986 2790982 2849165 2874436 2897612 2785746 2669262 2735804 2674457 2645142
15687 2645142 2686920 2701704 2690491 2675102 2678879 2708216 2722601 2711914 2793928 2742277 2730841
15676 2730841 2749149 2842298 2828675 2753309 2756021 2736024 2751504 2820632 2852825 2786250 2750221
15665 2750221 2725378 2766194 2746052 2859378 2849658 2790961 2666778 2729094 2835184 2779265 2779677
15654 2779677 2786390 2814529 2794178 2751017 2833217 2849935 2813562 2778389 2765518 2818690 2893646
15643 2893646 2835562 2836147 2831285 2734815 2784245 2798718 2774484 2851574 2795564 2782772 2767961 2775580
15631 2775580 2788345 2875637 2888259 2798492 2743474 2761625 2807754 2829493 2724011 2709862 2737440
15620 2737440 2766689 2776366 2784773 2851995 2855435 2794177 2719290 2770645 2823024 2841168 2824497 2849431
15608 2849431 2857836 2774761 2770243 2772176 2791489 2830517 2841412 2759264 2718432 2819183 2881736 2837292
15596 2837292 2929127 2915850 2857013 2812934 2807349 2837879 2807380 2819770 2817295 2788293 2838914 2779650
15584 2779650 2781265 2859456 2823710 2873602 2874612 2876212 2810403 2658310 2709720 2793746 2741059 2779076
15572 2779076 2752766 2769499 2815959 2841016 2873004 2867205 2701514 2761680 2840702 2872579 2826497
15561 2826497 2844472 2837142 2802006 2867860 2788591 2694868 2742348 2817572 2786842 2765743 2812997
15550 2812997 2771309 2732218 2753343 2835921 2831119 2857396 2745576 2699784 2925146 2899581 2954999
15539 2954999 2921284 2819274 2850450 2763984 2706870 2755889 2805064 2760595 2810912 2855895 2905265
15528 2905265 2828834 2818434 2845427 2778729 2759229 2814327 2805931 2690061 2665815 2806435 2772970
15517 2772970 2787012 2795943 2775201 2759112 2798681 2809482 2734689 2771030 2798653 2781387 2824683
15506 2824683 2860765 2881765 2873310 2890174 2903550 2801813 2744979 2632439 2700048 2806963 2877577
15495 2877577 2767013 2709835 2712535 2809587 2787475 2765519 2805843 2814674 2971840 2985985 2874778
15484 2874778 2866577 2794417 2795372 2835929 2844065 2787983 2780726 2842448 2802340 2793752 2836389 2810728
15472 2810728 2793482 2873607 2949221 2954360 2894247 2960304 2885274 2771791 2823576 2831836 2858229
15461 2858229 2896220 2840867 2812610 2784019 2813453 2830687 2845211 2823534 2806141 2790189 2736391
15450 2736391 2826039 2832757 2806591 2881657 2835713 2794943 2823002 2786287 2792560 2799945 2812097 2769049
15438 2769049 2834835 2899167 2848999 2850679 2793962 2796143 2912676 2957889 2879065 2868204 2897555
15427 2897555 2884332 2956647 2937473 2855654 2838329 2791216 2765947 2795903 2836092 2863780 2844357
15416 2844357 2832884 2878856 2929520 2896438 2917524 2866438 2748353 2757973 2757805 2821071 2802393 2775313
15404 2775313 2735384 2700695 2837539 2881088 2844370 2798016 2910527 2903843 2857617 2859279 2885208
15393 2885208 2835823 2871570 2902303 2755553 2744113 2885915 2906188 2914432 2871157 2777245 2804102
15382 2804102 2847317 2872800 2900924 2866820 2798075 2803276 2806194 2780072 2864000 2824608 2729049 2771157
15370 2771157 2814280 2870778 2997838 2959888 2842824 2954513 2857889 2808476 2782973 2745864 2785051
15359 2785051 2838051 2875016 2905145 2952051 2839317 2784115 2922800 2832256 2818041 2854612 2828401
15348 2828401 2806004 2890781 2816000 2795790 2909684 2912577 2963684 2892903 2764518 2820261 2872002
15337 2872002 2856387 2862301 2860248 2851535 2895166 3003225 3004607 2916758 2755112 2692919 2754275 2780755
15325 2780755 2847821 2832885 2851766 2828810 2937874 2951581 2945647 2981203 2850014 2857287 2862999
15314 2862999 2824124 2793210 2823388 2798140 2884952 2996423 3000134 2884090 2881330 2807879 2804836
15303 2804836 2823037 2920294 2934372 2856233 2951617 3054950 2930375 2854840 2959205 2915234 2889135
15292 2889135 2923027 2945312 2899346 2857040 2897428 2844031 2835153 2932280 2940203 2945767 2911711 2936691
15280 2936691 2939293 2924725 3010089 2996728 2932822 2904000 2944480 2991306 2989976 3047946 2982936 2968433
15268 2968433 2907814 2873949 2852262 2948811 2976493 2918167 2911657 2959956 2970702 2981083 3012344
15257 3012344 2902250 2850757 2942607 2949473 2909612 2898652 2904381 2920175 2943765 2929860 2971153
15246 2971153 2997325 2878600 2849772 2865111 2864033 2832868 2958900 2946368 2927629 2763162 2800055
15235 2800055 2810080 2891713 2966425 2862783 2909935 2978678 3014615 2938632 2958264 2994062 2966784
15224 2966784 2916307 2832264 2849720 2888458 2973456 2968468 2843620 2910609 2940631 2863581 2855479
15213 2855479 2855631 2782227 2748989 2792487 2782280 2834528 2857928 2881054 2960743 3002292 2978345 2943835
15201 2943835 2901698 2767619 2912933 2981311 2910331 2825863 2841093 2806057 2878258 2904693 2830133
15190 2830133 2799598 2883152 2887339 2908357 2955666 2898796 2949258 2970635 2900411 2950470 2851396
15179 2851396 2866984 2984808 2947678 2938526 2970384 2971928 2857637 2788647 2802441 2903851 2955705
15168 2955705 2866269 2997254 3043564 2844243 2921528 2954398 2930899 2926821 3005729 2982060 2931530
15157 2931530 2944661 2973649 3000301 2976065 2955693 2919478 2911667 2967567 2903275 2913865 2917724 2866286
15145 2866286 2849655 2938623 2967595 2866280 2769451 2793992 2890685 3034950 3022114 2866410 2892383
15134 2892383 3009755 3004988 2905321 2790974 2811492 2867524 2880705 2797949 2901919 2805779 2795932
15123 2795932 2928269 2880794 2887593 2967151 2952888 2913246 3039297 3030702 2973719 2894976 2845030
15112 2845030 2831791 2860727 2846231 2946785 2982027 2904333 2796940 2924326 2960196 2904588 2931146
15101 2931146 2911122 2974702 2926167 2850881 2875320 2909095 2855586 2959674 2935100 2917018 2938562
15090 2938562 2897863 2840754 2880875 2966690 2930964 2904401 2882753 2829095 2835331 2974131 2985701
15079 2985701 2984960 2934221 2958171 2982687 2972608 2930440 2951872 2935570 2969473 2916951 2902835 3088590
15067 3088590 3120906 3020285 2973564 2929999 2975656 2932304 2953216 2936759 2888585 2798110 2762672
15056 2762672 2887729 2886766 2898703 2965773 2906416 2814949 2795126 2787513 2874273 2871086 2896394 2865657
15044 2865657 2866961 2912289 2895968 2931861 2914136 2921894 2923957 2935034 2867378 2828276 2925394 2970969
15032 2970969 2937451 2900893 2819357 2832903 2859263 2904452 2972566 2965172 2906027 2885352 2901930
15021 2901930 2933483 2986627 2820072 2818058 2915227 2921648 2952676 2993740 2937784 2841151 2863990
15010 2863990 2936192 2900344 2895880 2869472 2879923 2935366 2932060 2948319 2945578 2859905 2823748 2880470
14998 2880470 2920040 2994832 2977256 2926112 2924823 2907457 2884149 2888498 2839166 2779696 2816564 2853026
14986 2853026 2917353 2925751 2904927 2953347 2902933 2937449 3019423 2998045 2935170 2960597 3042006
14975 3042006 2970649 2927165 2858211 2877024 2999302 2994905 2958685 2904206 2907541 2950744 2960974
14964 2960974 3093237 3140549 3025272 2921214 3088344 3094605 3001535 3010366 3039078 3041055 3043881
14953 3043881 2979759 2955496 2997930 2996692 2918729 3001478 3005184 2954105 2864584 2865139 3070269 3050956
14941 3050956 2995609 2858617 2861388 2934881 2985799 2942330 2837383 2895388 2947080 2988617 2892906
14930 2892906 2832986 2934728 2997913 3026979 3025982 3075185 3096287 3067653 3067672 3004499 3000595 2930655
14918 2930655 2889407 2983568 2973931 2990907 3016703 3039514 2931573 2954376 2982087 2950049 2959546
14907 2959546 2901582 2908648 3051815 3040572 3022587 3008596 2979905 2983612 2970551 2978854 3024017 3029850
14895 3029850 3014149 2944078 2974065 3050897 3032181 3012935 2997570 2953478 3051216 2989190 2926845
14884 2926845 3001673 2989853 2997351 3056550 3050754 2907692 2967486 2976027 2978632 3040201 3042265 3034889
14872 3034889 3071101 3017687 3079044 3026177 2943350 2942716 2947927 2991875 2988009 3032093 2962757 2951594
14860 2951594 3027521 3061113 3017554 2960501 3035691 3019388 2942755 2961499 2977970 2927430 2879936
14849 2879936 2907067 2898252 2963704 2962748 3045105 2953293 2962783 3030243 3002070 3042548 2984096 2904269
14837 2904269 2939474 2970398 2949519 2953666 2994803 3022598 3024668 2966909 2988656 2987232 2986614 3061237
14825 3061237 3066006 3017048 2961101 2946820 3000454 3014185 2930816 3042662 3054836 3083636 3020842
14814 3020842 3063304 2993482 3020018 2951448 2919990 2948302 3016107 3015487 2947406 2972499 3022123 3083145
14802 3083145 2985815 2983820 2980769 3004410 3104057 3019513 3031103 3008704 2908733 3094001 3082043
14791 3082043 3018710 3036197 3034445 3050021 3038473 3073329 3100089 3165814 3169927 3025328 2981872
14780 2981872 2976799 2991729 3031983 3129061 3092804 3034537 3023937 2980226 2994029 2988687 3071492 3134427
14768 3134427 2981398 3090400 3065675 2970387 2934458 2996872 3009332 3054438 3075305 2979138 2954314
14757 2954314 2979221 3125253 3189997 3103492 3029214 2993453 2989609 2948582 2970485 2972889 2969589 2983262
14745 2983262 2970827 3031885 3049574 2989379 2836043 2998603 3025571 3016992 3061917 3042626 2913894
14734 2913894 2959806 3005409 3086302 3079237 2992707 3009239 2993459 3062810 3035889 3056569 3043237
14723 3043237 3022759 2954267 2995296 3099632 3123342 3004534 2916051 2993592 3025934 2933371 2958745
14712 2958745 2968716 3007398 3153696 3132917 3066559 3084046 3172803 3091188 3174352 3179542 3089458
14701 3089458 3064897 3031261 3056682 2993218 2896248 2922086 2926073 3001077 3047070 3121090 3143981
14690 3143981 3090207 3109721 3030817 3057895 3068084 3078913 3103863 3197336 3124213 3065055 3158811
14679 3158811 3112215 3083527 3123017 3044836 3087623 3119782 3164593 3021659 3008842 3064440 3082550
14668 3082550 3172958 3013545 2960000 3067354 3104876 3113648 3067611 3043663 3096416 3184422 3199991
14657 3199991 3121230 3095039 3074896 3027059 3033723 3074906 3030049 3095334 3081500 2947856 3029234
14646 3029234 3018043 2957086 3027798 3046436 3033333 3008696 3123236 3070478 3024116 2956340 2921373
14635 2921373 3132325 3101837 3022527 3063557 3120839 2987892 2955626 3065175 3024432 3027822 3021120
14624 3021120 3108178 3071167 3048242 3076823 3130350 3105971 3108965 3112007 3062465 3161854 3170160 3064515
14612 3064515 3117576 3095782 3075623 2972919 2965423 3032138 3051882 3038562 2978488 3041732 3006877
14601 3006877 2967928 3059190 3097060 3053542 3048258 3066869 3072716 3080571 3143000 3088643 3081084 3042621
14589 3042621 3048753 3064027 2961349 2893265 3003968 3026507 2905640 2959809 3007896 3031501 3016397
14578 3016397 2954080 2925819 3014883 3047625 3102301 3086319 3107413 3103679 3018805 3049262 3052852 3063298
14566 3063298 2973756 3089787 3104864 3098981 3142101 3135462 3091247 3052773 3057306 3057185 2903585 2911531
14554 2911531 3006285 3057873 3052563 3059978 3055928 3040467 3102688 3050307 3170137 3197427 3154320 3075237
14542 3075237 3084910 3024790 2974197 3122505 2984952 3017022 3009730 2940804 2982610 3136243 3212541
14531 3212541 3094214 3128850 3108767 3118681 3045511 2926172 3032429 3137516 3041743 3062758 3143371
14520 3143371 3123386 3037819 3102185 3065208 3097533 3117107 3001681 3122459 3041243 3015265 2969736
14509 2969736 2999583 3069515 3023526 3080016 3038316 3075265 3140841 3069997 3053856 3081794 3060355
14498 3060355 3039055 2988812 2985483 3027836 3005557 2999035 3008502 3021482 3015587 3020060 3054785 3043823
14486 3043823 3010093 2958822 2985996 3042767 3072766 3054233 3033602 3035567 3011801 3003506 3143486
14475 3143486 3176846 3044396 3011655 3062995 3161558 3216009 3218806 3081648 3031744 3038571 3034985
14464 3034985 3113633 3135438 3050728 3057556 3151146 3076999 3089074 3158847 3092141 3042682 3111399
14453 3111399 3068951 3101455 3147063 3093358 3187419 3182263 3138609 3142951 3158568 3055331 3146692
14442 3146692 3180216 3172645 3171666 3110151 3083769 3005679 3028399 3022784 3122756 3119855 3092456 3149209
14430 3149209 3142460 3156985 3148899 3176263 3127593 3163996 3191007 3083119 3116819 3028070 3081010
14419 3081010 3124093 3157591 3091126 3090277 3029170 3053031 3056858 3082027 3145132 3215172 3187121 3171828
14407 3171828 3152260 3132327 3085886 3082838 3184696 3217774 3203504 3146178 3158183 3110894 3060074
14396 3060074 3146715 3164997 3170661 3277896 3233073 3217505 3126039 3105392 3111174 3208868 3146280
14385 3146280 3123109 3144166 3127869 3159445 3178459 3210202 3192583 3159261 3140443 3184450 3203418
14374 3203418 3279946 3227910 3187427 3143712 3148678 3208493 3119983 3049561 3087778 3164171 3203825
14363 3203825 3226309 3201110 3203964 3132207 3058240 2990527 3024959 3100121 3088041 2986631 3058023
14352 3058023 3095088 3094093 3046852 3080823 3073766 3116306 3135336 3195584 3224991 3127944 3118167 3033955
14340 3033955 3064065 3082060 3067960 3152872 3165622 3140208 3144106 3093252 3133181 3223537 3170013
14329 3170013 3238837 3271713 3284958 3139326 3116836 3083935 3070407 3057520 3059396 3118853 3122627
14318 3122627 3121338 3068876 3105196 3059162 3125556 3145764 3166737 3105730 3042830 3115015 3172697
14307 3172697 3074280 3075098 3119964 3202008 3197279 3284956 3283374 3243667 3197405 3245848 3216660 3042423
14295 3042423 3041409 3102835 3105194 3084188 3081451 3166049 3200273 3189770 3186445 3016722 3010216 3005847
14283 3005847 3039047 3045986 3143934 3188449 3267675 3191018 3080716 3188302 3256697 3184282 3110173
14272 3110173 3134624 3111804 3182418 3285802 3256520 3210645 3223358 3183286 3218877 3213146 3199706
14261 3199706 3144787 3167183 3174677 3196967 3268138 3208163 3246285 3217659 3176833 3198972 3246108
14250 3246108 3250610 3237337 3300731 3192975 3165249 3153712 3152557 3185277 3126757 3122232 3216704 3193468
14238 3193468 3143730 3199915 3158265 3106794 3238475 3211170 3240111 3270462 3144567 3220544 3234912
14227 3234912 3136763 3132729 3223067 3289624 3248567 3199602 3270448 3342483 3298349 3224898 3254745
14216 3254745 3254766 3211793 3200763 3113515 3131462 3176912 3175230 3137024 3190172 3240321 3160934 3139487
14204 3139487 3194631 3170519 3103116 3115766 3153648 3196498 3201598 3170193 3257777 3168637 3209917
14193 3209917 3305388 3346266 3266866 3249962 3302864 3248203 3235764 3217842 3223696 3215122 3209257 3226573
14181 3226573 3182538 3128507 3119482 3132347 3167134 3173758 3308180 3218665 3217704 3203999 3199277 3248617
14169 3248617 3209556 3238558 3199753 3185301 3193133 3106003 3242319 3325901 3349861 3300830 3263305
14158 3263305 3259503 3227764 3217636 3267458 3258728 3183666 3233022 3194450 3216815 3190408 3221672 3340804
14146 3340804 3227511 3145072 3276156 3332563 3251001 3231107 3265873 3229571 3271603 3246585 3144875
14135 3144875 3187261 3137740 3036772 3128016 3254141 3337164 3362525 3296445 3230700 3236408 3213355
14124 3213355 3150089 3048798 3017118 3203442 3268331 3216839 3214340 3193089 3162672 3231597 3159850
14113 3159850 3145969 3258904 3295352 3211093 3274895 3185305 3183016 3250066 3152841 3210201 3229551
14102 3229551 3154936 3162552 3242296 3233494 3237568 3328202 3325975 3270072 3236833 3245255 3217809 3140238
14090 3140238 3238433 3218768 3252832 3285881 3270201 3191182 3249365 3333673 3250292 3251757 3155264
14079 3155264 3148816 3148974 3147063 3185475 3100922 3046206 3041169 3039355 3134072 3152645 3202038 3293030
14067 3293030 3294990 3259305 3282535 3299898 3257864 3182747 3163625 3193625 3183670 3180484 3242337 3244947
14055 3244947 3176110 3107566 3166226 3201147 3151209 3189582 3278955 3294858 3230367 3291252 3399556
14044 3399556 3405379 3301989 3315920 3197133 3155255 3246115 3243664 3247757 3309331 3336771 3346113 3284438
14032 3284438 3257188 3305171 3316046 3314749 3335410 3320736 3269108 3264998 3308889 3269344 3256390 3284557
14020 3284557 3382710 3467501 3442951 3313420 3267845 3272423 3240101 3211265 3077870 2999473 3197502
14009 3197502 3275432 3294884 3362658 3415983 3284066 3268744 3233201 3220908 3273922 3230545 3255490
13998 3255490 3360969 3306435 3212100 3212993 3191984 3166250 3195314 3200915 3304554 3319997 3196914
13987 3196914 3210005 3173386 3209446 3188554 3199188 3225615 3256986 3263120 3298059 3305290 3290967 3201330
13975 3201330 3190029 3249151 3264270 3261996 3180567 3234411 3264843 3128988 3186883 3265333 3260994
13964 3260994 3236148 3133801 3212410 3297782 3381020 3457896 3389119 3442978 3357669 3367660 3407235
13953 3407235 3340219 3266262 3199950 3175987 3247899 3294903 3389733 3379771 3348478 3401426 3384939
13942 3384939 3298771 3239466 3237257 3237416 3282635 3223676 3168094 3200380 3247837 3247866 3175170 3233898
13930 3233898 3292829 3276406 3304047 3239252 3198096 3297647 3277309 3280534 3343667 3419203 3317066
13919 3317066 3228052 3347470 3387345 3350213 3284218 3364785 3365210 3365786 3321850 3285820 3384074 3380616
13907 3380616 3347912 3242148 3324307 3313195 3296174 3352209 3283142 3339067 3286178 3306936 3316089
13896 3316089 3332005 3289541 3138059 3211595 3252568 3247948 3336678 3300410 3268875 3355352 3371743
13885 3371743 3282371 3281777 3267802 3280781 3264416 3224288 3319915 3351842 3287807 3262677 3297534 3273217
13873 3273217 3199426 3208759 3162965 3179004 3292501 3244589 3288536 3384492 3422169 3325731 3278303
13862 3278303 3314225 3356000 3341349 3235516 3324869 3335512 3374445 3384453 3284980 3345361 3333261
13851 3333261 3295557 3298170 3306276 3289588 3400639 3396000 3350003 3308161 3324759 3273655 3196562 3288552
13839 3288552 3375005 3353137 3273500 3352743 3415908 3411070 3443096 3391168 3338132 3408442 3393837
13828 3393837 3318157 3319474 3315368 3349148 3331419 3288529 3302565 3273373 3275282 3222563 3262057 3257814
13816 3257814 3351612 3444131 3366597 3411994 3406298 3306285 3312275 3341396 3287699 3184859 3332987
13805 3332987 3332379 3342221 3433289 3405488 3327875 3265410 3238968 3250412 3295008 3274754 3330908 3408474
13793 3408474 3325703 3293487 3297753 3354690 3401072 3454279 3422749 3412314 3409962 3373382 3288439 3329721
13781 3329721 3328080 3373970 3335149 3299781 3360736 3316963 3307631 3312387 3366201 3394047 3359152 3335700
13769 3335700 3231691 3174873 3160776 3193386 3296192 3293179 3296404 3326796 3331175 3207894 3359811
13758 3359811 3410156 3294197 3240136 3269657 3334482 3466590 3423574 3362772 3347437 3373943 3337843
13747 3337843 3353378 3280335 3398496 3400475 3365243 3430014 3343882 3435792 3446018 3445706 3417012 3428540
13735 3428540 3447696 3293299 3324155 3340702 3333242 3365830 3356478 3326050 3312904 3374451 3420219
13724 3420219 3486879 3443509 3425529 3388457 3376828 3363990 3400021 3334386 3341027 3373576 3364807 3366178
13712 3366178 3423381 3352891 3375697 3405090 3399480 3401970 3317239 3404611 3432073 3361403 3330070 3371102
13700 3371102 3415925 3456923 3426761 3415078 3410381 3431327 3305430 3306755 3307451 3308927 3338416 3261651
13688 3261651 3226714 3264760 3407491 3416304 3450893 3456139 3348548 3402949 3339195 3347277 3327252
13677 3327252 3323083 3340650 3353325 3433923 3262772 3316959 3364801 3309094 3330425 3223209 3285048
13666 3285048 3335840 3390274 3389998 3381524 3401717 3391260 3508236 3419071 3368108 3353556 3369565 3426810
13654 3426810 3407690 3400135 3295081 3352396 3363820 3389332 3434725 3408013 3448788 3439794 3384230
13643 3384230 3343024 3414107 3494039 3438245 3380106 3316060 3329738 3426927 3513129 3602055 3514256
13632 3514256 3436785 3448620 3464311 3436410 3410700 3406864 3328200 3430024 3460349 3386503 3436887
13621 3436887 3382254 3416672 3373655 3398683 3476303 3475729 3405218 3394066 3437331 3379715 3435080 3411820
13609 3411820 3377746 3382627 3341881 3284139 3342017 3409117 3361511 3461745 3528488 3400306 3357361
13598 3357361 3301543 3364468 3364951 3305144 3314360 3329037 3361457 3309916 3385508 3344493 3251228 3339783
13586 3339783 3398036 3370054 3452235 3446528 3384390 3360850 3345597 3365163 3371118 3321129 3457204
13575 3457204 3481838 3379444 3418582 3424570 3361845 3401110 3421562 3423394 3372633 3311582 3262757
13564 3262757 3373743 3391291 3399136 3433124 3455058 3467687 3453242 3457165 3440354 3384620 3413041
13553 3413041 3373661 3458490 3357711 3321067 3334098 3330013 3453285 3365543 3346782 3415922 3462600
13542 3462600 3415236 3398919 3424255 3397819 3437615 3313200 3270730 3356399 3260181 3399632 3389632
13531 3389632 3410594 3372117 3360142 3289763 3240540 3365772 3316847 3428699 3450713 3453679 3486291
13520 3486291 3391691 3431641 3373281 3509362 3404794 3415311 3477861 3357308 3434190 3458767 3368125
13509 3368125 3424559 3496878 3482430 3446116 3473785 3415316 3499950 3502885 3438991 3488588 3394800
13498 3394800 3370406 3401589 3436413 3392853 3449739 3534868 3540469 3525919 3474344 3541359 3577547
13487 3577547 3442698 3281672 3279595 3374737 3476461 3517019 3526570 3523093 3501006 3385630 3406127
13476 3406127 3407394 3391717 3406551 3468702 3569233 3547536 3468247 3331690 3387369 3378016 3263624
13465 3263624 3319887 3359504 3449181 3546269 3550439 3477363 3512831 3482679 3312496 3436536 3436979
13454 3436979 3392464 3513973 3482182 3452360 3365899 3425643 3469472 3524264 3555052 3429395 3470153
13443 3470153 3425568 3383072 3479546 3415901 3430316 3394754 3393486 3353549 3358319 3330469 3322160 3446958
13431 3446958 3391295 3487065 3502487 3489356 3490426 3456970 3374074 3461872 3582190 3531342 3563030
13420 3563030 3564273 3393017 3485147 3405162 3466982 3477345 3527115 3492314 3487501 3541822 3563420
13409 3563420 3510287 3442396 3443884 3475622 3412388 3434749 3472408 3433983 3460445 3588346 3631862
13398 3631862 3553211 3596207 3493682 3508986 3539958 3509688 3500772 3500611 3504748 3445605 3491946 3448641
13386 3448641 3372940 3450001 3496828 3576778 3575968 3490495 3482673 3424898 3393520 3329310 3458862 3441054
13374 3441054 3558245 3671167 3621075 3578647 3409475 3448280 3384044 3485654 3460636 3453133 3462320
13363 3462320 3391461 3418248 3424336 3431131 3500109 3417013 3544515 3562885 3566561 3507352 3518851 3473098
13351 3473098 3484747 3625533 3637144 3633947 3562203 3473016 3488711 3526161 3492446 3502859 3510161
13340 3510161 3434458 3538745 3539506 3378867 3365522 3374393 3432078 3458163 3506471 3546739 3556951
13329 3556951 3565566 3542898 3428353 3347487 3341111 3405820 3414150 3502751 3490701 3551527 3475944 3435341
13317 3435341 3431286 3474913 3584752 3565992 3534198 3390842 3401761 3521721 3614778 3696737 3577201
13306 3577201 3495602 3538704 3553323 3596055 3457841 3520230 3412295 3454700 3528095 3505996 3569795
13295 3569795 3523572 3437031 3475609 3555119 3517465 3510398 3546991 3494630 3521659 3503310 3479416
13284 3479416 3531394 3438150 3364804 3402267 3484727 3459531 3408357 3414146 3485114 3515237 3491376
13273 3491376 3487035 3550751 3548438 3550572 3530197 3504762 3465015 3481391 3481153 3474467 3454295 3439463
13261 3439463 3482800 3507240 3545391 3526961 3471288 3371191 3392117 3455670 3510867 3661428 3613461
13250 3613461 3461857 3486838 3529312 3567931 3591750 3457999 3378397 3397724 3438832 3453700 3640029
13239 3640029 3659813 3704239 3610300 3420785 3446571 3433871 3465596 3559547 3654696 3623340 3537885
13228 3537885 3573997 3471133 3509144 3627164 3515279 3536140 3534206 3477051 3474534 3499901 3497940
13217 3497940 3453816 3508535 3567462 3571533 3510195 3541888 3557320 3557528 3625116 3561473 3562199 3575820
13205 3575820 3556744 3531604 3469221 3540267 3565640 3580360 3673725 3634653 3609802 3591569 3523893
13194 3523893 3528115 3591753 3529403 3579932 3662757 3658001 3680291 3581994 3616278 3703209 3559472
13183 3559472 3584004 3694981 3687240 3560592 3590470 3519354 3617999 3662711 3542356 3556335 3488582
13172 3488582 3508351 3555675 3620466 3612712 3500765 3591363 3583392 3560847 3709018 3537621 3556573
13161 3556573 3494210 3445768 3477800 3586556 3497791 3424033 3465690 3442761 3454623 3502416 3529795
13150 3529795 3602379 3714057 3691970 3646032 3628216 3632047 3548078 3559624 3494400 3611151 3570166
13139 3570166 3599121 3652241 3617101 3634914 3611237 3612746 3599893 3645527 3623859 3554670 3537379
13128 3537379 3586033 3652437 3621412 3563500 3523413 3511993 3525759 3480637 3521825 3621946 3699162
13117 3699162 3665222 3560146 3541922 3534027 3662105 3584599 3530630 3608264 3589168 3604178 3511677
13106 3511677 3497624 3550986 3534726 3624733 3570235 3620612 3726108 3723470 3611000 3603937 3536679
13095 3536679 3506305 3628058 3613296 3620028 3589685 3628684 3672834 3634613 3594287 3624511 3616436
13084 3616436 3513496 3523401 3544267 3507256 3551508 3616993 3619075 3585129 3615936 3597397 3652987
13073 3652987 3689208 3568375 3522066 3635881 3441978 3472298 3487471 3460474 3542463 3611295 3559215
13062 3559215 3614094 3661994 3673414 3725954 3663831 3615824 3629150 3623798 3498666 3469832 3604425
13051 3604425 3624749 3534181 3578147 3600582 3726004 3642393 3574246 3560790 3533775 3539939 3588210
13040 3588210 3650467 3600295 3624291 3658812 3625382 3539524 3494508 3610398 3699275 3702058 3614978
13029 3614978 3584460 3721060 3690670 3736280 3701737 3641545 3588211 3631697 3628462 3589180 3652417
13018 3652417 3693696 3640276 3730586 3661582 3604579 3580246 3556625 3500642 3570164 3591813 3544595
13007 3544595 3616898 3667842 3747747 3638161 3617409 3671476 3743195 3667671 3619000 3590353 3738971
12996 3738971 3704899 3687024 3606390 3595562 3600704 3682932 3731106 3660289 3712213 3658883 3609992
12985 3609992 3614209 3622708 3737119 3666409 3658996 3691294 3672153 3600898 3624300 3677168 3603135 3646387
12973 3646387 3700833 3691886 3734408 3746435 3759194 3656720 3708370 3728390 3677116 3704206 3572797
12962 3572797 3647435 3718347 3626033 3568617 3569632 3565843 3604986 3625870 3706278 3671910 3550327
12951 3550327 3559415 3584953 3687871 3798859 3749756 3780610 3780843 3716192 3684304 3594084 3606459
12940 3606459 3687109 3740200 3705870 3647998 3645584 3671412 3704734 3672188 3664800 3643106 3633551 3748449
12928 3748449 3760327 3698968 3673126 3666356 3634009 3549892 3569504 3541239 3648235 3686017 3845243
12917 3845243 3770798 3653717 3599045 3510206 3644459 3615834 3701244 3738160 3653546 3653096 3571205
12906 3571205 3631897 3597042 3642406 3647526 3592244 3592506 3587482 3616455 3646100 3701967 3721490 3619175
12894 3619175 3602222 3645810 3679967 3686364 3661794 3687083 3678362 3718450 3738209 3744196 3754469 3703540
12882 3703540 3644782 3656221 3609904 3589230 3524608 3549967 3655927 3653237 3628916 3703943 3771740
12871 3771740 3547790 3479399 3548698 3566992 3674744 3631296 3528276 3526610 3591630 3612351 3708467
12860 3708467 3608167 3711931 3701419 3635909 3622348 3665783 3744728 3785011 3753162 3711885 3652887
12849 3652887 3613582 3700231 3580508 3540668 3620023 3595216 3610305 3630828 3696902 3625206 3556193
12838 3556193 3619647 3719761 3762606 3677344 3802351 3746866 3695606 3748301 3717733 3622106 3704893
12827 3704893 3788652 3706958 3668059 3653468 3677493 3624395 3692075 3675470 3686199 3779218 3725279
12816 3725279 3696798 3627946 3789825 3839001 3789571 3756847 3693885 3671396 3748704 3652325 3668606
12805 3668606 3753865 3806127 3767250 3718688 3692305 3732735 3781529 3726894 3762247 3795998 3777675
12794 3777675 3793148 3794248 3683574 3694980 3739487 3745388 3766484 3835954 3761911 3727180 3698907
12783 3698907 3683756 3635650 3608805 3618566 3592852 3692130 3688844 3771253 3826854 3798111 3805162 3735654
12771 3735654 3792328 3732238 3767943 3719639 3775759 3836330 3855690 3819455 3790257 3710462 3685427
$$ [...]
##END NTUPLES=NMR SPECTRUM
##END=
