##TITLE=1H_CA-8843-1
 CDCl3, 8 sc, 
 9.04.2021
##JCAMPDX= 6.0         $$ Bruker NMR JCAMP-DX V2.0
##DATA TYPE= NMR SPECTRUM
##DATA CLASS= NTUPLES
##ORIGIN= UXNMR, Bruker Analytische Messtechnik GmbH
##OWNER= root
$$ XWIN-NMR		Version 3.5
$$ Fri Apr  9 11:18:52 2021 Russian Standard Time (UT+4h)  she@DPX200
##.OBSERVE FREQUENCY= 200.131506
##.OBSERVE NUCLEUS= ^1H
##.ACQUISITION MODE= SIMULTANEOUS
##.ACQUISITION SCHEME= undefined
##.AVERAGES= 8
##.DIGITISER RES= 18
##SPECTROMETER/DATA SYSTEM= spect
##.PULSE SEQUENCE= zg30
##.SOLVENT NAME= CDCl3
##.SHIFT REFERENCE= (INTERNAL, CDCl3, 0, 15.9699)
##AUDIT TRAIL= $$ (NUMBER, WHEN, WHO, WHERE, WHAT)
$$ ##TITLE= Audit trail, XWIN-NMR		Version 3.5
$$ ##JCAMPDX= 5.01
$$ ##ORIGIN= Bruker BioSpin GmbH
$$ ##OWNER= she
$$ F:/spectra/data/she/nmr/H-F/1/pdata/1/auditp.txt
$$ ##AUDIT TRAIL=  $$ (NUMBER, WHEN, WHO, WHERE, WHAT)
(   1,<2021-04-09 11:16:05.04 +0400>,<she>,<DPX200>,
      <created by zg, POWCHK disabled, PULCHK disabled
       configuration hash MD5:
       00 E9 B6 7A A2 85 ED C7 34 08 36 98 17 FE 4E 26
       data hash MD5: 16K
       29 92 24 1F 6C 63 1B 7E B7 DB 38 BA EE 88 AC ED>)
(   2,<2021-04-09 11:16:33.59 +0400>,<she>,<DPX200>,
      <Start of raw data processing
       efp BC_mod = 2 LB = 0.24 FT_mod = 6 PKNL = 1 PHC0 = -11124.03 PHC1 = 16.60092 SI = 16K 
       data hash MD5: 16K
       08 13 C0 66 8C A1 5E 2E D7 64 5E 62 65 EA D4 0D>)
(   3,<2021-04-09 11:16:57.48 +0400>,<she>,<DPX200>,
      <pk PHC0 = 2.996501 PHC1 = -4.4 
       data hash MD5: 16K
       CE C6 0A B8 C8 35 97 14 81 E1 46 29 51 8D 34 8F>)
(   4,<2021-04-09 11:17:00.95 +0400>,<she>,<DPX200>,
      <abs ABSG = 5 
       data hash MD5: 16K
       7F 27 46 0C 0E 97 45 81 96 5D 53 97 0D 96 94 E9>)
$$ ##END=
$$ 
$$ hash MD5
$$ 0C BE 75 15 9A A0 2F 52 96 D5 B9 90 50 82 61 66
##$RELAX= 
##$RELAX= 
##$RELAX= 
##$RELAX= 
##$RELAX= 
##$RELAX= 
$$ Bruker specific parameters
$$ --------------------------
##$DU= <F:/spectra>
##$EXPNO= 1
##$NAME= <H-F>
##$PROCNO= 1
##$TYPE= <nmr>
##$USER= <she>
##$AMP= (0..31)
100 100 100 100 100 100 100 100 100 100 100 100 100 100 100 100 100 100 
100 100 100 100 100 100 100 100 100 100 100 100 100 100 
##$AQSEQ= 0
##$AQ_mod= 1
##$AUNM= <au_zg>
##$AUTOPOS= <>
##$BF1= 200.13
##$BF2= 200.13
##$BF3= 200.13
##$BF4= 200.13
##$BF5= 200.13
##$BF6= 200.13
##$BF7= 200.13
##$BF8= 200.13
##$BYTORDA= 1
##$CFDGTYP= 0
##$CFRGTYP= 5
##$CHEMSTR= <none>
##$CNST= (0..31)
1 1 145 1 1 1 1 1 1 1 1 1 1 1 1 1 1 1 1 1 1 1 1 1 1 1 1 1 1 1 1 1 
##$CPDPRG= <>
##$CPDPRG1= <>
##$CPDPRG2= <>
##$CPDPRG3= <>
##$CPDPRG4= <mlev>
##$CPDPRG5= <mlev>
##$CPDPRG6= <mlev>
##$CPDPRG7= <mlev>
##$CPDPRG8= <mlev>
##$CPDPRGB= <>
##$CPDPRGT= <>
##$D= (0..31)
0 1.2 0 0 0 0 0 0 0 0.06 0 0.03 0 0 0 0 0.0002 0 0 0 0 0 0 0 0 0 0 0 0 
0 0 0 
##$DATE= 1617952564
##$DBL= (0..7)
120 120 120 120 120 120 120 120 
##$DBP= (0..7)
150 150 150 150 150 150 150 150 
##$DBP07= 0
##$DBPNAM0= <>
##$DBPNAM1= <>
##$DBPNAM2= <>
##$DBPNAM3= <>
##$DBPNAM4= <>
$$ [...]
##$SUBNAM3= <"">
##$SUBNAM4= <"">
##$SUBNAM5= <"">
##$SUBNAM6= <"">
##$SUBNAM7= <"">
##$SUBNAM8= <"">
##$SUBNAM9= <"">
##$SW= 16.9725357007746
##$SWIBOX= (0..15)
0 0 2 0 0 0 0 0 0 0 0 0 0 0 0 0 
##$SW_h= 3396.73913043478
##$TD= 16384
##$TD0= 1
##$TE= 0
##$TE2= 300
##$TE3= 300
##$TEG= 300
##$TL= (0..7)
0 120 120 120 120 120 120 120 
##$TP= (0..7)
150 150 150 150 150 150 150 150 
##$TP07= 0
##$TPNAME0= <>
##$TPNAME1= <>
##$TPNAME2= <>
##$TPNAME3= <>
##$TPNAME4= <>
##$TPNAME5= <>
##$TPNAME6= <>
##$TPNAME7= <>
##$TPOAL= (0..7)
0.5 0.5 0.5 0.5 0.5 0.5 0.5 0.5 
##$TPOFFS= (0..7)
0 0 0 0 0 0 0 0 
##$TUNHIN= 0
##$TUNHOUT= 0
##$TUNXOUT= 0
##$USERA1= <user>
##$USERA2= <user>
##$USERA3= <user>
##$USERA4= <user>
##$USERA5= <user>
##$V9= 5
##$VALIST= <valist>
##$VCLIST= <CCCCCCCCCCCCCCC>
##$VD= 0
##$VDLIST= <DDDDDDDDDDDDDDD>
##$VPLIST= <PPPPPPPPPPPPPPP>
##$VTLIST= <TTTTTTTTTTTTTTT>
##$WBST= 1024
##$WBSW= 4
##$XGAIN= (0..3)
0 0 0 0 
##$XL= 0
##$YL= 0
##$YMAX_a= 156618
##$YMIN_a= -140353
##$ZGOPTNS= <>
##$ZL1= 120
##$ZL2= 120
##$ZL3= 120
##$ZL4= 120
##$ABSF1= 15.99578
##$ABSF2= -0.9768839
##$ABSG= 5
##$ABSL= 3
##$ALPHA= 0
##$AQORDER= 0
##$ASSFAC= 0
##$ASSFACI= 0
##$ASSFACX= 0
##$ASSWID= 0
##$AUNMP= <proc_1d>
##$AZFE= 0.1
##$AZFW= 0.1
##$BCFW= 0
##$BC_mod= 2
##$BYTORDP= 0
##$COROFFS= 0
##$CY= -3
##$DATMOD= 1
##$DC= 0
##$DFILT= <>
##$DTYPP= 0
##$F1P= 0
##$F2P= 0
##$FCOR= 1
##$FTSIZE= 16384
##$FT_mod= 6
##$GAMMA= 0
##$GB= 0
##$INTBC= 1
##$INTSCL= 3.559346e-10
##$ISEN= 128
##$LB= 0.24
##$LEV0= 0
##$LPBIN= 0
##$MAXI= 10000
##$MC2= 0
##$MEAN= 0
##$ME_mod= 0
##$MI= 1.114404
##$NCOEF= 0
##$NC_proc= -9
##$NLEV= 6
##$NOISF1= 3.799351
##$NOISF2= 2.8
##$NSP= 0
##$NTH_PI= 0
##$NZP= 0
##$OFFSET= 15.96988
##$PC= 1
##$PHC0= -11121.03
##$PHC1= 12.20092
##$PH_mod= 1
##$PKNL= yes
##$PPARMOD= 0
##$PSCAL= 0
##$PSIGN= 0
##$REVERSE= no
##$SF= 200.13000831695
##$SI= 16384
##$SIGF1= 3
##$SIGF2= 2
##$SINO= 5.538805
##$SIOLD= 16384
##$SREGLST= <1H.CDCl3>
##$SSB= 0
##$STSI= 16384
##$STSR= 0
##$SW_p= 3396.73913043479
##$SYMM= 0
##$S_DEV= 0
##$TDeff= 16384
##$TDoff= 0
##$TI= <>
##$TILT= no
##$TM1= 0
##$TM2= 0
##$TOPLEV= 0
##$USERP1= <user>
##$USERP2= <user>
##$USERP3= <user>
##$USERP4= <user>
##$USERP5= <user>
##$WDW= 1
##$XDIM= 16384
##$YMAX_p= 480779379
##$YMIN_p= -2573252
$$ End of Bruker specific parameters
$$ ---------------------------------
##NTUPLES= NMR SPECTRUM
##VAR_NAME=  FREQUENCY,     SPECTRUM/REAL,   SPECTRUM/IMAG
##SYMBOL=    X,             R,               I
##VAR_TYPE=  INDEPENDENT,   DEPENDENT,       DEPENDENT
##VAR_FORM=  AFFN,          ASDF,            ASDF
##VAR_DIM=   16384,         16384,           16384
##UNITS=     HZ,            ARBITRARY UNITS, ARBITRARY UNITS
##FACTOR=    0.207333158178282, 1,           1
##FIRST=     3196.05223804721, 0,            0
##LAST=      -200.686892387579, 0,           0
##MIN=       -200.686892387579, -2573252,    0
##MAX=       3196.05223804721, 480779379,    0
$$ Real data points
##PAGE= N=1
##DATA TABLE= (X++(R..R)), XYDATA
$$ [...]
6178I02809o95880K34649r7894O4424k90387J8352N31046L32029L9407p50355
6168B88200l28722J87091J24237m10109r4618M1029P05412J7219l60508o0688
6158A08543K34107m00344O97675n96217k42358P61603P55156n98581Q9912o62576
6148A46920N53716M86029j567527n48891N03318J096553j19713k3748M35011k44488
6138G17180L93197m2321q44378n9699K93498j1885l61124K81601N87218k85582
6128F67705n56401J30148J54045N51148N30703N88682m25198m6163l52025K52197
6118A494841L55184j549971R5376r4672j41956N9216Q3618K95339O0579J28368
6108G85922m71253J75289N7200R2566M81739K81300l67879l08390l89777P40924
$$ y = [902809, 206929, 441578, 343684, 408108, 117721, 136073, 667119, 999148, 1038555, 288200, -40522, 146569, 270806, -139303, -233921, -192892, 512520, 529739, 169231, 108543, 342650, -57694, 639981, 43764, -198594, 563009, 1318165, 719584, 809496, 146920, 700636, 1186665, -380862, -929753, -426435, 670118, 550405, 526657, 961668, 717180, 1110377, 1068056, 223678, 163979, 457477, 445592, 84468, 366069, 953287, 667705, 111304, 241452, 395497, 946645, 1477348, 2066030, 1640832, 1594669, 1242644, 1494841, 1850025, 300054, 395430, 300758, 158802, 218018, 301636, 596975, 657554, 785922, 314669, 489958, 547158, 639724, 1121463, 1402763, 1034884, 726494, 336717, 1077641]
6098A077641M8235n4451O5014K78418m03816j48283n57340j80365K50364J53063
6088E28480j43237j62888l1465O28462K31022l6636k68768o6247M99219Q1388
6078A259330l27989j65879n95992K00991N3936M61148R3039o4468L99696j05984
6068A207828j30779o92535k64553j9188K26825L82164l45681o27210N3390J115002
6058I05263k35825k89299M7692m5796m31101O43554O58480M7109N5787p7100j282367
6047c603j07149J43240M771m14068m08439N35604J97071M50255j22114Q48972
6037A124540p08694j20045K41730O76106J11303j004917j04013L01479O9177L5409
6027F22075J01721m92134L78668N06298p24649L18193N1345R9446r13O6890j92730
$$ y = [1077641, 1125876, 1071425, 1136439, 1414857, 1011041, 862758, 305418, 125053, 375417, 528480, 385243, 222355, 190890, 819352, 1050374, 1013738, 744970, 678723, 1177942, 1259330, 931341, 765462, 169470, 370461, 424397, 885545, 978584, 914116, 1313812, 1207828, 1077049, 384514, 119961, 100773, 327598, 709762, 364081, -263129, -209739, 905263, 669438, 380139, 427831, 382035, -49066, 594488, 1252968, 1300077, 1355864, 1278764, -3603, -110752, 32488, 37259, -376809, -785248, -249644, -52573, 397682, 275568, 1124540, 415846, 295801, 537531, 1213637, 1324940, 320023, 216010, 517489, 586666, 622075, 723796, 231662, 610330, 1116628, 391979, 710172, 761517, 860963, 860050, 926940, 734210]
6016G34210M8256L58023J70604j21547j78428l34118N3111m02480n36700K65974
6006E6905K76977P3816P39194M4724L30388q75025j77020o8197n18099J221791
5996A105454N82968q41657J47944J67689n87667k4549J24815p12252q5720L80508
5986B57533J058005l82964q64209M92236L62993m55546K1418n63255Q6568J0731
5976B3510R84383N17012k99918o10993o6617J99320k69949O4314l57913o0696
5966A22453K73673O51884J35756l07972n72764M05887L96528p98137L29024L71147
5956A007479m11775j19462k39276Q4741O37632o03474L12810P0892p31030P54971
5946G63508J72634l54718l31763L18179J86752k69562m16758J056020n87982m1837
$$ y = [734210, 782466, 1140489, 1311093, 1189546, 1011118, 677000, 730111, 327631, -209069, 56905, 333882, 407698, 1146892, 1191616, 1522004, 646979, 469959, 401762, -116337, 1105454, 1688422, 846765, 994709, 1162398, 574731, 550182, 674997, -37255, -122975, 257533, 1315538, 932574, 68365, 560601, 923594, 468048, 489466, -73789, 12779, 23510, 1007893, 1524905, 1224987, 613994, 547377, 746697, 476748, 541062, 183149, 122453, 396126, 1048010, 1183766, 875794, 303030, 708917, 1105445, 307308, 636332, 1007479, 595704, 476242, 236966, 321707, 959339, 355865, 668675, 739567, 8537, 763508, 936142, 581424, 249661, 567840, 754592, 485030, 68272, 1124292, 536310, 494473]
5936D94473m77621P29747P32406p23823o94933K96989J25574N6699J47647n05466
5926A81692Q81629Q94954n72666R891q65424o57641M20038p32796Q98796j77194
5916B81279k5376M81131k79342Q0610m86055Q56500J21707j034543l15100Q78729
5906E59540p44j32262J18224O45561k9832n82957k82034N96371j72191m66428
5896B53248M25031l76878n3600J089625k49864J84194l69414K29596k67856m99037
5886C65045K27071J05397L96091p34104L07836R42603p20044o88867k8031l04719
5876a31722M55131M67002L89487M28925r7598k08516m38946K44078k19154m50413
5866D38274Q1670j72160N73388J44615J16375m99860J13831k77130q6884O219
$$ y = [494473, 16852, 746599, 1479005, 755182, 60249, 357238, 482812, 539511, 687158, 181692, 1063321, 1958275, 1385609, 1395500, 530076, -127565, 292473, -440323, 458473, 281279, 255903, 737034, 457692, 538302, 52247, 908747, 1030454, -4089, -319189, 559540, 558796, 426534, 544758, 1190319, 1160487, 577530, 295496, 891867, 719676, 253248, 678279, 301401, 247801, 1337426, 1087562, 1271756, 902342, 1131938, 864082, 365045, 592116, 697513, 1093604, 359500, 667336, 1609939, 889895, 201028, 172997, -131722, 323409, 790411, 1179898, 1608823, 1511225, 1302709, 863763, 1107841, 888687, 438274, 519944, 347784, 921172, 1065787, 1182162, 682302, 796133, 519003, 432119, 438338]
5856D38338j50443m9961Q48090R4548o29121Q30140M83338o29216m91274O46782
5846A391221l37904l90496O30284N99449q6420J71261r37551o04656O9590M33781
5836I38559m030r3725N75136M14589K9946n56749q46663O28063N99395N82316
5826B266837J08840K7493n78696n15306J48806m30965j88659Q3160L72514q28259
5816D65765J187471m24232J27574j53232j26953n9612m89136N57142K05314K90769
5806A580870k96958n11582K62274K3582l41394J13211M31131r75201L32162P35998
5796A354093K28899m53076o12123k31827L50385j4169m46318L00231N1001m62033
5786F5063O7630O88822K41395l10974m2401M8105J2676m09814O14493k74798J86652
$$ y = [438338, 287895, 237934, 1086024, 1180572, 551451, 1381591, 1864929, 1235713, 744439, 1391221, 1053317, 662821, 1293105, 1892554, 1806134, 1977395, 1039844, 435188, 504778, 938559, 934529, 840804, 1415940, 1830529, 1860475, 1303726, 457063, 1085126, 1684521, 2266837, 2375677, 2403170, 1824474, 1309168, 1457974, 1027009, 838350, 921510, 1294024, 465765, 1653236, 1229004, 1356578, 1203346, 1076393, 1016781, 527645, 1084787, 1290101, 1580870, 1283912, 772330, 1034604, 1058186, 716792, 830003, 1261134, 285933, 618095, 1354093, 1582992, 1129916, 517793, 285966, 636351, 622182, 175864, 476095, 527096, 65063, 132693, 821515, 1062910, 751936, 709535, 757640, 770316, 360502, 974995, 700197, 886849]
5775H86849N98104n25151O1498J93193o76595n38748Q01261K38274m89281M72089
5765A021493k51798M2502M12365m28786K78070n75517j09169n17459O20197j70453
5755C21445O0590O48998N005L00646m83839q8417k91942N4631M35846J63186j93115
5744I33034R146l43388o96338o8956N41949P28944P56097j42045j67927r4716
5734A455800K24327K61576m63590l77953n32023j18999N58224m51202j62528R65274
5724A358906l933j60204n78796j81703O17678M62994k74802K70135L88914l00582
5714A598607m81809J55171P6989q5606m05102j67542j49000L39841n20100K06102
5704E67551L61589J5797N84641o56809l73217k8844P01385L19467l85449O80429
$$ y = [886849, 1484953, 959802, 1021300, 1214493, 537898, -850, 800411, 1038685, 549404, 1021493, 769695, 812197, 1224562, 795776, 1073846, 498329, 389160, -128299, 491898, 321445, 382035, 1031033, 1036038, 1336684, 852845, 764428, 472486, 527117, 962963, 1126149, 933034, 942180, 598792, -97546, -166502, 375447, 1104391, 1860488, 1718443, 1550516, 1455800, 1680127, 1941703, 1478113, 1100160, 568137, 449138, 1007362, 556160, 393632, 1358906, 1354973, 1194769, 615973, 434270, 1051948, 1514942, 1240140, 1510275, 1899189, 1598607, 1116798, 1271969, 1348958, 1263352, 858250, 690708, 541708, 881549, 361449, 567551, 929140, 944937, 1529578, 872769, 499552, 470708, 1172093, 1491560, 1106111, 1786540]
5694A786540K00652q09394k54317M09379j74378N75001K34905m49475m19011r0348
5684A009554j69233j54400K15970K23893K30553l31329j24554N27110L85563q4521
5674A728606n09626L09077o67024n60357J115450K78708j187896l89889J3030
5665A30079M31547L00039J11334l51072m6385J41310J53591Q4753k41923J11275
5655H24548j72655M99141l7096m62034j65737K55152l10589L67998l49276M87699
5645I37151J113757m96636n16965o728J06133N7241P8559J9680N81141m30467
5635A442866j53771o35208l6589K74755l17431N46847L92817j71978j14610K0187
5625A247885J16488M0629K78699K06644n13436N78830M2504j061871r17649N41068
$$ y = [1786540, 1987192, 1177798, 923481, 1332860, 1158482, 1733483, 1968388, 1518913, 1099902, 1009554, 840321, 685921, 901891, 1125784, 1356337, 1025008, 900454, 1427564, 1813127, 1728606, 1218980, 1528057, 861033, 300676, 1416126, 1694834, 506938, 117049, 130079, 561626, 861665, 972999, 621927, 575542, 716852, 870443, 955196, 713273, 824548, 651893, 1151034, 1113938, 651904, 486167, 741319, 430730, 798728, 449452, 937151, 2050908, 1554272, 1037307, 1030579, 1136712, 1193953, 1272512, 1292192, 1873333, 1442866, 1289095, 653887, 617298, 892053, 574622, 1121469, 1514286, 1342308, 1227698, 1247885, 1364373, 1405002, 1683701, 1890345, 1376909, 1955739, 1998243, 936372, 18723, 559791]
5615E59791N29234P02812j57222k80332j88668K32982L33407m29436l53869N24767
5605A473466R7573o44277N75206M74748L11550j079530k89061L6176m60846M11523
5595I06528N68368M21606j00852L7323M62155n95089n5172N41960l71312p827
5585A807688n9070n04973m72482K25233L40685k97780L12003J497j57188M78383
5575A673996N25944j041600k09437P38876k68933j81834J17681M53584J95115
5566B003392O57525o64505J96162j55753n9266K82750O06822o17424m73471l96935
5556A379297N13577j19534M46439m59711l45556L55267l68849o8211O74832N5449
5546B063000q33064K16353j41162N10620P8521O81767q5686m6814p40167m19026
$$ y = [559791, 1089025, 1791837, 1634615, 1354283, 1165615, 1398597, 1732004, 1302568, 948699, 1473466, 1571039, 926762, 1501968, 1976716, 2288266, 1208736, 919675, 955851, 495005, 906528, 1474896, 1896502, 1795650, 1832973, 2295128, 1700039, 1644867, 2186827, 1815515, 1807688, 1748618, 1243645, 771163, 996396, 1337081, 1039301, 1351304, 1352801, 1195613, 1673996, 2199940, 1158340, 948903, 1687779, 1418846, 1237012, 1354693, 1808277, 2003392, 2660917, 1996412, 2192574, 2036821, 1977555, 2260305, 2867127, 2249703, 1776232, 1379297, 1892874, 1773340, 2219779, 1760068, 1414512, 1769779, 1400930, 1332719, 2007551, 2063000, 1229936, 1446289, 1305127, 1815747, 1894268, 2576035, 2490349, 2443535, 1703368, 1284342]
5536A284342J064558j29100l24661j31294n38969l75603R18167O91228n95437
5527A863231k37886K77185N65106m15596K22670K66180P0839l95710J12691r4577
5517B234133p78317j09213K49438j36391j4317P20596l75643l20592K30609m66909
5507A233394L74156K01506m14083l17693L86835J014773K81065j42088o19598
5498A998267n92728L39999J80484P02233k82257k56387P0005K19973l9622m84769
5488A855198K62299K07542Q4427k63607n83240n26772N36541M32292O802N63898
5478B575380J52342J12514o46770q47315N78063l350l41822O3029N31454j66059
5468B007466m99526J05040o06O79063J90393j53869J45828j69637j62751O5826
$$ y = [1284342, 2348900, 2219800, 1895139, 1763845, 1224876, 849273, 1767440, 2458668, 1863231, 1625345, 1902530, 2467636, 2052040, 2274710, 2540890, 2611729, 2216019, 2328710, 2234133, 1455816, 1346603, 1596041, 1459650, 1445333, 2165929, 1790286, 1469694, 1700303, 1233394, 1607550, 1809056, 1394973, 1077280, 1464115, 2478888, 2759953, 2617865, 1998267, 1405539, 1745538, 1926022, 2628255, 2345998, 2089611, 2159616, 2379589, 2339967, 1855198, 2117497, 2325039, 2409466, 2145859, 1562619, 1035847, 1572388, 2004680, 2011482, 2575380, 2727722, 2840236, 2193466, 1346151, 1924214, 1920864, 1579042, 1642071, 2173525, 2007466, 1507940, 1612980, 1612374, 2291437, 2481830, 2327961, 2473789, 2304152, 2141401, 2207227]
5458B207227O89244k69007o7246J93743N01561M09524l76837j67820K76141j85864
5448C210666n0600K61635n29096j15396K96736o0208J1324M71597L9084o5344
5438C470398M76104q08953K15750N48184l39287n8263L21475M39516l26840l23791
5428C614293N66630J26232p60160O10911K55097M13224m27821j15248K49023P40924
5418E273105J9606P3942L33479m12336k77197M74265J95602L60523M02541N06327
5408F949857n3831l79122q6435L00658Q08702m3274K80241j46816l62602r74295
5398F293083p6617k79743n09762K14528k0598L09155J4130M57949r7809N19692
5388F824008l77013J1465P87648r39153k7181N39434k95279o1336M0450K62310
$$ y = [2207227, 2896471, 2627464, 2560218, 2753961, 3255522, 3665046, 3288209, 3120389, 3396530, 3210666, 3160066, 3421701, 2892605, 2777209, 3073945, 3013737, 3025061, 3496658, 3535742, 3470398, 3946502, 3137549, 3353299, 3901483, 3562196, 3503933, 3825408, 4264924, 3938084, 3614293, 4180923, 4307155, 3546995, 4157906, 4413003, 4826227, 4398406, 4283158, 4532181, 5273105, 5292711, 5366653, 5700132, 5287796, 5010599, 5484864, 5680466, 6040989, 6443530, 6949857, 6896026, 6516904, 6430469, 6731127, 7539829, 7496555, 7776796, 7629980, 7267378, 6293083, 6216466, 5936723, 5426961, 5641489, 5620891, 5930046, 5944176, 6402125, 6304316, 6824008, 6446995, 6458460, 7246108, 6306955, 6279774, 6819208, 6523929, 6462593, 6503043, 6765353]
5378F765353k51643j20095K7994k85303J7812L30479J74717p15576k45806j29030
5368E568902L14853p2868n37646N06845N14837K0395K96821K48165j17216k86159
5358F456929K55132N25614J58343j8208O26809p24118J1926R734L56054J120860
5348H779075K65097l08406M52386M57283K17857K1703K91247n12243j61131K62588
5338I765456r2141P22176L29776r0861r0487P771n47037p03814l11367L42970
5328I332442n50732n09923N71722l6531L00499l43643k82349J37206O85359Q8073
5318I392123k48346o40568J48259K90143j86329j62638k37181m4395m46908L63464
5308H227624J118081L06095j232991q25689n72242J62803J20753M3418j31359
$$ y = [6765353, 6513710, 6393615, 6421609, 6136306, 6154118, 6484597, 6659314, 5943738, 5697932, 5568902, 5883755, 5810887, 5273241, 5780086, 6294923, 6315318, 6612139, 6860304, 6743088, 6456929, 6712061, 7237675, 7396018, 7377810, 8004619, 7280501, 7292427, 7302161, 7658215, 8779075, 9044172, 8735766, 9188152, 9645435, 9863292, 9884995, 10176242, 9663999, 9502868, 9765456, 9673315, 10395491, 10725267, 10634406, 10543919, 10551690, 10004653, 9300839, 8989472, 9332442, 8781710, 8271787, 8843509, 8806978, 9107477, 8763834, 8481485, 8618691, 9304050, 9392123, 9143777, 8503209, 8651468, 8941611, 8755282, 8592644, 8355463, 8311068, 7864160, 8227624, 9345705, 9651800, 8418809, 7593120, 7020878, 7183681, 7304434, 7347852, 7216493]
5299G216493J51121J48614j66129J05935k49643m87637n166m51530k24368K4303
5289F061993m55021J14753j26986r7429K93770m10745O95220J082137j035111
5280F122581O53051K57385k39537P9947j35466K5845L54974j02644q92031N41586
5270F665691j84222n04502O47000r4682N00634k71122K55525l70629o40775O26079
5260F628997l48942K52608J58355j21132Q21063j69162r0099P11074j18843j83937
5250G539982M21422L26785O24528K51351k35735n56463k32705N26047J40886m08446
5240H397652p08022K66874n37384Q51702l22183l10537j850M27126q027N42340
5230H597691K16349R63152j145806k53191N05487M82866O82254O97149M94722
$$ y = [7216493, 7367614, 7516228, 7350099, 7456034, 7206391, 6718754, 6713588, 6262058, 6037690, 6061993, 5606972, 5721725, 5594739, 5497310, 5791080, 5380335, 6075555, 7157692, 6122581, 6775632, 7033017, 6793480, 6873427, 6737961, 6763806, 7118780, 7016136, 6124105, 6665691, 6481469, 5976967, 6623967, 6529285, 7029919, 6758797, 7014322, 6643693, 6002918, 6628997, 6280055, 6532663, 6691018, 6569886, 7390949, 7221787, 7131688, 7842762, 7723919, 7539982, 7961404, 8288189, 8912717, 9164068, 8928333, 8371870, 8139165, 8665212, 8806098, 8397652, 7689630, 7956504, 7419120, 8270822, 7948639, 7638102, 7636252, 8063378, 8055351, 8597691, 8814040, 9777192, 8631386, 8378195, 8883682, 9366548, 10048802, 10745951, 11240673]
5221A1240673M0701R0553N22679L34986L67212o5683j45338J44738o16522l686
5211A1910313J54972K75966o19910j73457M77490K57474J52737j58764J99247
5202A2476068J180610O03707j67735k36495R70475M132L66545j1612M46789Q50004
5192A6482488r6856j92040P15642l27773J12207N9356r18445j103587p37514q42609
5182A3150869j239620M4485L69199l3249m47575k85659j04918k22345o01545k3297
5172A0606345n62969j38870M27020n6016l74899q60096m31507J56303l66577m17675
5162G981059P52195k8366m44141j92360K28077r5850j39733Q48021J51506o86878
5152H373530l26151l03022r195o8224M53760n51885k6996Q69178N91374j139137
$$ y = [11240673, 11281374, 11371927, 11894606, 12229592, 12596804, 12531121, 12385783, 12530521, 11913999, 11910313, 12065285, 12341251, 11721341, 11547884, 12025374, 12282848, 12435585, 12276821, 12476068, 13656678, 14260385, 14092650, 13856155, 14826630, 14830762, 15197307, 15185695, 15632484, 16482488, 16385632, 16193592, 16909234, 16581461, 16693668, 16753024, 15834579, 14730992, 13993478, 13150869, 11911249, 11955734, 12324933, 12291684, 11844109, 11558450, 11453532, 11231187, 10629642, 10606345, 10043376, 9904506, 10331526, 10275510, 9900611, 9040515, 8609008, 8765311, 8398734, 7981059, 8733254, 8704888, 8260747, 8068387, 8296464, 8200614, 8060881, 8908902, 9060408, 8373530, 8047379, 7744357, 7735162, 7666938, 8120698, 7568813, 7541817, 8410995, 9002369, 7863232]
5142G863232n40742J28510M98322P70503l18306r1296L12713m35779Q3504j68794
5132H101867N32701L99525n15604N92917L89065K09336k67389N56233p29820o11151
5122H657680M93687O65869P06545q19570k04154m65118o99942J035281o7475n30454
5112H772349n08477K8281n29287m78710N16340l21846k03070l6550J79003k51462
5102G166571m66934k77692J29975R01972l38775q62187n94747K25724O76032K42671
5092F802610n91521n49206M35696J28588J90532P4470L92418J16339q68512o43258
5082E488156P14587K18910j044264K93303K34069M30779Q4658k39349L89613m42552
5072F127910j10297k26279R1962l83092L53245M43292O6913J66263l74578o13844
$$ y = [7863232, 7322490, 7451000, 7949322, 8719825, 8401519, 8310223, 8622936, 8187157, 8270661, 8101867, 8634568, 9034093, 8518489, 9111406, 9500471, 9709807, 9442418, 9998651, 9268831, 8657680, 9151367, 9817236, 10523781, 9704211, 9500057, 9034939, 8334997, 9370278, 9302803, 8772349, 8263872, 8292153, 7762866, 7284156, 7800496, 7478650, 7275580, 7239030, 7418033, 7166571, 6699637, 6421945, 6551920, 7453892, 7115117, 6252930, 5658183, 5883907, 6559939, 6802610, 6211089, 5661883, 6097579, 6226167, 6416699, 6491169, 6883587, 6999926, 6131414, 5488156, 6202743, 6421653, 5377389, 5670692, 5904761, 6335540, 6420198, 6180849, 6570462, 6127910, 6017613, 5791334, 5883296, 5500204, 5853449, 6296741, 6363654, 6529917, 6155339, 5541495]
5062E541495J96552j65290l6634O62028j71700j42410m1664n5393j96435j38280
5052E452269J081792k96569k3596n92437Q6322j01890O6643R27023q03087J117504
5042F913974k65327j067322K04698J70584l57056L35225N28583M20109l25335
5033F558133K12014m67368L08336j05232p4303K45651L46563j56806j39528o7111
5023F660349q12229j86264K29339P04256K68908n7315n22329K29936K66367q40141
5013E940877k03148Q66545P6327o60871M02606m62258o5354M00717q4222j20795
5003F090424K36435j26520o57987O91300L5589j64362O29346N98618o18929p16515
4993E997399m5265k05834L43032L11733K91100k00768K71016J07582O35334k20738
$$ y = [5541495, 5738047, 5572757, 5536123, 6198151, 6026451, 5884041, 5842377, 5786984, 5590549, 5452269, 6534061, 6237492, 6213896, 5621459, 5707781, 5605891, 5672534, 6599557, 5796470, 6913974, 6648647, 5581325, 5786023, 5956607, 5599551, 5934776, 6463359, 6883468, 6558133, 6770147, 6302779, 6611115, 6505883, 6431580, 6677231, 7023794, 6866988, 6727460, 6660349, 5848120, 5661856, 5891195, 6595451, 6864359, 6807044, 6284715, 6514651, 6781018, 5940877, 5737729, 6604274, 6680601, 6019730, 6422336, 5960078, 5894724, 6295441, 6211219, 6090424, 6326859, 6200339, 5542352, 6233652, 6269241, 6104879, 6734225, 7332843, 6713914, 5997399, 5952134, 5746300, 6089332, 6401065, 6692165, 6491397, 6762413, 6869995, 7505329, 7284591]
4983G284591q90078J53986N00936Q75161k83694O79728n80141q04363l9676N71874
4973G468324n8662j001351Q36529P09531J3475p89570K68516p80250m38644N75133
4963F803031P641N86703o3303j92488L54971j02110k40305N37733O79897o57769
4953G714001l42617j24301O43678M85921l30200j07472L97711P34755m19397J07770
4943H759849m63153L78791O98652j06917j653m08623m21856O25651k69159k11096
4933H580486O60059p31582L11710L68470k05523P83681k40523K63824n79814M46156
4923I656944j2609j27167l65355M72999O13630K3830L6110k12534o1102J90398
4913A0215144l50263K1550p9604M05684J072258m40660m56254m76492O06476J039832
$$ y = [7284591, 6394513, 6548499, 7049435, 7924596, 7640902, 8320630, 7740489, 6936126, 6896450, 7468324, 7409662, 6408311, 7244840, 7954371, 7967846, 7178276, 7446792, 6666542, 6227898, 6803031, 6810672, 7397375, 7334072, 7141584, 7496555, 7394445, 7154140, 7691873, 8371770, 7714001, 7371384, 7247083, 7890761, 8376682, 8046482, 7939010, 8336721, 9071476, 8652079, 8759849, 8296696, 8675487, 9374139, 9267222, 9265569, 8856946, 8435090, 9060741, 8791582, 8580486, 9240545, 8508963, 8820673, 9189143, 8983620, 9767301, 9526778, 9790602, 9210788, 9656944, 9644335, 9517168, 9151813, 9624812, 10238442, 10262272, 10298382, 10085848, 10024746, 10215144, 9864881, 9886431, 9806827, 10212511, 11284769, 10844109, 10387855, 9911363, 10517839, 11557671]
4903A1557671M48808p74146m15225L3498K93355M53020j78512Q40276K53652j091528
4893A1420869K03667K75287K05464n56536Q45808l6156L896J178969K68117L9686
4883A3849071m65565l8289M59251K96203L61998R09035j69489q21401j90570K47091
4873A4437335N77376p3434K52457J35143m86086K65288k17089j49210L30794N78332
4863A5650906M88474j15791Q02626P19845j136848o18596M87995M85034m97697
4854A6265948j27595O76372m19103J31394O20604n14884K14236J004619M68631
4845A8320222l48264m83141N36808M31289N31318K39674p37540j8394M05879k96363
4835A8581488k70730J05189J93453N05683M24093j29917M85755J70161m48902
$$ y = [11557671, 12006479, 11232333, 10817108, 10850606, 11143961, 11596981, 11418469, 12258745, 12512397, 11420869, 11624536, 11899823, 12105287, 11548751, 12394559, 12358403, 12362299, 13541268, 13809385, 13849071, 13383506, 13345217, 13804468, 14100671, 14462669, 15371704, 15202215, 14380814, 14190244, 14437335, 15014711, 14941277, 15193734, 15328877, 14842791, 15108079, 14890990, 14741780, 15072574, 15650906, 16139380, 16023589, 16826215, 17546060, 16409212, 15790616, 16278611, 16763645, 16265948, 16138353, 16814725, 16395622, 16527016, 17147620, 16632736, 16846972, 17851591, 18320222, 17971958, 17488817, 18025625, 18456914, 18988232, 19227906, 18490366, 18471972, 18877851, 18581488, 18310758, 18415947, 18609400, 19115083, 19539176, 19409259, 19895014, 20065175, 19616273]
4826A9616273m59919l97403J77357q7397n92980K03563j83265N21420K98153m20401
4816A8675401J48356m75300K0389j02190L86142m70296m28875M25264p2720Q7145
4806A8193316n73993l60395j73355O16121n8089r92640J03779q1562p10299J22052
4796A6084935l59580M60293Q29550m03802l96182L34367K88291n60596M4653K42617
4786A6564546K36583l06323M82208p36841R8674O10916j117158l38673L62798
4777A5856730m57282m47360L67206K55794K03703k16889l27292l48891K50898
4768A5136617j49194j19845R48891K80648q87716M02191p10814k63021L0515k82917
4758A4385355K9952J185312L13329m96740K10865m12448k95289o52557M84690
$$ y = [19616273, 19156354, 18758951, 18936308, 18848911, 18255931, 18459494, 18276229, 18797649, 19095802, 18675401, 18823757, 18348457, 18368846, 18266656, 18652798, 18182502, 17753627, 18178891, 18106171, 18193316, 17619323, 17258928, 17085573, 17701694, 17643605, 16650965, 16754744, 16673182, 15962883, 16084935, 15725355, 16185648, 17015198, 16611396, 16215214, 16549581, 16837872, 16277276, 16321929, 16564546, 16801129, 16494806, 16977014, 16240173, 16338847, 16949763, 15832605, 15493932, 15856730, 15399448, 14952088, 15319294, 15575088, 15778791, 15561902, 15234610, 14885719, 15136617, 14987423, 14867578, 15816469, 16097117, 15209401, 15611592, 14900778, 14637757, 14668272, 14385355, 14415307, 15600619, 15913948, 15417208, 15628073, 15215625, 14920336, 14267779, 14752469]
4749A4752469J013426J59670m23640r7835L97254J00425q2240L8222n8811N53292
4739A6352232J1868M9231k95086j13453M01796P67154M36943R25895O56860n3952
4729A9139488j3156K34997K21196n5744l82223j95704q53885j72444j57682n38505
4719A7226338o62031n49448N4443k88679J94584K15233k66112r04052L62858M99800
4709A5882934M61552q96074k99232j70768K00238M58069J83276j78887p19858
4700A4921250L62920L91464l33988j03222r531L02554r9894m87438j14889O35167
4690A5464393K62233q58288M73595M24860m65491K34127N68536l36248o51750
4681A5115967l20734Q89405L06425K34528k77041j54453Q15792n7510o50682k4920
$$ y = [14752469, 15765895, 15925565, 15501925, 15404090, 15801344, 15901769, 15819529, 15857751, 15798940, 16352232, 16364100, 16413331, 16118245, 16004792, 16406588, 17173742, 17610685, 18536580, 19193440, 19139488, 19126332, 19361329, 19582525, 19526781, 19144558, 18948854, 18094969, 17922525, 17764843, 17226338, 16564307, 16014859, 16069302, 15780623, 15975207, 16190440, 15924328, 15020276, 15383134, 15882934, 16344486, 15448412, 15149180, 14978412, 15178650, 15636719, 15819995, 15641108, 14921250, 15284170, 15675634, 15341646, 15238424, 15228893, 15531447, 15431553, 14944115, 14829226, 15464393, 15726626, 14868338, 15341933, 15766793, 15301302, 15535429, 16103965, 15767717, 15115967, 14795233, 15684638, 15991063, 16225591, 15948550, 15794097, 16609889, 16552379, 15901697, 15876777]
4671A5876777L16036k72344R46378P3188j83741N18421r0752m27507L54972O47660
4661A7759088o49669L82067L08901j53936q10073P48761K43924m43287M40259
4652A7826035L59121Q35295N409n63893L18816Q92562j28511o52795l89717k1895
4642A8480427K50770M13474K06873q59385N47954N68470K8736P69908o00076r1685
4632A9715466R5515J85856P91096L72952k20989J13256n0728M41872K97405j41503
4622B1600198P2226J142896P3884n89272o45985O911J50699K4960O28880R77516
4612B3442913k60674q8093K21540R82106M96943m95152P97894m27022o34481r55035
4602B3080939Q00809N08483k02892R37529P21262n34456L46164j83310r215k86629
$$ y = [15876777, 16192813, 15920469, 16866847, 16940035, 16756294, 17274715, 17183963, 16756456, 17111428, 17759088, 17109419, 17491486, 17800387, 17646451, 16836378, 17585139, 17829063, 17385776, 17826035, 18185156, 19020451, 19025860, 18461967, 18780783, 19673345, 19544834, 18892039, 18502322, 18480427, 18731197, 19144671, 19351544, 18492159, 19040113, 19608583, 19637319, 20407227, 19807151, 19715466, 19810981, 19996837, 20787933, 21160885, 20939896, 21053152, 21002424, 21444296, 21741701, 21600198, 21672424, 22815320, 22889204, 22299932, 21653947, 21660858, 21811557, 21836517, 22465397, 23442913, 23182239, 23094146, 23315686, 24297792, 24794735, 24299583, 25097477, 24670455, 24035974, 23080939, 23881748, 24390231, 24187339, 25124868, 25846130, 25311674, 25657838, 25474528, 25465313, 25178684]
4592B5178684n21092P11525k020l66247Q83607M64547j14903N95020J071465k28257
4582B7672329j32606k60026J94330N04170O6148P11294L09346l85116N41980J059731
4572C0281580R75468N5812k43637j24425L2780N53445p0332m5013K63948Q14348
4562C2493974m086M60127Q97018K92207q0090P2259Q15811N17751k5145O00431
4552C6040257J72977Q74082N23690J24096K07109N57261Q53967J202128P29388
4543D1284955Q77345L74035J405920J837370J015487J647978J060217J113361
4535E0616668K084419J066375R68117K429011K159640K704502K454701K024738
4527F6508171K771463L064058L391866L827402L987743M532491M857237N702165
$$ y = [25178684, 24657592, 25369117, 25367097, 25000850, 25884457, 26349004, 26234101, 26829121, 27900586, 27672329, 27539723, 27279697, 27474027, 27978197, 28044345, 28755639, 29064985, 28679869, 29221849, 30281580, 31257048, 31312860, 31069223, 30944798, 30977578, 31531023, 31460691, 31415678, 31679626, 32493974, 32489888, 32950015, 33847033, 34139240, 34059150, 34131409, 34947220, 35464971, 35439826, 36040257, 36213234, 37087316, 37611006, 37735102, 37942211, 38499472, 39353439, 40555567, 41284955, 42162300, 42536335, 43942255, 45779625, 46795112, 48443090, 49503307, 50616668, 52701087, 53767462, 54735579, 57164590, 59324230, 62028732, 64483433, 66508171, 69279634, 72343692, 75735558, 79562960, 83550703, 88083194, 92940431, 98642596]
4519I8642596O723727N419857P798229R672302R241373R048186J1299352J0805841
4511A68651463J0760897J0537385R907832R359758Q462268O863716M149816K642916
4503B31336051r14319l089375o097204r000878r786510j0477828j1192495j0354839
4495A70422603j0302360j1108851j1337005j0160431q870404q766638q141248
4488A01735666p645145o715291n231170m908027m213790m213007l103438l763788
4480F1942010k137127j970551j718896k508902k175915j721061k243229j039151
4472D6427178r55854j841091r45473p85812j183909o77598r55018r80705j320456
4463C6781262n30625K37778k16129m97608j054711m14496P68579l03091j605839
$$ y = [98642596, 105366323, 110786180, 118584409, 128256711, 137498084, 146546270, 157845622, 168651463, 179412360, 189949745, 199857577, 209217335, 217679603, 224543319, 228693135, 231336051, 230421732, 227332357, 221235153, 212234275, 202447765, 191969937, 180777442, 170422603, 160120243, 149011392, 137674387, 127513956, 118643552, 109876914, 101735666, 94090521, 87375230, 82144060, 77236033, 73022243, 68809236, 65705798, 61942010, 59804883, 57834332, 56115436, 53606534, 51430619, 49709558, 47466329, 46427178, 45471324, 43630233, 42684760, 41898948, 40715039, 40037441, 39082423, 38101718, 36781262, 36250637, 36488415, 36272286, 35774678, 34719967, 34305471, 35074050, 34770959, 33165120]
4454C3165120o32220o35341j22889N87072n72662l403r62650o51472M47596L87290
4444C1006441o75606m54635M86257L30691m75936l8261j1987k30755r73352P14747
4434B9677604J34827k38059k63496n56352J004183L34818M22977K30102j49270
4425C0597334j38379o2036N94130l23662J48865J21485j65705J76029N21207O53697
4415C2122965N15032P42476Q76789L35042J007737J361539J582906J381643J280210
4406D1206339J117752K002795K780827K036337J842440J676074J541508r7896
4398E4106176l36187p51588q02289k282784k666532k277224j712170k149268j821341
4389C9306793q69458m58884q57652l58989m87272m73994o89176j008376R9531
$$ y = [33165120, 32532900, 31897559, 31774670, 32361742, 31789080, 31785677, 30823027, 30171555, 30619151, 31006441, 30330835, 29876200, 30362457, 30693148, 30217212, 30178951, 30166964, 29936209, 28962857, 29677604, 29812431, 29574372, 29310876, 28754524, 29758707, 30093525, 30516502, 30746604, 30597334, 30458955, 30396919, 30991049, 30667387, 30816252, 30937737, 30772032, 30948061, 31469268, 32122965, 32637997, 33380473, 34257262, 34592304, 35600041, 36961580, 38544486, 39926129, 41206339, 42324091, 44326886, 47107713, 49144050, 50986490, 52662564, 54204072, 54106176, 53769989, 53018401, 52216112, 49933328, 47266796, 44989572, 43277402, 41128134, 39306793, 38437335, 37978451, 37120799, 36761810, 36274538, 35800544, 35111368, 34102992, 34202523]
4380C4202523m4195Q2817J49642N80340R27034N73524n47549l58469r01630P0945
4370C4734982N4036r48964M2704n99287l71517m06246R2856k72073r87445o88073
4360C0650973j37956l64002K59510o2738n07888q65076P14592P1446m04477o1494
4350B9292890l76133O2151m1392j70404o32561L96689m32881M55817J00481N09517
4340B9164174j15587K31018N63897o87934P45898M44213L47473K77741J03263
4331C1074156J97045q03969j48235J284564k62300J77057m370M75041L84160L47400
4321C2720549l60997j03995J432009Q24303J74799P19250O95580l83895r2862
4312C5624741J069851k99361O8711J435600k1371K41798J216744K58837P4840
$$ y = [34202523, 34158328, 34241145, 34390787, 34971127, 35898161, 36471685, 35924136, 35565667, 34664037, 34734982, 34789018, 33840054, 33882758, 33283471, 32911954, 32505708, 32598564, 32326491, 31339046, 30650973, 30513017, 30149015, 30408525, 30345787, 29837899, 28972823, 29687415, 29758861, 29354384, 29292890, 28916757, 28978908, 28937516, 28767112, 28134551, 28531240, 28098359, 28554176, 28654657, 29164174, 29048587, 29279605, 29843502, 29155568, 29901466, 30345679, 30693152, 30970893, 31074156, 31271201, 30467232, 30318997, 31603561, 31341261, 31518318, 31513948, 31988989, 32373149, 32720549, 32359552, 32255557, 33687566, 34511869, 34686668, 35405918, 36101498, 35717603, 35624741, 36694592, 36395231, 36463942, 37899542, 37878171, 38119969, 39336713, 39595550, 39670390]
4303C9670390J42916n46910L05730m94336j25437n7713N63211l29905j95112P4765
4293C9007599J05527N58258j53994j01699P46778J88460n5881m87124J89559O33757
4283D0631240J430771L15877k34429R06705L10749K00243P19812k08163N14767
4274D4587572o13979m9670L13779n49207l41972p92593J02262P12918J87481o92500
4264D2864091r76682p93492r61558j047739l59928q16948N20176j61673k63121
4255C8003126J97910p19295K91903K16602j80236K66101N04342k8683k9214m24048
4245C8098508O51999K29851M7605N60858k77575l82459n2612j392516p88719J71419
4235C6866359q58368m04200k74611j112862q29239j123210R4748K22670J28086
$$ y = [39670390, 39813306, 39266396, 39572126, 39077790, 38952353, 38894640, 39457851, 39127946, 38932834, 39007599, 39113126, 39671384, 39517390, 39415691, 40162469, 40350929, 40295048, 39807924, 39997483, 40631240, 42062011, 42377888, 42143459, 43050164, 43360913, 43561156, 44280968, 44072805, 44587572, 43973593, 43923923, 44237702, 43688495, 43346523, 42553930, 42656192, 43369110, 43556591, 42864091, 41887409, 41093917, 40132359, 39084620, 38724692, 37907744, 38427920, 38266247, 38003126, 38201036, 37481741, 37773644, 37990246, 37810010, 38076111, 38580453, 38551770, 38522556, 38098508, 38750507, 38980358, 39027963, 39588821, 39311246, 38928787, 38876175, 37483659, 36694940, 36866359, 36007991, 35603791, 35329180, 34216318, 33387079, 32263869, 32358617, 32581287, 32709373]
4226C2709373p7646j028251j56146m34657L93935m91643M39369O5012m71750p4554
4216C0873042j3044L18792p4962p21178J67015N82062L7324p64088m7655j44284
4206C0213024r4796l7538p8188j52516K24734J5814l13673r57573N28946K27456
4196B9575690n6970M93964l73135o78112O40578j94868j26958M51733l55991M06475
4186B9782406O22630J5361L66760Q9376o55890p60696R70318Q0397j000712N92089
4176C0102039N94120R9096k49473M9627M7798j63245o88913M4567m83060r4016
4166B9258540l50955l59501N45770M84060j029532n15284O79060m41228k54392
4157B8016538L41205K94664J41683P00142L98877J91172q18298k95580O51808
$$ y = [32709373, 32631727, 31603476, 31447330, 31012673, 31406608, 30914965, 31354334, 31419346, 30947596, 30873042, 30859998, 31178790, 31103828, 30382650, 30549665, 31131727, 31169051, 30404963, 30357308, 30213024, 30118228, 30080690, 30002502, 29849986, 30074720, 30090534, 29776861, 28819288, 29348234, 29575690, 29518720, 30012684, 29639549, 28961437, 29602015, 29407147, 29280189, 29731922, 29375931, 29782406, 30405036, 30420397, 30787157, 30876533, 30220643, 29459947, 30430265, 30510662, 29509950, 30102039, 30696159, 30795255, 30545782, 30595409, 30643207, 30479962, 29791049, 29835616, 29352556, 29258540, 28907585, 28548084, 29093854, 29577914, 28548382, 28033098, 28712158, 28270930, 28016538, 28357743, 28652407, 28794090, 29494232, 29893109, 30084281, 29265983, 28970403, 29622211]
4148B9622211J7735n55085n76629Q4012m37216k14683k07170O19148O15019j81346
4138B8785996P0056k81923n25704L53468L3870p43610r7883M20003K9821k88679
4128B7755415L89326P05514l48530j66231n01079k13475M75291J39544m6975m53258
4118B7735542m14917K85088n31273M26562K71618m16986M80658L15355K1088m63393
4108B7709342K6865J41006j349521q47246J389468K52349j570o89893p63143J8514
4098B5886171N39512K95336p39157O10358M9276l65375j12038J07443r52485N49347
4088B5868388M74043L60591M93812o11206j70360J89867k04898j14227K79378
4079B6565388L66892L05085M37260L15078O1296J14102N90876j01222n45782K60903
$$ y = [29622211, 29639946, 29084861, 28508232, 28592244, 28155028, 27940345, 27733175, 28352323, 28967342, 28785996, 28856052, 28574129, 28048425, 28401893, 28435763, 27692153, 27594270, 28014273, 28044094, 27755415, 28144741, 28850255, 28501725, 28335494, 27834415, 27620940, 28096231, 28235775, 28188800, 27735542, 27320625, 27605713, 27074440, 27501002, 27772620, 27355634, 27836292, 28151647, 28172735, 27709342, 27736207, 27877213, 26527692, 25680446, 27069914, 27322263, 27320693, 26630800, 25867657, 25886171, 26425683, 26721019, 25981862, 26592220, 26641496, 26276121, 26164083, 26271526, 25319041, 25868388, 26342431, 26703022, 27196834, 26585628, 26415268, 26605135, 26400237, 26286010, 26565388, 26932280, 27237365, 27674625, 27989703, 28050999, 28165101, 28755977, 28654755, 28108973, 28369876]
4069B8369876P00875k23641l91234p93148M13682M91022L34698l55241K39197
4060B8786086m7159r23222P49319N76970K3391j417444J71376P41339L13987n10953
4050B8463690J90573k47810N76339n96331J3780J073567k92159O39469K8517k72902
4040B9576733K35629L36717m045M71977Q92577o20671N14922N79550O8993N07163
4030C2559545R65477K87220P49958J030841k58527O64840K56308M29689J292539
4021C7977890P57921M96174O52755P65445O07754l10638N20514J208304J17504
4012D2793623r102j87812M88699K46896m62835N96783j98905m95896O07029q72882
4002D2505598j078572K81053p45906m44301m50351j38375J085191N58287K35985
$$ y = [28369876, 29070751, 28847110, 28455876, 27662728, 28076410, 28567432, 28902130, 28546889, 28786086, 28738927, 27815705, 28565024, 29141994, 29165385, 27747941, 27919317, 28660656, 28974643, 28463690, 28654263, 28406453, 28982792, 28386461, 28400241, 29473808, 29181649, 29821118, 29849635, 29576733, 29812362, 30149079, 30145034, 30617011, 31509588, 30888917, 31403839, 31983389, 32052382, 32559545, 33525022, 33812242, 34562200, 35593041, 35334514, 35999354, 36255662, 36685351, 37977890, 38735811, 39231985, 39884740, 40650185, 41257939, 40947301, 41467815, 42676119, 42793623, 42784521, 42596709, 43085408, 43332304, 42869469, 43466252, 43267347, 42771451, 43378480, 42505598, 41427026, 41708079, 40962173, 40517872, 40067521, 39929146, 41014337, 41572624, 41808609]
3993D1808609R13099K48546m19427L52559P12549J011034P80384K72255M79128
3984D6158736M22633l62834k33674R2254q38472n53922k84905L64561M51378j31513
3974D5084242j350328o37978r1683q10762R1672p03197j193698n4499n27512j45349
3964C9660908m6622m68107J88115K8228O64734j81504K28294M2897M24174P43856
3954D1284973M97983J08137j25648m292j02059l94102K18930P68952q1460k60749
3944D1910665p79379l56208q38929n7854K25425L17304N6839N14165o8737q71676
3934D0051615L5444O6042J5003j048714j68022K39754K43805R70273K02543l46118
3924D0261625J10735M81425J43849k30485Q33181N26372J59689P37006j43037
$$ y = [41808609, 42721708, 42970254, 42550827, 42903386, 43615935, 44626969, 45407353, 45679608, 46158736, 46581369, 46218535, 45984861, 46077115, 45238643, 44684721, 44399816, 44764377, 45215755, 45084242, 43733914, 43095936, 43004253, 42193491, 42285163, 41581966, 40388268, 40333769, 39806257, 39660908, 39614286, 39146179, 39334294, 39362522, 40027256, 39845752, 40074046, 40116943, 40541117, 41284973, 41782956, 41891093, 41765445, 41761153, 41659094, 41264992, 41483922, 42252874, 42171414, 41910665, 41131286, 40775078, 39936149, 39878295, 40103720, 40421024, 40477863, 40992028, 40923291, 40051615, 40087059, 40153101, 40168104, 39119390, 38951368, 39191122, 39434927, 40405200, 40607743, 40261625, 40372360, 40853785, 40997634, 40767149, 41600330, 42126702, 42286391, 43023397, 42880360]
3915D2880360j00138K74548q59333m61692r23164L07085L48431r6543N48719J82595
3905D2100868J05317J107735J73515J68650K6240M14288O39137O61254L51914
3896D5748918O05818K89953N99498M70593J150414R72125N68715K197538P27508
3887E3331080N34962J526782J385123R76484J496057P43215O68381p8241R79253
3878F1563096j41940M66084n02628o37726j037565k69821o94370k95183r00600
3869E7549347j098280o18762o08976q65783q67479r61129r26454k21891k27198
3860E1153395j27910q65107l10645j470k71152j64130L39489k91623r045o44097
3850D8807705P4682L11630R53137L88305p2071p36816K54462J305435K52638N09609
$$ y = [42880360, 42780222, 43054770, 42195437, 41733745, 40810581, 41117666, 41466097, 41369554, 41918273, 42100868, 42206185, 43313920, 43487435, 43656085, 43682325, 44096613, 44735750, 45397004, 45748918, 46354736, 46644689, 47244187, 47714780, 48865194, 49837319, 50406034, 52603572, 53331080, 53866042, 55392824, 56777947, 57754431, 59250488, 59993703, 60662084, 60583843, 61563096, 61421156, 61887240, 61384612, 60746886, 59709321, 59439500, 58745130, 58449947, 57549347, 56451067, 55832305, 55223329, 54357546, 53490067, 52528938, 51602484, 51380593, 51153395, 51025485, 50160378, 49849733, 49848263, 49577111, 49412981, 49752470, 49460847, 49451802, 48807705, 48882387, 49194017, 50147154, 50535459, 50463388, 49726572, 49981034, 51286469, 51539107, 52048716]
3840E2048716M29803J73963K85759J142174R68031K17248Q31098J542250J692987
3831E9332029J022276O09199R93507J837234J875639M09031K958887K488454K634540
3822G4160796K396680K702543M042954M540327N092180M869212N469940N528720
3814A08803352M912489K258690O41885k401185m605282m707733m689431m669200
3806I5543585m098176l930451k819822k753692j168950j580481j207984j621812
3798G6362217j136849o75869j051363n4901o18264m39343p34474L59133J76974
3789G2187261p51404k39833L1988Q89M45457L92576J124582M34560k649J340363
3779G4963790K97164Q62750J598379K280812J099406O10362Q40253J312116J783759
$$ y = [52048716, 52478519, 52652482, 52938241, 54080415, 55048446, 55265694, 56096792, 57639042, 59332029, 60354305, 60963504, 61957011, 63794245, 65669884, 66078915, 69037802, 71526256, 74160796, 76557476, 79260019, 83302973, 87843300, 92935480, 97804692, 103274632, 108803352, 113715841, 115974531, 116616416, 114215231, 109609949, 104902216, 100212785, 95543585, 91445409, 87514958, 84695136, 81941444, 80772494, 79192013, 77984029, 76362217, 75225368, 74549499, 73498136, 73443235, 72824971, 72385628, 71651154, 72010287, 72187261, 71435857, 71196024, 71228012, 71228901, 71674358, 72066934, 73191516, 73626076, 73623427, 74963790, 75260954, 76123704, 77722083, 80002895, 81102301, 81712663, 82552916, 83865032, 85648791]
3770H5648791Q91899J682993K217003J218537J653424J286557J275310J237033
3762I7111547O86940K710375J292634K478643J539284J654129K994563L184391
3754A13652506L474895M378319M597779N052544O222792N382835N200024K746825
3746A50708519K218034K45454j865426k919778k932888k687299k024891j666691
3738A39075034r81821l73292n41649K65342J546589J128587K252749K290078J224255
3729A45885872K746231L698756N250732M101753M201881M712561M461397M877328
3721A79936511N319126O235225N336983N235626O234202O236235N881716M965398
3713B25381022M989979N411180O194767N341582O815415P524489P298142P620027
$$ y = [85648791, 86540690, 88223683, 90440686, 91659223, 93312647, 94599204, 95874514, 97111547, 97798487, 100508862, 101801496, 104280139, 105819423, 107473552, 110468115, 113652506, 117127401, 121505720, 126103499, 131156043, 137378835, 142761670, 147961694, 150708519, 152926553, 153172007, 151306581, 148386803, 145453915, 142766616, 140741725, 139075034, 138093213, 137719921, 137178272, 137443614, 138990203, 140118790, 142371539, 144661617, 145885872, 148632103, 152330859, 157581591, 161683344, 165885225, 170597786, 175059183, 179936511, 185255637, 191490862, 196827845, 202063471, 208297673, 214533908, 220415624, 225381022, 230371001, 235782181, 241976948, 247318530, 254133945, 261658434, 268956576, 276576603]
3705B76576603P490380Q310646P966811O953126P323765P037360N597123M190095
3697C31445909L471978K400909N55477k535130m555484n636693r221091j0974791
3689C04951084j1963678j2646692j1873746r778006q269384o336989n515698l491578
3681B35075313k076149k816916k726144m672207n773811p884663r258259r637067
3673A90230097j0858721r490949r027906p020570o583319n493764n572685l364961
3665A32817222l086400k946604l508459l106434j438036k087397j354128j421600
3657A13868164q15859j473828o76052k475882j991060j830233j508794j822772
3649A01273684j310733j834044k050822j999143j206469j157882j083549j214086
$$ y = [276576603, 284066983, 292377629, 300344440, 307297566, 314621331, 321658691, 327255814, 331445909, 334917887, 337318796, 337874273, 335339143, 330783659, 325146966, 315925875, 304951084, 292987406, 280340714, 268466968, 258688962, 250419578, 244082589, 238566891, 235075313, 232999164, 230182248, 227456104, 222783897, 217010086, 209125423, 199867164, 190230097, 179371376, 169880427, 160852521, 153831951, 147248632, 141754868, 136182183, 132817222, 129730822, 126784218, 123275759, 120169325, 118731289, 116643892, 115289764, 113868164, 113052305, 111578477, 110902425, 108426543, 106435483, 104605250, 103096456, 101273684, 99962951, 98128907, 96078085, 94078942, 92872473, 91714591, 90631042, 89416956]
3641H9416956j161108l65033j112136L17903r35930j143576p6379q83074l02003
3632H3755620r675l51583l61496p84683m42869k93829o06799o13252j08598n72793
3622G9610043j467869j116885p11203n55569l44276n13669l23417j22473n38090
3613G3916592j29762k13609j099074j006408K81603n50400j766983l53075l42389
3604F8736495J68392r26405p83818n30668j335489m60963M13546j25725M9396
3595F5204761o31592k60713P30429k05822m59689j31019j73117n43950L1592l83238
3585F3177642m99541p28951L22118j172237o53115j84699j83534l9313j078678
3576E8959692R1115j47039q8513M42572k3383n83454q70821r71318l61303L50058
$$ y = [89416956, 88255848, 87890815, 86778679, 87096582, 86160652, 85017076, 84940697, 84057623, 83755620, 83745945, 83394362, 83032866, 82248183, 81805314, 81511485, 80904686, 80291434, 80182836, 79610043, 78142174, 77025289, 76314086, 75758517, 75414241, 74900572, 74577155, 74454682, 73916592, 73786830, 73573221, 72474147, 71467739, 71749342, 71198942, 69431959, 69078884, 68736495, 68904887, 67978482, 67194664, 66663996, 65328507, 64867544, 65281090, 65155365, 65204761, 64573169, 64312456, 65042885, 64837063, 64377374, 64246355, 64073238, 63529288, 63560880, 63177642, 62678101, 61949150, 62271268, 61099031, 60445916, 60261217, 60077683, 60038370, 58959692, 59050807, 58903768, 58815255, 59257827, 59234444, 58650990, 57780169, 56808851, 56447548, 56797606]
3566E6797606N75598J9563L72342k12050j65300K78844m17994k21496l35710M35823
3556E7127226L06670o22222J10411R75572J35131j32322l38637k77585o02286
3547E6681958o74382J57442N37581L73493j36005L68621K94587n89526p81475
3538E6232294j29033l79412m97994K30407J84149K86971K70010n58089K20135
3529E5859438m99540k70707J013390M74948l06830O80677O00993Q63299J50881
3520E8566549J62651k5701M82134n97304O12407Q13422j91648Q03846N75417Q4666
3510F1286439r7100K48811K02168L29422J980k3661J037019J433377J11078l09833
3500F4219700J67828K20757Q17757O38348M85147R28322n09693K99644N14968
$$ y = [56797606, 57373204, 57392767, 57765109, 57553059, 57387759, 57666603, 57248609, 57027113, 56691403, 57127226, 57433896, 56811674, 56922085, 57897657, 58032788, 57900466, 57561829, 57284244, 56681958, 56007576, 56165018, 56702599, 57076092, 56940087, 57308708, 57603295, 57013769, 56232294, 56103261, 55723849, 55225855, 55456262, 55640411, 55927382, 56197392, 55639303, 55859438, 55359898, 55089191, 56102581, 56577529, 56270699, 56951376, 57552369, 58415668, 58566549, 58729200, 58703499, 59185633, 58588329, 59200736, 60014158, 59822510, 60626356, 61201773, 61286439, 61189339, 61438150, 61640318, 61969740, 61971720, 61948059, 62985078, 64418455, 64529533, 64219700, 64387528, 64608285, 65426042, 66064390, 66549537, 67477859, 66968166, 67267810, 67782778]
3491F7782778P37053N51098l11091P11213R90648O50946P46274Q00405K78778
3482G2938102K35298J336637L67821J132016J024967K004684J109469P20426K92809
3473H1162229J292190J846481J315444J624469J031084K338878J712053P17200
3465I3040028K443069J946652J918476L236500L300326K417912K721176L544969
3457A14569108L820244L654363M174758M427169N494647P251315P324683O683517
3449A57399804P440548Q921675J0352010J0884092J1749110J4077146J5225313
3442B36049698J7548590J9127100K2991107K6826338L1294552L4009024L3258682
3435D21105091K8448132K1048774J0177382o035438k3261310l5117103m0175565
$$ y = [67782778, 68519831, 69070929, 68759838, 69471051, 70461699, 71112645, 71858919, 72659324, 72938102, 73173400, 74510037, 74877858, 76009874, 77034841, 79039525, 80148994, 80869420, 81162229, 82454419, 84300900, 85616344, 87240813, 88271897, 90610775, 92322828, 93040028, 95483097, 97429749, 99348225, 102584725, 105885051, 108302963, 111024139, 114569108, 118389352, 122043715, 126218473, 130645642, 136140289, 143391604, 150716287, 157399804, 164840352, 173762027, 184114037, 194998129, 206747239, 220824385, 236049698, 253598288, 272725388, 295716495, 322542833, 353837385, 387846409, 421105091, 449553223, 470601997, 480779379, 474743941, 451482631, 416365528, 376189963]
3428C76189963m0077804l5991406l1235527k6560264k1706925j6439047j3664658
3421A90514332j2235248r954266p953529p384309p348101n552663o387585n930264
3413A27768367m329866m191554m280478l133343l042896l381534k978135l017705
3405I9412856k300983k710863j866400j917385k164271l241104k083018k239536
3397H0889296k238379n25193j496922j299648p96572j42981r18367o05049r17668
3388G1948517j047807j252391o38902j7108o48664j777451r26017l41000o92088
3379F4607089j036185p35941q27728m05516j043953p86869Q8786j100687j120860
3370E7638136j19828q53035O97185n19116p95655j27777r07741O8156j08388q4974
$$ y = [376189963, 336112159, 300120753, 268885226, 242324962, 220618037, 204178990, 190514332, 178279084, 168324818, 160371289, 152986980, 145638879, 140086216, 133698631, 127768367, 123438501, 119246947, 114966469, 111833126, 108790230, 105408696, 102430561, 99412856, 97111873, 94401010, 92534610, 90617225, 88452954, 85211850, 83128832, 80889296, 78650917, 78125724, 76628802, 75329154, 74532582, 74389601, 73471234, 72866185, 71948517, 70900710, 69648319, 69009417, 68992309, 68343645, 66566194, 65640177, 65299177, 64607089, 63570904, 62834963, 62007235, 61601719, 60557766, 59770897, 59859683, 58758996, 57638136, 57518308, 56665273, 57362458, 56843342, 56047687, 55919910, 55012169, 55080325, 54971937, 54886963]
3360E4886963j343096m58444Q4685l91230r15806L23031j064366n54454M2151
3351E0609434Q5593L645L61992j359163j97588O60615K06788j74743k46324l16457
3341D9633792Q3886m95332M0172N62527M92233l71091n99297P33630k34565O11127
3331E0457082l03347r631l78962l70669l54115n21882M3602o13262m73121m21162
3321D7054533J86892p8703j22789j72322q43562q87821J20892L11483Q07397n49755
3311D5826245n63991O04269L08676n06776p60094M04224q02859N66829N06652
3302D5583175L91082Q3396N46254n56181M36490P13591r6110Q80766k22616J58471
3292D7918318Q21102Q71555K26658o6960J71652J151615N64697m04334j79098
$$ y = [54886963, 53543867, 53085423, 53170108, 52778878, 51863072, 52186103, 51121737, 50567283, 50609434, 50695027, 50698672, 51060664, 49701501, 49503913, 50164528, 50371316, 50196573, 49950249, 49633792, 49717678, 49222346, 49262518, 49825045, 50317278, 49946187, 49346890, 50080520, 49845955, 50457082, 50153735, 50144104, 49765142, 49394473, 49040358, 48518476, 48562078, 47948816, 47475695, 47054533, 47241425, 47162722, 47039933, 46867611, 46024049, 45136228, 45257120, 45568603, 46376000, 45826245, 45262254, 45866523, 46175199, 45668423, 44908329, 45312553, 44509694, 45076523, 45583175, 45974257, 46057653, 46603907, 46047726, 46484216, 47197807, 47101697, 47982463, 47759847, 47918318, 48739420, 49610975, 49837633, 49770673, 49942325, 51093940, 51658637, 51254303, 51075205]
3283E1075205j77126M79966P25087P89007L00704j82474J50337Q1279Q76676P96612
3273E4915273J008586K37778J60891M95206m64396O63141j13406J524658N43371
3264E8971102L43736K11905R7106J043706L34396M45140K70103P13229Q04365
3255F3234788M31407R20648M72782R65137J631000J607459J430095J959222J110713
3246G3763251J878470K749980J860843K058081K060909K989102J807149K186609
3238I1354394K105468L262797J838561J042375R37072r70930k530982k289346
3230I4749409j201085j939177k861271j794202j418669j566192j121715j083876
3222H1763222j629738L1017l02759r3671j58433m14682q00503j615576j489552
$$ y = [51075205, 50898079, 51378045, 52103132, 52892139, 53192843, 53010369, 53160706, 53241985, 54118661, 54915273, 55923859, 56161637, 56322528, 56817734, 56353338, 57016479, 56903073, 58427731, 58971102, 59314838, 59526743, 59623849, 60667555, 61001951, 61447091, 61717194, 62430423, 63234788, 63666195, 64586843, 65059625, 66024762, 67655762, 69263221, 70693316, 72652538, 73763251, 75641721, 78391701, 80252544, 82310625, 84371534, 87360636, 89167785, 91354394, 93459862, 96722659, 98561220, 99603595, 100540667, 99569737, 97038755, 94749409, 93548324, 91609147, 88747876, 86953674, 85535005, 83968813, 82847098, 81763222, 80133484, 80164501, 79861742, 79768071, 79609638, 79194956, 78394453, 76778877, 75289325]
3213G5289325q54833j233498q87825o75237o41864o3569m81544j10248k97817
3204G0042890K70345N67061r49437j598271m10914j158871m76515q34556k78478
3195F5173254r73821n12588m15224k56213m10669n51756q718P40282J74673J31336
3185F3090556n115M46157K50674O31577O56718o6382J70109k77638J64067J63123
3175F5223846l14161K12854J092103J150098J424264J061593J805012K122039
3167G3777648K652239J824828K521053L234491M459110N338585N209071M928284
3159A03945309N813636N115244M117527K725729P91258j785411l929058n997430
3151A10796804o301181p099984p506213n506446n067270l666656l042574k416681
$$ y = [75289325, 74434492, 73200994, 72313169, 71637932, 70996068, 70932499, 70450955, 70340707, 70042890, 70313235, 70880296, 69930859, 68332588, 67921674, 66762803, 66286288, 65451732, 65173254, 64199433, 63686845, 63271621, 63015408, 62604739, 62052983, 62044265, 62784547, 62959220, 63090556, 63085441, 63531598, 63782272, 64413849, 65070567, 65004185, 65174294, 64896656, 65060723, 65223846, 64909685, 65122539, 66214642, 67364740, 68789004, 69850597, 71655609, 73777648, 76429887, 78254715, 80775768, 84010259, 88469369, 93807954, 99017025, 103945309, 109758945, 114874189, 118991716, 121717445, 122508703, 120723292, 116794234, 110796804, 104495623, 97395639, 89889426, 84382980, 79315710, 75649054, 72606480, 70189799]
3143G0189799k306699k224280j412140r13746j943402j492853j382953j920393
3135E6593333j585704r93711q40299l86718o45293j065561k12372q49050n24551
3126D9490074m90555Q4617o1022n00343k88381j654717n82462p40300l49304j43407
3116D4764200n46403m85030l05463L97372J5110q85612O68496l49499R2924j21434
3106D3244661J12612K92334M3758j700023q84491M49515L66524k83256l99654
3097D1241980O32796J21755K33924p36152Q41930M1575P66066q2265J74119Q21116
3087D4056844L55596L52296M03123k8393k45334m5315N64736L82089N4502M40564
3077D6290708j62270k50297J073082M64768M27273O52397k71983P85119O10168
$$ y = [70189799, 67883100, 65658820, 64246680, 63332934, 61389532, 59896679, 58513726, 56593333, 55007629, 54013918, 53173619, 52786901, 52141608, 51076047, 50863675, 50014625, 49490074, 48999519, 49084136, 49023114, 48522771, 48234390, 46579673, 45997211, 45256911, 44907607, 44764200, 44217797, 43732767, 43427304, 43824676, 43839786, 42954174, 43622670, 43273171, 43366095, 43244661, 43357273, 43649607, 43693365, 41993342, 41108851, 41558366, 41924890, 41641634, 41241980, 41874776, 41996531, 42230455, 41494303, 42336233, 42377808, 43143874, 43061609, 43235728, 44056844, 44412440, 44764736, 45167859, 45139466, 44894132, 44848817, 45413553, 45795642, 45850144, 46290708, 46128438, 45878141, 46951223, 47415991, 47843264, 48495661, 48223678, 49008797, 49618965]
3068D9618965m2794k77153L6301N87007M19136j6791j52358k55790M27308j88785
3058E0155046j316143O12601k75947m03662j408068o3733K82429M58865L02857
3049D8344245l89425O20087o27884l973j73609j03820J11504J83765k21874k29528
3039D7509488J5483J54073l75624n25749M41328J82344M89225L18633l93974j110416
3029D6704811J36358M64063l3663R18041M22220j54272L49126l12276J118450
3020D9612858J109211n82683N63529K46316Q93403j74885O24687J561877P00502
3011E4554815R61460M49509J251736J352142R79308N38162M91660J135937R70906
3002F2685635J201278J377461J655235J831028J030942J412240K063323K165391
$$ y = [49618965, 49576171, 49299018, 49335319, 49922326, 50341462, 50324671, 50172313, 49916523, 50343831, 50155046, 48838903, 49451504, 49175557, 48771895, 47363827, 47300094, 47582523, 48041388, 48344245, 47954820, 48574907, 47947023, 47943050, 47769441, 47665621, 47777125, 47960890, 47739016, 47509488, 47524971, 47679044, 47303420, 46777671, 47218999, 47401343, 47890568, 48209201, 47815227, 46704811, 46841169, 47305232, 47271569, 48189610, 48611830, 48457558, 48806684, 48494408, 49612858, 50722069, 50139386, 50702915, 50949231, 51842634, 51667749, 52292436, 53854313, 54554815, 55516275, 55965784, 57217520, 58569662, 59548970, 60087132, 60578792, 61714729, 62685635, 63886913, 65264374, 66919609, 68750637, 69781579, 71193819, 73257142, 75422533]
2994G5422533J616520O40277J093616L041236K276184J977819K141281J612486
2986H9821952K567563J453462K043661K097715J904829J876888K272457K847726
2978A06886253K406828K250328K350161J377699J645522K878711K188759J065914
2970A23050175K481248J433537Q80366P02957K379577J589113J468038J628252
2962A35613263J123857N55995N25389J372389l78610O97685O76178N2862n83332
2953A39655676k5617L01398j4294K62416l99867l11324l21293q47843m54071q26747
2943A37018434j546930p15396j017891j289174l11504r49987j334711j263340
2935A28589501p61797j123847j213229j534513k895700n35614r98228j518133
$$ y = [75422533, 77039053, 77679330, 78772946, 81814182, 84090366, 86068185, 88209466, 89821952, 92389515, 93842977, 95886638, 97984353, 99889182, 101766070, 104038527, 106886253, 109293081, 111543409, 113893570, 115271269, 116916791, 119795502, 121984261, 123050175, 125531423, 126964960, 127845326, 128548283, 130927860, 132516973, 133985011, 135613263, 136737120, 137293115, 137818504, 139190893, 138812283, 139509968, 140186146, 140239008, 139655676, 139630059, 139931457, 139917163, 140179579, 139779712, 139468388, 139147095, 138299252, 137845181, 137018434, 135471504, 134756108, 133738217, 132449043, 132137539, 131187552, 129852841, 128589501, 127827704, 126703857, 125490628, 123956115, 121060415, 120524801, 119526573, 118008440]
2927A18008440j302000j843656j613298k026674j269545q49241j302945j286862
2919A06514219j871274j686974j409011n30430j584848j918002j524739j489302
2911I4499639r99459k043562j453690k424805o64337j375694j761328j216135
2903H2560629k183371k050513j338005j618359j276646j184564j758948j634200
2895F9516023j857823j602575j418097j447731j172002j466025j456591j188339
2887E7906840p18734j076450j325408j828162j166026q93478j362165j180567
2879D8355850n96043n51477l93029q9728j373560j919862j31469o94231j088908
2870D1517543m62764m5956o03638o64645M47320o72785o69341p30163l28820J82809
$$ y = [118008440, 116706440, 114862784, 113249486, 111222812, 109953267, 109104026, 107801081, 106514219, 104642945, 102955971, 101546960, 101016530, 99431682, 97513680, 95988941, 94499639, 93500180, 91456618, 90002928, 87578123, 86913786, 85538092, 83776764, 82560629, 80377258, 78326745, 76988740, 75370381, 74093735, 72909171, 71150223, 69516023, 67658200, 66055625, 64637528, 63189797, 62017795, 60551770, 59095179, 57906840, 57188106, 56111656, 54786248, 52958086, 51792060, 50898582, 49536417, 48355850, 47759807, 47208330, 46815301, 46725573, 45352013, 43432151, 43300682, 42606451, 41517543, 41054779, 41008823, 40405185, 39740540, 40187860, 39515075, 38845734, 38115571, 37786751, 37969560]
2860C7969560M53366r8540m58722p48484j052516Q36941m7112m09343N87311J09395
2850C7141856q2501J94529q0810q8523m43433m24090K43352M90326M81701K88553
2840C7720960j35602M81391J83711K26586O20228J01953j43596M43640K6226m7973
2830C9477524J09846N59065j99906K1228J6642M37728J598168J92606J86721P01644
2820D3101266O4069L37502O65131R33765J35095K12468J109314Q210P37021O84219
2810D7988060Q30438M06398N38409R59205O61022P11192P71681O59567M47237
2801E3973209Q48841R84641j9867P90310N48951N33446M41420O07095j85548P50817
2791E9273315N93990k051N78682Q29158n33235o42551l0206r29037M407o5978
$$ y = [37969560, 38422926, 38324386, 37865664, 37117180, 36064664, 36901605, 36854493, 36445150, 37032461, 37141856, 37059355, 37253884, 37173074, 37084551, 36641118, 36217028, 36460380, 36950706, 37432407, 37720960, 37585358, 38066749, 38250460, 38477046, 39097274, 39199227, 39055631, 39499271, 39525497, 39477524, 39587370, 40146435, 39946529, 39967757, 39984399, 40422127, 42020295, 42212901, 42399622, 43101266, 43165335, 43502837, 44167968, 45101733, 45236828, 45449296, 46558610, 46566820, 47303841, 47988060, 48818498, 49224896, 49763305, 50722510, 51383532, 52094724, 52866405, 53525972, 53973209, 54822050, 55806691, 55786824, 56577134, 57126085, 57659531, 58100951, 58708046, 58522498, 59273315, 59867305, 59865254, 60443936, 61273094, 60739859, 60097308, 60067102, 59138065, 59142472, 59076494]
2781E9076494o05257m25751k01386o63603p24891k21089n97209J66174o65191
2772E5138291j361692k38300n62343O5372j00900r51617o08873m15812n04604
2763E0459522p25720k1916n85106N99443k76480L0041j62855r18793p83413j07660
2753D7507063O87622k2703l26692O63727K56770O2058P0903K18586M85137p3009
2743D9529462Q6359M46572l33068l27559n21343j40460N40741L42975l34004o1706
2733D9227969l29574q51922J00584l79109k81687m68608m48327k27685J57732
2724D6499373K0948r95511r28338n0802o52959L61882l35941l53126r6235M82068
2714D3951359l84332P13109L2993p2753j44487o56712L30579J4582n45424M77883
$$ y = [59076494, 58471237, 58045486, 57844100, 57180497, 56455606, 56234517, 55637308, 55803482, 55138291, 53776599, 53538299, 52975956, 53041328, 52940428, 51988811, 51379938, 50964126, 50459522, 49733802, 49711886, 49126780, 49726223, 49449743, 49479784, 49316929, 48398136, 47614723, 47507063, 48194685, 48171982, 47845290, 48509017, 48765787, 48827845, 48898748, 49117334, 49602471, 49529462, 49615821, 50062393, 49729325, 49401766, 48880423, 48739963, 49280704, 49623679, 49289675, 49227969, 48898395, 48046473, 48147057, 47767948, 47486261, 47017653, 46569326, 46341641, 46499373, 46520321, 45524810, 44596472, 44545670, 43892711, 44254593, 43918652, 43565526, 43469291, 43951359, 43567027, 44280136, 44313129, 44240376, 44095889, 43439177, 43769756, 43784338, 43238914, 43716797]
2704D3716797L75705L83895R39125O49084P22638M28725K90605J64165Q54100
2695D8524839K30416K00017J211370Q02981P96191O06582R31738J293567Q78881
2686E5476582L61125J017269J234889P31796J265627Q04040J293506J525755Q56057
2677F4566646N03093J699580J686670N86819J545235J453183O34243Q63770K672202
2668G6211441R95692R51799J245694N41013J642548J481870L38899K400938J466459
2659H7276353J651356J899126M0773J854639J167507J558563K230671Q59298M79432
2650I9017718O62761Q10670J484269P83339L25606J507654J796508J485239J007454
2641A08881218O73912R14100J156683R88921Q67865J494734J883852J277375Q77243
$$ y = [43716797, 44092502, 44476397, 45415522, 46064606, 46787244, 47215969, 47506574, 47670739, 48524839, 48755255, 48955272, 50166642, 50969623, 51765814, 52372396, 53304134, 54597701, 55476582, 55837707, 56854976, 58089865, 58821661, 60087288, 60891328, 62184834, 63710589, 64566646, 65069739, 66769319, 68455989, 69042808, 70588043, 72041226, 72675469, 73539239, 76211441, 77207133, 78158932, 79404626, 79945639, 81588187, 83070057, 83408956, 85809894, 87276353, 88927709, 90826835, 90867608, 92722247, 93889754, 95448317, 97678988, 98538286, 99017718, 99680479, 100491149, 101975418, 102758757, 103084363, 104592017, 106388525, 107873764, 108881218, 109555130, 110469230, 111625913, 112614834, 113482699, 114977433, 116861285, 118138660, 119015903]
2632A19015903J682464O84458J235739J193504J477738J666471J641383J976847
2624A30574507Q70917J402453J695784K309898K674146J785691J588272J674427
2616A44576095P72809J717506L095344J631635J688423J963321J495238J861721
2608A58802092J526147J809150K239254J375178J473052P12358O21341J330409
2600A69888981J518902P89697P26814L85541N71750J220884O43448J250520P60408
2591A77756945K25339R31895K75445N17846J467577O95132J551558J320877J017884
2582A85760498J611826J210549J787382J771673J521440K737378K404995L077823
2574B01883564K459997K884099L213135K982027L211405M040537M198473M237886
$$ y = [119015903, 120698367, 121382825, 122618564, 123812068, 125289806, 126956277, 128597660, 130574507, 131445424, 132847877, 134543661, 136853559, 139527705, 141313396, 142901668, 144576095, 145348904, 147066410, 150161754, 151793389, 153481812, 155445133, 156940371, 158802092, 160328239, 162137389, 164376643, 165751821, 167224873, 167937231, 168558572, 169888981, 171407883, 172197580, 172924394, 173309935, 173881685, 175102569, 175746017, 176996537, 177756945, 177982284, 178914179, 179189624, 179707470, 181175047, 181870179, 183421737, 184742614, 185760498, 187372324, 188582873, 190370255, 192141928, 193663368, 196400746, 198805741, 201883564, 204343561, 207227660, 210440795, 213422822, 216634227, 220674764, 224873237, 229111123]
2566B29111123N362736M772218M515521L853754M654108N626210O021141N008050
2558B68924861N194042M545677N682563O098714N462737N154609M945208M805285
2550C10813696M853617L800535N047997M007573L848902L137702K889641K941780
2542C41341443K410581K141159K323601J205782M54472N29281J084281M88709
2534C51979309q98392o05071o39946j235442j854779j403806k012515k163937
2526C41165421j689301k912784j905517j974896k586444l171814m127023k688963
2518C20108679l709744l799394l753685l406982m734891l971835m046628m534982
2510B88150538m701389m271187m512204m367641l869156l929553l790402m193820
$$ y = [229111123, 234473859, 239246077, 243761598, 247615352, 252269460, 257895670, 263916811, 268924861, 274118903, 278664580, 284347143, 290445857, 295908594, 301063203, 306008411, 310813696, 315667313, 319467848, 324515845, 328523418, 332372320, 335510022, 338399663, 341341443, 343752024, 345893183, 348216784, 349422566, 349877038, 350406319, 351490600, 351979309, 351080917, 350475846, 349835900, 348600458, 346745679, 345341873, 343329358, 341165421, 339476120, 336563336, 334657819, 332682923, 330096479, 326924665, 322797642, 320108679, 316398935, 312599541, 308845856, 305438874, 300703983, 296732148, 292685520, 288150538, 283449149, 279177962, 274665758, 270298117, 266428961, 262499408, 258709006, 254515186]
2502B54515186m877689m616019m658837l878087l253539m432808m188892l197985
2494B21411330l955582m041226l930213l470522k909253j345642k676253l164595
2486A95918044j876110k489824k279876j528090k163140k315313j883675k154134
2478A79227882j921621j768685q76872j051949j911155j826894j145484j021754
2470A67703468j678444k354763j930166j035203r38504j007387j122224n96368
2462A57040409j112218j059127j237573q64501q89283j566473J27317l48603p51352
2453A49338596L90798k92136O25283m32419M30723J698115O16477R64044J817842
2444A55157323J327635J499998K785210K644975K451642K347933J005226P83896
$$ y = [254515186, 249637497, 245021478, 240362641, 236484554, 233231015, 228798207, 224609315, 221411330, 217455748, 213414522, 209484309, 206013787, 203104534, 201758892, 199082639, 195918044, 194041934, 191552110, 189272234, 187744144, 185581004, 183265691, 181382016, 179227882, 177306261, 175537576, 174660704, 173608755, 171697600, 169870706, 168725222, 167703468, 166025024, 163670261, 161740095, 160704892, 159766388, 158759001, 157636777, 157040409, 155928191, 154869064, 153631491, 152766990, 151877707, 150311234, 150438551, 150089948, 149338596, 149729394, 149437258, 150062541, 149630122, 150060845, 151758960, 152375437, 153339481, 155157323, 156484958, 157984956, 160770166, 163415141, 165866783, 168214716, 169219942, 170003838]
2436A70003838J378338M56947M13568O15703M72030Q19222O36152Q01298M74212
2427A76071308J340238P33859j2251K59419N90434P64171n30853k036986j950031
2418A75229308j848129l213053k787338l610643l809636l028819k749312m276081
2410A49906297l793210m080381l864077k815394l662744m384122l721900l494163
2402A20090306m371638m232856m617845l817991l726485l385000l597666m365906
2394H7974919m051921l517400k802131l693418l198142k690323l267927k856466
2386F1897191k787710k331223j110900k008210j814355j803286j082627j408179
2378D7550701j965459j828286j315308p50471j284092q37554n80935j364537o64450
$$ y = [170003838, 171382176, 171839123, 172252691, 172868394, 173340424, 174159646, 174795798, 175597096, 176071308, 177411546, 178145405, 178133154, 178392573, 178983007, 179747178, 179216325, 177179339, 175229308, 173381179, 170168126, 167380788, 163770145, 159960509, 156931690, 154182378, 149906297, 146113087, 142032706, 138168629, 135353235, 131690491, 127306369, 123584469, 120090306, 115718668, 111485812, 106867967, 103049976, 99323491, 95938491, 92340825, 87974919, 83922998, 80405598, 77603467, 73910049, 70711907, 68021584, 64753657, 61897191, 59109481, 56778258, 55667358, 53659148, 51844793, 50041507, 48958880, 47550701, 45585242, 43756956, 42441648, 41691177, 40407085, 39569531, 38988596, 37624059, 36959609]
2369C6959609j150925j110444j297917J40150m80826q02954j059559m90657p19267
2360B9987210n45295j174535j014889k10094q30059j72189q04452j399433m3707
2351B3792557P02110o6723j254881m29092Q4252P4366j57083o16672m53352j172377
2341B0503105m34983j58180P57224r16091J86023l75885j325920j8074j28684
2332A8088535j04551J65093k42739J30598q97924j319452R9500j59675k84149
2323A5475236J50244m83506p58578o96197k32032j054893l3211j69764j68858
2314A2028441N12093k85156k59677K86282j93173n86865o73480J89239N81701
2305A1599405l56266l81733j56366l78505k286r052K22423j71427l60081N25757
$$ y = [36959609, 35808684, 34698240, 33400323, 33540473, 33059647, 32256693, 31197134, 30706477, 29987210, 29441915, 28267380, 27252491, 27042397, 26212338, 26040149, 25235697, 23836264, 23792557, 24494667, 24427944, 23173063, 22743971, 22828223, 22902589, 22745506, 22128834, 21675482, 20503105, 20068122, 19909942, 20667166, 19751075, 19937098, 19561213, 18235293, 18217219, 18088535, 17983984, 18149077, 17906338, 18036936, 17139012, 15819560, 15919060, 15759385, 15475236, 15625480, 15141974, 14383396, 13687199, 13455167, 12400274, 12367063, 12197299, 12028441, 12540534, 12255378, 11995701, 12281983, 12088810, 11501945, 10828465, 11017704, 11599405, 11243139, 10861406, 10705040, 10326535, 10324249, 10315197, 10537620, 10366193, 10006112, 10531869]
2295A0531869r834l26129k62468o09144M87090o33554o3104L06259p2226q1231
2285I267528l86727n67735J02066N5888l68199K94828k7639O7912K44661n47280
2275H135303k31687j80885m38431Q98573l46580M71818l58775k11645L58685l65644
2265G730732M2241j26654J98110N48202k53994r2944N49739M15127p76532k70098
2255G963929L39597j08302l95315J14458J92853m23808m90848L98821p1560K14239
2245G734064N35118k59270l07407j82751K35145O31557o7754o05054R688n7327
2235G666009l1149j5303j06840O57252K54292K34553L07092n05328L55263r84860
2225G830981j32349J015780K65186n37694k3901P81854L34359n90878l01537l28484
$$ y = [10531869, 10522035, 10195906, 9933438, 9324294, 9811384, 9177830, 9114726, 9420985, 9348759, 9267528, 8880801, 8313066, 8415132, 8471020, 8102821, 8397649, 8370010, 8437922, 8682583, 8135303, 7903616, 7722731, 7284300, 8182873, 7836293, 8308111, 7949336, 7737691, 8096376, 7730732, 7772973, 7646319, 7844429, 8392631, 8138637, 8045693, 8595432, 9010559, 8234027, 7963929, 8303526, 8195224, 7799909, 7914367, 8107220, 7683412, 7192564, 7591385, 7519825, 7734064, 8269182, 8009912, 7702505, 7519754, 7754899, 8386456, 8318702, 7713648, 7723336, 7666009, 7634860, 7619557, 7512717, 8169969, 8424261, 8658814, 8965906, 8460578, 8815841, 7830981, 7698632, 8714412, 8979598, 8441904, 8418003, 9199857, 9534216, 8943338, 8641801, 8313317]
2215H313317o33241R66244r12403r991J010567j11651O3837K29701J26257K36552
2205I279189o61434j68713j26905j64219p356m83359P83264M10662j0665j23157
2195H727307m55782l30950Q76360O05186L97208M86472r8263M65277N46100R5958
2185A1314873l10092J51909P67546L5007Q0130M26801J314812M5649J28988K85700
2175A4241323j55969j087456k12759l36914m95133m37278j502956j86463M96263
2166A0322658k89919j0808p58947o33527j21262m69890L9625r30898m37444K98183
2156G007771k56444l34734k51260J23328k21998K13704l84724L7955k01252j171727
2146D560619M39589r7616J99041l59540J79420Q4091N2245l35943J93922P037
$$ y = [8313317, 7680076, 8646320, 7733917, 7723926, 8734493, 8622842, 8686679, 8916380, 9042637, 9279189, 8617755, 8449042, 8322137, 8157918, 8150562, 7667203, 8450467, 8861129, 8850464, 8727307, 8271525, 7940575, 8816935, 9422121, 9819329, 10305801, 10207538, 10672815, 11218915, 11314873, 11004781, 11156690, 11924236, 11959243, 12039373, 12466174, 13780986, 13826635, 13955623, 14241323, 14085354, 12997898, 12785139, 12448225, 11953092, 11515814, 10012858, 9826395, 10322658, 10032739, 10021931, 9262984, 8629457, 8508195, 8038305, 8077930, 7147032, 6709588, 7007771, 6751327, 6416593, 6165333, 6288661, 6066663, 6280367, 5895643, 5933598, 5732346, 4560619, 5000208, 4902592, 5101633, 4742093, 4921513, 5005604, 5057849, 4721906, 4915828, 4922865]
2136D922865J33488M771j210912k84561O9472n39061L83887L75948j33656l125
2126C719116P71826k98817L66621N04272j009842p81490p22405r309N86170M14521
2116C540663k83245M4061n22491j52699K82169m1700n4364k05014k72413J57098
2106B492065L54324L1009j25979j56414r59083n14843O9839R53573n05956K51010
2096A889545k2486k57238N90871k21276J32952L99770o94837m19366P14124r86267
2086A125792P7130j79006N78997j51182k53355o33722L63932l80821O2185O54086
2076A264036K58706J86301k34788p1885n06715N03539n06082j27269N31200L08371
2066A605414K15577q3917l96689J73545N1188N35285m82003j24023r25626M7190
$$ y = [4922865, 5056353, 5061124, 3850212, 3565651, 3635123, 3096062, 3479949, 3855897, 3722241, 3719116, 4490942, 4192125, 4558746, 5063018, 4053176, 3271686, 2549281, 2539972, 3126142, 3540663, 3257418, 3301479, 2778988, 2626289, 2908458, 2866758, 2812394, 2607380, 2334967, 2492065, 2846389, 2877398, 2751419, 2595005, 1635922, 1121079, 1190918, 2144491, 1638535, 1889545, 1867059, 1609821, 2200692, 1979416, 2112368, 2512138, 1817301, 1397935, 2112059, 1125792, 1202922, 1023916, 1602913, 1451731, 1198376, 564654, 928586, 547765, 609950, 1264036, 1522742, 1709043, 1474255, 1402370, 895655, 1399194, 893112, 765843, 1297043, 1605414, 1820991, 1737074, 1340385, 1513930, 1565118, 2100403, 1618400, 1494377, 568751, 615941]
2056F15941m00983O63551k86313l552J151948L34775m29187r48283M3834O91412
2046A433143N07501q3071k46983m32158M04079q09881O65974m32086l00631N72661
2036A278548K23744K88214J2412k55704r0372l67992l70033j67320O57532J60642
2026A369671n98834R5540R7847J90277M55335j149983P2617J007499L0792K40859
2016A811620J41436l63779n34854J88542K39683J3595n33833n04441k9611R9679
2006E28037j76470K17398j75215j99590O32555j12995j7588M23907k46537J30558
1996A004060J46938o8209q97617m85441N39954k63602l95452M77740J74942J60176
1986C93489j73670L41488k28139k70210L78264O8703N9798J61730p9567j18026
$$ y = [615941, 214958, 878509, 592196, 588644, 1740592, 2075367, 1646180, 697897, 741731, 1433143, 1940644, 1857573, 1610590, 1178432, 1582511, 772630, 1438604, 1006518, 705887, 1278548, 1502292, 1790506, 1802918, 1547214, 1456842, 1088850, 718817, 551497, 1209029, 1369671, 770837, 866377, 964224, 1154501, 1609836, 459853, 532470, 1539969, 1570761, 1811620, 1953056, 1589277, 1054423, 1242965, 1482648, 1496243, 962410, 457969, 428358, 528037, 351567, 568965, 393750, 194160, 826715, 713720, 696132, 1120039, 873502, 1004060, 1150998, 1082789, 185172, -300269, 239685, -23917, -419369, 58371, 233313, 393489, 219819, 561307, 333168, 62958, 441222, 509925, 569723, 731453, 651886, 533860]
1976E33860L86912j94572n74322p66032k35225Q80138K87410J99296q00985r61554
1966a245074O73126N25193N0438m1974J75639M91801k39184j19501J53048J16038
1956E39550l02860j94550O18772k41381m69841m8518M13957N20477r3223o78440
1946F3943k99799L8007m66709M35596O99783o30275l12643M28745o6852J05217
1936d987L60561l57485N97023L64022p30350k94168K81610L36276j97517o6987
1926B87998l64530k62831Q63305k63107k15116J78133k30784L26844K27804L03127
1916H50843J28151k29060j84590n95908j23474O76288k23421q8189l22792J06368
1906e784j52317L90865j94346K75240L60668j007728P38076P58007J74592n00603
$$ y = [533860, 920772, 726200, 151878, -614154, -849379, 30759, 318169, 517465, -283520, -1245074, -571948, -46755, 3683, -38291, 137348, 629149, 389965, 270464, 423512, 539550, 236690, 42140, 660912, 419531, -50310, -98828, 315129, 835606, 742383, 63943, -235856, -197849, -664558, -228962, 470821, -159454, -472097, -43352, -110204, -4987, 355574, -1911, 595112, 959134, 228784, -65384, 216226, 552502, 354985, 287998, -76532, -339363, 523942, 260835, 45719, 223852, -6932, 319912, 547716, 850843, 978994, 749934, 565344, -30564, -154038, 522250, 298829, 210640, -112152, -5784, -158101, 232764, 38418, 313658, 674326, -333402, 404674, 1162681, 1337273, 836670]
1896H36670m88850j31684N62422n64111m45953K63683P11874L59935o88367r66309
1886e50690O57248K91040q61433K64829K08069M83904l05626K47108o4185o3763
1876C06501J55603N99270j01227m78663l04396k41250N67512O86778P8006m29917
1866H38217m60614m82454L73479M04151L67303m22642k26628k78039K4431K09670
1856C46874L76228o62459m5073K02349J84107N06805j22997K6934j35812j48325
1846E28631J02985R1704L71189n07682O72445N29433q71120O5966m58127l32563
1836A92861J053233O05386m26061k98336k854q3098R8197J57360L36473o76711
1826I56450n89044O5173J74102P09223J154211L64693q31696l39030N15818j66924
$$ y = [836670, 347820, 216136, 778558, 214447, -231506, 32177, 744051, 1103986, 415619, -550690, 106558, 397598, -463835, -199006, 9063, 492967, 187341, 434449, 370264, 306501, 462104, 1061374, 960147, 481484, 177088, -64162, 503350, 1190128, 1268134, 838217, 377603, -104851, 268628, 672779, 1040082, 617440, 390812, 112773, 137204, 346874, 723102, 60643, 15570, 217919, 402026, 908831, 785834, 812768, 676956, 528631, 631616, 723320, 1094509, 586827, 1259272, 1788705, 917585, 983551, 525424, 192861, 1246094, 1851480, 1425419, 1127083, 1124229, 1041131, 1139328, 1296688, 1633161, 956450, 367406, 432579, 606681, 1315904, 2470115, 2834808, 2003112, 1664082, 2179900, 2012976]
1816B012976q64714m18440l36498K62771k17466M9777M25546L33658q7249O2421
1806A222782n91222r9700M11774j8895k78651K78464J89275J23316O6038j85886
1796A117295k3818Q087M03959k30438k08246L85810o63337M34885P23646l35801
1786A612042n69254j03825k71617l7046o2933J64662M69785R4810Q99212l64425
1776A831411j063727m9672Q3855n01376k14649j88878J032523K94572M13995o45449
1766I92605n6671n45177N86553M85424j116904O41015J191371l5278q72064o30300
1756F40574o72346K92834L31549K74108J15450O94703n45622p82993Q473N36792
1746H93522L14592q36364J29044J379903o3971N857j079615m35851R3341J24532
$$ y = [2012976, 1148262, 729822, 393324, 656095, 438629, 488406, 913952, 1247610, 1160361, 1222782, 631560, 531860, 943634, 924739, 646088, 924552, 1113827, 1237143, 1303181, 1117295, 1093477, 1101564, 1505523, 1275085, 1066839, 1452649, 789312, 1224197, 1947843, 1612042, 1042788, 938963, 667346, 630300, 567367, 732029, 1201814, 1296624, 2195836, 1831411, 767684, 718012, 801867, 300491, 85842, -103036, 929487, 1224059, 1638054, 992605, 935934, 390757, 977310, 1462734, 345830, 986845, 2178216, 2142938, 1270874, 640574, -31772, 261062, 592611, 866719, 982169, 1676872, 1131250, 348257, 356730, 893522, 1208114, 371750, 500794, 1880697, 1816726, 1822583, 742968, 307117, 400458, 524990]
1736E24990O53754O25950K1593K00788O29787k60623j100809k37982j83687o4308
1726H09453k38262k98000j20324r00969N05725J105108K81812k83839q89882M46104
1716D16926k29041l34679k50921K80380M44168O0260p3412n9985P55921m29019
1706E80598k97086M91704O3577j18008m38893k32097m18209Q29604j66101n82175
1696b87086j98088q079J41121K79397O72367q99926j25071O6174L26070k49524
1686b82645Q1554J132686M35088j98116k97219o68728k47155O21598o23954j20801
1676a67692K39896j81572p53087j72440M86503O5694J21312j108699O90286R05554
1666A25755l69634j469915L29899O82287R04857J68441N52642p92184m30467m7642
$$ y = [524990, 1178744, 1804694, 1826287, 2027075, 2656862, 2396239, 1295430, 1057448, 873761, 809453, 571191, 273191, 152867, -748102, -242377, 862731, 1144543, 860704, -29178, 416926, 187885, -146794, -397715, -117335, 326833, 387093, 313681, 253696, 1009617, 580598, 283512, 775216, 838793, 720785, 281892, 49795, -368414, 461190, 295089, -287086, -485174, -493253, -352132, -72735, 599632, -300294, -425365, -359191, -33121, -282645, -201091, 931595, 1366683, 1168567, 871348, 202620, -44535, 577063, -46891, -167692, 72204, -109368, -862455, -1034895, -548392, -482698, -361386, -1470085, -779799, 125755, -243879, -1713794, -1383895, -701608, 203249, 371690, 924332, 132148, -298319, -345961]
1656c45961K88736l96949J44621J6525n72752N24258K64231O7315n48697n5086
1646f13759J91242Q8061p4915j83526K51314O52291q3430o01025k0449r9298M56694
1635c6800L87974r4627n7218q45249n40864m6897l7895M20230J39952k06383P3622
1624h44155M26541L97179j94526L23340N53403j99464m04627K95539l89874n40956
1614e77600R46073K64910j067063m869Q98428M75431l91191o60573j76804l20324
1604f13582k79074o21113R92864L88500n10864N06810o97782k29611P11352N95841
1594B43341o37538k31057N49597n47702m0212P09389k17146o99331K27884M66340
1584a76435k18237r8141M86957Q489k31215L79586n44263k43478O35703Q6080
$$ y = [-345961, -57225, -454174, -309553, -293028, -865780, -341522, -77291, -9976, -558673, -613759, -422517, -334456, -409371, -592897, -341583, 310708, 227278, -373747, -394196, -493494, -36800, 351174, 256547, 199329, -645920, -1186784, -1233681, -1271576, -851346, -711394, -917777, -844155, -417614, -20435, -214961, 108379, 661782, 462318, 57691, 353230, -36644, -577600, 368473, 633383, -433680, -438549, 459879, 935310, 544119, -116454, -293258, -613582, -892656, -1513769, -520905, -132405, -643269, -136459, -834241, -1063852, -352500, 243341, -394197, -625254, -75657, -623359, -663571, 45818, -171328, -870659, -642775, -176435, -394672, -492813, -5856, 2633, -228582, 151004, -393259, -636737, -1034, 85046]
1574H5046j356846J209150k63578n71089M71870Q4931N51909k18724L53597k6985
1564C19281n36809M30352l86257m09482K86351r0413m42448M30539l61600N56875
1554b03611j215013p43349R20023O07358M22070K31337J26882p4887p86106p0147
1544g85443k5767M42171N83429l98467l69909j09336R03834n76676k77502K48889
1534c64777l64691N09480k54619J35247n96018j59379J011477m22525l16573m19276
1524a241654O89497J68165j85853k63584J78398J41357k20826l11807J71667M98148
1514c76492Q70633K82315k72721J17665o06382o80564j91140N41130l72959m42341
1504a130856N48579j34922N19497K18543m88863k36123O82951K10643r9273J30179
$$ y = [85046, -1271800, -62650, -326228, -897317, -425447, -340516, 211393, -7331, 346266, 319281, -217528, 212824, -173433, -582915, -296564, -386977, -829425, -398886, -760486, -203611, -1418624, -2161973, -1241950, -634592, -212522, 18815, 145697, 70810, -715296, -785443, -811210, -369039, 214390, -184077, -553986, -663322, 240512, -336164, -613666, -364777, -729468, -219988, -474607, -339360, -935378, -1094757, -83280, -505805, -822378, -1241654, -552157, -383992, -569845, -833429, -655031, -513674, -734500, -1046307, -874640, -376492, 494141, 776456, 503735, 621400, 15018, -665546, -856686, -315556, -688515, -1130856, -582277, -717199, -197702, 20841, -468022, -704145, -21194, 189449, 90176, 220355]
1494B20355N1650L56049j45705l73920m80435P72175p38658n04002M33648J8540
1484c90303M18416n12009K65289k29025k05327m10509L58942l25442K18356M69393
1474c42219J251970o81098j550195M31136L42795k71307K95106M14814N20275
1465D11277j44716n8320k42916m88921L37968J26149K18877L5954q253m5191J9642
1454A61550j62658m75282l46226j4902J30088K15837P1741Q74478o59982k44095
1444d49451M191M73368J075997o98812p57611m92852K90997L91289o0807l75387
1434e99078M84515L47691J77816n17164n94677K2279n48057K28054N92540K62695
1424a43386P2979P2848j73287J41884m32924j18791N97997O04942J09885j115029
$$ y = [220355, 272005, 628054, 482349, 108429, -372006, 400169, -338489, -842491, -408843, -390303, 28113, -483896, -218607, -447632, -652959, -1063468, -704526, -1029968, -811612, -342219, 909751, 228653, -1321542, -890406, -547611, -818918, -523812, -108998, 411277, 266561, 208241, -34675, -523596, -185628, -59479, 159398, 195352, 187099, 141908, 161550, -1108, -476390, -822616, -837518, -707430, -491593, -419852, 454626, -205356, -449451, -445260, 28108, 1104105, 405293, -352318, -845170, -554173, -162884, -223691, -599078, -114563, 233128, 410944, -106220, -700897, -678618, -1226675, -998621, -406081, -143386, -70407, 2441, -170846, -28962, -461886, -580677, 17320, 622262, 732147, -382882]
1414c82882J87280k05917m80639m15464K42860L61422M99537j13992Q42590n48154
1404a3359l42315K8099o19972L84982N62929O03607j010595J3447n75037O59518
1394c08696L57788N0912l09130p52417M65419j60918j21957K69382j44709J645565
1384I91239m68565q36120p08968j92622P34875L90562p85829k00422N49698O22138
1374I5986j83906q50870l16428J96895K18011j14765J25313M18821M78848n8073
1364I832n09038L69213m05291j44560O93264j14210j23934K66341l77859L81440
1354D5198L56376o62571q31954l31058Q03869J30050l38958N00497N86514J3212
1344B71175o57538n70932N02937J65197n4553m0294N61251m47793k64534P35519
$$ y = [-382882, -195602, -401519, -882158, -1297622, -1054762, -693340, -193803, -307795, 534795, -13359, -355674, -327575, -947547, -562565, 364, 603971, -406624, -393177, -968214, -308696, 49092, 100004, -209126, -961543, -496124, -657042, -778999, -509617, -654326, 991239, 522674, -313446, -1022414, -1215036, -480161, -89599, -875428, -1075850, -526152, 95986, -87920, -938790, -1255218, -1058323, -840312, -955077, -829764, -410943, 67905, 9832, -499206, -129993, -535284, -679844, 13420, -100790, -224724, 41617, -336242, 45198, 401574, -260997, -1092951, -1424009, -620140, -490090, -829048, -328551, 257963, 271175, -386363, -957295, -454358, -289161, -343714, -384008, 177243, -270550, -535084, 200435]
1334B00435L95364m27944m7429k16174j68308n26013q2188P82967M76068n14288
1324a27510m05874k78398K62936M53769n61729o67582j26290R92825N85358o440
1314A21065N4790j104361N53084N26768K43753Q1482k40074j045913l7052P03070
1304a43388l59665O18518J28159P4336Q5828l58415L20960o99795l03287j00452
1294g37201l43998N20444M69673M37875J68221J89689j92072p77061O0399J320264
1284A116233n74009j448705K44503j2508K43770K60733l29499N70374m81147J98720
1274b11535j15760j7946q8789m10063M57841M5246q6387R16766J28632p79306
1264a61301q5202j08797L99054J20621o61696M97025O09704l65431J74697N7367
$$ y = [200435, 595799, 167855, 120426, -95748, -264056, -790069, -872257, -89290, 386778, -127510, -533384, -811782, -548846, -95077, -656806, -1324388, -1450678, -457853, 127505, 121065, 175855, -928506, -375422, 151346, 395099, 476581, 236507, -809406, -846458, -143388, -503053, 115465, 243624, 317960, 403788, 45373, 366333, -333462, -636749, -737201, -1081199, -560755, -91082, 346793, 515014, 704703, 512631, -264430, -204031, 1116233, 542224, -906481, -661978, -674486, -430716, -169983, -499482, 70892, -410255, -211535, -327295, -345241, -434030, -844093, -386252, -341006, -427393, 489373, 618005, -161301, -246503, -355300, 43754, 164375, -497321, -296, 609408, 243977, 418674, 476041]
1254D76041k38113O89923J87324J45551j59145p35809M11971k9013q8447J95533
1244H55816k59592K71354Q0316j144m09496L41761J53362m05828P0860m38050
1234B59359q64948l33966K23690K60940L11724K61405L80586P4580J12715m36510
1224B49575k69589N67722o47756k16939O18414l05524m7366L39168P2397J79555
1214E39657r8988m52083l05024j869K95667m90169M66452L09717J72051R6207
1204E31618O1764m77264l63551K5601J07343J13168o9283N38786j72227j95995
1194I9960J77844p03571M71516k22917r7188R54618J30667m43651k2879J11734
1184D56133m26139j71895o02916l9927N36467O71800n9311P9927j29022L18911
$$ y = [476041, 237928, 927851, 1115175, 1260726, 1101581, 365772, 777743, 748730, 660283, 855816, 596224, 867578, 947894, 946750, 537254, 879015, 1032377, 626549, 697409, 259359, -605589, -939555, -715865, -454925, -143201, 118204, 498790, 573370, 686085, 249575, -20014, 547708, -100048, -316987, 301427, -4097, -51463, 287705, 360102, 539657, 440669, -11414, -316438, -318307, -22640, -512809, -46357, 263360, 435411, 531618, 593382, 116118, -247433, -221832, -114489, -1321, -70604, 468182, 295955, 99960, 277804, -425767, 45749, -177168, -274356, 680262, 810929, 367278, 344399, 456133, 29994, -141901, -744817, -784744, -248277, 423523, 364212, 444139, 315117, 634028]
1174F34028L41440Q13465k38691q84679n13365m66795J109427J55475n80980K3393
1164C92718K59211j38403l04630j74076m1287k73410L28627j18670L22102r12650
1154f60468p11147J059668L09490K64739O5076O18111q6512J55871j41917M52530
1144A325441L03918o98356j02346k26947L47489l14594N75022P22421k64174L53625
1134B021499l62948K23686q14732m52547O15774k58055n96902Q42699o2813k10025
1124I45636R12357m78189M77838J67847l99580J67822o9088j62060R25469j01019
1114B387033o66642Q2120l70210j78496J66936O26137J74501q69007N85315N14884
1104B452571l59494l11079R83678M22862q64853o84663P83292k30430J11218O37662
$$ y = [634028, 975468, 1788933, 1550242, 665563, 152198, -314597, 794830, 950305, 369325, 392718, 651929, 513526, 208896, 34820, -6467, -279877, 48750, -69920, 252182, -660468, -1371615, -311947, -2457, 262282, 327358, 945469, 858957, 1014828, 872911, 1325441, 1629359, 931003, 828657, 601710, 949199, 634605, 1209627, 1932048, 1667874, 2021499, 1658551, 1882237, 1067505, 614958, 1230732, 972677, 375775, 1218474, 1155661, 945636, 1857993, 1379804, 1857642, 2025489, 1625909, 1793731, 1724643, 1562583, 2488052, 2387033, 1720391, 1802511, 1432301, 1253805, 1420741, 2046878, 2221379, 1352372, 1937687, 2452571, 2093077, 1781998, 2765676, 3188538, 2323685, 1639022, 2422314, 2191884, 2303102, 2940764]
1094B940764Q8756k88543p37010Q6958N58282L77070o40882O96337R35373L4554
1084D051659l82690K64290l18769j99530N95605M8159o08491k45251N79683l01705
1074C482960j78944N63553m18552k5454k50024R01858j50274K41155P6339k52881
1064C989736N1828Q8025K35503L77047M57762p7405M1308l11293K61875N20541
1054E634927j82263L69138k73427L2679Q98031M02450o69864p53992K02709J685681
1044G346069M74058k73616k13983O5581O32562k3856j54773l9333O39001M52702
1034H904412J33429L43547M91708o07953J44580N50531P80972N15831J23762L33321
1024A1714140j15268m4320O3975j00112N05349P57454N68436P35060p7729K89329
$$ y = [2940764, 3029520, 2740977, 2003967, 2090925, 2649207, 3026277, 2385395, 3081732, 4017105, 4051659, 3668969, 3933259, 3614490, 3414960, 4010565, 4058724, 3450233, 3204982, 3784665, 3482960, 3304016, 3867569, 3449017, 3423563, 3173539, 4075397, 3925123, 4166278, 4242617, 3989736, 4041564, 4129589, 4365092, 4742139, 5199901, 5122496, 5163804, 4852511, 5114386, 5634927, 5452664, 5821802, 5548375, 5581054, 6479085, 6881535, 6211671, 5457679, 5660388, 7346069, 7820127, 7546511, 7332528, 7398109, 8030671, 8006815, 7852042, 7812709, 8451710, 8904412, 9037841, 9381388, 9873096, 9265143, 9409723, 9960254, 10741226, 11257057, 11380819, 11714140, 11598872, 11554552, 11618527, 11518415, 12023764, 12781218, 13349654, 14084714, 14006985, 14296314]
1014A4296314N44708M26159J028727N10595R20035j55762Q08131R80838P95594
1005B0155339J127765J181523Q20976Q72302J12584J116089J437149O44168J322142
996B8790037K061670J770173J711448J918824K310339K040051J314439K682800
988D4599781L865728K840166L624265M391952M265676M504174M783770M249582
980G7125094N329690O817980P444821Q125714R188583J1872801J5301356J8044835
972A59250874K3649474K8581357K6288936K2996957J9453849J2174238m268562
965B88127123k2737298l2654453l5683524l2804334k5630180j9103101j4805283
958A04708950j2189584r722359o668732n908932n209107m288846l120699k847313
$$ y = [14296314, 14841022, 15267181, 16295908, 16806503, 17726538, 17570776, 18378907, 19359745, 20155339, 21283104, 22464627, 23285603, 24157905, 24270489, 25386578, 26823727, 27467895, 28790037, 30851707, 32621880, 34333328, 36252152, 38562491, 40602542, 41916981, 44599781, 48465509, 51305675, 54929940, 59321892, 63587568, 68091742, 72875512, 77125094, 82454784, 89272764, 96717585, 104843299, 114031882, 125904683, 141206039, 159250874, 182900348, 211481705, 237770641, 260767598, 280221447, 292395685, 288127123, 265389825, 232735372, 197051848, 164247514, 138617334, 119514233, 104708950, 92519366, 82797007, 76128275, 70219343, 65010236, 60721390, 57600691, 54753378]
950E4753378l051856l385630l641519l816585l705588k105506r43946j587500
942C2515248j904648j993050j148126j218249j196200j004560j808473n66313
934B1675629j818979j072248j583081r78940o63923r3741l96742q9359j190674
925A3787942k47802K27392q00762p66115K0161n25045n67073L29453p99795p47232
915I911124J72104m8757o23786l00586n02422p28854m31385M91737l76580o94467
905F868128j87642O02430J38200k02426j22048o60692j59105m7471K02671P2210
895F504255q49285n31628N26504N15388m11808j82243p90473j58706k21137p59301
885C641566L90989j07101k19357J131730K03445n44093p69753O16914o53323j2476
$$ y = [54753378, 51701522, 48315892, 44674373, 40857788, 37152200, 35046694, 34102748, 32515248, 30610600, 28617550, 27469424, 26251175, 25054975, 24050415, 22241942, 21675629, 19856650, 18784402, 17201321, 16222381, 15558458, 15464717, 15067975, 14978616, 13787942, 13540140, 13767532, 12966770, 12200655, 12220816, 11695771, 11128698, 11458151, 10658356, 9911124, 10083228, 10034471, 9410685, 9110099, 8607677, 7878823, 7447438, 7939175, 7562595, 6868128, 6680486, 7282916, 7421116, 7218690, 7096642, 6435950, 6276845, 6229374, 6432045, 6504255, 5654970, 5123342, 5649846, 6165234, 5753426, 5571183, 4780710, 4622004, 4400867, 3641566, 4032555, 3925454, 3706097, 4837827, 5041272, 4497179, 3727426, 4344340, 3691017, 3678541]
875C678541l74396n0331P21813m4923J05633o07165k77458k34979J76641J51003
865C244379J67601o89671r03668n7867N59130l19163K74377L67774j7646n78522
855B046724N079j84349m43904l08088M01480N9781K24040n9533M57519J70975
845B369724o18916m15207j25771J02303r13764M43901L43211K05693n78169k71158
835E41847P7555O5890M33472l38954j66321r9422L89500O3218L77243r67003K74060
824F51085N99876k65961J70111j60135o27018J13017j63802l49559J48838j37623
814b1171K44761L0902j9223k8375J04683Q0715K39279L29447N81115k0323k78278
803A243532n87909o09727Q26056q43959j81357J020836k98083j98237o49812l40159
$$ y = [3678541, 3304145, 3253814, 3975627, 3930704, 4036337, 3429172, 3151714, 2916735, 3093376, 3244379, 3411980, 2722309, 1818641, 1760774, 2319904, 2000741, 2275118, 2642892, 2625246, 2046724, 2051803, 1867454, 1423550, 1115462, 1516942, 1576723, 1800763, 1741230, 2198749, 2369724, 1750808, 1335601, 1209830, 1312133, 398369, 842270, 1185481, 1391174, 813005, 541847, 619402, 685292, 1118764, 779810, 613489, 514067, 903567, 966785, 1344028, 377025, 651085, 1250961, 985000, 1155111, 994976, 367958, 480975, 317173, -32386, 116452, -21171, 223590, 254492, 235269, 206894, 311577, 392292, 631571, 961018, 1542133, 1521810, 1243532, 655623, 45896, 871952, 27993, -153364, 867472, 569389, 371152, -278660, -618819]
793f18819M60008L93791p0410Q8553J7028R14563n52630K25017j87040L45519
783A015580m55371q13383m62391N77731R01932l73025K80495K71061n04511l88858
773D9260K89393O95557r27581k14004q7802k69853K40424P20883n20207k6572
763e0502l41985N42580K98585q58327M09377K59283J0218L6961k60699m92319
753d46828l84984O57731K45015k01627Q01965n66605N02582j21466Q2454L65568
743I33805l37296j397414K79611Q00689L09626J40084l2140p4825m05031k32063
733a4954j44952l39783R71578K43469m49857k49772J41984l593L7673L40116j47944
722C83965M56891m76816Q9680n16233K3853K95721n3074O8058n7234J83464k37138
$$ y = [-618819, -158811, 234980, 164570, 253123, 270151, 1184714, 632084, 857101, 670061, 1015580, 560209, -253174, -715565, -137834, 764098, 391073, 671568, 942629, 438118, 49260, 338653, 1034210, 106629, -107375, -195177, -465030, -224606, 496277, -23930, -50502, -392487, 150093, 448678, -409649, -272, 259011, 269229, 306190, 45491, -446828, -831812, -174081, 70934, -130693, 671272, 104667, 607249, 485783, 568237, 933805, 596509, -800905, -521294, 279395, 589021, 729105, 696965, 622140, 217109, -14954, -159906, -499689, 471889, 715358, 265501, 15729, 157713, 154120, 191793, 531909, 383965, 840856, 364040, 453720, -62513, -38660, 257061, 203987, 272045, 214811, 398275, 161137]
$$ [...]
##END NTUPLES=NMR SPECTRUM
##END=
