##TITLE=1H_CA-8842-1
 CDCl3,8 sc, 
 7.04.2021
##JCAMPDX= 6.0         $$ Bruker NMR JCAMP-DX V2.0
##DATA TYPE= NMR SPECTRUM
##DATA CLASS= NTUPLES
##ORIGIN= UXNMR, Bruker Analytische Messtechnik GmbH
##OWNER= root
$$ XWIN-NMR		Version 3.5
$$ Wed Apr  7 11:47:31 2021 Russian Standard Time (UT+4h)  she@DPX200
##.OBSERVE FREQUENCY= 200.131506
##.OBSERVE NUCLEUS= ^1H
##.ACQUISITION MODE= SIMULTANEOUS
##.ACQUISITION SCHEME= undefined
##.AVERAGES= 8
##.DIGITISER RES= 18
##SPECTROMETER/DATA SYSTEM= spect
##.PULSE SEQUENCE= zg30
##.SOLVENT NAME= CDCl3
##.SHIFT REFERENCE= (INTERNAL, CDCl3, 0, 15.9771)
##AUDIT TRAIL= $$ (NUMBER, WHEN, WHO, WHERE, WHAT)
$$ ##TITLE= Audit trail, XWIN-NMR		Version 3.5
$$ ##JCAMPDX= 5.01
$$ ##ORIGIN= Bruker BioSpin GmbH
$$ ##OWNER= she
$$ F:/spectra/data/she/nmr/H-F/1/pdata/1/auditp.txt
$$ ##AUDIT TRAIL=  $$ (NUMBER, WHEN, WHO, WHERE, WHAT)
(   1,<2021-04-07 11:46:23.90 +0400>,<she>,<DPX200>,
      <created by zg, POWCHK disabled, PULCHK disabled
       configuration hash MD5:
       00 E9 B6 7A A2 85 ED C7 34 08 36 98 17 FE 4E 26
       data hash MD5: 16K
       8E 6F 6D 7E F0 D0 85 E5 7A 30 D7 30 75 69 E6 A5>)
(   2,<2021-04-07 11:46:26.84 +0400>,<she>,<DPX200>,
      <Start of raw data processing
       efp BC_mod = 2 LB = 0.24 FT_mod = 6 PKNL = 1 PHC0 = -11121.43 PHC1 = 14.20092 SI = 16K 
       data hash MD5: 16K
       C7 CA 9C EC D7 F1 DC E7 48 10 3B CC 14 A0 AE 36>)
(   3,<2021-04-07 11:46:30.73 +0400>,<she>,<DPX200>,
      <abs ABSG = 5 
       data hash MD5: 16K
       41 E4 13 C7 4C 8A 8B 80 0B 61 1F 40 1F 64 CB 89>)
(   4,<2021-04-07 11:46:51.45 +0400>,<she>,<DPX200>,
      <pk PHC0 = 0.9164519 PHC1 = -1.4 
       data hash MD5: 16K
       82 46 8C 12 7A A1 15 E8 3E 1F 08 9F 45 12 68 3A>)
(   5,<2021-04-07 11:46:54.31 +0400>,<she>,<DPX200>,
      <abs ABSG = 5 
       data hash MD5: 16K
       0A 96 73 95 82 7C 19 BA 6E A9 12 A3 18 4E 6D B7>)
$$ ##END=
$$ 
$$ hash MD5
$$ 9B CF E7 6B 91 DE 34 19 30 FC FF 9C CA C7 7B AA
##$RELAX= 
##$RELAX= 
##$RELAX= 
##$RELAX= 
##$RELAX= 
##$RELAX= 
$$ Bruker specific parameters
$$ --------------------------
##$DU= <F:/spectra>
##$EXPNO= 1
##$NAME= <H-F>
##$PROCNO= 1
##$TYPE= <nmr>
##$USER= <she>
##$AMP= (0..31)
100 100 100 100 100 100 100 100 100 100 100 100 100 100 100 100 100 100 
100 100 100 100 100 100 100 100 100 100 100 100 100 100 
##$AQSEQ= 0
##$AQ_mod= 1
##$AUNM= <au_zg>
##$AUTOPOS= <>
##$BF1= 200.13
##$BF2= 200.13
##$BF3= 200.13
##$BF4= 200.13
##$BF5= 200.13
##$BF6= 200.13
##$BF7= 200.13
##$BF8= 200.13
##$BYTORDA= 1
##$CFDGTYP= 0
##$CFRGTYP= 5
##$CHEMSTR= <none>
##$CNST= (0..31)
1 1 145 1 1 1 1 1 1 1 1 1 1 1 1 1 1 1 1 1 1 1 1 1 1 1 1 1 1 1 1 1 
##$CPDPRG= <>
##$CPDPRG1= <>
##$CPDPRG2= <>
##$CPDPRG3= <>
##$CPDPRG4= <mlev>
##$CPDPRG5= <mlev>
##$CPDPRG6= <mlev>
##$CPDPRG7= <mlev>
##$CPDPRG8= <mlev>
##$CPDPRGB= <>
##$CPDPRGT= <>
##$D= (0..31)
0 1.2 0 0 0 0 0 0 0 0.06 0 0.03 0 0 0 0 0.0002 0 0 0 0 0 0 0 0 0 0 0 0 
0 0 0 
##$DATE= 1617781583
##$DBL= (0..7)
$$ [...]
##$SUBNAM3= <"">
##$SUBNAM4= <"">
##$SUBNAM5= <"">
##$SUBNAM6= <"">
##$SUBNAM7= <"">
##$SUBNAM8= <"">
##$SUBNAM9= <"">
##$SW= 16.9725357007746
##$SWIBOX= (0..15)
0 0 2 0 0 0 0 0 0 0 0 0 0 0 0 0 
##$SW_h= 3396.73913043478
##$TD= 16384
##$TD0= 1
##$TE= 0
##$TE2= 300
##$TE3= 300
##$TEG= 300
##$TL= (0..7)
0 120 120 120 120 120 120 120 
##$TP= (0..7)
150 150 150 150 150 150 150 150 
##$TP07= 0
##$TPNAME0= <>
##$TPNAME1= <>
##$TPNAME2= <>
##$TPNAME3= <>
##$TPNAME4= <>
##$TPNAME5= <>
##$TPNAME6= <>
##$TPNAME7= <>
##$TPOAL= (0..7)
0.5 0.5 0.5 0.5 0.5 0.5 0.5 0.5 
##$TPOFFS= (0..7)
0 0 0 0 0 0 0 0 
##$TUNHIN= 0
##$TUNHOUT= 0
##$TUNXOUT= 0
##$USERA1= <user>
##$USERA2= <user>
##$USERA3= <user>
##$USERA4= <user>
##$USERA5= <user>
##$V9= 5
##$VALIST= <valist>
##$VCLIST= <CCCCCCCCCCCCCCC>
##$VD= 0
##$VDLIST= <DDDDDDDDDDDDDDD>
##$VPLIST= <PPPPPPPPPPPPPPP>
##$VTLIST= <TTTTTTTTTTTTTTT>
##$WBST= 1024
##$WBSW= 4
##$XGAIN= (0..3)
0 0 0 0 
##$XL= 0
##$YL= 0
##$YMAX_a= 781708
##$YMIN_a= -810256
##$ZGOPTNS= <>
##$ZL1= 120
##$ZL2= 120
##$ZL3= 120
##$ZL4= 120
##$ABSF1= 15.97713
##$ABSF2= -0.995532
##$ABSG= 5
##$ABSL= 3
##$ALPHA= 0
##$AQORDER= 0
##$ASSFAC= 0
##$ASSFACI= 0
##$ASSFACX= 0
##$ASSWID= 0
##$AUNMP= <proc_1d>
##$AZFE= 0.1
##$AZFW= 0.1
##$BCFW= 0
##$BC_mod= 2
##$BYTORDP= 0
##$COROFFS= 0
##$CY= -3
##$DATMOD= 1
##$DC= 0
##$DFILT= <>
##$DTYPP= 0
##$F1P= 0
##$F2P= 0
##$FCOR= 1
##$FTSIZE= 16384
##$FT_mod= 6
##$GAMMA= 0
##$GB= 0
##$INTBC= 1
##$INTSCL= 2.992141e-10
##$ISEN= 128
##$LB= 0.24
##$LEV0= 0
##$LPBIN= 0
##$MAXI= 10000
##$MC2= 0
##$MEAN= 0
##$ME_mod= 0
##$MI= 1.114404
##$NCOEF= 0
##$NC_proc= -6
##$NLEV= 6
##$NOISF1= 3.799351
##$NOISF2= 2.8
##$NSP= 0
##$NTH_PI= 0
##$NZP= 0
##$OFFSET= 15.97713
##$PC= 1
##$PHC0= -11120.51
##$PHC1= 12.80092
##$PH_mod= 1
##$PKNL= yes
##$PPARMOD= 0
##$PSCAL= 0
##$PSIGN= 0
##$REVERSE= no
##$SF= 200.130006866141
##$SI= 16384
##$SIGF1= 3
##$SIGF2= 2
##$SINO= 5.538805
##$SIOLD= 16384
##$SREGLST= <1H.CDCl3>
##$SSB= 0
##$STSI= 16384
##$STSR= 0
##$SW_p= 3396.73913043479
##$SYMM= 0
##$S_DEV= 0
##$TDeff= 16384
##$TDoff= 0
##$TI= <>
##$TILT= no
##$TM1= 0
##$TM2= 0
##$TOPLEV= 0
##$USERP1= <user>
##$USERP2= <user>
##$USERP3= <user>
##$USERP4= <user>
##$USERP5= <user>
##$WDW= 1
##$XDIM= 16384
##$YMAX_p= 310016625
##$YMIN_p= -322225
$$ End of Bruker specific parameters
$$ ---------------------------------
##NTUPLES= NMR SPECTRUM
##VAR_NAME=  FREQUENCY,     SPECTRUM/REAL,   SPECTRUM/IMAG
##SYMBOL=    X,             R,               I
##VAR_TYPE=  INDEPENDENT,   DEPENDENT,       DEPENDENT
##VAR_FORM=  AFFN,          ASDF,            ASDF
##VAR_DIM=   16384,         16384,           16384
##UNITS=     HZ,            ARBITRARY UNITS, ARBITRARY UNITS
##FACTOR=    0.207333158178282, 1,           1
##FIRST=     3197.50312383659, 0,            0
##LAST=      -199.236006598202, 0,           0
##MIN=       -199.236006598202, -322225,     0
##MAX=       3197.50312383659, 310016625,    0
$$ Real data points
##PAGE= N=1
##DATA TABLE= (X++(R..R)), XYDATA
$$ [...]
7397 2897449 2847226 2740537 2687402 2673938 2526795 2480278 2403402 2365710 2311353 2331224 2325352
7386 2325352 2221361 2165293 2038879 2100287 2195678 2081231 2009363 1856504 1748025 1803938
7376 1803938 1855786 1846766 1779241 1777593 1843083 1829731 1789293 1828273 1832696 1778561 1818707 1776685
7364 1776685 1729756 1780330 1776460 1787388 1818259 1835165 1746145 1621935 1608938 1640651 1723553
7353 1723553 1799435 1933782 1953741 1824783 1830195 1883710 1955869 1942469 1884425 1911664 1820946
7342 1820946 1807353 1858938 1957050 2036849 2059142 2052052 1994668 2003630 2040862 2059035 2094253 2137507
7330 2137507 2093923 2107157 2228630 2376476 2429266 2513953 2601498 2767824 2903270 2893410 2973027
7319 2973027 3243540 3394958 3659251 3949939 4250667 4499646 4729351 4797641 4831062 4798005
7309 4798005 4700131 4573701 4487396 4451325 4402676 4226258 4029161 4055453 4014770 3885321 3818665
7298 3818665 3856598 3745419 3700454 3591981 3579948 3510342 3555635 3551404 3505776 3448811 3506176
7287 3506176 3547653 3487602 3516647 3612354 3701345 3821791 3954041 4013795 4172569 4239182 4454257
7276 4454257 4746078 4936176 5048178 5081805 4990946 4843528 4812927 4743795 4652173 4616437 4545690
7265 4545690 4546657 4588816 4464786 4441491 4363804 4429420 4525459 4546205 4517824 4446225 4389787 4537204
7253 4537204 4629985 4690866 4786616 4839280 4916696 4849266 4922129 4993738 4930201 5048482 5118448
7242 5118448 5133733 5147876 5142863 5279130 5407829 5520866 5538610 5590035 5718366 5866610 5989193
7231 5989193 6327339 6461918 6713334 6793654 6864849 6977474 7166437 7247583 7316002 7492482
7221 7492482 7496135 7541708 7596070 7754658 7649086 7655519 7623263 7470383 7370663 7284858 7194910
7210 7194910 7015911 6883538 6721322 6394243 6234430 6081984 5767147 5595476 5448326 5244414
7200 5244414 5064420 4933660 4772795 4596227 4364583 4241381 4198116 4081184 3898737 3724896
7190 3724896 3661604 3536556 3485940 3293940 3168430 3163914 2959508 2866355 2811230 2740703 2553391
7179 2553391 2529838 2482324 2424280 2344013 2259207 2204445 2089166 1995216 1977951 1963629 1972611
7168 1972611 1933852 1862008 1897289 1723547 1622816 1670656 1714299 1774623 1728633 1680630 1580165
7157 1580165 1658915 1672700 1600855 1481100 1430233 1446939 1363687 1374993 1319154 1322885 1327396 1339861
7145 1339861 1432462 1398961 1327233 1310141 1200672 1165696 1223916 1219985 1215204 1232549 1203068 1242395
7133 1242395 1258992 1243061 1129834 1139635 1178528 1116436 1027329 1048714 1125426 1154748 1180156
7122 1180156 1095701 1040412 1059603 1025111 1030390 1048994 1096078 1041334 1034752 1039634 1005835 1037832
7110 1037832 1043025 1043539 1053658 1045243 1158918 1057456 980031 992948 997261 950748 1015005 1010747
7098 1010747 946042 937019 963701 973494 992751 889888 816834 897424 862534 812007 750524 838412
7086 838412 863284 832236 866894 788576 772716 830717 740400 718584 701978 790585 751590 816406
7074 816406 890744 853865 755802 801802 848832 814652 899900 849808 852753 804496 714284 690749
7062 690749 724676 620898 611731 701665 686812 680417 624135 669141 667908 682797 810096 823447
7050 823447 760396 764862 755083 789386 788802 880232 863738 802832 840585 833290 854401 891930 978947
7037 978947 929590 825349 909810 816432 707392 706652 716217 770755 699406 660038 670220 686099
7025 686099 617026 577616 572589 524388 546689 539073 616689 603247 505738 416733 420350 449466
7013 449466 430735 515389 601142 591236 591145 632039 599544 589938 569007 496326 619728 659573
7001 659573 500650 513923 520453 482640 466105 374956 430062 571492 521833 435171 459939
6990 459939 343518 295364 335611 333339 269146 257845 348385 354064 268296 270443 269161 250256
6978 250256 262880 244571 234790 235916 296408 174687 197302 260288 150475 158504 222260 241757
6966 241757 225829 172335 146452 139827 168126 227498 241978 234940 275486 257888 165458 199861
6954 199861 222158 134875 206394 228166 145694 105996 54690 48658 41981 550 42205 139247
6942 139247 208930 185478 198221 147456 121179 111424 187124 197579 159833 171509 168556 159141
6930 159141 213867 273301 209031 120991 67489 141201 157856 116013 132269 208501 340557
6919 340557 380458 288729 273414 330278 321011 320505 266422 282021 250428 125675 111076 126965
6907 126965 29017 30559 103256 72230 52529 49808 122326 144107 95513 65503 59908 61702
6895 61702 59089 42831 60808 134924 109998 9760 110499 204134 222396 164839 163557 75200
6883 75200 74829 60109 92513 118401 41172 24939 123047 108901 122225 132155 148357 182977
6871 182977 168556 290309 278691 178490 223853 260745 290055 416095 349246 255185 217624
6860 217624 232412 302326 414139 475041 510065 404367 420328 373336 392032 416260 467881
6849 467881 563332 560555 494074 413172 459641 529766 516503 432593 412439 434110 459041 482793
6837 482793 409380 262662 310660 271700 220725 271799 297471 239777 175622 280063 274285
6826 274285 211469 176319 171900 169601 196956 235874 248662 256440 272854 228700 182545 128679
6814 128679 16960 99754 87086 120546 188647 105837 -3925 -7720 33037 56974 18315
6803 18315 -106265 -80174 -28704 -5330 2490 -206 45095 80356 123757 24648 -25491 67955
6791 67955 144800 113578 116131 145260 36765 116346 110848 140593 105515 124653 139962 28727
6779 28727 76413 22928 -50186 -21100 69806 17088 69592 154773 60970 19663 14584 4217
6767 4217 130967 167297 84720 49435 -1531 -66219 -8312 -16768 58535 33786 90700 82763
6755 82763 49622 42597 85345 96574 79583 115865 65173 2665 8573 93715 71861 90049
6743 90049 143900 212228 98012 97010 92896 95266 171153 136348 249811 166687 85816 74224
6731 74224 100273 145698 169791 142821 142470 227881 245403 272265 237111 221001 268452 344629
6719 344629 173193 205668 240534 270331 227564 238442 305616 355959 307216 270353 215721
6708 215721 221595 248495 269759 262314 155072 56412 117087 255058 269746 259766 224969 165825
6696 165825 201190 276610 236862 258623 309267 312300 189783 162990 204477 236394 245331 251792
6684 251792 276758 288057 248649 259078 171780 130395 184013 208324 201815 231635 239623 246606
6672 246606 289764 285727 239385 178855 157263 211160 166923 60664 83939 107587 144181 247368
6660 247368 240484 258564 218893 144715 191098 229874 315846 235804 305084 334998 254475 118729
6648 118729 132151 66070 136013 192037 172602 195533 203199 218244 171106 346777 377144 329849
6636 329849 299930 260684 230878 267304 229029 273694 269513 319087 204205 150367 139156 159002
6624 159002 162174 217157 284070 240569 165459 188208 196915 231581 259842 348092 391445 390322
6612 390322 321471 249194 309986 300457 330559 427955 485491 522134 522346 485197 457787 390002
6600 390002 442570 465615 507237 434642 456521 425500 407024 453048 387231 319521 315319 339739
6588 339739 388654 340520 216008 190147 128818 189788 218255 225363 177705 135163 143850 113408
6576 113408 169244 100900 48416 6946 42934 82864 31945 53402 92502 -7534 -42159
6565 -42159 12921 34237 -36242 -21244 -56931 -81394 -5477 65492 80302 -26287 -13695 -6062
6553 -6062 -30080 -58114 -67997 -63273 -126154 -19362 68432 76740 38249 88412 62633 45398
6541 45398 3065 -16508 -90431 -164264 -138608 -214400 -77130 -2942 -101107 -51264 1808 7349
6529 7349 61274 23811 -36855 -3645 6880 -66988 -110843 -114534 -191353 -120240 -69767 -91818
6517 -91818 -123228 -60389 -16242 -3380 -30462 6993 41297 -70598 -138367 -78317 -165913 -126001
6505 -126001 -93299 -66334 -44386 -81901 -56525 -146044 -38103 -101169 -191353 -107100 -77723
6494 -77723 -159634 -159025 -159311 -146483 -38230 17267 -38883 39485 102961 103181 77953 75786 36616
6481 36616 50494 -56405 61158 34719 75506 -26613 -41085 58825 68456 -35517 879
6470 879 155172 58177 64738 85470 56857 104349 120670 89859 101070 213028 210423 210244 221238
6457 221238 272942 251965 209617 241724 306301 291673 236252 231567 226821 316427 231701 234661
6445 234661 305034 345784 426424 499934 541668 515542 470545 517357 542592 543214 553676 585324
6433 585324 552491 656012 658955 753320 859195 995444 1005830 1097118 1171312 1206793 1310484
6422 1310484 1299792 1356211 1507732 1638265 1669958 1717569 1889378 1893014 1841488 1915711 2040249
6411 2040249 2070029 2051475 2016380 2026204 1987530 1976535 1951525 1865931 1869240 1812937 1755862 1674162
6399 1674162 1614295 1542354 1437626 1265245 1261670 1232982 1171405 1148308 1131978 1085595 948748
6388 948748 983757 909817 914213 988352 934646 784845 707637 695802 647076 627546 553858 488698
6376 488698 515829 567192 627921 689670 689816 594419 620655 621642 691596 638544 567830 527118
6364 527118 455577 464020 523724 507035 527100 506314 488109 603155 597634 564082 505475 537817
6352 537817 532227 446282 401924 382916 435247 408290 449379 433220 420817 359323 274024 432921
6340 432921 380621 419114 530675 514241 431443 358675 301733 380684 391894 392761 384287 398895
6328 398895 380501 446330 560104 450412 395739 421734 374157 417686 452241 444110 440363 451591
6316 451591 411899 354032 358124 297850 238886 285732 339179 385068 453419 428549 370324 431809
6304 431809 414475 449709 365641 303345 344538 332082 309220 406223 401197 374136 463401 485256
6292 485256 480589 442126 422380 369927 359484 423964 450863 408245 519993 512883 505511 534495
6280 534495 505001 415832 344322 489185 465716 425533 475896 494672 545582 659736 563253
6269 563253 541743 467630 435239 541261 559902 491730 558209 650350 648592 571315 614048 711322
6257 711322 691357 675512 589890 588701 525015 507842 679009 706690 692116 714011 749546 777628
6245 777628 765983 733385 645547 568793 590617 724184 672361 585467 484900 637836 709184
6234 709184 707424 721588 671443 643107 651879 631187 646055 681882 643224 628884 613617 628882
6222 628882 686096 712228 654859 516334 533296 604184 709466 784653 798217 834778 749624
6211 749624 701956 593038 604289 682220 711095 728807 697290 776380 827730 860562 783680
6200 783680 850359 795261 845217 888090 884319 840355 906197 927022 885268 1054137 1081508 1013786
6188 1013786 994534 1060115 1146947 1156780 1181513 1157863 1073973 1110269 1099607 960260 1039148
6177 1039148 964508 941376 926049 896670 890601 852853 890590 885662 833387 815288 817986 807796
6165 807796 783960 600761 555709 566564 673621 691632 677408 664998 614480 667661 701513
6154 701513 726476 655107 642054 653610 547793 646574 627512 594790 582112 573123 493478 455621
6142 455621 452624 540431 527879 486720 493363 454382 470851 469175 424959 453536 449613 449964 525202
6129 525202 613556 573902 475593 382920 470793 511612 442989 463417 500738 534510 581773 512363
6117 512363 443823 485195 456880 432795 457571 407980 424159 462144 505731 445344 536360 515328
6105 515328 458711 493446 535471 586142 552020 643623 625868 665465 606869 538199 537716 550408
6093 550408 576007 593363 648593 582265 527639 560521 658716 653157 687459 696387 738645 669284
6081 669284 704306 753087 734749 672320 655230 667260 725187 832840 838613 907242 895720 907653
6069 907653 844004 796128 790472 971843 1037662 1074069 1050368 1089150 1038499 984842 1005115 1006161
6057 1006161 1040377 1062834 1042648 1024220 915440 976237 1036997 1009880 922691 895077 874730
6046 874730 977198 982068 905907 911512 885536 883227 904603 908290 897912 822379 827703 977178
6034 977178 960263 919955 811826 824895 830789 756926 725549 791224 838309 794638 729230 792910
6022 792910 807923 770755 712990 737041 694132 700273 830311 802977 795942 852235 900295 815278
6010 815278 841798 837314 794328 815484 784716 807290 953599 932869 984125 1059485 1035260 974811
5998 974811 985529 1051014 1140549 1077300 999444 912464 875659 924269 927624 916271 927486 937577
5986 937577 942229 1031648 1070040 1069369 907176 990172 1088790 1072678 1063485 1096473 1099069 1030921
5974 1030921 1074813 1064985 1080172 1071447 1107459 1178706 1224621 1191030 1284778 1431909 1369690 1380539
5962 1380539 1436899 1349160 1204197 1210549 1258513 1273016 1256627 1185827 1147834 1147864 1184357 1206829
5950 1206829 1113797 1030845 961076 1000523 1034434 1058483 1016943 966409 903550 1005139 1018030
5939 1018030 1020038 1079188 1156173 1122677 1035400 957064 1025492 1063087 1035552 1050823 1068614 1065824
5927 1065824 1049173 1015112 982638 987159 1034082 1018205 1047137 1007106 1018109 1014581 990383 1106589
5915 1106589 1179737 1191697 1198547 1120076 1087441 1129407 1108774 1096237 1191701 1217270 1272502 1351446
5903 1351446 1346808 1351115 1350448 1360120 1325702 1411725 1492413 1462477 1472132 1566760 1595764 1576961 1633473
5890 1633473 1690542 1625058 1707698 1791321 1766161 1783236 1768518 1754967 1979809 1987592 1960359
5879 1960359 1964846 1992004 2077703 2145406 2138205 2117087 2113298 2170970 2203612 2231648 2260529 2336285
5867 2336285 2350991 2483150 2576123 2673397 2717641 2847549 2928113 3089193 3267860 3324616 3429952
5856 3429952 3597369 3742540 3826970 3982710 4166510 4403745 4506974 4621142 4726804 4774384
5846 4774384 4884503 4882503 4780197 4753897 4785324 4715268 4655750 4542226 4366367 4275778 4266062
5835 4266062 4082797 4001155 3926587 3809918 3642586 3508623 3489474 3498076 3368049 3220267
5825 3220267 3244734 3115234 3053027 2989811 2898566 2705300 2714218 2760906 2722310 2668883 2544731
5814 2544731 2445500 2366159 2301667 2309134 2331574 2341083 2292369 2272466 2175965 2179153 2072637 2085661
5802 2085661 2148408 2144526 2034845 2130055 2106512 2047846 2096169 2007188 2068137 2036561 2039653 2035475
5790 2035475 1990485 2034537 2005664 1958212 2001779 2034614 2113197 2101953 2082404 2137971 2188127
5779 2188127 2293392 2236267 2208836 2132709 2196886 2378351 2355933 2298949 2253349 2304998 2360055
5768 2360055 2411590 2399060 2246310 2105932 2163018 2186542 2179548 2117093 2045719 2139482 2126138
5757 2126138 2091991 1987917 2039522 2120679 2077414 2051467 2027967 2048755 2056194 2086017 2033585
5746 2033585 2025140 2077342 2157283 2109186 2063091 2009936 1985897 1998105 2003064 2020174 2003540 1952948
5734 1952948 1941725 1942325 1993454 1986712 1929698 1953457 1981576 1953211 1847801 1840097 1880376 1874257
5722 1874257 1830432 1877223 1895001 1913182 1828197 1766386 1662757 1670096 1800159 1832195 1725311
5711 1725311 1759618 1762308 1677240 1782218 1793541 1759523 1782952 1700377 1670414 1722059 1605625
5700 1605625 1620868 1638389 1626788 1628777 1617274 1556981 1364038 1488587 1647669 1532501 1458964
5689 1458964 1423879 1383744 1302459 1315575 1272446 1358099 1330239 1339113 1315436 1380591 1422014 1363425
5677 1363425 1343007 1362341 1440223 1389244 1360466 1330493 1402300 1437366 1385378 1471183 1395735
5666 1395735 1370269 1399215 1379255 1419954 1443633 1522884 1459076 1512828 1486697 1445186 1425678
5655 1425678 1404658 1369538 1427871 1440696 1416327 1496962 1426993 1367133 1332340 1299873 1349879
5644 1349879 1332533 1296080 1395181 1372295 1357529 1357250 1375298 1378814 1366209 1347732 1427102 1469565
5632 1469565 1499197 1474314 1567685 1555175 1506082 1491949 1467469 1493213 1515367 1599001 1585526
5621 1585526 1577933 1586682 1561489 1597625 1664482 1684442 1639789 1633641 1635089 1608477 1662034 1624056
5609 1624056 1630980 1626890 1678123 1709888 1682493 1650904 1691337 1723494 1683908 1606928 1640508 1727409
5597 1727409 1699452 1702379 1752720 1701794 1596169 1660892 1688274 1782109 1890923 1902258 1804282
5586 1804282 1796221 1844793 1968162 1966322 1775565 1870040 1916468 1971287 2004918 1996293 2083253 2086970
5574 2086970 2039818 2108156 2199854 2197053 2143607 2118666 2144710 2189437 2148157 2236616 2229885 2315287
5562 2315287 2360964 2366503 2263401 2287209 2414719 2407522 2490682 2690232 2756284 2798243 2836730
5551 2836730 2910570 2929980 2932604 3047152 3109337 3112069 3219759 3344385 3532778 3694755 3773000
5540 3773000 3865009 4068374 4168770 4371630 4539329 4561706 4635333 4718779 4803888 4970042
5530 4970042 5014766 4978029 5024303 4919724 4844282 4635827 4642655 4669796 4697627 4652160 4629758
5519 4629758 4524507 4628888 4601457 4466101 4516917 4491207 4516099 4482683 4474877 4498099 4458078
5508 4458078 4411358 4368018 4386462 4493362 4477601 4415339 4301735 4188765 4240251 4226980 4186849
5497 4186849 4156247 4010668 4004152 4107079 4090583 4055582 4045663 4089351 4065376 4277002 4257457
5486 4257457 4297045 4441320 4440380 4495607 4587550 4556183 4468907 4476658 4507824 4473558 4443002 4444651
5474 4444651 4423766 4418832 4348463 4314845 4297508 4320269 4349113 4351023 4282242 4306157 4384030 4407107
5462 4407107 4560484 4515446 4583899 4709277 4647055 4765220 4765844 4742316 4712613 4728667 4641290
5451 4641290 4613701 4597288 4545137 4470201 4444561 4469010 4359565 4360476 4365960 4361290 4330598 4340760
5439 4340760 4427792 4379747 4265799 4201088 4272589 4287010 4253714 4302279 4184697 4131435 4094549
5428 4094549 4074139 3989651 3910804 3829844 3857782 3805767 3730393 3751772 3632834 3631958 3563587 3602660
5416 3602660 3583953 3614299 3669990 3563144 3438138 3442008 3377376 3415159 3568857 3564706 3538099
5405 3538099 3501440 3498754 3618611 3661112 3523882 3576629 3577261 3631181 3709055 3726982 3798116 3854988
5393 3854988 3971991 4027267 4226340 4336913 4426332 4481475 4367009 4502011 4518283 4489356
5383 4489356 4507720 4516332 4498410 4459100 4435033 4432676 4390355 4275464 4347384 4482091 4500115
5372 4500115 4492159 4594720 4452318 4413225 4563567 4666802 4656762 4615060 4645143 4670493 4616656
5361 4616656 4566117 4566187 4591870 4661810 4796057 4795331 4815110 4865915 4862844 4947971 4980394 5149214
5349 5149214 5288549 5267686 5263719 5251683 5284259 5383074 5272260 5197012 5183923 5069335 4936106
5338 4936106 4943623 4928356 4875995 4948465 4888117 4827358 4800774 4780165 4794670 4708712 4729649 4710537
5326 4710537 4638883 4587091 4640253 4738320 4678762 4779121 4720166 4743772 4858352 4891229 5041257
5315 5041257 5085766 5146703 5202488 5253371 5369450 5437233 5408577 5378317 5494038 5542202 5559335
5304 5559335 5662922 5714460 5781587 5926817 6056476 6356843 6592567 6814749 7127007 7422004
5294 7422004 7753165 8147454 8760452 9445428 10075165 10799216 11611619 12473237 13232964 13838358
5284 13838358 14184447 14033890 13528774 13018472 12463220 11821820 11348240 10926960 10383037
5275 10383037 9976008 9603274 9239753 8897330 8519116 8285640 8008791 7698887 7487396
5266 7487396 7269018 7060234 6921569 6657723 6422550 6293738 6130319 5906546 5783590 5659146
5256 5659146 5468341 5328597 5140163 4982368 4842439 4724904 4670338 4604481 4513914 4408241
5246 4408241 4244327 4161172 4122557 4017278 3919883 3878872 3876132 3727782 3666698 3749074 3779532
5235 3779532 3717316 3668747 3654312 3592395 3584159 3629570 3530421 3615077 3574469 3648356 3604323 3683961
5223 3683961 3660813 3557887 3561592 3531331 3614620 3642493 3733855 3829773 3809753 3748795 3604185
5212 3604185 3600328 3733019 3761252 3731875 3824436 3800659 3786710 3798636 3776508 3881715 3841833
5201 3841833 3840706 3852078 3768160 3777774 3868444 3897895 3900969 3862970 3889272 3828738 3805798 3854693
5189 3854693 3804089 3747142 3764018 3769311 3680054 3603179 3598641 3653928 3650224 3536160 3539761 3572087
5177 3572087 3597994 3569181 3484404 3361225 3388995 3363874 3311222 3255680 3285399 3231080 3217636
5166 3217636 3177299 3170346 3135763 3098190 3024149 2985115 3000120 3078431 3023928 2982177 2945787 2928858
5154 2928858 2940832 2875399 2888458 2830865 2805067 2807650 2805424 2843806 2845509 2750020 2721219 2670703
5142 2670703 2676661 2674494 2737385 2744526 2732523 2743723 2701730 2721638 2788891 2780090 2808849 2754747
5130 2754747 2733410 2784491 2798448 2802636 2784808 2828585 2830432 2733421 2806594 2840213 2784792 2894353
5118 2894353 2866097 2891540 2926202 2898979 2861128 2842310 2797542 2817876 2885430 2914257 2947051
5107 2947051 2965162 2962134 2983202 2995464 3012390 3004445 2973719 2965049 2900800 2841984 2985505 3068615
5095 3068615 3121149 3070161 3083692 3213891 3225141 3241668 3381332 3364658 3260729 3271706 3254433
5084 3254433 3244269 3236073 3284821 3328829 3329568 3284115 3264191 3254773 3275772 3266033 3378476 3298262
5072 3298262 3171554 3250098 3256126 3238182 3261829 3197779 3204320 3231657 3179378 3138479 3107934 3181894
5060 3181894 3261839 3242332 3247789 3238646 3252818 3246006 3216518 3225273 3230207 3239449 3222053 3236818 3284308
5047 3284308 3276795 3243489 3204865 3325086 3338264 3326886 3290631 3307134 3355923 3384713 3426273
5036 3426273 3453017 3373508 3310776 3286650 3351063 3377799 3400291 3350247 3357215 3336687 3365410 3426599
5024 3426599 3335898 3382754 3406849 3444672 3486783 3465508 3440014 3423811 3410284 3481756 3484044 3468204
5012 3468204 3520690 3490299 3470605 3434350 3449472 3527542 3546458 3600213 3607264 3555480 3596853 3624317
5000 3624317 3580363 3604033 3551219 3531944 3609875 3654212 3701969 3733183 3782768 3793298 3733841
4989 3733841 3738202 3733558 3728276 3751194 3807640 3804756 3748030 3766181 3835458 3877057 3857654 3820021
4977 3820021 3850564 3805155 3857858 3856276 3908860 3846939 3964146 4114832 4094081 4099112 4088670
4966 4088670 4192050 4205856 4148355 4217198 4243144 4285130 4312277 4320273 4341954 4263753 4288361
4955 4288361 4407626 4527217 4527384 4542680 4644593 4737530 4712437 4733542 4729358 4722334 4836124
4944 4836124 4853724 4796663 4891587 4961420 4978291 5096861 5217035 5209299 5223097 5344598 5443533
4933 5443533 5536223 5626767 5736580 5818495 5904356 6027368 6111020 6131554 6185851 6287298 6418389
4922 6418389 6670060 6773040 6832488 6937830 7107448 7271999 7483904 7666090 7800722 8062886
4912 8062886 8314613 8573358 8744974 8883986 8957621 9124170 9228645 9232753 9210475 9218484 9103210
4901 9103210 9000566 9065734 9161459 9074955 9088690 8990093 9031274 9149978 9170294 9157283 9266570
4890 9266570 9378550 9363392 9548478 9682008 9768985 9879783 10049297 10245887 10485303 10871202
4880 10871202 11206805 11478607 11814235 12246790 12540346 12853020 13208061 13242602 13300046 13138589
4870 13138589 12976631 12774562 12562441 12247846 12048564 11814595 11635019 11514171 11394684
4861 11394684 11221407 11050137 10876137 10817717 10729245 10650987 10525791 10342274 10294437 10363175
4851 10363175 10450567 10472483 10470226 10435162 10450199 10542998 10598404 10655957 10822100 10853030 10978728
4840 10978728 10959141 10975293 10977805 10918226 10715233 10475271 10344845 10213272 9988003 9947689
4830 9947689 9824865 9614437 9470877 9329808 9204026 9177576 9086409 9031659 8999405 8789460
4820 8789460 8758497 8715216 8592361 8591339 8661149 8570548 8558619 8386032 8259784 8233256 8147729
4809 8147729 8088558 7987226 7945021 8019002 8002368 7904702 7851530 7915819 7968558 8013051 7927233
4798 7927233 7782626 7871957 7827269 7888154 7910765 7843069 7829024 7863715 7976453 8062688 8063088
4787 8063088 8010705 8122867 8187634 8276603 8380233 8539282 8608513 8766840 9013291 9167196
4777 9167196 9289828 9365348 9414349 9455193 9525179 9665884 9763038 9750805 9780469 9750882 9738706
4766 9738706 9766535 9819876 9772825 9659731 9581783 9513718 9459473 9396096 9317383 9231417 9164868
4755 9164868 9141103 9136088 9074360 9066122 9144115 9151643 9200101 9186622 9278824 9329345 9332370 9404076
4743 9404076 9497743 9577545 9636167 9709944 9822054 9877921 9804819 9846448 9831755 9859975 9920794
4732 9920794 9942468 9948093 9929150 9884318 9866487 9835611 9833163 9845652 9787316 9759307 9715121 9739631
4720 9739631 9771921 9747342 9754899 9842287 9806408 9779199 9972522 10066839 10097773 10227190 10420503
4709 10420503 10662356 10806359 11026461 11415938 11678904 11932664 12100602 12174697 12079694 12052343
4699 12052343 12000614 11888423 11862559 11743525 11680083 11601366 11551727 11442127 11450238 11461293 11506135
4688 11506135 11572644 11602399 11584855 11657578 11642288 11610674 11629818 11607023 11657359 11740805 11868963
4677 11868963 11926089 12061907 12183806 12343661 12456543 12656020 12851589 13048249 13288588 13560758
4667 13560758 13914233 14266858 14630472 15002433 15443936 15934510 16503576 17046360 17703797
4658 17703797 18527500 19461393 20440840 21564813 22708811 23948315 25193406 26195666 26775209
4649 26775209 26865325 26428174 25668445 24880809 24180447 23539851 22917826 22408196 21836824 21254656
4639 21254656 20846314 20476913 20125877 19816748 19414979 19085914 18878781 18578783 18343022
4630 18343022 18231894 18039839 17884808 17881842 17784092 17755618 17671833 17504538 17461540 17299733
4620 17299733 17160883 17099276 17068679 17171691 17323428 17360411 17457678 17666816 17808362 18063007
4610 18063007 18525051 18966926 19291373 19844392 20490691 20952815 21180545 21190599 21206905 21260577
4600 21260577 21272927 21222280 21365369 21424760 21571617 22000011 22393379 22616912 22946300 23396109
4590 23396109 23817373 24181463 24637553 25162346 25734921 26333461 26690496 27009907 27412508
4581 27412508 27757691 28207579 28737242 29310044 29851693 30378110 31024879 31654807 32223377
4572 32223377 32322795 31768339 31444110 31271683 31131168 31021428 30971179 30967096 30954549 31044429
4562 31044429 31244102 31442540 31565915 31650128 31723048 31770458 31742838 31782442 31670469 31323488
4552 31323488 30931925 30424425 30014803 29761068 29629811 29552620 29508248 29516976 29534195 29488791
4542 29488791 29387310 29442486 29335964 29121380 28832929 28648610 28572965 28476735 28392360 28300246
4532 28300246 28256439 28089510 28030044 27974866 27815786 27603675 27483523 27273575 27120055 26844182
4522 26844182 26650970 26473791 26322145 26276448 26074679 25838648 25696463 25621640 25452406 25395042
4512 25395042 25284396 25231661 25095109 25101920 25201387 25341880 25472362 25662551 25819883 26061869
4502 26061869 26354397 26665159 27029621 27581617 28014800 28579682 29094176 29718791 30517303
4493 30517303 31338459 32202191 33197658 34334960 35526142 36776154 38082251 39378433 40725353
4484 40725353 42115940 43466407 44717311 45796490 46755164 47637852 48226361 48766980 49014099
4475 49014099 49054371 49190585 49339701 49448774 49537834 49769055 49945658 50294904 50633285 51202406
4465 51202406 51898888 52986479 54082845 55375539 57102379 58975054 61012082 63176784
4457 63176784 65523785 67915335 70364476 72845975 75224919 77442321 79129052 80312061
4449 80312061 80862421 80653633 79991294 79006719 77805475 76591674 75226106 73821700 72476077
4440 72476077 71145914 69950074 68721858 67669812 66863801 66190885 65673342 65335516 65067996
4431 65067996 64918798 64803159 64649956 64686144 64791126 65022006 65380325 66028122 66615918 67293883
4421 67293883 67814129 67920695 67914263 68048908 68210101 68419126 68802036 69394538 70139460 70986089
4411 70986089 72072750 73310982 74549283 75683402 76885721 77973562 78939214 79848132
4403 79848132 80701102 81642326 82577051 83594788 84937449 86488126 88221087 89971001 91770360
4394 91770360 93269893 94020424 93801677 92830101 91227044 89451473 87888257 86543903 85297862
4385 85297862 84238256 83330412 82543144 81668074 80663887 79705751 78552408 77158690 75569223
4376 75569223 73985226 72470482 71084942 69745848 68700037 67735503 66734104 65822316
4368 65822316 65018252 64237841 63263012 62005235 60501653 58805619 56958547 54952341 53003084
4359 53003084 51335378 49777260 48335459 46849822 45476380 44279272 43182645 42047756
4351 42047756 40952763 39976434 39101551 38098957 37081624 36290185 35606054 34808222 34150700
4342 34150700 33528428 32965968 32557766 32103722 31808074 31538041 31362459 31131329 30813143
4333 30813143 30383762 29726590 29050918 28362507 27805164 27207973 26587154 26022513 25570659
4324 25570659 25070859 24644641 24240785 23884997 23505802 23086017 22805106 22482341 22170976
4315 22170976 21892319 21590010 21211886 20849047 20531827 20335521 19983852 19690814 19386612
4306 19386612 18916319 18606270 18335342 18056483 17713060 17335103 16968260 16665408 16445560
4297 16445560 16144896 15898710 15643723 15415630 15122981 14942879 14615627 14503426 14253931
4288 14253931 14076446 13862839 13707114 13570403 13386142 13179383 12940009 12816331 12633067
4279 12633067 12523812 12419982 12265515 12160161 12023876 11921274 11799011 11720071 11615234 11474931
4269 11474931 11406079 11261213 11208536 11150739 11056405 11068649 11161782 11076749 10976380 10896579 10848422
4258 10848422 10840860 10887555 10862450 10899383 10878787 10651881 10588142 10593148 10518358 10443565 10429490
4247 10429490 10278633 10129396 10132478 10022171 9954806 9956604 9840148 9703802 9534222 9291929
4237 9291929 9315907 9184326 9137993 9016682 8939043 8870088 8729052 8637369 8561419 8451104 8404689
4226 8404689 8400744 8321784 8126642 8152856 8117225 8002562 8006462 7942825 7896116 7780674 7708786
4215 7708786 7806115 7638009 7529198 7491352 7358873 7276443 7299587 7271027 7323756 7273503 7265216
4204 7265216 7227396 7256455 7342623 7290565 7242981 7233490 7162103 7159864 7265643 7234138 7214904 7349621
4192 7349621 7451842 7396914 7323489 7257952 7297175 7320235 7285477 7176845 7135124 7065036 7051150
4181 7051150 6986749 6923575 6927706 6941104 6890161 6827342 6701929 6743399 6661005 6588953 6590422 6500278
4169 6500278 6458710 6473062 6427878 6391016 6432781 6487193 6442210 6361496 6381262 6420841 6342136
4158 6342136 6362608 6337556 6311677 6357418 6361538 6433666 6480878 6450114 6405030 6352903 6337388 6246655
4146 6246655 6289458 6244981 6145695 6106706 6238867 6187171 6164721 6169934 6132038 6096381 5993230
4135 5993230 5944386 6070395 6096284 5992267 6028415 5990539 5971655 5994369 5981932 5969852 5995426
4124 5995426 5982146 5950700 5942082 5884071 5835282 5889868 5896238 5885876 5843482 5705790 5725999 5790612
4112 5790612 5734937 5693607 5768959 5711213 5661736 5670902 5607505 5476906 5522240 5549863 5525083
4101 5525083 5547708 5514547 5490614 5541330 5553032 5451375 5492987 5569167 5644087 5636308 5613670
4090 5613670 5584943 5662971 5754593 5700047 5653043 5612613 5666184 5758017 5751253 5821132 5826102 5863162
4078 5863162 5856177 5803101 5665307 5594379 5625753 5759023 5693692 5717870 5695527 5709766 5636581
4067 5636581 5619624 5617305 5624957 5726342 5757165 5808254 5736970 5710385 5816956 5842921 5902214
4056 5902214 5982313 5983226 5985654 6005123 6019145 6160245 6174889 6187527 6121540 6128330 6183772 6145744
4044 6145744 6106849 6059163 6016292 5955821 5953151 5974277 5985353 5915642 5887066 5924492 5882542 5904847
4032 5904847 5960741 5955488 5897742 5874962 5834294 5858160 5986539 5999323 6068203 5928339 5856157
4021 5856157 5819220 5786648 5743758 5663040 5642973 5672092 5721622 5579323 5567009 5688259 5675071
4010 5675071 5726194 5755972 5746817 5637125 5703300 5713365 5635600 5625147 5723443 5685938 5728997
3999 5728997 5762168 5748780 5920291 5981295 6014594 6073939 6058658 6056463 6097712 6172529 6224928
3988 6224928 6308337 6181036 6097972 6197188 6239113 6235755 6245094 6346258 6381385 6329790 6329756 6306721
3976 6306721 6203519 6264370 6255627 6287180 6306690 6258936 6256577 6162419 6185282 6286041 6283244 6248955
3964 6248955 6283887 6177146 6147296 6168501 6176274 6280916 6258952 6263557 6240611 6262836 6421525
3953 6421525 6473224 6504627 6629228 6686465 6805872 6884965 6907216 7007793 7192497 7169293 7202977
3942 7202977 7369094 7362103 7503039 7542362 7639696 7747964 7730370 7812369 7875658 7943764 8008563
3931 8008563 8087257 8213341 8366037 8551941 8650963 8831814 9019553 9148297 9247614 9278835
3921 9278835 9184135 9038029 8841617 8696277 8735981 8776982 8657241 8596751 8781064 8721730
3911 8721730 8670875 8700040 8550447 8528890 8504198 8439849 8518093 8543464 8553588 8510046 8410982
3900 8410982 8324742 8162841 8117164 7994308 7895071 7823485 7777903 7694820 7641927 7638853 7590748
3889 7590748 7557402 7480208 7445768 7383678 7330604 7306033 7238789 7220097 7245085 7207200 7181961
3878 7181961 7159568 7289920 7294180 7243769 7223540 7308908 7410443 7478270 7512545 7563965 7567957
3867 7567957 7649059 7717690 7676582 7664490 7637669 7549240 7569399 7409823 7394245 7372496 7365173
3856 7365173 7380373 7388525 7350706 7364903 7370516 7275029 7254645 7360139 7433649 7443516 7477823 7433474
3844 7433474 7426942 7358058 7411756 7415429 7453002 7474274 7574453 7605085 7646297 7663854 7608545 7601208
3832 7601208 7715164 7655988 7674201 7882165 7823367 7818880 7965673 7990759 7905615 7990600 8022530
3821 8022530 8027092 8078222 8136513 8287221 8327906 8438354 8436806 8516175 8570356 8639568 8780982
3810 8780982 8798691 8877628 9193929 9307798 9365607 9427848 9497258 9559451 9710352 9784945 9802222
3799 9802222 9937097 10038626 10288000 10417578 10481059 10553619 10628186 10732930 10850222 11042935
3789 11042935 11154950 11288306 11568353 11835026 12007655 12207257 12465301 12786852 13144705
3780 13144705 13484591 13855222 14175178 14432972 14767759 15101433 15446488 15804498 16133185
3771 16133185 16418564 16623929 16913406 17145057 17519700 17784909 18038337 18331153 18627008
3762 18627008 18833398 18999373 19225090 19316012 19381247 19471146 19594122 19785997 19948382 20019249
3752 20019249 20158778 20353705 20548424 20689704 20986938 21449756 21879855 22305706 22730675
3743 22730675 23189723 23535493 24018272 24434365 24966989 25546431 26257524 26943751 27609944
3734 27609944 28302340 29141793 30137034 31094297 32072060 32973283 33726700 34498770 35192463
3725 35192463 35682047 36166420 36624127 37262272 37791109 38336648 38863146 39684570 40450351
3716 40450351 41221646 42089866 42881881 43839656 44834091 45783471 46764787 47446151 48174865
3707 48174865 48711486 48938687 49012413 48897989 48676878 48426018 48088603 47753710 47441965 47130273
3697 47130273 46977056 46754714 46486099 46180248 45740027 45266881 44818060 44270161 43798323
3688 43798323 43295170 42914683 42523984 42255483 41976341 41699646 41466621 41347390 41143237
3679 41143237 40901818 40794942 40590251 40479157 40457627 40406619 40370879 40467672 40634429 40788408
3669 40788408 40975259 41086055 41329905 41715651 42069282 42537354 43037527 43500777 43996213
3660 43996213 44558551 45254186 46046463 46884607 47804122 48863148 50055850 51554719 53231790
3651 53231790 54993862 57069761 59321592 61875577 64716518 67978698 71624980 75686880
3643 75686880 80230704 85258905 90770422 96747238 103116681 109614968 115892369 121483084
3635 121483084 126228015 129456550 130969068 130893819 129280004 126761292 123694586 120058282
3627 120058282 116282035 112547725 108783567 105005441 101359564 97951426 94668568 91340749
3619 91340749 88221332 85257853 82393441 79634488 77000562 74556908 72068788 69827412
3611 69827412 67648080 65312501 63043260 60957450 58942653 56980755 55046438 53333489
3603 53333489 51832428 50388419 48987123 47660585 46529118 45532011 44532139 43612314 42794884
3594 42794884 42060251 41295169 40721921 40180174 39650625 39369798 39075010 38945034 38836469
3585 38836469 38687180 38670935 38602607 38530206 38263178 37859912 37344125 36799515 36265951 35780612
3575 35780612 35473888 35198647 34894583 34699026 34493921 34373277 34281315 34233966 34253136 34295414
3565 34295414 34341093 34360039 34456474 34637020 34849424 35036331 35186697 35383302 35456930 35533112
3555 35533112 35459560 35246621 34924858 34563044 34099248 33630205 33340003 33081063 32853026 32604003
3545 32604003 32377788 32239538 32093786 31958177 31947262 31951548 32023812 31797439 31570429 31681412
3535 31681412 31797985 31758309 31859857 31862105 31837527 31559507 31188242 30736166 30336231 29887903
3525 29887903 29456465 28908430 28448775 28086670 27587756 27226749 26890286 26504655 26142790
3516 26142790 25740625 25405340 25204655 24992584 24814345 24759871 24677395 24678770 24757112 24728379
3506 24728379 24804129 24813134 24649677 24317262 23910676 23573764 23197325 22845603 22597665 22358600
3496 22358600 22101978 21983180 21804031 21599248 21400203 21235990 21182204 21090660 20981827 20908874
3486 20908874 20819273 20754497 20737117 20840044 20939879 20929354 20979945 21066744 21146864 21392124 21608904
3475 21608904 21858588 22294155 22697877 23178593 23618074 23970023 24152240 24062104 24010274 24057933
3465 24057933 24099051 24170612 24219575 24248478 24078556 24128576 24133287 24137773 24225099 24309807 24422141
3454 24422141 24537768 24589495 24669990 24726265 24930927 25109873 25232003 25529856 25884417 26237497
3444 26237497 26696685 27132368 27609566 28093130 28612273 29277258 30028764 30716943 31445241
3435 31445241 32281836 33032177 33890830 34938875 36114994 37365911 38635535 40181034 41844496
3426 41844496 43773920 45915771 48289478 50924253 53462964 55736170 57586942 59183740
3418 59183740 60255378 61073092 62148357 63500770 65264517 67231971 69219573 71263556
3410 71263556 73251469 74884430 75994331 76393491 76359960 76249927 76243614 76635035 77436894
3401 77436894 78687457 80391067 82465326 84983598 88235076 92187139 97104124 102913892
3393 102913892 109456079 116513373 123316352 129000574 132102611 131355917 127344232 121713027
3385 121713027 115939384 110655086 106238434 102350870 98692070 95300212 92061594 89189640
3377 89189640 86698434 84250637 81911192 79320774 76844000 74557375 72402983 70442464
3369 70442464 68700000 67076959 65424873 63776624 62129360 60664496 59228645 58008296
3361 58008296 56955240 55957083 55080488 54270338 53689873 53372584 53201123 53122660 53122045 53214630
3351 53214630 53375783 53587359 53738237 53960418 53997825 54041488 54317933 54629907 55060989 55502710
3341 55502710 56063093 56730588 57554821 58362825 59260484 60379193 61588536 62785193 64072952
3332 64072952 65601093 67232232 69007732 70936038 73085908 75430982 78044854 80850032
3324 80850032 83587977 86155824 88590793 90831521 93005766 94940389 96922657 99017985
3316 99017985 101153344 103696686 106522104 109121405 111357216 113051789 113869669 114133864
3308 114133864 114004157 113801160 113625689 113659924 114141625 115254689 117046095 119492768 122879341
3299 122879341 127182915 132358969 138461928 144993566 151210467 156497563 160098169 161790949
3291 161790949 161357118 158650657 154345405 148789599 142549556 136354285 130608517 125424497
3283 125424497 120764570 116606389 112596729 108770494 105224477 101875605 98641099 95487008
3275 95487008 92510891 89750094 87112094 84646605 82274550 79920172 77588885 75248663
3267 75248663 73047764 70946133 68996863 67048065 65140705 63605224 62204788 60890601
3259 60890601 59769207 58688014 57616223 56579566 55794724 55323021 54965453 54724116 54652602
3250 54652602 54845275 55202396 55582366 56039080 56510359 56751529 56940906 57128704 57379794
3241 57379794 57479136 57371938 56658694 55623177 54399505 53171827 52167391 51226815 50416722
3232 50416722 49750339 49288467 48694515 48195822 47921583 47846973 47738846 47713822 47816059 47990066
3222 47990066 48259498 48495348 48606816 48594152 48095445 47186538 46289324 45465401 44787249 44316738
3212 44316738 43724610 43178084 42757884 42360737 42094312 41870794 41702264 41535394 41298725
3203 41298725 41066152 40977990 40932676 40954528 40869026 40847700 40860275 40721138 40547885 40332586
3193 40332586 40084382 39957535 40001666 39920298 39949662 40072534 40124831 40479384 40860320 41371397
3183 41371397 41951371 42633626 43499337 44400679 45234233 46249296 47284603 48511762 49995246
3174 49995246 51781935 53835412 56123721 58564390 60381809 60589721 59003858 57156599
3166 57156599 55844834 55018412 54573384 54437500 54499231 54589625 54617500 54757064 55072633 55466078
3156 55466078 55747927 55992593 56238255 56802771 57621639 58602994 59698753 60898064 61942051
3147 61942051 62825526 63791665 64556421 65266498 65960831 66402541 66669966 66679090 66579837 66347714
3137 66347714 65689906 64754594 63752565 62667725 61489418 60556346 59611645 58699761 58137023
3128 58137023 57588763 57039766 56688069 56443210 56092390 55747916 55265441 54804476 54338035
3119 54338035 53867573 53387791 52922440 52493699 51971508 51425263 50925131 50449460 50217953
3110 50217953 50033218 50002800 50100259 50355192 50836327 51322835 51734481 51990350 52002658 51583293
3100 51583293 50677388 49580900 48559899 47632086 46787469 46176284 45645427 45077102 44470876
3091 44470876 43925976 43429457 42842830 42273686 41573192 40989252 40609088 40336889 40019330
3082 40019330 39649537 39328595 39108831 38611923 37950702 37302291 36686210 36181053 35712133
3073 35712133 35221108 34653691 33914774 33316141 32798354 32297345 31953992 31658925 31358592
3064 31358592 31121798 30738600 30435062 30269445 29946180 29630562 29286176 28981492 28686154
3055 28686154 28292742 27942199 27480254 27081638 26775864 26404043 26090370 25770014 25580397
3046 25580397 25441033 25207179 25018109 24827323 24777151 24570799 24393332 24280830 24236283 24109930
3036 24109930 24005557 24053519 24041511 23991843 23945903 23945916 23931599 24046425 24119839 24227992 24310490
3025 24310490 24319465 24413725 24553237 24771386 24886200 24954046 25097057 25383569 25732796 25895286
3015 25895286 26231423 26570732 26891039 27261052 27576750 27833358 28137149 28532847 28991537
3006 28991537 29479893 29923467 30369311 30842213 31390572 31941994 32538721 33073354 33670581
2997 33670581 34406824 34977887 35595836 36415482 37199690 37983015 38864182 39776052 40612275
2988 40612275 41511124 42452350 43379267 44301888 45336964 46392472 47387475 48466032 49609606
2979 49609606 50812124 52119102 53413814 54644269 55942628 57218660 58668173 60061989
2971 60061989 61388596 62910090 64453880 65911819 67469812 68957486 70465366 72067560
2963 72067560 73723002 75344982 76935145 78628356 80324113 81952428 83489825 85138454
2955 85138454 86776872 88334396 89837035 91297771 92762315 94163991 95497382 96709232
2947 96709232 98008875 99078754 100155233 101248031 102139610 102974850 103819193 104592067 105155405
2938 105155405 105791483 106458420 106966077 107495119 107896831 108203132 108393507 108550562 108637383
2929 108637383 108706340 108780807 108833667 108802551 108679702 108774892 108688502 108617898 108497520 108331872
2919 108331872 108102545 107775139 107473995 107128755 106847337 106615900 106307989 106084837 105940142
2910 105940142 105707759 105411746 105120821 104905747 104557231 104118785 103671131 103114061 102569631
2901 102569631 102011162 101474352 100924778 100461348 100000586 99552306 99303956 98992985 98539944
2892 98539944 98231484 97975961 97659712 97435218 97218901 96870872 96539060 96154675 95838052
2883 95838052 95423137 94981222 94587177 94247056 93962969 93679949 93396970 93201535 93070658
2874 93070658 92748403 92671971 92635997 92475928 92458583 92503195 92700398 92942632 93119302 93501267
2864 93501267 93913662 94474944 95203380 96042364 96744360 97514598 98187033 98719333 99014671
2855 99014671 98926569 98627468 98210390 97726354 97135885 96543600 95819880 95188824 94550618 93932282
2845 93932282 93227211 92574931 91683744 90723044 89594545 88139387 86564086 84933126 83312738
2836 83312738 81492513 79651175 77836906 76086537 74290172 72578908 71021932 69363281
2828 69363281 67851978 66393852 65023382 63689508 62326344 61088739 59899498 58730005
2820 58730005 57702047 56682483 55578232 54513763 53618511 52744596 51902101 51163641 50361256
2811 50361256 49772761 49094045 48438177 47796589 47232429 46727365 46249098 45727805 45344951
2802 45344951 44898447 44503645 44131539 43766578 43580191 43359883 43133417 43027436 43005655 43023311
2792 43023311 43065049 43140133 43236934 43239095 43412030 43695983 43990948 44182270 44346583 44500402
2782 44500402 44471560 44261446 44299385 44407633 44585087 44906133 45183202 45354952 45146239 44914360
2772 44914360 44673926 44489390 44165489 43836817 43736385 43732173 43846147 43987720 44140544 44320485
2762 44320485 44506371 44495591 44531724 44483422 44498022 44276350 44281368 44325580 44332718 44387153 44588736
2751 44588736 44860368 45088585 45580918 46276626 46965859 47816277 48802860 49609169 49983407
2742 49983407 49640508 48728223 47911231 47328354 47035311 46991830 46952407 46923305 46965650 47121182
2732 47121182 47187453 47358437 47531009 47734025 47843929 47901024 47920998 48007344 48068075 47987930
2722 47987930 48086949 48218943 48215801 48423614 48723474 49101100 49633372 50257198 50855643 51555236
2712 51555236 52207309 52813810 53222870 53581260 54084501 54772134 55586660 56608074 57655401
2703 57655401 58794838 60051039 61377333 62706464 64020287 65525335 67010142 68254693
2695 68254693 69366707 70166513 70812312 71260777 71431032 71709467 71807048 71894492 72029655 72162818
2685 72162818 72246423 72165406 72158610 72176884 71968999 71532700 70968998 70191395 69145341 67979492
2675 67979492 66821666 65514745 64185243 62813013 61534630 60314475 59165785 58141942
2667 58141942 57170278 56233714 55367913 54555362 53726541 53067192 52361737 51711261 51146476
2658 51146476 50647577 50150442 49692852 49273044 48725228 48346041 48056186 47791952 47623691
2649 47623691 47411420 47149522 46879905 46821796 46718754 46586619 46560865 46606512 46611574 46656486
2639 46656486 46784871 46839025 46849362 46849449 46982157 47124695 47281749 47551990 47844580 48227013
2629 48227013 48433903 48758168 49220026 49742342 50386180 51038142 51715513 52438173 53270738
2620 53270738 54150206 55093716 56098095 57060417 58183650 59436893 60698692 61952672 63269374
2611 63269374 64669526 66028972 67399530 68892003 70323203 71800270 73399024 74839517
2603 74839517 76302441 78003265 79779541 81453981 83135048 84963909 86857215 88766665
2595 88766665 90609543 92721957 94759585 96739401 98792228 100970434 103081142 105148401
2587 105148401 107253371 109332893 111390205 113457729 115373857 117334868 119423186 121459628
2579 121459628 123640208 125832433 128205862 130506799 132835291 135105023 137228401 139276314
2571 139276314 141215180 143220068 145056650 146814361 148838000 150829393 152895976 155017267
2563 155017267 157313511 159676403 162020197 164226913 166377519 168502211 170565862 172499038
2555 172499038 174351789 176124241 178003686 179872348 181885214 183984889 186046701 188310173
2547 188310173 190715749 193134891 195484272 197716221 199695173 201568633 203219091 204626298
2539 204626298 205932517 207322469 208589869 209802027 211105927 212550283 214079153 215825497
2531 215825497 217686332 219724370 221770820 223817212 226013241 228294589 230702611 233022787
2523 233022787 235395687 237842735 240275181 242564312 244816796 247110527 249336387 252001109
2515 252001109 255040460 258415230 262204347 266302311 270634652 274899037 278978463 282781209
2507 282781209 286178440 289054684 291463368 293256589 294750800 296064223 297286192 298420230
2499 298420230 299791781 301407642 303299833 305348094 307293037 308955007 310016625 309894651
2491 309894651 308452879 305701482 301714348 297212013 292549309 287701150 283259349 278947813
2483 278947813 274905106 271152634 267692151 264569152 261489974 258576630 255455334 252214147
2475 252214147 248800326 245228457 241425625 237625623 233843868 230131698 226555825 223207474
2467 223207474 219998132 216888821 213798937 210567447 207173624 203449109 199596133 195600551
2459 195600551 191433054 187340334 183235615 179182057 175175669 171290013 167665021 164313712
2451 164313712 161070633 158079969 155381834 152973054 150712234 148554205 146579222 144681191
2443 144681191 142842521 141133536 139312867 137466170 135718711 133855132 131937896 129938130
2435 129938130 128067640 126199767 124427414 122594449 120741553 119083593 117417221 115701261
2427 115701261 113853721 111962596 109988820 107976042 105773814 103521716 101097365 98553006
2419 98553006 96138065 93849609 91450933 89132743 86962424 84741013 82616416 80659354
2411 80659354 78760747 76927542 75064827 73281789 71484846 69843852 68265934 66669557
2403 66669557 65142382 63707167 62428735 61047936 59835343 58649798 57471965 56325865
2395 56325865 55241951 54306316 53334135 52430441 51533478 50588475 49674636 48734975 47943084
2386 47943084 47066410 46229102 45298805 44495404 43725175 42881089 42301819 41661356 40921335
2377 40921335 40250207 39623461 39037877 38492060 37892036 37317194 36688562 36159121 35714024
2368 35714024 35288247 34819635 34289660 33882190 33555853 33121600 32748220 32442575 32067418
2359 32067418 31762177 31573440 31186928 30887746 30470215 30084421 29784296 29375834 29147037
2350 29147037 28685419 28351089 28058332 27759288 27349479 27094412 26960855 26804167 26590884
2341 26590884 26296765 25927832 25517757 25267596 24892217 24516532 24088080 23685552 23245928
2332 23245928 22933347 22609048 22327938 22036216 21701838 21475700 21178390 20842174 20447374
2323 20447374 20186430 20112318 19958674 19605366 19353301 19057289 18789866 18585812 18422190 18140758
2313 18140758 17902677 17794754 17623036 17452707 17253254 17017549 16874339 16760671 16543753
2304 16543753 16332411 16257709 16151757 15997316 15924666 15844643 15701215 15595284 15485858 15464046
2294 15464046 15432607 15353840 15268539 15187865 15070726 15122170 15147038 15100775 15151306 15161215 15145862
2283 15145862 15059585 14910312 14842769 14756020 14704074 14573364 14461195 14329601 14264102 14285445
2273 14285445 14133373 14053827 13959462 13842530 13776647 13682203 13658574 13551385 13482752 13405731 13286754
2262 13286754 13266002 13197320 13209948 13124837 13105454 13173229 13056809 12965275 12921734 12696287 12750391
2251 12750391 12838819 12794596 12709612 12666787 12743250 12714991 12682809 12682364 12737864 12824630 12770275 12748757
2239 12748757 12677228 12691848 12653206 12644781 12541327 12452129 12574668 12645117 12626285 12716990 12791808
2228 12791808 12895628 12994848 12946975 12977451 13137102 13245731 13320185 13470356 13631754 13774991
2218 13774991 13897948 14026501 14270068 14400343 14473368 14514569 14541416 14497077 14467401 14488119
2208 14488119 14426303 14447476 14387352 14388786 14224339 14185358 14179833 14164793 14281828 14414537 14434581
2197 14434581 14348066 14423183 14573181 14621199 14679156 14750753 14842618 15010735 15109731 15205627 15252547
2186 15252547 15466515 15667943 15856588 16024306 16378993 16836343 17160895 17510490 17889270
2177 17889270 18080443 18132931 18123268 18042779 17761354 17453133 17250988 17114337 17000566 16826308
2167 16826308 16711916 16677003 16648351 16588135 16461241 16283471 16024082 15804089 15764652 15734328
2157 15734328 15561885 15356912 15214712 15107377 14929895 14683267 14630609 14563049 14539053 14498025
2147 14498025 14461719 14371825 14478881 14648726 14887309 15078669 15380743 15594740 15689297 15806615
2137 15806615 16058252 16506196 16900631 17343802 17794394 17977610 18007304 17669820 17153150 16528947
2127 16528947 16098547 15687319 15265919 15034378 14715375 14403736 14070002 13842376 13666007
2118 13666007 13373567 13132053 12859489 12650879 12466541 12212720 12162605 11954210 11793489 11602504
2108 11602504 11523301 11364921 11292304 11260943 11174731 11084783 10976586 10813850 10677936 10598797
2098 10598797 10521592 10490080 10393597 10299015 10212860 10184580 9980736 9990071 9972045 9928201 9840395
2087 9840395 9774989 9693747 9533217 9475492 9499597 9446892 9404928 9305572 9180957 8997203 8889904
2076 8889904 8783780 8616287 8572915 8492519 8532690 8506061 8391167 8306752 8281599 8223167 8205458
2065 8205458 8071893 8137806 8006450 7982815 8012061 7957719 7896273 7855685 7822780 7879674 7934609
2054 7934609 7903608 7904254 7960113 7962116 7975821 8060966 8149092 8232514 8363035 8472821 8561029 8704222
2042 8704222 8849821 9061984 9406175 9746576 10056321 10316382 10388298 10164902 9981187 9741763
2032 9741763 9443990 9209650 9036006 8900865 8783124 8750200 8708131 8606006 8455969 8319616
2022 8319616 8216774 8244257 8274855 8243823 8255307 8242757 8217417 8367938 8495974 8616794 8660075
2011 8660075 8775639 8923201 9234993 9574386 9960193 10437565 11116771 11677867 12287476 12631096
2001 12631096 12402972 11839560 11345135 10959430 10610678 10324619 10073492 9914477 9717275
1992 9717275 9450756 9281290 9142774 9029509 8858151 8615624 8528859 8299471 8114705 8171390
1982 8171390 8074173 8014663 8002829 7906059 7809980 7772683 7815941 7842871 7860250 7904416 7975313
1971 7975313 8146552 8390844 8485354 8513025 8529504 8405308 8029265 7722172 7507663 7331028
1961 7331028 7165581 6986723 6764515 6591089 6487426 6412848 6219837 6121742 6063605 6001660
1951 6001660 5868337 5803702 5830546 5732133 5579002 5446870 5394665 5312372 5359241 5300616 5188706
1940 5188706 5157127 5103599 5000954 4822335 4783422 4744875 4706118 4698961 4511919 4395871 4357387
1929 4357387 4314859 4414858 4314556 4272481 4286071 4333186 4283318 4161637 4145617 4136875 4233024
1918 4233024 4290473 4287922 4300756 4283619 4259728 4249662 4316061 4317934 4382423 4496451 4429701 4424231
1906 4424231 4391314 4316553 4183362 4085101 4020111 3921799 3997037 4029979 3958423 3820379 3795102
1895 3795102 3788607 3719002 3768907 3724666 3646599 3582060 3688207 3703804 3675513 3652997 3718082
1884 3718082 3743941 3742481 3864311 3839533 3868347 3950645 3984600 4160883 4172169 4250115 4392728
1873 4392728 4320011 4282010 4252988 4272139 4126575 4070118 4090250 3972544 3959685 4021437 3944452
1862 3944452 3811728 3774678 3717745 3621506 3624693 3708027 3695072 3661482 3640927 3680959 3658535
1851 3658535 3578761 3618460 3570413 3577378 3635386 3716413 3754877 3785580 3810090 3766755 3793523 3880867
1839 3880867 3930823 3961481 3956298 4079283 4120291 4105527 4039226 3965744 3995147 3909648 3850676
1828 3850676 3827467 3891666 3882156 3777894 3632428 3635817 3712694 3778831 3772919 3704237 3715394 3749102
1816 3749102 3708938 3675085 3673291 3651376 3646778 3609134 3532566 3503167 3509262 3492033 3481548 3576047
1804 3576047 3625714 3611390 3554016 3578518 3602956 3643311 3619883 3649293 3667476 3663753 3659462 3615442
1792 3615442 3735698 3795366 3628805 3691729 3705827 3638036 3628594 3612217 3508343 3457247 3460518
1781 3460518 3354677 3341740 3298350 3299042 3323746 3274790 3243820 3204596 3279817 3270649 3207426 3229884
1769 3229884 3184819 3223368 3269697 3381931 3282466 3265428 3227098 3215718 3148476 3184992 3227393
1758 3227393 3184178 3268817 3172981 3145686 3146248 3103229 3107739 3115883 3205774 3221012 3247501 3220151
1746 3220151 3268847 3262454 3207783 3189411 3242178 3274316 3267641 3170879 3149846 3200295 3245690 3150889
1734 3150889 3125031 3174664 3176077 3200040 3154347 3129872 3159942 3225979 3213527 3248824 3201057 3149814
1722 3149814 3187191 3179709 3222614 3211592 3280233 3358007 3403692 3411224 3427943 3522658 3625898 3714398
1710 3714398 3863702 4006591 4084997 4164425 4169614 4175256 4079412 3914935 3818502 3698990 3569711
1699 3569711 3561063 3526664 3355175 3164637 2986347 2859551 2923584 2890269 2858728 2731110 2611427
1688 2611427 2546035 2534714 2521776 2376330 2358036 2360291 2208653 2179493 2136366 2128352 2175972
1677 2175972 2126566 2027535 2006079 2010490 1950919 1872742 1879876 1892087 1900553 1827779 1828839 1765524
1665 1765524 1715906 1681168 1700728 1641844 1689539 1733563 1696510 1671278 1729327 1766594 1693412
1654 1693412 1649340 1592958 1523060 1603517 1645604 1661051 1700568 1565010 1517807 1499299 1422508
1643 1422508 1440070 1381182 1424295 1358144 1255971 1207665 1260706 1303583 1243743 1286747 1218460
1632 1218460 1124458 1093546 1185389 1120402 1183563 1186383 1211627 1060612 1055924 1018223 1031426 1113746
1620 1113746 1138002 1115790 1016978 1036928 925163 891944 920184 943013 962548 954538 1033122
1609 1033122 958441 1028806 1055383 1026711 972144 965466 1017433 923395 895685 921824 897911 901871
1597 901871 889657 890670 844293 801007 822634 805018 830615 856762 895938 873648 821067 803265
1585 803265 834797 774533 733888 771964 804118 702869 668913 769724 704470 579342 748235
1574 748235 727540 657405 643303 631712 627757 702977 684845 613163 610151 586243 660353 678483
1562 678483 770409 802458 787773 802778 731548 683180 692039 724601 683477 708303 704127 629210
1550 629210 625181 513540 414139 463437 578332 557905 571140 490347 531267 558439 536328
1539 536328 489668 495322 482160 511759 565879 625196 603929 625993 545881 515066 560345 510484
1527 510484 527475 503730 564596 599381 578309 590322 591238 535886 496654 495343 514195 461320
1515 461320 304061 296007 366943 325892 386818 371190 354476 380646 413783 422538 486443 491529
1503 491529 487928 511289 512164 410610 293718 304953 344842 359278 407265 448716 429342 339373
1491 339373 354312 378544 405980 416994 388440 356202 390557 300228 343736 364533 435953 405767
1479 405767 324819 312273 257903 324574 344905 341862 330264 276090 335802 393942 348884 366710
1467 366710 265580 236989 177967 210901 341550 375864 395501 270120 209370 270772 281125
1456 281125 387258 287200 285887 387787 381437 356962 346725 304114 206804 240646 229100
1445 229100 250370 306270 392154 430287 351786 342742 266075 277405 245552 217227 253026 200217
1433 200217 285718 392684 366088 353287 365087 286871 272684 282974 257739 243389 318338
1422 318338 338379 285282 253665 258663 255827 269812 259658 283077 254934 219319 216939 288839
1410 288839 274972 248772 314487 318742 324203 301410 298829 300667 230589 192333 206659 167589
1398 167589 174828 121638 166466 188070 260017 265276 218272 154360 138461 150702 276962 267718
1386 267718 191936 101928 57159 129727 143729 105800 45848 150397 127872 150975 248721
1375 248721 274564 254439 171765 150351 181835 209814 266258 250313 222358 286261 237313 287519
1363 287519 239042 220284 264980 235257 178061 136428 129427 122674 135842 239772 242093 195568
1351 195568 197650 169800 163323 148536 180770 65305 72274 81636 91744 69474 167331 153564
1339 153564 91072 105630 137263 116629 84367 107688 154995 194003 154232 175162 140605 100063
1327 100063 128716 106993 18856 4564 23051 48713 79992 89204 111973 150957 151553 36613
1315 36613 64945 96507 83252 173889 224145 239629 184119 199335 205418 166207 141331 92929
1303 92929 158373 202636 92622 29431 26535 148650 126829 71789 26183 62597 207051
1292 207051 172873 117297 51857 77519 159861 137807 135766 79666 60227 146053 120017 43270
1280 43270 -30151 10519 42946 109385 89341 128794 192386 57242 50312 82146 121076 193604
1268 193604 126598 104061 68650 31448 34206 108819 109203 111492 145584 122654 88864 112934
1256 112934 75873 141608 168468 107547 283264 268954 246598 175605 273274 275144 197195 178800
1244 178800 108099 177343 255884 277469 218002 190765 155048 89276 18293 157200 219233
1233 219233 156345 55592 57834 113496 49185 45696 94929 48771 8045 -4198 49407 130421
1221 130421 125522 181433 107222 29388 57987 147665 148473 135356 53428 -11849 49703 123717
1209 123717 111512 109684 205601 214700 95279 102622 127481 124624 156416 111197 89076 41001
1197 41001 -76988 72539 81549 117311 88643 71065 74912 -1700 -39993 -6334 51027 48402
1185 48402 87412 89531 79281 22030 32683 89413 111260 68633 84749 31194 40621 -64266
1173 -64266 51443 122848 72254 4443 103208 178897 60417 -12198 -7496 -1453 52927 100364
1161 100364 54524 47853 17785 -4690 -11894 -2639 75434 -35199 -35063 -42509 -778 81046 97921
1148 97921 19397 -70200 -20336 -41883 40694 59780 35989 56275 33810 104610 -14910 -62619
1136 -62619 -43641 -99316 -47566 30408 152655 9681 -26445 -75887 -39916 -14441 -25337
1125 -25337 -77641 -13255 50784 53802 196242 198938 114517 23297 32167 75588 -623 -23851
1113 -23851 -49785 -56350 -49258 14420 27200 16298 44776 31024 25348 89047 38523 60087
1101 60087 84581 106604 81985 139403 78852 86826 76684 93032 97107 99869 92755 54023 50788
1088 50788 107554 128827 77195 123095 79661 43742 -11882 26649 68608 45235 35300 148899
1076 148899 45087 18146 35459 116811 198631 90309 40121 -34015 -72427 72811 48000
1065 48000 142886 113711 70278 85253 174845 263651 146244 103382 114580 93625 154165 82908
1053 82908 88037 201018 262501 138193 194166 162358 167985 251071 250989 215518 214765 183985 265068
1040 265068 383632 308114 294784 260685 277927 267587 318699 358662 288132 306408 400490
1029 400490 420241 394420 324246 377738 388285 405529 482243 530829 532412 549242 583069 616274
1017 616274 596125 643237 652051 771499 659329 641022 811491 853286 834471 896338 897559
1006 897559 937216 935589 984815 1141984 1158954 1249541 1263442 1281595 1351303 1463953 1542455
995 1542455 1739958 1876426 1943025 2018026 2165751 2309928 2376346 2486862 2716196 2969023
985 2969023 3127442 3336137 3576659 3908224 4172855 4427637 4764105 5128634 5538892 6067075
975 6067075 6649226 7226572 7935631 9041162 10470356 12150966 14125511 16369797 18888403
966 18888403 21402379 23528161 23355682 20673891 18279166 16615523 15403279 14544201 13947902
957 13947902 13175713 12158176 11268724 10724111 10488251 10096282 9552097 8890518 8299923
948 8299923 7988188 7609430 7297429 6995681 6711253 6452036 6054272 5574345 5182272 4951666
938 4951666 4629117 4372045 4084706 3846801 3655422 3434003 3284770 3087984 2943573 2857363
928 2857363 2762661 2661529 2464309 2451950 2454470 2404929 2226067 2164420 2028412 1979892 1975170
917 1975170 1844774 1771199 1780456 1724863 1532143 1521133 1491242 1407307 1377953 1365501 1480777
906 1480777 1376520 1332244 1334102 1275692 1175570 1178878 1145063 1130097 1175396 1098944 1085805 1015597
894 1015597 980128 961663 991659 939660 883736 876031 777481 705598 775362 790372 809839 851691
882 851691 855389 884037 789415 715648 639875 613102 661324 668875 715851 722345 739116 662543
870 662543 640771 697141 697615 648501 675385 636468 619865 559636 529347 540761 511112 531457
858 531457 481442 434209 456846 496874 431655 360044 398098 392721 404191 409722 390252 360787
846 360787 304324 318595 323409 327228 321282 327195 352728 257000 207429 211930 205973 202917 230155
833 230155 277071 270525 241903 196939 220635 139409 178987 203443 181905 114517 75837 169068
821 169068 154765 51322 142739 183898 118281 146981 124614 70137 209892 214930 224230 251378
809 251378 168879 163011 122812 67401 73254 125247 95603 12908 61109 133598 77069 122493
797 122493 45335 49034 38381 22602 101143 115743 114952 172777 104878 -5799 -12974 116200
785 116200 86610 -71139 -71938 -80383 -110247 3239 15510 89607 50408 34615 75269 143422
773 143422 141894 85983 134181 14075 -105693 -68450 87924 55315 -53052 -56126 -40199
762 -40199 23126 85292 60371 62250 -21297 -73080 -28168 22966 -33420 -8834 73630 76073
750 76073 -724 -65699 -30894 -57047 -68922 31790 16636 172 3488 30854 -18963 -69682
738 -69682 21172 -47759 -54857 3659 57785 14550 -50242 -27403 60289 46434 14087 24730
726 24730 -11135 -64529 -14795 -94759 -144965 -60358 -54489 -83399 -134710 -95539 -61282 13334
714 13334 -32599 43940 -12419 34239 40310 -14960 -47809 -79085 -62168 -101371 -116621 -67091
702 -67091 -16528 -8197 21733 -27809 -55641 -157951 -94639 28535 28462 20450 26806 28518 5986
689 5986 -16805 -52754 -115395 -25186 56720 103327 109955 40775 142374 200223 222908 102144
677 102144 65567 85089 89694 80163 27547 -24139 2616 10748 -12708 -43782 -13673 79208
665 79208 52695 77042 29022 -62692 -52820 -4963 -1868 -19649 -45790 -31749 58839 33390
653 33390 853 87302 -8356 -36077 -54586 -88233 5563 51196 3157 -6799 -39677 -2077
641 -2077 -10541 -44882 -24118 -62789 -81367 -110786 -94755 -71043 -177704 -94100 6637 -10380
629 -10380 -65240 -136949 -206506 -122723 -59660 -83412 -50390 -5047 -71229 -82908 -99114 -90647
617 -90647 -59893 -88944 -31338 -504 -7817 -112506 -105078 -103929 -91729 -72546 -71244 -160931 -224156
604 -224156 -102167 -56622 -6513 -25024 -129552 -105781 -131079 -126025 -99533 -147363 -113980 -49171
592 -49171 -71672 -85911 -24044 -66129 -130866 -129972 -167823 -68098 -121180 -150232 -157650 -159307 -187405
579 -187405 -228503 -123726 -77676 -71802 -93804 -118561 -128017 -144844 -93011 11701 -21823 -76705
567 -76705 -40466 -5489 26087 32838 21932 -60921 -29949 -99334 -95165 -73144 -98845 -157007
555 -157007 -91367 -52861 -180060 -200317 -125540 -12014 -83183 -81183 -81659 -66756 -81772 -11857
543 -11857 20121 -19477 -54595 575 -62771 -45642 -28124 -35743 -142633 -95726 -65466 -125574
531 -125574 -158495 -237625 -104208 -117789 -151707 -109428 -75652 -52826 -137442 -154606 -117175 -123016
519 -123016 -105310 -109329 -103081 -43331 -48840 -129276 -166912 -178350 -143400 -140505 -113299 -65523 -131112
506 -131112 -66728 -12156 -67089 -93217 -205761 -28526 -6372 -80168 -60797 -47565 -68581
495 -68581 -26264 -41664 -80120 -88478 -191350 -234512 -176572 -102015 -89181 -98384 -46026 3028
483 3028 780 5746 -87432 -81812 -92872 -77553 8298 44700 -56572 -29085 -97923 -54435 -103292
470 -103292 -124942 -71428 -46109 -25966 -93058 -82399 -54399 -11327 -60946 -39212 -137375 -90963
458 -90963 14357 -40606 -49998 -78782 -64485 -129544 -205611 -141676 -94696 -143837 -189991 -22172
446 -22172 -22152 -37818 -31220 -104281 -155637 -165373 -124913 -191301 -243522 -132703 -109024 -126826 -157584
433 -157584 -149604 -154426 -189929 -163716 -149837 -160132 -167785 -215795 -148629 -206613 -161279 -114160
421 -114160 -152261 -130979 -132749 -93977 -82388 -114551 -121912 -123149 -35579 -142147 -157435 -70327
409 -70327 -98533 -130328 -187231 -176715 -124592 -35614 -86662 -28371 -75382 -116814 -2899 -127032
397 -127032 -229989 -201457 -186951 -175110 -113294 -125006 -244392 -213837 -162354 -54779 -29735
386 -29735 -151070 -162528 -51771 -142190 -173723 -185342 -164752 -122707 -132544 -211300 -190832 -186779
374 -186779 -184097 -71640 -83850 -111231 -25479 -110137 -161933 -181178 -93934 4835 -79427 -105261
362 -105261 -205613 -273027 -128012 -197479 -229052 -236406 -133767 -106800 -174542 -213718 -163433
351 -163433 -81254 -162387 -140920 -56959 -63340 -83440 -78809 -49722 40251 -80675 -198540 -244555
339 -244555 -229226 -137006 -166407 -245286 -165097 -174213 -129071 -77706 -116640 -124574 -115336 -232862
327 -232862 -168500 -247671 -187461 -118326 -110679 -106220 -116467 -122779 -136666 -137616 -223323 -154453 -121799
314 -121799 -168997 -196471 -213664 -229487 -144524 -122056 -195775 -180997 -109451 -119107 -169582 -127319
302 -127319 -109201 -66793 -72257 -106365 -119942 -224734 -193689 -260368 -311905 -263391 -140270 -81529
290 -81529 -193290 -246010 -177285 -140657 -161427 -236233 -244257 -218851 -225692 -231122 -218624 -134287
278 -134287 -105723 -209015 -224111 -168894 -159164 -153054 -183311 -210372 -188243 -165480 -225569 -300274
266 -300274 -281631 -246749 -190876 -158796 -228675 -314180 -311272 -249568 -184770 -86114 -146412 -128474
254 -128474 -26185 -241704 -367151 -193446 -153645 -224393 -286211 -209766 -195531 -111388 -23580
243 -23580 -158363 -247121 -231265 -172583 -161807 -39409 -74109 -149728 -85621 -131778 -166011 -183303
231 -183303 -138113 -256344 -245623 -114901 -87827 -148048 -158168 -102953 -168950 -192370 -200301 -253852
219 -253852 -260830 -207262 -230540 -280798 -343784 -279131 -263050 -265076 -199001 -219133 -246911 -160943
207 -160943 -152780 -281463 -255427 -247078 -252083 -186367 -194771 -315053 -327454 -305657 -272849 -252360
195 -252360 -301747 -246294 -243890 -204740 -194970 -180736 -130551 -200043 -216380 -207996 -294819 -219346
183 -219346 -202418 -176966 -181539 -312561 -274576 -163919 -164046 -190125 -217067 -284102 -281149 -252203
171 -252203 -189485 -247563 -211831 -150395 -150090 -139909 -136186 -167147 -178181 -180133 -107632 -119361 -122574
158 -122574 -205592 -255659 -224820 -230311 -276534 -244769 -180500 -269628 -154148 -136262 -194494 -286391
146 -286391 -292859 -233036 -268557 -273896 -243489 -215968 -254115 -307645 -201210 -265492 -226668 -190057
134 -190057 -202766 -234643 -200857 -214042 -240243 -275726 -280144 -226681 -263593 -253336 -292586 -300528
122 -300528 -221367 -226027 -269995 -255947 -279853 -300511 -270355 -309890 -326991 -243887 -205679 -211773
110 -211773 -250901 -226064 -239530 -237626 -215012 -166831 -226478 -310940 -219744 -267662 -240986 -200965
98 -200965 -259357 -302841 -313904 -302023 -390491 -363484 -311076 -278665 -275736 -214653 -179991 -181948
86 -181948 -255633 -283889 -257569 -226202 -329559 -293849 -226992 -254194 -248115 -263710 -265243 -287402
74 -287402 -310780 -282205 -343444 -291149 -303811 -370240 -321639 -277297 -312067 -322794 -240571 -275699
62 -275699 -297820 -291198 -281664 -219289 -273973 -329444 -245391 -190908 -195677 -230333 -226028 -256461 -246076
49 -246076 -242666 -206126 -228862 -256983 -194998 -223231 -302098 -284045 -259018 -272524 -295726 -277922
37 -277922 -345688 -320861 -295434 -270121 -236152 -289245 -230795 -241260 -282539 -262705 -289789 -291648
25 -291648 -356537 -350303 -324296 -331853 -306741 -256692 -251851 -329020 -301482 -336798 -353564 -334839 -302274
12 -302274 -274630 -338307 -294846 -271762 -227923 -270585 -318202 -332254 -292359 -260709 -289498 -248376
0 -248376
$$ Imaginary data points
##PAGE= N=2
##DATA TABLE= (X++(I..I)), XYDATA
16383 -5516205 -5419949 -5357949 -5286121 -5230628 -5161879 -5111399 -5069282 -4910848 -4957438 -4883073 -4775246
16372 -4775246 -4740905 -4671601 -4643547 -4560575 -4525036 -4482124 -4420473 -4307018 -4271890 -4243467 -4199473
16361 -4199473 -4116612 -4098831 -4024217 -3934893 -3852631 -3790266 -3767649 -3734113 -3629486 -3555933 -3475666
16350 -3475666 -3408785 -3388920 -3292041 -3231796 -3212321 -3142428 -3095101 -3071451 -3006464 -2961361 -2871902
16339 -2871902 -2746763 -2743124 -2763530 -2762275 -2633851 -2545726 -2519388 -2456521 -2397834 -2336585 -2298754
16328 -2298754 -2269933 -2184460 -2111582 -2106846 -2096209 -2057565 -1936231 -1930834 -1842984 -1749633 -1723745
16317 -1723745 -1706170 -1673142 -1638347 -1591356 -1497386 -1414930 -1391949 -1315779 -1281466 -1301300 -1262985
16306 -1262985 -1210226 -1157547 -1138642 -1046069 -973745 -911969 -882115 -860938 -820820 -756959 -711998
16295 -711998 -700180 -638146 -561825 -491706 -427437 -396981 -359257 -318710 -312134 -221446 -137682 -84462
16283 -84462 -37462 -21500 31278 95086 107518 145195 155726 200684 261389 359592 315927 257405
16271 257405 347937 444673 433501 424032 471015 523169 616519 665972 723759 749299 744865 795699
16259 795699 879621 951002 995966 985217 967210 1034800 1079998 1094947 1179874 1267825 1283484
16248 1283484 1252734 1359752 1307143 1317488 1399644 1436203 1399896 1431732 1505526 1509587 1533573
16237 1533573 1561287 1529667 1488450 1507046 1594248 1665236 1690852 1666472 1703038 1807059 1895503
16226 1895503 1936057 1891081 1903411 1946690 1978627 2082409 2097274 2120050 2068755 2058180 2121914
16215 2121914 2076538 2202908 2227269 2177136 2242498 2285062 2285910 2229570 2202124 2209098 2315039
16204 2315039 2443200 2450280 2468407 2495144 2533152 2557960 2539257 2464657 2490986 2542508 2519888
16193 2519888 2524441 2616313 2598134 2692583 2611730 2614519 2686042 2744875 2821312 2823895 2782108 2797945
16181 2797945 2864017 2821158 2835898 2888945 2917683 2943020 2982014 2980186 2909440 2882607 2998578
16170 2998578 3016560 3023410 3009930 3036043 3116487 3125644 3137105 3172836 3141731 3055253 3139322 3223727
16158 3223727 3235328 3251000 3308685 3258815 3243484 3297813 3297265 3315544 3294374 3281212 3295667 3396322
16146 3396322 3392867 3301515 3275249 3286985 3268272 3377754 3415250 3355634 3393980 3421697 3420003
16135 3420003 3396037 3413587 3492089 3410177 3387646 3444349 3472445 3476546 3412505 3403915 3408871 3440154
16123 3440154 3424649 3362768 3393567 3462953 3476283 3484188 3508161 3452174 3506671 3521096 3521249 3544533
16111 3544533 3478292 3498684 3580548 3603803 3539526 3511381 3557891 3560772 3523486 3523421 3591680 3571822
16099 3571822 3631303 3620925 3605915 3628048 3619378 3696211 3645496 3606057 3685377 3760388 3659217
16088 3659217 3658394 3560863 3528446 3573391 3624966 3644185 3592116 3629312 3583166 3646532 3684351 3661642
16076 3661642 3615838 3715945 3694280 3629214 3652278 3662724 3616644 3562573 3563865 3631957 3654385
16065 3654385 3732288 3798871 3776978 3720177 3679105 3800118 3700493 3646612 3721628 3718476 3723397
16054 3723397 3820013 3932424 3862223 3752771 3773593 3803210 3835353 3795693 3815807 3807153 3799702
16043 3799702 3820336 3686159 3679444 3785430 3783054 3877200 3765998 3671497 3683218 3666840 3783790
16032 3783790 3823572 3788445 3730279 3691661 3622483 3643092 3685136 3729935 3803771 3869861 3835390
16021 3835390 3761426 3828299 3798257 3778947 3726652 3771221 3767834 3801577 3698038 3732873 3729849
16010 3729849 3752772 3797164 3701006 3712680 3696790 3678790 3647626 3733877 3739943 3718998 3762431
15999 3762431 3821165 3816595 3888034 3917796 3895311 3839324 3753195 3813217 3797727 3665984 3762419
15988 3762419 3794326 3773326 3774942 3772728 3788502 3742819 3657571 3675728 3664609 3645919 3621762 3724406
15976 3724406 3683520 3698847 3671311 3714325 3719649 3751440 3852263 3789337 3742613 3779764 3746295
15965 3746295 3758050 3836591 3773463 3765223 3779437 3735622 3605405 3572135 3572177 3606560 3679816 3724859
15953 3724859 3792729 3787881 3781996 3749353 3691400 3764249 3752254 3748412 3695685 3703467 3758883 3799960
15941 3799960 3773603 3853825 3825287 3830078 3821937 3767467 3753053 3758599 3722733 3693606 3782357 3727905
15929 3727905 3645815 3728034 3725837 3617676 3673635 3729658 3766841 3821628 3747417 3796140 3794344
15918 3794344 3756614 3837748 3889327 3751319 3677193 3771933 3806510 3771571 3646458 3669674 3767548
15907 3767548 3794450 3858798 3843166 3788025 3765134 3725380 3787073 3693881 3741022 3800142 3762847
15896 3762847 3825043 3795064 3736140 3821556 3853072 3790391 3722668 3772622 3825038 3734734 3714862
15885 3714862 3700779 3715842 3764810 3784287 3810754 3850928 3859169 3933828 3858096 3769515 3794961
15874 3794961 3789542 3793658 3828477 3813528 3809295 3835598 3784856 3847224 3897496 3816139 3769815 3700239
15862 3700239 3736937 3811490 3781361 3848963 3867043 3894155 3929318 3889790 3767334 3724233 3854679
15851 3854679 3859356 3732875 3771350 3777219 3710312 3806106 3767464 3777573 3821872 3793741 3760316
15840 3760316 3684296 3672683 3742460 3828882 3835990 3773550 3747299 3790404 3815700 3796861 3804590 3755335
15828 3755335 3855537 3865348 3866540 3937405 3828898 3835445 3732789 3751944 3794002 3806947 3740714
15817 3740714 3832377 3869050 3891025 3810314 3758964 3830023 3858300 3769263 3680166 3709113 3796622
15806 3796622 3855531 3887132 3890958 3767255 3752286 3729373 3767429 3767726 3761981 3796392 3830429 3855642
15794 3855642 3861002 3865383 3809917 3820591 3879282 3912730 3842662 3906085 3963706 3926846 3887394 3804224
15782 3804224 3792907 3781936 3796804 3791308 3824644 3817681 3786405 3803743 3868322 3804746 3829250 3862291
15770 3862291 3854895 3755860 3740154 3725243 3838372 3892722 3924301 3885960 3849145 3808301 3821036
15759 3821036 3923756 3877202 3889414 3896190 3864244 3776797 3763965 3834340 3894014 3821790 3811838
15748 3811838 3847039 3886089 3858532 3802741 3853686 3868448 3820969 3813136 3882294 3862823 3797182
15737 3797182 3804165 3863261 3900227 3957602 3898099 3912855 3903956 3863923 3879059 3866789 3891330 3861997
15725 3861997 3876362 3837686 3805130 3769201 3788507 3833531 3870448 3842463 3819181 3890701 3884839
15714 3884839 3866677 3804984 3751337 3873450 3878684 3855029 3854762 3851927 3899287 3901249 3807263 3840285
15702 3840285 3821629 3816497 3847557 3850142 3891093 3825121 3846431 3876381 3884323 3900818 3850241 3708505
15690 3708505 3686012 3776315 3850489 3785092 3781793 3839804 3915384 3876255 3778568 3814706 3810092 3844005
15678 3844005 3817636 3824068 3880059 3906738 3895592 3918554 4011273 3925759 3847991 3934766 3825133
15667 3825133 3611820 3693050 3704565 3739463 3749741 3738030 3700330 3729172 3844678 3890336 3907545
15656 3907545 3842387 3918068 3924855 3988472 3878574 3876927 3802947 3818573 3859562 3872027 3965766
15645 3965766 3945742 3948255 3956507 3897010 3920618 3974934 3944739 3838198 3802309 3890847 3823182
15634 3823182 3865278 3797746 3882491 3913420 3837814 3901129 3924978 3891500 3917919 3939498 3933688
15623 3933688 3857148 3866151 3929138 3920339 3919171 3857240 3860447 3914070 3954080 3891522 3846866 3919021
15611 3919021 3936870 3876791 3960261 4012504 3925041 3901583 4009087 3947305 3942909 3907630 3793883
15600 3793883 3862334 3943847 3902840 3884626 3867655 3908210 3931303 3873959 3776210 3756399 3771847
15589 3771847 3808764 3852239 3879358 3911495 3881280 3859206 3836782 3899782 3943529 4057907 4006655
15578 4006655 3914439 3906837 3853343 3806467 3864385 3904937 3854490 3931145 3911860 3894905 3940586
15567 3940586 3922668 3966232 3936269 3972428 3864986 3931679 3974330 3969988 3971164 3961612 3959003 3945982
15555 3945982 3915719 3987119 3969230 3980803 3963124 3964247 4022620 3932445 3888650 3894328 3942738 3820787
15543 3820787 3932048 3919269 3907599 3847899 3858793 3871086 3887037 3933636 3878023 3958481 3990796
15532 3990796 3933338 3933273 3914712 3843134 3909616 3935228 3963633 4016927 3963276 3872051 3909973 3933362
15520 3933362 3911345 3947442 3884610 3784404 3798110 3834732 3741165 3874528 3980383 3868498
15510 3868498 3806402 3893229 3987583 3894749 3788352 3819409 3849902 3892741 4031847 4010509 3844034
15499 3844034 3855485 3868827 3863419 3886955 4005418 4038709 3979628 3952615 3967580 3980890 3975582
15488 3975582 3911651 3923457 3854152 3871323 3902483 3869028 3812179 3896888 3871893 3795032 3910639
15477 3910639 3963258 3984558 3901460 3967265 3897904 3875771 3868676 3930076 3858939 3879997 3925182
15466 3925182 3907263 3934804 3942031 3957880 3964899 3973965 3978916 3890741 3880622 3900801 3962654 3986873
15454 3986873 3909321 3858296 3891109 3860730 3919692 3881281 3889346 3850102 3781168 3791776 3835670
15443 3835670 3902878 4000752 4017304 3961205 3900226 3888693 3951136 3933063 4000546 3975013 3899983
15432 3899983 4001378 3938537 3908525 3911310 3957268 3941938 3845506 3945831 3966045 4004676 3966213
15421 3966213 3979492 3917475 3984686 3978307 3941039 3939215 3978397 4070858 4116735 4013239 4010836 3982272
15409 3982272 3939338 3918305 3879378 3899733 3927302 4020082 3899200 3840354 3867696 3880025 3947900
15398 3947900 3903209 4017812 3941784 3951273 4022881 4031844 3908258 3955516 3948780 3931859 4013518
15387 4013518 4011604 3980362 3944774 4056423 4020630 3980045 3882075 3909503 3891054 3932507 3977411
15376 3977411 3990562 3998885 4061082 4105920 4032943 3996027 3880845 3873103 3926350 3979305 3944093
15365 3944093 3912374 3902465 3892354 4015031 4000229 3912936 3897376 3859796 3880218 4002592 3897952
15354 3897952 3925347 4062230 3948757 4007637 4015325 4018665 4036002 4034017 4053091 4001322 4036011
15343 4036011 3993543 3915336 4012134 4052665 3921704 3921706 4001746 4047494 3981383 3986548 4030780 3929658
15331 3929658 3969743 3929496 3930721 4043696 4014456 4065181 4036313 4005070 4032789 3959715 3948159
15320 3948159 3912405 3949739 4065022 4029312 3995440 4015209 3982937 4111025 4084942 4051368 4087359
15309 4087359 4074614 4098090 4041643 3937718 3969708 4036971 3956599 3957748 3945275 4025377 4100837
15298 4100837 4063617 4078559 4057987 3930501 3999869 3978441 3977455 3948736 3958099 3993265 4102828
15287 4102828 4102839 3991451 4043836 4079631 4085008 4113911 4063014 4038710 4089415 4111997 4108696 4022865
15275 4022865 4000831 3988978 3983173 4089935 4032026 3973378 3891693 3932145 3996390 3894767 3945707
15264 3945707 4046682 4074660 4025087 4039552 4066073 4117892 4105255 3989723 4020820 4048321 4086261
15253 4086261 4047060 4016258 4067812 4039841 4021992 3994844 3969879 4063571 4097112 4041726 3943432
15242 3943432 3963803 4016630 4063966 4101849 4146856 4154539 4088806 4078798 4091856 4105008 4110323 4191606
15230 4191606 4104526 4135808 4045601 4054622 4081689 4037057 3981342 3963597 4032701 4001922 4046292
15219 4046292 4093673 4048474 4042372 4109556 4055530 4116271 4116069 4017414 4035052 4019222 4037347 3977179
15207 3977179 4047421 4107945 4060500 4088695 4086282 4111470 4063144 4087799 4160344 4092285 3975880
15196 3975880 3901628 3944156 3957593 4002161 4003149 4016700 4096175 4118759 4002779 4113796 4133400
15185 4133400 4199959 4245865 4101603 4096115 4071115 4025048 4125402 4163175 4121088 4029188 4006771
15174 4006771 4012876 3952249 3997655 4030350 4027522 4046261 4199352 4177584 4103227 4071823 4049705
15163 4049705 4016519 4047035 4035735 4057595 4048980 4034624 4021650 4059257 4094841 4049279 4058538 4064294
15151 4064294 4018092 4026897 4093262 4148898 4113541 4129105 4152798 4152513 4186425 4131007 4120877 4076941
15139 4076941 4149146 4058461 4074444 4082122 4022932 3886943 3871002 4019784 4082422 4156107 4162903
15128 4162903 4181081 4124659 4088583 4053295 4117083 4098347 4063060 4084603 4128886 4190545 4123282
15117 4123282 4171232 4083539 4109003 4114544 4076580 4089767 4082004 4100004 4108810 4142715 4083773 4046372
15105 4046372 4070620 4098149 4113682 4138032 4101010 4154650 4113328 4115315 4096612 4113420 4040210
15094 4040210 4034965 4112772 4148911 4136263 4144918 4089641 4041057 3948460 4012780 4108129 4097725 4123128
15082 4123128 4046468 4059936 4178390 4138773 4128656 4164526 4247135 4225182 4056043 4145407 4162722
15071 4162722 4179702 4198966 4174949 4218770 4225231 4188181 4098575 4112549 4165909 4156456 4168539 4034524
15059 4034524 4057612 4062850 4109791 4141826 4085498 4147948 4145847 4163348 4181838 4203046 4131248 3915099
15047 3915099 4023819 4154584 4172085 4198442 4097471 4038797 4112175 4199660 4193132 4121043 4023305
15036 4023305 4113257 4101909 4047481 4039158 4131065 4077964 4070207 4096135 4163804 4210626 4153906 4170986
15024 4170986 4197025 4198208 4168309 4110873 4082228 4073183 4101059 4118903 4145787 4133844 4193803 4252840
15012 4252840 4171210 4215111 4198881 4109707 4045280 4126861 4196305 4106872 4058694 4171662 4160414
15001 4160414 4188928 4156741 4080067 4152778 4194915 4164430 4155601 4154699 4178079 4207901 4182337 4153772
14989 4153772 4127799 4174196 4166755 4164893 4097405 4050915 4051935 4022321 4043468 3996091 4053169 4187042
14977 4187042 4265251 4166060 4131727 4112707 4182983 4220382 4156387 4067612 4106576 4147909 4135096
14966 4135096 4197697 4215490 4156991 4202272 4193755 4110831 4054378 4098000 4176627 4119204 4126013 4126029
14954 4126029 4058270 4062340 4162995 4209859 4191896 4117365 4041154 4080444 4076902 4081110 4064127 4125562
14942 4125562 4142591 4125414 4168778 4134918 4086479 4109476 4095537 4082751 4096488 4044322 4080087
14931 4080087 4023692 4057145 4063880 4088397 4056678 3984781 4117038 4244991 4226915 4091461 4095002
14920 4095002 4144130 4237956 4239609 4198654 4123217 4025649 4009800 4031996 4114693 4204650 4318300
14909 4318300 4219433 4115555 4118030 4120043 4148779 4131553 4130360 4129325 4092580 4098837 4080380 4121754
14897 4121754 4194298 4179746 4132282 4170937 4260478 4240948 4194136 4199468 4135095 4117016 4056647
14886 4056647 4126986 4148707 4137821 4243102 4211235 4231432 4253322 4251953 4116483 4055199 4115197
14875 4115197 4123792 4193531 4167373 4208375 4184674 4152635 4188918 4190163 4192811 4142117 4166015 4177175
14863 4177175 4152645 4183549 4171394 4235929 4263583 4167351 4119213 4167368 4244476 4222655 4154149
14852 4154149 4131921 4194080 4273477 4278490 4213457 4146047 4108665 4108679 4154909 4236589 4261041 4059103
14840 4059103 4153443 4223614 4114639 4119271 4237168 4288180 4225534 4286323 4300721 4166143 4175864
14829 4175864 4173446 4175322 4251942 4187841 4165138 4142329 4083306 4109982 4216965 4218951 4223722 4246627
14817 4246627 4236364 4250218 4251457 4299309 4274367 4217652 4242183 4131290 4076929 4129456 4060863
14806 4060863 4064555 4181451 4205511 4239370 4198957 4193594 4175948 4095021 4118265 4264584 4235765
14795 4235765 4176339 4129571 4181294 4231520 4183848 4208547 4253807 4210363 4186865 4241193 4329965
14784 4329965 4296381 4221339 4268808 4229011 4295902 4206548 4111274 4156257 4232745 4237504 4141449
14773 4141449 4279753 4301563 4185694 4169747 4188852 4194929 4144432 4139429 4153257 4249054 4251954
14762 4251954 4246343 4215015 4269895 4267471 4217805 4260373 4233009 4242610 4191995 4156655 4270555 4249204
14750 4249204 4186123 4221696 4197538 4233711 4294677 4243800 4224375 4281141 4157929 4200747 4248405
14739 4248405 4190590 4233358 4277168 4216279 4212313 4236878 4239174 4279790 4260326 4250192 4161980 4211687
14727 4211687 4312701 4180980 4150864 4201910 4262889 4325084 4266431 4212879 4279454 4219529 4236994
14716 4236994 4258332 4246191 4298824 4307824 4228084 4227283 4317601 4363145 4170580 4157329 4267693
14705 4267693 4180589 4162445 4135978 4171092 4217242 4210023 4318505 4361813 4233011 4304981 4312473
14694 4312473 4209403 4206381 4227931 4305439 4274581 4268220 4317938 4325483 4274889 4272638 4301147 4301548
14682 4301548 4211093 4225216 4200793 4127792 4192383 4277398 4318829 4356969 4310517 4234151 4253417
14671 4253417 4215248 4246582 4230000 4193691 4281622 4327221 4316728 4347408 4291673 4276330 4277295 4261004
14659 4261004 4304990 4306479 4207163 4197968 4180395 4183776 4162991 4127038 4150942 4212999 4314314 4340982
14647 4340982 4331526 4268309 4247895 4345447 4261616 4216957 4223931 4257445 4167931 4180189 4301226
14636 4301226 4290989 4268202 4276769 4316733 4254647 4205170 4280149 4237149 4250460 4231561 4325779
14625 4325779 4309969 4275123 4253287 4190227 4237004 4259121 4234412 4245574 4265009 4359281 4350037
14614 4350037 4255945 4312214 4311190 4290993 4309523 4265144 4354976 4310414 4270586 4346189 4364691
14603 4364691 4297427 4308443 4418921 4336813 4296875 4303434 4359233 4270737 4227239 4374031 4380638
14592 4380638 4340420 4373431 4398771 4413469 4358811 4358717 4405551 4425909 4356037 4316442 4336060 4389825
14580 4389825 4319106 4363955 4414068 4449579 4384610 4311835 4303179 4341381 4171632 4166503 4210046
14569 4210046 4217154 4303403 4245093 4298047 4338153 4326307 4280017 4291675 4344572 4361584 4322667
14558 4322667 4263918 4303690 4258923 4226477 4303384 4309621 4290204 4328746 4389680 4341036 4237676
14547 4237676 4268836 4258635 4278476 4338927 4329396 4311007 4330183 4312128 4339853 4422503 4421029 4363604
14535 4363604 4378863 4443324 4403435 4231994 4285750 4379116 4337169 4385092 4337410 4370954 4462761
14524 4462761 4436252 4439603 4373525 4408721 4403413 4375621 4290400 4293731 4323883 4296433 4301836 4243076
14512 4243076 4268103 4337523 4279911 4269308 4424305 4328948 4305281 4357307 4338311 4302299 4345531
14501 4345531 4316468 4268660 4446262 4485891 4400847 4456394 4457964 4486723 4498010 4436578 4366198
14490 4366198 4396504 4355543 4325416 4284671 4375370 4390086 4431764 4432129 4348151 4348539 4336405 4374090
14478 4374090 4467619 4295942 4200303 4170118 4228109 4365112 4354311 4353584 4330754 4416677 4422093
14467 4422093 4389760 4328966 4384757 4379066 4319373 4383765 4354827 4301858 4259029 4297357 4319048
14456 4319048 4215774 4178986 4291980 4344555 4343043 4377570 4428679 4400999 4275740 4324271 4412074
14445 4412074 4379638 4297532 4287202 4288631 4379478 4368351 4378560 4251472 4239360 4273989 4252155
14434 4252155 4267632 4306280 4278813 4319435 4344511 4415413 4412359 4359373 4379062 4352222 4359051 4318642
14422 4318642 4332047 4386913 4489201 4457030 4405960 4347601 4260058 4286868 4362673 4410077 4343889
14411 4343889 4338927 4497626 4523322 4455170 4450595 4532689 4518243 4423963 4452995 4395354 4375227
14400 4375227 4476115 4444160 4379561 4340175 4382678 4359971 4334432 4309067 4346959 4375060 4464382
14389 4464382 4430735 4269988 4280401 4330024 4342515 4405188 4442906 4454299 4419937 4364320 4432419
14378 4432419 4407365 4425084 4393215 4216896 4297404 4287469 4363187 4372102 4323542 4341776 4336689 4393611
14366 4393611 4443837 4459703 4351824 4371608 4371064 4333039 4378486 4429845 4441853 4389702 4400549
14355 4400549 4322044 4336131 4382652 4375348 4346707 4397062 4313904 4361167 4471926 4473858 4502991
14344 4502991 4481975 4453742 4372720 4323017 4321502 4359734 4387497 4409527 4374414 4431494 4459236
14333 4459236 4425332 4387045 4378181 4418413 4359709 4277564 4242603 4327302 4431043 4381505 4558138
14322 4558138 4470703 4380487 4444865 4371666 4343563 4428447 4520255 4491033 4434078 4529365 4494251
14311 4494251 4363221 4355006 4413170 4390088 4421692 4426500 4414165 4359849 4366013 4491973 4421055
14300 4421055 4393064 4430696 4438386 4397249 4334039 4379868 4392048 4523108 4530504 4429939 4519876
14289 4519876 4566819 4466453 4443581 4484736 4481320 4429096 4402375 4369733 4308710 4291727 4381653
14278 4381653 4461430 4438499 4453789 4440221 4451178 4521336 4474371 4461574 4433522 4491455 4420476
14267 4420476 4368891 4376766 4289590 4365575 4385946 4416979 4427161 4520921 4534572 4485025 4401428
14256 4401428 4419554 4469121 4509615 4394439 4431611 4556907 4487287 4486367 4492917 4519629 4478302
14245 4478302 4512992 4555977 4533184 4440418 4445958 4483018 4478735 4445500 4445248 4478694 4559279 4544617
14233 4544617 4529127 4531388 4471236 4487079 4400041 4439844 4459620 4493509 4484250 4511132 4430573 4394812
14221 4394812 4457858 4476739 4446462 4404818 4428548 4442022 4485136 4495040 4536725 4522219 4486880
14210 4486880 4514014 4601138 4568244 4462628 4449670 4445725 4466937 4491829 4497925 4378621 4501873
14199 4501873 4581418 4508299 4365614 4298730 4337145 4444026 4489743 4370052 4388309 4402483 4422003
14188 4422003 4481096 4514532 4553971 4592406 4589149 4586998 4530224 4520374 4489008 4353317 4428098 4581898
14176 4581898 4574854 4513023 4501735 4414388 4497740 4590305 4548455 4488156 4436803 4477542 4631433
14165 4631433 4666744 4553046 4590336 4513091 4473734 4437636 4446980 4492494 4506072 4556029 4479616
14154 4479616 4416899 4430375 4449907 4449472 4507707 4558321 4478895 4454044 4469344 4504897 4479430 4374113
14142 4374113 4377587 4443765 4439559 4434865 4461316 4496486 4438921 4462794 4469436 4523230 4619936 4583686
14130 4583686 4600037 4615643 4556430 4580442 4536102 4533310 4504399 4531773 4551399 4564057 4561616 4500307
14118 4500307 4506611 4592348 4601410 4528633 4531959 4443435 4460507 4464391 4416997 4452810 4492307 4550398
14106 4550398 4573458 4598074 4561348 4546344 4500327 4453949 4505474 4586622 4558507 4551956 4587972
14095 4587972 4599585 4589628 4517405 4541924 4436451 4405530 4520574 4585262 4597002 4487544 4549928
14084 4549928 4599274 4588181 4532548 4503462 4558729 4558523 4587998 4595219 4515083 4466261 4572163 4533420
14072 4533420 4549923 4472576 4536328 4540198 4503934 4473127 4501599 4546462 4596775 4526580 4475516
14061 4475516 4479803 4477837 4579155 4604313 4608207 4565470 4502842 4537154 4601823 4542545 4492769 4533326
14049 4533326 4563844 4563179 4606839 4587032 4532768 4485566 4583478 4612490 4640799 4562051 4507218 4454979
14037 4454979 4487301 4522154 4558782 4553899 4547867 4631603 4586978 4553712 4533804 4632387 4665658 4502200
14025 4502200 4582203 4581374 4531053 4571552 4512137 4454221 4513967 4507743 4510832 4538791 4502490 4544087
14013 4544087 4533105 4493136 4628550 4636401 4534626 4558238 4634960 4636069 4558159 4521517 4542232
14002 4542232 4529278 4539788 4572352 4555436 4553169 4538457 4564771 4559166 4552828 4529151 4675538 4661125
13990 4661125 4703448 4692887 4700805 4714742 4606152 4658438 4589233 4552812 4549798 4545601 4575666 4536847
13978 4536847 4602180 4602470 4624101 4596424 4556864 4450882 4541774 4605203 4616965 4598448 4652243
13967 4652243 4736226 4672798 4653619 4592730 4533734 4605656 4568737 4554238 4634148 4602526 4662993
13956 4662993 4631801 4685155 4669266 4652527 4697960 4657145 4589765 4691655 4665194 4623568 4557999
13945 4557999 4602971 4617580 4582943 4533394 4607151 4697295 4663858 4653523 4695774 4725444 4666140
13934 4666140 4621700 4613102 4596319 4641623 4588229 4536411 4586380 4576989 4723471 4658639 4615771
13923 4615771 4611188 4586337 4574100 4583610 4557613 4628107 4727232 4704812 4664533 4632469 4621758 4580767
13911 4580767 4655642 4642268 4663949 4651806 4629619 4659846 4698642 4694292 4635812 4568205 4514386
13900 4514386 4654921 4685242 4703679 4643969 4623011 4560395 4606359 4645871 4734364 4753341 4693567
13889 4693567 4677425 4606645 4546660 4591613 4589717 4557751 4619420 4680833 4679424 4564302 4625691
13878 4625691 4675870 4672922 4701894 4775758 4788296 4704886 4634333 4620979 4593934 4640383 4643479 4571647
13866 4571647 4611877 4611646 4574368 4589291 4621324 4657537 4658334 4807926 4769833 4805319 4830678 4718343
13854 4718343 4659616 4638360 4672741 4728309 4754638 4751891 4692250 4677376 4571383 4625244 4617878
13843 4617878 4558586 4600692 4626889 4690981 4627265 4644808 4675597 4721976 4755202 4742429 4726758
13832 4726758 4774938 4717180 4658718 4755430 4701232 4678942 4690470 4677761 4623182 4567453 4576519
13821 4576519 4675603 4779311 4691020 4614562 4630019 4603476 4646154 4614435 4539581 4536951 4619305
13810 4619305 4651200 4678152 4754045 4657438 4637045 4624372 4631125 4529770 4541632 4704264 4731175
13799 4731175 4655364 4679025 4613954 4602877 4586810 4613281 4649958 4656837 4662677 4623803 4648880 4629969
13787 4629969 4672158 4754128 4751860 4715753 4760521 4847434 4800286 4730453 4768497 4726226 4702415
13776 4702415 4713791 4676320 4660131 4729831 4763321 4782546 4794624 4813479 4808551 4784345 4708997
13765 4708997 4720017 4756245 4734702 4757055 4752350 4847938 4827433 4802370 4786663 4693021 4707928
13754 4707928 4681037 4764986 4883970 4822988 4792069 4757921 4737690 4745135 4772047 4743209 4652084
13743 4652084 4605160 4614698 4785995 4823854 4761755 4752968 4766141 4669586 4570885 4676183 4725194
13732 4725194 4767571 4810900 4821034 4780925 4769316 4687349 4633417 4665101 4668258 4673449 4764584 4774580
13720 4774580 4816421 4815095 4797021 4779895 4759242 4695969 4809421 4869826 4877087 4820889 4774059
13709 4774059 4847451 4785708 4757961 4779364 4743483 4651936 4640501 4659979 4600050 4644237 4778719
13698 4778719 4766379 4814476 4735261 4731951 4697682 4650330 4730681 4746201 4712048 4814107 4785041
13687 4785041 4706343 4746268 4754764 4787441 4790066 4770369 4766069 4608541 4716041 4793356 4744316
13676 4744316 4572763 4608687 4693305 4695999 4738398 4787924 4820294 4735436 4796053 4738309 4712168
13665 4712168 4699038 4724443 4791028 4770568 4762267 4790669 4698740 4687058 4797598 4776092 4829569
13654 4829569 4798085 4835435 4905823 4873086 4846728 4798647 4731590 4735184 4820710 4818462 4791147 4824545
13642 4824545 4857810 4814655 4758343 4673140 4635702 4705399 4753707 4757002 4754708 4722229 4722827 4759080
13630 4759080 4817080 4816186 4861465 4769303 4751507 4791990 4792747 4751434 4829686 4789457 4735085 4727365
13618 4727365 4783048 4833749 4823701 4800725 4684896 4714304 4784761 4779762 4776214 4803522 4786808
$$ [...]
##END NTUPLES=NMR SPECTRUM
##END=
