##TITLE=1H_CA-8841-2
 CDCl3,8 sc, 
 6.04.2021
##JCAMPDX= 6.0         $$ Bruker NMR JCAMP-DX V2.0
##DATA TYPE= NMR SPECTRUM
##DATA CLASS= NTUPLES
##ORIGIN= UXNMR, Bruker Analytische Messtechnik GmbH
##OWNER= root
$$ XWIN-NMR		Version 3.5
$$ Tue Apr  6 10:52:18 2021 Russian Standard Time (UT+4h)  she@DPX200
##.OBSERVE FREQUENCY= 200.131506
##.OBSERVE NUCLEUS= ^1H
##.ACQUISITION MODE= SIMULTANEOUS
##.ACQUISITION SCHEME= undefined
##.AVERAGES= 8
##.DIGITISER RES= 18
##SPECTROMETER/DATA SYSTEM= spect
##.PULSE SEQUENCE= zg30
##.SOLVENT NAME= CDCl3
##.SHIFT REFERENCE= (INTERNAL, CDCl3, 0, 15.9792)
##AUDIT TRAIL= $$ (NUMBER, WHEN, WHO, WHERE, WHAT)
$$ ##TITLE= Audit trail, XWIN-NMR		Version 3.5
$$ ##JCAMPDX= 5.01
$$ ##ORIGIN= Bruker BioSpin GmbH
$$ ##OWNER= she
$$ F:/spectra/data/she/nmr/H-F/1/pdata/1/auditp.txt
$$ ##AUDIT TRAIL=  $$ (NUMBER, WHEN, WHO, WHERE, WHAT)
(   1,<2021-04-06 10:50:31.57 +0400>,<she>,<DPX200>,
      <created by zg, POWCHK disabled, PULCHK disabled
       configuration hash MD5:
       00 E9 B6 7A A2 85 ED C7 34 08 36 98 17 FE 4E 26
       data hash MD5: 16K
       03 E7 14 2A 6E F2 0F 0F C5 6A 60 15 22 3B 77 86>)
(   2,<2021-04-06 10:50:37.39 +0400>,<she>,<DPX200>,
      <Start of raw data processing
       efp BC_mod = 2 LB = 0.24 FT_mod = 6 PKNL = 1 PHC0 = -11117.22 PHC1 = 11.20092 SI = 16K 
       data hash MD5: 16K
       15 D1 6D 4F 4B F8 F0 03 69 86 51 A1 5B AD 25 92>)
(   3,<2021-04-06 10:50:57.04 +0400>,<she>,<DPX200>,
      <pk PHC0 = -3.319872 PHC1 = 1.2 
       data hash MD5: 16K
       6B EE B4 CB 2C E6 BC EB B8 97 96 90 EB BB 9A 7F>)
(   4,<2021-04-06 10:50:59.96 +0400>,<she>,<DPX200>,
      <abs ABSG = 5 
       data hash MD5: 16K
       14 37 4F EC BA CE 7B C1 00 6C B8 CD DD 8A AE 27>)
$$ ##END=
$$ 
$$ hash MD5
$$ F7 8D 4A 3E A0 1B 8E EE F9 6A 29 97 70 E8 37 4D
##$RELAX= 
##$RELAX= 
##$RELAX= 
##$RELAX= 
##$RELAX= 
##$RELAX= 
$$ Bruker specific parameters
$$ --------------------------
##$DU= <F:/spectra>
##$EXPNO= 1
##$NAME= <H-F>
##$PROCNO= 1
##$TYPE= <nmr>
##$USER= <she>
##$AMP= (0..31)
100 100 100 100 100 100 100 100 100 100 100 100 100 100 100 100 100 100 
100 100 100 100 100 100 100 100 100 100 100 100 100 100 
##$AQSEQ= 0
##$AQ_mod= 1
##$AUNM= <au_zg>
##$AUTOPOS= <>
##$BF1= 200.13
##$BF2= 200.13
##$BF3= 200.13
##$BF4= 200.13
##$BF5= 200.13
##$BF6= 200.13
##$BF7= 200.13
##$BF8= 200.13
##$BYTORDA= 1
##$CFDGTYP= 0
##$CFRGTYP= 5
##$CHEMSTR= <none>
##$CNST= (0..31)
1 1 145 1 1 1 1 1 1 1 1 1 1 1 1 1 1 1 1 1 1 1 1 1 1 1 1 1 1 1 1 1 
##$CPDPRG= <>
##$CPDPRG1= <>
##$CPDPRG2= <>
##$CPDPRG3= <>
##$CPDPRG4= <mlev>
##$CPDPRG5= <mlev>
##$CPDPRG6= <mlev>
##$CPDPRG7= <mlev>
##$CPDPRG8= <mlev>
##$CPDPRGB= <>
##$CPDPRGT= <>
##$D= (0..31)
0 1.2 0 0 0 0 0 0 0 0.06 0 0.03 0 0 0 0 0.0002 0 0 0 0 0 0 0 0 0 0 0 0 
0 0 0 
##$DATE= 1617691831
##$DBL= (0..7)
120 120 120 120 120 120 120 120 
##$DBP= (0..7)
150 150 150 150 150 150 150 150 
##$DBP07= 0
##$DBPNAM0= <>
##$DBPNAM1= <>
##$DBPNAM2= <>
##$DBPNAM3= <>
##$DBPNAM4= <>
$$ [...]
##$SUBNAM3= <"">
##$SUBNAM4= <"">
##$SUBNAM5= <"">
##$SUBNAM6= <"">
##$SUBNAM7= <"">
##$SUBNAM8= <"">
##$SUBNAM9= <"">
##$SW= 16.9725357007746
##$SWIBOX= (0..15)
0 0 2 0 0 0 0 0 0 0 0 0 0 0 0 0 
##$SW_h= 3396.73913043478
##$TD= 16384
##$TD0= 1
##$TE= 0
##$TE2= 300
##$TE3= 300
##$TEG= 300
##$TL= (0..7)
0 120 120 120 120 120 120 120 
##$TP= (0..7)
150 150 150 150 150 150 150 150 
##$TP07= 0
##$TPNAME0= <>
##$TPNAME1= <>
##$TPNAME2= <>
##$TPNAME3= <>
##$TPNAME4= <>
##$TPNAME5= <>
##$TPNAME6= <>
##$TPNAME7= <>
##$TPOAL= (0..7)
0.5 0.5 0.5 0.5 0.5 0.5 0.5 0.5 
##$TPOFFS= (0..7)
0 0 0 0 0 0 0 0 
##$TUNHIN= 0
##$TUNHOUT= 0
##$TUNXOUT= 0
##$USERA1= <user>
##$USERA2= <user>
##$USERA3= <user>
##$USERA4= <user>
##$USERA5= <user>
##$V9= 5
##$VALIST= <valist>
##$VCLIST= <CCCCCCCCCCCCCCC>
##$VD= 0
##$VDLIST= <DDDDDDDDDDDDDDD>
##$VPLIST= <PPPPPPPPPPPPPPP>
##$VTLIST= <TTTTTTTTTTTTTTT>
##$WBST= 1024
##$WBSW= 4
##$XGAIN= (0..3)
0 0 0 0 
##$XL= 0
##$YL= 0
##$YMAX_a= 144298
##$YMIN_a= -159104
##$ZGOPTNS= <>
##$ZL1= 120
##$ZL2= 120
##$ZL3= 120
##$ZL4= 120
##$ABSF1= 15.97506
##$ABSF2= -0.9976015
##$ABSG= 5
##$ABSL= 3
##$ALPHA= 0
##$AQORDER= 0
##$ASSFAC= 0
##$ASSFACI= 0
##$ASSFACX= 0
##$ASSWID= 0
##$AUNMP= <proc_1d>
##$AZFE= 0.1
##$AZFW= 0.1
##$BCFW= 0
##$BC_mod= 2
##$BYTORDP= 0
##$COROFFS= 0
##$CY= -3
##$DATMOD= 1
##$DC= 0
##$DFILT= <>
##$DTYPP= 0
##$F1P= 0
##$F2P= 0
##$FCOR= 1
##$FTSIZE= 16384
##$FT_mod= 6
##$GAMMA= 0
##$GB= 0
##$INTBC= 1
##$INTSCL= 2.992141e-10
##$ISEN= 128
##$LB= 0.24
##$LEV0= 0
##$LPBIN= 0
##$MAXI= 10000
##$MC2= 0
##$MEAN= 0
##$ME_mod= 0
##$MI= 1.114404
##$NCOEF= 0
##$NC_proc= -8
##$NLEV= 6
##$NOISF1= 3.799351
##$NOISF2= 2.8
##$NSP= 0
##$NTH_PI= 0
##$NZP= 0
##$OFFSET= 15.97921
##$PC= 1
##$PHC0= -11120.54
##$PHC1= 12.40092
##$PH_mod= 1
##$PKNL= yes
##$PPARMOD= 0
##$PSCAL= 0
##$PSIGN= 0
##$REVERSE= no
##$SF= 200.130006450189
##$SI= 16384
##$SIGF1= 3
##$SIGF2= 2
##$SINO= 5.538805
##$SIOLD= 16384
##$SREGLST= <1H.CDCl3>
##$SSB= 0
##$STSI= 16384
##$STSR= 0
##$SW_p= 3396.73913043479
##$SYMM= 0
##$S_DEV= 0
##$TDeff= 16384
##$TDoff= 0
##$TI= <>
##$TILT= no
##$TM1= 0
##$TM2= 0
##$TOPLEV= 0
##$USERP1= <user>
##$USERP2= <user>
##$USERP3= <user>
##$USERP4= <user>
##$USERP5= <user>
##$WDW= 1
##$XDIM= 16384
##$YMAX_p= 529035400
##$YMIN_p= -1210104
$$ End of Bruker specific parameters
$$ ---------------------------------
##NTUPLES= NMR SPECTRUM
##VAR_NAME=  FREQUENCY,     SPECTRUM/REAL,   SPECTRUM/IMAG
##SYMBOL=    X,             R,               I
##VAR_TYPE=  INDEPENDENT,   DEPENDENT,       DEPENDENT
##VAR_FORM=  AFFN,          ASDF,            ASDF
##VAR_DIM=   16384,         16384,           16384
##UNITS=     HZ,            ARBITRARY UNITS, ARBITRARY UNITS
##FACTOR=    0.207333158178282, 1,           1
##FIRST=     3197.91938033638, 0,            0
##LAST=      -198.81975009841, 0,            0
##MIN=       -198.81975009841, -1210104,     0
##MAX=       3197.91938033638, 529035400,    0
$$ Real data points
##PAGE= N=1
##DATA TABLE= (X++(R..R)), XYDATA
$$ [...]
6537 -819 -156098 70771 317882 429452 228330 -208323 -397446 -436130 -412827 -698622 -497526
6526 -497526 -14713 -269128 -380384 -104588 -420498 -585691 -488013 -235376 -75383 -47322
6516 -47322 -67028 -179777 -110730 818 -167170 -270543 74452 314403 71978 -172153
6506 -172153 -201687 -95378 -397616 -467406 -533542 -170988 -222480 -413904 -68781 268935
6496 268935 139152 96627 93555 -127921 -40088 379507 317571 32522 -27708 -283041 -402690
6485 -402690 -69316 -130176 -288547 -86690 -115054 -51469 58732 -195716 -426564 -366204
6475 -366204 -113148 244100 270676 96760 14743 -126859 -44405 20592 -166385 -315561
6465 -315561 -143987 136349 -20628 -151833 -454192 -427671 -492896 -91303 -109154 -64775
6455 -64775 202520 543738 333077 144376 208695 464108 -143089 -77687 -212640 -228564
6445 -228564 -147179 -75488 331801 444907 229139 61409 79296 -65144 92177 -82555
6435 -82555 -188045 -142232 -228989 -175084 -41755 71248 -63856 -197495 -67805 -154437 35729
6424 35729 263790 121295 209124 108139 248513 617384 627908 614410 31238 101554 401974
6413 401974 458300 405554 241411 231460 703215 543428 307491 313284 574829 118955 57387
6402 57387 327566 128441 69397 26145 -164681 -131327 319313 440609 -2552 -98391 57890
6391 57890 251788 224617 -92996 -23244 -3088 119775 149155 193381 193301 67435 31773 20369
6379 20369 51354 -81222 -63039 180957 139857 296407 650479 487580 638301 917633
6369 917633 967684 608257 532546 893790 283526 304387 655618 631616 693441 625952 760041
6358 760041 753484 917949 731907 443020 537649 176081 166575 456211 798796 888572 128845
6347 128845 238060 515539 491537 332187 -89601 232525 248011 -160427 141691 70386
6337 70386 127292 110312 51833 91200 195509 -198049 164486 161861 70368 215420 -20843
6326 -20843 70258 105806 183293 364082 74993 -459128 -884521 -334882 226157 86111
6316 86111 -105163 -317400 -362591 -360998 -608244 -468310 215327 375256 319334 -43508 63479
6305 63479 80478 273582 294064 433488 382662 182185 147702 26124 36791 -160963 -17633
6294 -17633 27704 280553 206001 260197 371395 118506 84141 -203477 -161320 -51996 41641
6283 41641 -320865 -123367 -130134 72613 137011 330020 1140 -190123 -127079 33576 -239604
6272 -239604 42760 42909 -30495 460164 707478 485233 241041 441391 260434 292849 136740
6261 136740 -35419 -43115 -66120 -232382 -236682 -55795 154530 33533 108888 292452 19725
6250 19725 193182 260885 54151 200455 236554 342744 502004 515356 715139 368269
6240 368269 309314 347885 469197 705748 879001 627447 289151 479470 518531 14278
6230 14278 111852 -98525 -75381 232175 323273 173669 -235218 265504 138978 -18254
6220 -18254 433747 228824 110 84897 53307 107053 -58259 -80755 98459 434592 218927
6209 218927 666075 498167 216356 345920 341775 375059 573836 452952 217862 143507
6199 143507 93464 201639 406396 521771 421766 299126 703127 562124 569578 324822
6189 324822 338688 284422 612040 406893 185032 450449 290771 414804 402297 149439
6179 149439 445007 779459 595969 556666 570355 706473 928251 1129779 1115256 898875
6169 898875 651686 687425 949373 1272722 1332529 1555039 1535395 1454772 1655363 1923659
6159 1923659 1687612 1608185 1626972 1228107 1460905 1467474 1569053 1402001 1123557 1223886
6149 1223886 1260709 1055709 830814 670029 915041 1340491 1386584 1590451 1655714 1645986
6139 1645986 1177713 901600 860910 1051780 748388 682593 1020142 804338 895457 798100
6129 798100 674009 644377 727402 266679 340013 425057 458548 700907 347569 253471 359358
6118 359358 737737 680605 720590 581477 778862 811159 597085 503719 498384 379282 222014
6107 222014 478444 526642 632748 301478 395727 679048 559687 871386 1046006 692107
6097 692107 188908 327322 483848 557619 785569 1353211 903873 715963 875146 393691
6087 393691 399191 611055 814011 763512 706651 595050 566177 393825 176724 469689 620391
6076 620391 500557 715486 528458 372385 520010 483635 537307 733103 1300712 987077
6066 987077 1016079 909304 551508 706551 1017974 818695 759667 807997 718498 1156720
6056 1156720 1195206 985602 982758 876555 988771 874093 810026 969099 962962 1192281 1275163
6045 1275163 1124044 1078318 1107009 566931 430487 791615 951595 1365332 1236861 1002866
6035 1002866 761818 749945 1044404 878741 790571 991064 888918 864876 748736 986780
6025 986780 1085039 985281 1194130 948930 705961 1086741 905348 757824 933998 1203052
6015 1203052 1339329 1434436 1625136 1631779 1740764 1444044 1271712 1360730 1542744 1616466
6005 1616466 1447756 1287080 1686148 2038126 1746403 1563479 1853269 1982484 1698188 1618469
5995 1618469 1647310 1455454 1864635 1746562 2016243 2113778 1554989 1491429 1762364 1513915
5985 1513915 1593565 1918724 2101371 1992100 1832002 1812896 2125242 1868136 2510274 2345290
5975 2345290 1905641 2254108 2540951 2398588 2558070 2699062 2141567 2098002 2185920 2326131
5965 2326131 2381697 2339835 2323846 2788353 2827032 2663026 2832460 3023283 2986885 2747241
5955 2747241 2994830 3321329 3302906 3291494 3060883 3079724 3376490 3738293 3932101 4043953
5945 4043953 4344043 4329189 4054475 4160258 4038507 4089426 4244920 4306891 4576622 4935616
5935 4935616 4672460 4431216 4436366 4385489 4808190 5106199 5305842 5404872 5557834 5404089
5925 5404089 5624673 5713637 5553865 5747399 6034141 6134800 6275174 6297109 6713209 7069681
5915 7069681 7035068 7225927 7317042 7636901 7389891 7333018 7710693 7939686 8234060 8681996
5905 8681996 9059721 8785180 8400672 9181373 9561259 9731779 10405571 10589979 10616895 10636724
5895 10636724 11057556 11557055 11895512 12408562 12985213 13554932 13959952 14302791 14632644
5886 14632644 15118923 15495431 16089157 16600186 17410931 18560337 19212612 20080208 20970300
5877 20970300 21543303 22482612 23425463 24682115 25564421 26904800 27946167 28565342 29829134
5868 29829134 31327868 32805404 34245503 35578364 36266023 37617267 38487209 39326990 40987910
5859 40987910 42167990 42633415 43023096 43689673 44165744 43998592 43801758 43801784 42683306 42038776
5849 42038776 40949494 39610098 38213055 37064570 35717577 34776334 33153491 31280383
5841 31280383 29642657 28279540 27108065 25929578 25051088 23936057 22900147 21866474
5833 21866474 20817531 19923769 19317838 18424805 17618583 16756928 16288645 15579063 15075555
5824 15075555 14485066 14139590 13560961 12538607 11893090 11832951 11817465 11944048 11778494 11297486
5814 11297486 10515172 9692024 9380622 9026667 9163909 8835545 8568328 8518252 8050741 8078032
5804 8078032 8234068 7750870 7672538 7207581 6773831 6533296 6009210 6258270 6350599 6000648
5794 6000648 5461155 5608704 5804360 5826689 5858726 5748144 5696574 5381861 4959548 4971657
5784 4971657 5201875 5212185 4497850 4569602 4547918 4574823 4887473 4970260 4666140 4527630
5774 4527630 4604912 4521660 4348630 4346444 4185160 4206486 4345381 4078149 4120292 4228285 3787651
5763 3787651 3506146 3428245 3207180 2816524 2895490 2763895 2584920 2834154 2991042 2897483
5753 2897483 3181906 3287705 3182100 2754781 2581961 2519375 2423813 2625146 2354178 2369350
5743 2369350 2488071 2644571 2738408 2431476 2340457 2585774 2230299 2034067 2027182 2178908
5733 2178908 2152415 2533067 2202662 2095812 2011714 1821816 1879644 2078487 2074370 1767398
5723 1767398 1871467 2242101 2248918 1871947 1772523 1774112 1725497 1747225 1768997 1683777 1798821
5712 1798821 1745256 2075737 2099539 2129406 2194793 2190419 1903872 1753827 1874226 1734074 1711813
5701 1711813 1820079 1728455 1677026 1793585 1424633 1341319 1467299 1383138 1450804 1435252 1407163
5690 1407163 1255784 1204762 1796907 1600551 1448750 1494792 1713148 2060796 2006063 1782627
5680 1782627 1758610 2160737 1984320 1832528 1852860 1896218 1652588 1617728 1697913 1399757
5670 1399757 1352571 1363645 1712871 1787742 1436915 959673 1072773 946057 853790 369386
5660 369386 225744 919389 1152702 1180212 970677 792004 600681 838903 1196285 1117394
5650 1117394 977550 1113304 1420026 1632244 1649263 1466051 1500615 1325181 1113338 1054196
5640 1054196 1484104 1681422 1553450 1304101 1006406 1173784 1222670 1526566 1116598 1032796
5630 1032796 753067 576857 853360 819818 1042873 1231843 811263 756628 814609 773113
5620 773113 624554 855961 850704 683484 522209 648677 904943 1010679 1496119 1283718
5610 1283718 1298339 1267185 1266980 1396045 1568867 1272398 1238241 1506667 1452995 1299232 1031924
5599 1031924 958939 921426 921074 786901 1028064 1266965 1217372 1233428 1318878 1636278 1771132
5588 1771132 1845613 1738876 1652705 1442614 1317225 1524804 1683132 1626811 1486190 1337819
5578 1337819 1417181 1407167 1535540 1197558 1455211 1343176 1247015 1393440 1187176 1230383
5568 1230383 1574854 1883838 1683017 1428181 1005044 536247 1074570 1403690 1484637 1450280
5558 1450280 1257916 1479461 1257709 1127786 1455494 1396858 1240547 1380069 1425346 1629214
5548 1629214 1587278 1849743 1910555 1792252 1748948 1528164 1329445 2034090 2267152 1943789
5538 1943789 1657565 1582864 1721223 1575939 1674392 1807905 1978460 2103579 1676566 1812783
5528 1812783 2272034 1804579 1641420 1689809 1472133 1658019 1426103 1587376 1626352 2063161
5518 2063161 1839842 1950897 2143761 1824060 1840212 2133949 2255554 2272832 2386060 2248399
5508 2248399 2316073 2209226 2357086 2493861 2316182 2631971 2663505 2561806 2444236 2208851
5498 2208851 2292227 2237614 2169761 2570062 2624156 2369099 2391465 2571222 2954557 3096225
5488 3096225 3152407 3033534 3103456 2836166 2748502 2812247 2885176 2979887 2953621 2784856 3080707
5477 3080707 3037544 3090116 3574357 3597416 3466281 3614143 3598734 3499733 3825642 3512542
5467 3512542 3515121 3745488 4059187 3804248 3774088 4411807 4411785 4624831 4440575 4053061 4261077
5456 4261077 3936433 3932141 4430051 4524345 4460862 4168191 4250838 4535235 4666716 4466040
5446 4466040 4404710 4624997 4984480 5053295 5028092 5153292 5201387 5189127 5463810 5350108
5436 5350108 5524892 6080696 6183426 6483878 6863511 6604361 6383447 6574181 6581208 6676629
5426 6676629 6712549 6864160 7201830 7550358 7948953 7667706 7613579 8008412 8009902 8283445
5416 8283445 8004878 8159134 8717763 8892461 9294173 9763925 9801461 9782532 10001873 10056704
5406 10056704 10178525 10223427 10285603 10733442 10625199 10458331 10244162 10473264 11282201 11952924
5396 11952924 11860383 12140262 12333398 12561998 13513941 13594413 14102067 14028984 14405409 14682368
5386 14682368 15041738 15379318 16091057 16824585 17282709 17344018 17885559 18746216 19439402 19779680
5376 19779680 20359334 21453162 22317732 22949170 23827574 25090969 26187376 27319362 28176311
5367 28176311 29446490 31036740 32885484 34759061 36896343 38922596 40725803 42976105
5359 42976105 45496896 48499085 51739595 54838366 58032767 62383036 67261965 72156112
5351 72156112 77396827 83978877 90933701 98969440 108320673 118397884 129947693 141796900
5343 141796900 153370627 164275121 172555487 176534848 175350452 169073801 159063057 145875077
5335 145875077 131828450 118344124 105957441 95452953 85919547 77431445 70453185
5328 70453185 64119619 58801961 53973006 49975290 46173625 43178873 40500415 37765967
5320 37765967 35899398 33836043 31712645 30296431 29067523 27670029 26336100 24853930
5312 24853930 23986660 23602425 22811890 21855418 20599598 19837151 19000551 18382481 17951693
5303 17951693 17551567 16448952 16142408 15756704 15387137 14790198 14192669 13355334 12688603
5294 12688603 12523419 12278283 11985270 11768025 11399425 10936229 10327813 10446367 10314903
5285 10314903 9554364 9599208 9307164 9027785 8898040 8813045 8701651 8255442 8285328 8215326
5275 8215326 7867310 8034226 7855042 7521808 7266652 7416987 7478085 7162359 6894225 6470745
5265 6470745 6142225 6465494 6586545 6541906 6004948 6006479 5739592 5628854 5914349 5624000
5255 5624000 5306714 5390475 5303705 5219531 5273647 4968575 4875405 4687136 4470016 4292147
5245 4292147 4417364 4381759 4235727 4457687 4552395 4229882 3954955 3814033 3869719 3434418
5235 3434418 3307960 3637482 3812129 3500633 3166243 2800462 2984380 3260073 2755673 3086636
5225 3086636 2801160 2994688 2968656 2598368 2794901 3047609 3167908 3050596 2907210 2483148
5215 2483148 2158585 2648844 2426728 2237473 2066862 2568729 2890040 2714904 2300503 2436314
5205 2436314 2357174 1979554 1845557 2057496 2069174 1777594 1567774 1898642 2142600 2063041
5195 2063041 1715346 1910779 1802336 1519428 1887062 1698182 1647249 1712631 1524263 1726946
5185 1726946 1875582 1797452 1950446 1955652 1938940 1717518 1482843 1769005 1866040 1682157
5175 1682157 1589717 1199758 1314208 1307514 1119930 826488 1256234 1298909 1484855 1717014
5165 1717014 1397453 1212894 1097287 1110601 1472010 1301001 1561438 1549414 1356247 1210538
5155 1210538 1214927 1416866 1146234 1228567 1394327 1192634 1396596 1591164 1517935 1385997
5145 1385997 1508246 1213898 1103468 781747 943441 931433 929422 1071772 1205687 1741929
5135 1741929 1380930 1415271 1695949 1620775 1410371 1317869 1547885 1236703 1096121 1006487
5125 1006487 973654 921159 1126379 1665894 1474750 983091 871695 1250518 1096095 1288952
5115 1288952 1377219 1148468 978384 1024624 1091135 1135250 1123470 963241 956653 1399973 1481351
5104 1481351 1253002 1195808 1619874 1545877 1501607 1408490 1378787 1414905 1426155 1273909 1055786
5093 1055786 1225803 995044 1359030 2030727 2013365 1506579 1002661 1379377 1426968 1212591
5083 1212591 948439 1065049 1396279 1092360 1044247 1210349 1167741 1355998 1201397 910812
5073 910812 543103 771583 1144478 1357145 1364398 886928 1086625 869453 868241 921008 1055561
5062 1055561 1070287 1130847 1043398 1192597 885910 1133952 1189375 1120918 1058066 806321 848898
5051 848898 862026 1098729 850867 701741 1043544 1063476 1077245 1115040 941429 1018857 939472
5040 939472 1203744 1265472 1205822 977869 1000489 1173571 1166319 1325161 1136691 940789 1086695
5029 1086695 1551451 1584933 1545222 1060914 885185 1011979 1003977 723406 851183 920616
5019 920616 972077 1245219 963744 827232 871680 1074819 1347373 1326325 1334324 1305934 1201740
5008 1201740 1405078 1425587 1243788 1685169 2157979 2344512 2305549 2026126 1871735 1737423
4998 1737423 1792681 1566950 1338754 1156367 1123829 1057469 1370675 1460468 1557701 1402683
4988 1402683 1253929 1204965 1310462 1043935 874823 917290 1090666 1220658 973887 1067327
4978 1067327 1312658 1195406 649222 772346 970779 583912 691674 1058133 1415879 1038856
4968 1038856 839501 679826 719315 911650 903705 955757 1158477 963960 1241507 995093
4958 995093 891334 678217 709222 1208711 754762 878492 877597 899224 972045 780683 346491
4947 346491 771672 808300 694330 821827 1093064 675015 789230 656985 915840 985479
4937 985479 733089 1065345 592256 314462 559860 917324 826484 842219 661234 892358
4927 892358 621111 668541 1010227 783151 284501 253690 516773 568672 1020557 1012494 760506
4916 760506 861365 934013 700082 377530 404082 712316 834725 843160 980402 986304 1035919
4905 1035919 838099 1066753 1146681 1379276 953018 787156 1167406 1046935 871055 463461
4895 463461 698755 1141956 1040920 1002475 1017626 635857 1000020 682961 846328 1025545
4885 1025545 927913 865891 962900 1135431 818128 608227 948506 979708 836229 685378
4875 685378 832059 1140784 910911 1009750 944335 998181 1179163 1358444 970325 1037735
4865 1037735 1360667 1297520 1345494 1145284 1271690 1249315 1251818 1284649 1163269 1273183 1316439
4854 1316439 1306679 1334750 1759603 1887718 1356761 1551776 1699092 2194884 2019893 1445028
4844 1445028 1517407 2090168 1916865 1684115 1955545 1670222 1768581 1785928 1847936 1537476
4834 1537476 1771147 1865041 1768777 1933744 1700129 1994283 1625684 1556083 1653452 1695193
4824 1695193 1952094 1619644 1394531 1154133 923020 1387699 1477563 1511176 1424415 1709625
4814 1709625 1582233 1419777 1092127 992670 906677 730252 968241 1088583 1124256 910247
4804 910247 1161728 1170529 1053532 799484 1525451 1464346 1237919 1546322 1423630 1615172
4794 1615172 1498093 1181131 1210393 1414311 1336979 1411884 1225578 1247429 1675654 1596154
4784 1596154 1608501 1624418 1781793 1736656 1825176 1700866 1753448 1904408 1943273 1962097 1946789
4773 1946789 1999106 1744508 1534514 2036120 2017233 1908995 1919775 1956832 1712060 1714359 1901486
4762 1901486 1561338 1609779 1720265 1589046 1742259 1972598 2237885 2149261 2284742 1999130
4752 1999130 2131310 2365073 2376387 2832059 2909659 2602478 2633053 2840987 2519475 2782550
4742 2782550 2974337 2678706 2549732 2439561 2378936 2575721 2855767 2935291 3267684 3562075
4732 3562075 3411930 3305106 3471903 3954382 4027009 4158060 4373192 4742513 5348274 5545066
4722 5545066 5855472 6192291 6928371 7359043 7628339 7978844 8019195 8082642 7773508 7478878
4712 7478878 7246658 6815067 6613443 6079654 5341512 5082255 5001120 4546411 4419956 4421753
4702 4421753 3989647 3599255 3306163 3112876 2954574 3368254 3518978 3545843 4038895 4038436
4692 4038436 3363297 3408056 3630436 3501689 3388892 3145873 2988556 3238231 3288852 3090371
4682 3090371 3172960 3024755 3253332 3194253 2953098 3348737 3141875 2842293 2974532 3268229
4672 3268229 3207957 3418782 3390354 3208224 3237667 3488001 3060406 3373925 3071540 3181116
4662 3181116 3035100 2973482 3211685 3275413 3271865 3501830 3870105 3827890 3929801 3659218
4652 3659218 3729436 3739096 3798323 3363416 3551331 3810684 3887004 4128646 4006799 3954543 4113494
4641 4113494 4071968 3866560 4180398 4091884 3731487 3899709 3981585 4308362 4630439 4900981
4631 4900981 4816469 5147530 5414545 5488471 5468026 5681988 5619004 5527883 5436405 5602533 5913423
4620 5913423 6119013 6181547 5862020 5733063 5894603 6252854 5970145 6222130 6372200 5902754
4610 5902754 5945923 6289949 6529505 6664184 6875483 6893509 7491194 7729246 7923790 7901970
4600 7901970 7730259 7762570 7863791 7814988 7855362 8186121 8423472 8538318 8362983 8981915
4590 8981915 9074397 9198474 9152736 9476872 10114974 10509864 10667165 10606909 10913061 11029844
4580 11029844 11068614 10990581 11469705 12236644 12708809 13111522 13576774 13748064 13791831 14200035
4570 14200035 14164968 14681342 15369465 15861016 16330955 16503593 16664757 17198576 17812546 18113502
4560 18113502 19523190 20660990 21126639 21814427 22188418 23218191 24296569 25075092 26131150
4551 26131150 27020452 28066307 29712776 31149079 32318991 34044281 35855134 37806776
4543 37806776 40098651 42624317 44948954 47599939 51084500 54937344 58160885 61996254
4535 61996254 66209214 70429452 75285751 80786023 86397066 92133388 97627809 103549372
4527 103549372 109201325 114343292 119242932 123667448 127524321 130957411 133914624 135430595
4519 135430595 135942445 134388589 131282687 127302584 121925417 116423437 110638575 104276152
4511 104276152 97821318 91501755 85121600 78618279 72707725 66961973 61709097 57014825
4503 57014825 53106988 49016353 45657842 42653898 40024935 37941567 35646007 33745278
4495 33745278 31829437 30470520 29424018 27935252 26699799 25857903 24448064 23507841
4487 23507841 22538477 21859879 21231300 20510807 19775710 19252322 18636816 18069130 17479378
4478 17479378 17106509 16712235 15874222 15698673 15273692 14582444 14048490 13821863 13072383
4469 13072383 12617237 12514379 12402808 12209255 12051197 11859597 11451577 11224482 11276820 11097830
4459 11097830 10558322 9868657 9620390 9298598 8791432 8769431 8987144 8806660 8501878 8363234
4449 8363234 8136242 8322539 8616170 8368538 7823137 7591197 7853161 8008549 8052278 7896154
4439 7896154 6981663 6998949 7247624 6991627 6639350 6377014 6488750 6477493 6450739 6279203
4429 6279203 6139416 6012345 6006044 5903691 5800546 5641630 5737470 5486254 5447451 5413933
4419 5413933 5469699 5388122 5431542 5200501 4964418 4720056 4386711 4864114 4799620 4478957
4409 4478957 4360869 4535023 4553962 4795585 4480162 4121404 4709839 4965007 4828419 4616933
4399 4616933 4345446 3999040 4053258 4100968 4104498 3835982 4099596 4321020 3994087 4015606
4389 4015606 4073861 4036943 3866543 4086652 4008845 3800782 3793723 3686132 3567058 3436671
4379 3436671 3545583 3722890 3324810 3440291 3241342 2964440 2745011 2762763 3013615 2938378
4369 2938378 2985851 2787685 2933027 2949179 3033239 3113283 3000779 2920640 2952607 2922321 2699317
4358 2699317 2527582 2592111 2650109 2581115 2535570 2699949 2654612 2557198 2351981 2067868 2034403
4347 2034403 2335947 2514813 2098408 2160528 2058117 1949132 2014503 2225742 2661587 2565818
4337 2565818 2266184 2471703 2434578 2617085 2806831 2449914 1756087 1645574 1634075 1663955
4327 1663955 1871503 2115584 1992238 1589468 1998123 1983600 1794791 1654863 1744515 1566693
4317 1566693 1586049 2062169 1937905 1609186 1374805 1553434 1684644 1360872 1369551 1663561
4307 1663561 1230251 1322760 1435400 1390076 1285299 1696846 1993713 1921025 2142792 2222483
4297 2222483 1814457 1572145 1779995 1692222 1828625 1983732 1975351 1750231 1801337 1811951
4287 1811951 1579309 1746072 1635743 1699800 1843047 2169731 2356715 1760980 1480320 1647575
4277 1647575 1498492 1567914 1538358 1540521 1718211 1686473 1812677 1701752 1394840 1670190
4267 1670190 2374471 2003036 1519811 1723778 2009422 2248681 1840371 1734207 1709398 1624097
4257 1624097 1815856 1839644 1930907 1920203 2036949 1364274 1895837 1863069 1084279 1292538
4247 1292538 1698150 1878773 2067922 1762026 1396622 1681799 1710186 1791968 2206367 2161503
4237 2161503 1864905 1996011 1982990 1917826 1963940 1972727 2235353 1976836 1962287 1915284 1864176
4226 1864176 1952375 2177642 2439031 2412252 2160415 2195275 2089099 1984874 2270333 2161211
4216 2161211 1941029 2131496 1993100 1795664 2087660 2500319 2543911 2389184 2436385 2424829
4206 2424829 2257694 2275971 2209107 2490541 2666699 2681655 2722111 2431925 2603589 2651598
4196 2651598 2723854 3004077 2915386 2454481 2477353 2517994 2647737 2307530 1977722 2264415
4186 2264415 2121736 2520498 2709202 2243072 2506274 2219074 2268857 2454915 2400492 2527423
4176 2527423 2879929 2396723 2267670 2235444 2404869 2311262 2340810 2418489 1937557 1876254
4166 1876254 1797881 1915489 2034400 2328229 2528259 2507470 2426535 2373192 2611574 2573060
4156 2573060 2540665 2485864 2313095 2706814 2840829 2520181 2565226 2479301 2748999 3086414
4146 3086414 3311998 2672985 2525506 2601444 2636834 2972266 2628698 2595351 2636696 2425527
4136 2425527 2814137 2661813 1806080 1974643 1994841 1941969 1787616 2109741 1981926 2230689
4126 2230689 2248302 1963796 2299910 2288165 1859025 1992166 1778932 1801580 1642044 1591149
4116 1591149 1648300 1895329 2377459 2223646 2285272 2423205 2285332 1957771 2275342 2285061
4106 2285061 1981246 1709379 1991623 2340334 2293171 1686511 1798977 1958632 1828648 1867528
4096 1867528 1932705 2065894 2471768 2457954 2191191 2289806 2297658 2261562 2343193 2608425 2304095
4085 2304095 2561755 2450526 2207413 2476594 2817649 3014136 3018517 2866953 2939637 2845066
4075 2845066 2989181 2760691 3016629 3105975 3135860 3081229 2942282 3078542 2623997 2745198
4065 2745198 2813482 2910047 2678589 2513520 2487661 2670570 2668965 2561995 2723980 2601568
4055 2601568 2864859 2497390 2816154 3044319 3341244 3115498 2851424 3119774 2837897 2659616
4045 2659616 2581643 3074961 3312520 3348429 2687674 2474269 2255390 2735710 3285854 3044336
4035 3044336 2706063 2544109 2494558 2942724 2956196 2796802 3032947 3070947 3132791 3238474
4025 3238474 2882871 2899095 2899205 2774347 2994265 3120265 3288636 3503559 3592257 3558752 3367958
4014 3367958 3086760 2921604 3026226 3176208 3182226 3326179 3514486 3300535 3269296 3612668
4004 3612668 3747320 3512690 3386757 3379119 3456591 3422736 3739499 3821334 3914619 3941733 4113499
3993 4113499 3989846 4102416 4339721 4144973 4381361 4342926 4129021 4326135 4376400 4319030
3983 4319030 4342137 4224671 4446817 4492705 4661484 4245736 4681648 4517909 4534697 4824075
3973 4824075 4932787 4740788 4862371 4990018 4571541 4443282 4569504 4115176 4213957 4672490
3963 4672490 4562430 4805337 4957791 4933817 4477431 4573604 4968281 5155041 4930685 5145930
3953 5145930 5542172 5509247 5655379 5671949 5571021 5685682 5777984 5501374 5661702 5393787
3943 5393787 5603373 5885184 5985731 6310585 5972214 6067516 5931773 5785827 5901243 6062475
3933 6062475 6294495 6517052 6514460 6739687 6724382 6371293 6528431 6440726 6236244 6572751
3923 6572751 6929672 7069839 6919940 6585655 6885841 6982097 7285192 7721607 7589275 7840504
3913 7840504 7715324 7774638 8175406 8090373 8722930 9119113 8930672 9154112 9180702 9348615
3903 9348615 9369449 9469340 9113858 9442183 9869347 9695627 9855623 9835464 10051433 10436468
3893 10436468 10605834 10320526 10061403 10307408 11006399 11042900 10800383 10988786 11236520 11600526
3883 11600526 12237269 12434029 12642359 12980089 13194892 13469045 13524222 13833333 13683601 14087592
3873 14087592 14400480 14471063 14462741 14592894 15279778 15562614 15764553 15979166 16439428 16758713
3863 16758713 17212813 17657790 17578226 18156592 19095340 19334198 19757675 20194097 20601237 21606524
3853 21606524 22266978 22717613 23445376 23587072 24489834 25517710 26132925 26932964 27940300
3844 27940300 29072381 30096127 31121483 32331403 33889423 35643993 37521740 38620859
3836 38620859 40346444 42558236 44621187 46550623 49028976 51688613 54224224 57304697
3828 57304697 60639158 64455316 68320233 73066223 78775598 84626846 91381100 99368043
3820 99368043 109051671 120421061 132866893 146698201 160966417 174294168 184752211
3813 184752211 190943504 191122334 184139541 172255517 157172919 141069131 126057144 112453216
3805 112453216 101353357 92481714 84743236 78512906 73281797 68772006 65086299 61692767
3797 61692767 58941132 56838875 54868748 53377600 52379626 51149226 50348233 49620649 49128012
3788 49128012 49055108 48453463 48357590 48616519 48742088 48843110 49228701 49267736 49535095 50268168
3778 50268168 50774091 51366491 52342308 53586344 54531419 55433695 56777116 58301257 60200525
3769 60200525 61998604 63653648 65978246 68346457 71149576 73945955 76426847 78992912
3761 78992912 81798051 84911784 88465420 92360963 96242543 100901456 106217155 111925696
3753 111925696 118838610 127091181 136583686 147297247 159262180 172342540 186649716
3746 186649716 200615246 212892404 222473418 227338405 226260098 220041841 209550776 196456937
3738 196456937 182408691 169034046 157186632 147431336 139963530 134306999 130472832 127805432
3730 127805432 126562084 126319482 126701708 127277582 128182775 129093838 129417521 129059996 127566973
3721 127566973 125674482 122927686 120267277 117456484 114388782 112586332 111629906 111121136
3713 111121136 111037785 111971846 113530992 115296247 117505836 120084858 122516626 124655880
3705 124655880 126512363 128161614 128656467 128016406 126443215 124299358 121690355 118789590
3697 118789590 115522869 112842871 110317061 107349884 105107858 103887653 103075305 102775242
3689 102775242 102846905 103576592 104555685 105224738 106070376 107317919 108847606 109440050 110293104
3680 110293104 111220865 111425238 111173196 111141378 110705066 109643681 108658674 108031393 106215873
3671 106215873 104735757 103091548 101708082 100787750 99440436 98063554 96663239 95669576
3663 95669576 94081605 93076247 92693322 91967819 90996208 89836744 88448423 87275213 85938161
3654 85938161 84073449 81914925 80153550 78128617 75705066 73550151 71754487 69932928
3646 69932928 68223420 66478619 64379448 62397146 61387954 60114053 58508062 57016700
3638 57016700 55592708 54365699 53329311 52311533 51307648 50207339 49212567 47812683
3630 47812683 46887748 45806983 44547753 43739596 42759258 41902343 40850935 39959226 38937606
3621 38937606 38536869 37935476 36841015 35974036 35109488 33819182 32692746 31817485 31194865
3612 31194865 30497281 29434279 28608899 27650818 26531560 25731421 25305899 24579655 23740758
3603 23740758 23099336 22851959 22592819 21613002 21095774 20804243 20378231 20126918 19839239
3594 19839239 19471113 19198871 18844115 18644237 18379270 18119038 17743749 17179540 17192112 17167993
3584 17167993 16877015 16584345 16204658 16275079 15889595 15718978 15624088 15117071 15113796 15232947
3574 15232947 15568615 15559970 15187309 15117968 15178693 15242501 15455233 15122135 14818744 15100627
3564 15100627 15269082 14977755 14794527 14431446 14321212 14060330 14270603 14263962 14299327 14543857
3554 14543857 14255319 14442511 14820327 14912071 14613063 14648042 14589870 14546696 14851016 14772319
3544 14772319 14520896 14589197 14970995 15280072 15317441 15571778 15675823 15538403 15166416 15496677
3534 15496677 16057755 16197889 16152039 16441505 16446096 16487693 16835251 16805409 16865669 17094298
3524 17094298 17343713 17380435 17475145 17368622 17555950 17502990 17779646 18253739 18836157 19453519
3514 19453519 19874726 19987530 19683471 19798625 20095067 20073041 20780325 21132819 21157452 21642477
3504 21642477 22115927 22664815 23250638 23941113 24354712 24971703 25806855 26255230 26616711
3495 26616711 27217788 27979094 28943275 29626433 30666190 31520006 32145448 32849753 34054563
3486 34054563 35230441 36607339 37694095 38960233 40755637 42347552 43880142 45918351
3478 45918351 48202245 50162563 52076261 54408620 56665829 59899514 63425363 66638291
3470 66638291 70140230 74013293 77921025 82519646 88092910 93592947 99479103 106006462
3462 106006462 113693725 122382752 131904270 142412880 154604277 168224424 183704960
3455 183704960 200594990 218052114 234487043 248697646 259227315 263593139 259712584
3448 259712584 249165910 233316260 214380331 194226524 174930123 157593180 142219039
3441 142219039 129148428 117620849 108041272 98984390 91754777 85482883 79911049 74996348
3433 74996348 70792796 66823374 63038963 59563058 56978614 54584793 52350714 50183096
3425 50183096 48316178 46659648 44861613 43283942 42105142 40992183 39863269 38685938
3417 38685938 37308731 35932548 34209279 33414797 32347163 31715291 30643429 29977603 28878303
3408 28878303 28343239 27389636 26452925 25892195 25508826 24798460 24088715 24025003 23530062 23098739
3398 23098739 22734355 22575087 21770201 21766103 21830341 20900739 20259924 19921234 19404732 18993567
3388 18993567 18187291 17661038 17403303 17259700 16924828 16496929 16321442 15849264 15503819
3379 15503819 14968517 14791039 14953770 14680603 14259182 13957817 14033367 13671094 13363901 13481267
3369 13481267 13354705 12959348 12389891 12368485 12311145 12337094 12104020 11860693 11170479 11029855
3359 11029855 10925267 10891369 10162714 10195117 10344227 10069847 10154040 10205668 10289698 9833263
3349 9833263 9482464 9823647 9832227 9588799 9695314 9304760 9549323 8982413 9104521 9612960
3339 9612960 9730988 9369472 9256924 8869850 8633967 8274698 8142742 8329302 8398393 8402625
3329 8402625 8341938 8092105 7788150 7320764 7469384 7813584 7850353 7536795 7414646 7314459
3319 7314459 7474221 7477001 7154972 7254887 7465944 7410833 7440730 7429408 7461884 7166957 6774697
3308 6774697 7058913 7221466 7398718 7464561 7247785 7288341 6995825 7024652 7209777 6894484
3298 6894484 7173953 7180176 6652656 6720625 6556305 6563111 6214973 5812345 5709823 5948715
3288 5948715 5664493 5202489 5284803 5416440 5802386 5516451 5609231 5519401 5440424 5515889
3278 5515889 5674356 5618369 5434677 5381898 5499195 5304747 5667869 5690301 5470044 5799169
3268 5799169 5732867 5074424 4883856 5001450 5347898 5186318 5234357 5063260 5223527 5242442
3258 5242442 5148282 5175918 5221211 5171331 5149612 5748343 5980647 5561033 5511162 5597021 4971071
3247 4971071 4895143 5062544 5037098 5123101 4947102 4937904 5351626 5270423 4616344 4537921 5068967
3236 5068967 5327594 5425464 5163602 5103867 5096882 5059964 4803029 5138075 5537697 5216874
3226 5216874 5010367 5309325 5672550 5975238 6111505 5798000 5634518 6100000 6252728 6141342
3216 6141342 6227480 6145888 6260667 6223786 6415859 6605002 6146597 5971332 5946753 5844845
3206 5844845 5556576 5460225 5138619 5300152 5296586 5249798 5445798 5168100 5501340 5503612 5581709
3195 5581709 5589321 5487571 5554289 5457395 5692565 6165742 5965751 5707787 5304169 5205702
3185 5205702 5198741 5511421 5193163 4984573 5351824 5302098 5522234 5587344 5634021 5415743
3175 5415743 5072021 5378444 5267186 5281827 5065568 5028976 5280271 5362205 5564169 5669337
3165 5669337 5581376 5504641 5666756 5597209 5293995 5210761 5295446 5243523 5225359 5104886 5431833
3154 5431833 5530077 5729096 5834966 5582820 5574983 5895834 5987201 5866789 5686405 5887534
3144 5887534 5906125 6223729 6158896 6218096 6488079 6642499 6488961 6536212 6823262 6944859
3134 6944859 6656365 6574315 6372059 6340649 6803577 7145764 7624993 7933925 7674075 7486295
3124 7486295 7294146 7294071 7568874 7451487 7399668 7531780 7525124 7579164 7538512 7449285 7433295
3113 7433295 7299209 7272098 7250578 7168097 7128676 7054933 7334087 7217896 7033824 6881358
3103 6881358 7076233 7229125 7162078 7454072 7205803 7312977 7569915 7606798 7817509 7876187
3093 7876187 7557658 7529688 7799891 7802753 7088203 7293174 7850524 8184860 8069880 7821424
3083 7821424 8043794 8209910 8325649 8329640 8807989 8925090 8751832 9020713 8868789 8804746
3073 8804746 9143892 9317081 9592084 9595202 9476754 9568814 9650450 10140205 10248147 10479154
3063 10479154 10425868 10254145 10463738 10406466 10295708 10478846 11154919 11485411 11802624 12055132
3053 12055132 11608420 11766456 11786520 11467362 11741430 12088492 11881525 11945865 12295815 12551556
3043 12551556 12451675 12263123 12475707 12920185 12966964 12681897 12907194 13153723 13334341 13197081
3033 13197081 13055455 13004056 12943086 13502093 13523550 13630725 13961035 14098427 13932979 14179653
3023 14179653 14205363 14141522 13888857 13747814 14170398 14355865 14117299 14631648 14784900 14846159
3013 14846159 15189311 15417586 15948952 15995232 16276191 16229526 16434075 16963653 17087920 16766264
3003 16766264 17151191 17588774 17909745 18460798 19086061 19391444 19584500 20125915 20583473
2994 20583473 21048408 21140254 21414456 22433491 23118137 23883385 24581399 25043911 25767803
2985 25767803 26412732 26501622 27183526 28484817 29263310 29951162 30874504 31995243 32831339
2976 32831339 33324858 33809096 34549782 35088418 36148294 37139085 37704440 38524509 39257639
2967 39257639 40318256 41204438 42410778 43478919 44592551 46215589 47531608 48798635
2959 48798635 49808846 50275899 50464222 50762724 51440700 51938712 52018792 52206135 53025181
2950 53025181 53489899 54433508 55393604 56349848 57221291 57799225 58038182 57728352 57767834 57278364
2940 57278364 56367271 55930804 55069566 54628662 54324878 53994395 53508821 53571393 53431637 53586620
2930 53586620 53508052 52862452 52244034 51251448 50550720 49514189 48212375 46647630 45501153
2921 45501153 44640100 44006983 43335368 42605368 41986284 41405819 40801796 40284926 39630514
2912 39630514 39012429 38270465 37653571 36788018 35956755 35037694 34325190 33535871 32934027
2903 32934027 32194926 31833070 31406959 31069438 31230044 30851199 30504757 30124530 29645526
2894 29645526 29313847 29176834 28888646 28118193 27701964 27773961 27781383 27848476 27519031 27392976
2884 27392976 27117415 26569873 26174610 26409723 26056255 26037721 25797405 25458182 25529105 25511348
2874 25511348 25450837 25403491 25255713 24858413 24724547 24407302 24006690 23612178 23986448 24037511
2864 24037511 24028164 23432301 23429865 23541213 23260692 23034745 22717658 23102613 23146680 22741386
2854 22741386 22457303 22439661 22375745 21905588 21843703 21438197 21106257 21387508 21189867 21006897
2844 21006897 20486987 20950013 20875082 20372371 19834769 19701625 20200352 19997399 19664494 19427038
2834 19427038 19325641 19034256 18727803 18465811 18548135 18320651 18334845 18349537 18166441 18064295
2824 18064295 17968281 17878536 17995350 17902109 17763136 17282833 17095328 17046897 16853716 16960708
2814 16960708 16784456 16442143 16618421 16605768 16316404 15874113 15889625 15586976 15615524 15773578
2804 15773578 15494483 15728248 15333669 14935381 15163443 15273474 15257917 15113661 14775996 14916749
2794 14916749 14916549 14889010 14930709 14621821 14318019 14004761 14239370 14536722 14459409 14202632
2784 14202632 14167642 13974429 14386060 14567309 14460763 14408780 14697883 15068505 15008341 14850144
2774 14850144 14413587 14897232 15362294 15534788 15748772 15932801 15988591 16049103 15840453 15948394
2764 15948394 15797459 16148205 15917470 15905674 15887653 15025090 14895848 15268530 15412783 15148947
2754 15148947 14692917 14827717 14886804 15073872 15032940 14268809 14231174 14163672 14225677 14291689
2744 14291689 13930438 13422227 12904454 12710484 12601720 12630808 12254055 11930746 12080769 12103863
2734 12103863 12114961 12285893 11407425 11323147 11478143 11382367 11409542 11553754 11378107 11176460
2724 11176460 11337289 11189416 10886809 10951667 10776861 10457725 10598342 10573921 10338481 10434312
2714 10434312 10478755 10331363 10477067 10675362 10623556 10651686 10644967 10414551 10649442 10866906
2704 10866906 10705563 10466473 10345294 10691005 10495540 10429684 10422484 10400141 10332359 10192225
2694 10192225 10314232 9956578 10388498 10478891 10359379 10423164 10656897 10602530 10659351 10727067
2684 10727067 10995051 10868164 10817503 10636703 11127843 11366411 11150598 11377106 11129745 10723087
2674 10723087 10518259 11015425 11318821 11047618 10906249 11187485 11272479 11535542 11731471 11475610
2664 11475610 11202839 11217000 11449463 11305831 11249031 11122196 11295201 11612474 11587128 11582070
2654 11582070 11881872 11739046 11793970 11559675 11468392 11657720 11410502 11772354 12193894 12365431
2644 12365431 12354477 12266253 12309016 12253772 12460658 13056712 13394403 13235016 13361086 13495646
2634 13495646 13328642 13455173 13657458 14009614 14114512 14246586 14469573 14405080 14867883 14914853
2624 14914853 14960344 15233170 15439722 15770100 15977822 15962638 15951531 16224618 16787551 17416287
2614 17416287 17379999 17285391 17294653 17765898 18166155 18670343 18910876 19063963 19182566 19780975
2604 19780975 20496258 21127083 21944767 22092378 22472017 22196338 22557178 23096721 23457644
2595 23457644 24116215 24836080 25530380 26130849 26863083 27559284 28455924 29631148 30222866
2586 30222866 30549915 31602968 32767673 33810417 34665307 35729512 37125692 38835892
2578 38835892 39946920 41166226 42894441 44398895 45969706 47367295 48550478 50509206
2570 50509206 52650440 54935911 57366053 59751446 62680329 65706983 68703281 72251580
2562 72251580 76453709 80795612 85242794 89702588 94588513 99724710 104088703 108167074
2554 108167074 112190092 115439182 117892583 119730872 120730642 121118490 120845702 120648173 119728676
2545 119728676 119011316 118500730 117656279 117079684 116262583 115396648 114722066 113794865 112523507
2536 112523507 110269510 107654586 105017628 101017858 96619857 92281271 88070276 83515486
2528 83515486 78723650 74310586 69682936 65208623 61429890 58046732 54885815 52099307
2520 52099307 49551207 47156206 45309876 43933234 42131593 40746922 39232215 38248335
2512 38248335 37153730 36012917 35049339 34240524 33507248 32564301 31713268 31078064 30548221
2503 30548221 29918464 29390628 28677105 28049015 27791833 27477657 26935148 26350093 25869140
2494 25869140 25827163 25379699 25060867 25009645 24313687 24157917 23765690 23516168 23272860 23414251
2484 23414251 23117660 22689221 22877235 22616769 22476425 22412245 22224976 22013447 22004742 21842043
2474 21842043 21754812 21569157 21841354 21799264 21713183 21535497 21533611 21724033 22013858 21866955
2464 21866955 21803363 21767306 21817997 21901611 22290917 22178005 22324083 22215413 22426544 22863983
2454 22863983 22910844 23007734 23405625 23709044 23734128 23574260 23504272 23874992 24782999 24962958
2444 24962958 25427451 25723604 25940646 26572526 27024127 27042819 27394798 28193757 29330972
2435 29330972 30476314 31244831 32078598 33128357 33789925 34740911 35856091 36229790 37216558
2426 37216558 37834770 38691753 39452119 39792947 40305193 40271530 40478762 40880219 41058836 40943899
2416 40943899 40656617 40515197 40316757 40655057 40966157 41089851 40910619 41220463 41900823
2407 41900823 42636182 43014854 44166865 44854752 45605803 46556537 47623366 48962478 50114555
2398 50114555 51484875 53097461 54622349 56126619 58041741 60345564 63031961 65505760
2390 65505760 67591198 70527611 73335166 76732670 80014472 83512962 87928406 92489360
2382 92489360 97724410 103333545 109227814 115757391 122900486 131194410 139975018 148997876
2374 148997876 159092499 169370755 180147735 191041829 201482692 211278141 219868424
2367 219868424 227539515 233586940 238334702 241357509 242604397 242384986 240743438 237481997
2359 237481997 232675184 227117600 220649076 213419079 205446268 197702675 189065649 180119151
2351 180119151 171444212 162432659 153726649 144892253 136369957 127962447 120336483 113223649
2343 113223649 106385142 99896955 94002799 88342035 83593878 79942151 75819611 72268925
2335 72268925 69139856 66087237 63342724 61216614 58924108 57226804 55081430 53299471
2327 53299471 52017824 51218710 50212891 48712754 47607108 46491753 45593000 44740726 43959915
2318 43959915 43603444 43320686 42961958 42590475 42373024 41940226 41647025 41797420 42018748
2309 42018748 41792207 41400526 41755923 42237300 42474061 42953339 43393298 43505221 43411411 43250263
2299 43250263 43226901 43344751 43495944 43799288 43759898 43059695 42752287 41588524 40709349 40211485
2289 40211485 39838076 39614466 38472009 37797601 37332065 37227602 36884897 36244096 36425029
2280 36425029 36591461 36167668 35767584 35698799 35550900 35585260 35661202 35728915 35948335 36021105
2270 36021105 36009304 36355319 36507808 37306731 38236154 38875072 39449651 39983313 40781347 41751167
2260 41751167 42519369 43596696 44570484 45403154 46499793 47485829 47995133 48816291 49434158
2251 49434158 49776782 50187792 50572989 51026866 51018771 51370276 51264674 51333495 51760193 51798885
2241 51798885 51690678 51466090 51637367 52269993 52404465 52146396 51724644 51356900 51141166
2232 51141166 50681104 50305700 50254600 49851335 49608489 49246374 49165617 49253135 49242846 49199806
2222 49199806 49516006 50089626 50749766 51511285 52178679 52566937 53348241 54739511 56120027
2213 56120027 57373769 59076575 60555701 62331056 64572593 67014649 69229442 71726370
2205 71726370 74628952 78220943 81744065 85402787 89681382 93593002 97849806 101804325
2197 101804325 105797592 109981468 113731681 117409354 120849231 123884438 126155456 128167733
2189 128167733 130427034 131799447 132936386 133701058 134705076 135633917 136889480 137727932
2181 137727932 138515026 139344694 140232380 140919085 141789483 142217879 142132677 142275010 142199722 141840855
2171 141840855 141224566 140966076 140320179 139504553 139184752 139038132 138669567 137844302 136909691
2162 136909691 136008180 135387966 134590455 133525335 132108271 130832549 129343543 128117061
2154 128117061 126950278 125427172 123367248 121374278 119396118 117476197 115205143 112303852
2146 112303852 108879691 105932207 102496896 99047625 95402269 91290346 87267242 83238472
2138 83238472 79443547 75592828 72024661 68667611 65991392 62890790 60144801 58023543
2130 58023543 56057552 53882927 52069784 50679965 49063292 47927891 47111047 45781434
2122 45781434 45068880 44454023 44315768 43906849 43584351 43205555 43114634 43202385 43568687 43810644
2112 43810644 44126975 44445567 44324996 44535152 45335592 45684635 46057239 46511410 47162094
2103 47162094 47765510 47946958 47979263 47850439 47882486 48557691 48406738 48217730 48252973 47924002
2093 47924002 47700420 47572573 47181220 46749163 46828553 46348499 45872754 44847264 43758516
2084 43758516 42870794 41602059 41181000 40404999 39491010 38557835 37441500 36211949 35776737
2075 35776737 35260773 34638927 34239464 33678691 33979011 33585122 33093547 32835088 32490583
2066 32490583 32126013 31520108 31534959 31294161 31078121 31160762 30745144 30458539 30654526 30752662
2056 30752662 30273376 30453010 30180329 30224111 29865097 29858839 30098462 30228097 30064228 30232699
2046 30232699 30252829 30448891 31028504 31336477 31615152 31861780 32091033 32290607 32870529 34024814
2036 34024814 34437249 35095011 36059824 36869075 37416181 38020599 39510725 41003855 42135470
2027 42135470 43368243 44368381 46159940 48085169 50261670 52313865 54318248 57229880
2019 57229880 59873194 62546210 65798682 69764376 73294369 77738306 82490348 87365626
2011 87365626 92758155 98113652 103196484 108470817 113778178 118802782 123781761 128397473
2003 128397473 132636873 136796143 139754042 141192635 142158658 142109920 140682462 137866902
1995 137866902 133821557 128859709 123115626 117218560 110677426 103598033 96747411 90097811
1987 90097811 83505674 77515990 71877989 66697301 62334477 58293475 54775643 51452843
1979 51452843 48606226 46184764 43572475 41471087 39637935 37778768 36692394 35801058
1971 35801058 34195553 32742393 31433099 30288451 29493620 28755712 27754265 26762868 26213756
1962 26213756 25525155 25057703 24761783 24129775 23543876 23105978 22309856 21431524 21226704
1953 21226704 21197100 20619598 20200115 20010543 19667591 19441304 19178259 18999479 18635484 18241030
1943 18241030 18270342 18266280 18244718 18238340 17863497 17762028 17852259 17859538 17565969 17064108 16403812
1932 16403812 16413270 16344184 16064775 16142977 15966124 15548345 15200926 14992797 14773171 14504010
1922 14504010 14316588 14392430 14083813 13982149 13883190 13669794 13261560 13248364 13473326 13415893
1912 13415893 13232719 12690395 12404859 12187167 12484286 12709350 12800000 12472927 12510340 12362964
1902 12362964 12064003 12211415 12115936 11969960 12239475 12289406 12021943 11925135 12087899 12042493
1892 12042493 12140759 12269449 12200875 12018541 12471381 12508088 12686354 12367622 12324199 12562466
1882 12562466 12670621 12532757 12399358 12657621 12308375 12412784 12476796 12802483 12780601 12771645
1872 12771645 12519901 12588208 12436227 12335256 12390428 12385717 12344440 12408399 12595242 13032240
1862 13032240 13144642 13107131 13204700 13128668 12965993 13323664 13601543 13629290 13827542 14192504
1852 14192504 14151276 14215103 14015362 14407311 14461279 14465587 14615041 14613806 14638511 14814357 15710856
1841 15710856 15684011 15544758 15819426 16041309 16517643 16811970 16943244 17326394 17461957 17518081
1831 17518081 17833045 18158266 18880391 19178770 19682748 19890516 20271569 20837461 21416343
1822 21416343 22132325 22726502 23484893 23797311 24265385 24587736 25173309 25897784 26942198
1813 26942198 27354129 27836182 28636380 29421735 30477788 31418775 32964509 34026412 35470799
1804 35470799 36739108 38119962 39308551 40909699 42634005 44355179 46818948 48530996
1796 48530996 49917350 50881028 51910957 52176090 51920575 51126805 50610807 49743872 48908941
1787 48908941 48892078 48641641 48287774 47849435 47618772 47461458 47540269 48227494 48236852 48521262
1777 48521262 48708149 48971973 49141893 49787280 50320326 50715978 51145436 51484007 52361023
1768 52361023 53287096 53761578 54476460 55336845 55918471 56872238 57395756 57985818 58569561
1759 58569561 59438058 60455516 61639275 62619684 64200497 65834726 67670942 69469414
1751 69469414 71424608 73797566 76117043 78657627 81269920 84443172 87736680 91419036
1743 91419036 95512913 99417529 103670177 108456338 113306412 118330953 123821317 129870165
1735 129870165 136427084 143460118 150765542 159138319 168137890 178245983 188608047 200351628
1727 200351628 212787900 227046695 242344253 258907930 277953067 299357485 323650824
1720 323650824 350573575 380658335 412629789 445961005 478080540 504794340 522799622
1713 522799622 529035400 521289634 500986218 469661410 432138037 393155131 355607488
1706 355607488 321239352 290777319 264111980 240972987 221103719 203671056 187962653
1699 187962653 173667390 161316909 150255349 140332591 131067723 123072048 116326486 109870790
1691 109870790 104685304 99929382 95599391 91145067 87367838 84000148 80901565 78205395
1683 78205395 75348681 72462196 69642919 67241315 64488272 62503552 60270067 57903908
1675 57903908 55692573 53364572 51582864 49925187 48146996 46595283 44818376 43526700
1667 43526700 42282964 41007140 40094927 38777171 37838515 37038246 36010375 35015870 34266193
1658 34266193 33216131 32709340 32018924 31275415 30626745 29892412 29431448 28583567 27648129
1649 27648129 27107630 26600026 25965480 25385435 24958173 24659235 24302177 23990489 23280091
1640 23280091 22970169 22577439 22109961 21757033 21416886 20967138 20639330 19947014 19372793
1631 19372793 19626893 19350414 18745727 18274558 17954342 17396013 16974095 16590405 16366994
1622 16366994 15918411 15804657 15477931 14985629 14972584 14738093 14108571 14082593 13884962 14063344
1612 14063344 13534378 13260628 13321523 13101020 12730398 12612236 12630072 12028385 11795572 11628277
1602 11628277 11603106 11427459 10933504 10647477 10837134 10542060 10044753 10217479 10073436 9786636
1592 9786636 9675041 9760812 9543650 9374435 9541627 9282718 8901567 8502307 8531403 8761742
1582 8761742 8528667 7991421 7919132 7853944 8117856 8003959 8011076 7963318 7583362 7640922 7384091
1571 7384091 6726807 6819886 6944706 7249133 7408085 6652992 6678555 6797586 6855411 6900763
1561 6900763 6564690 6194338 5988353 6150847 6407165 6227839 6152362 6090919 5388859 5216876
1551 5216876 5444648 5857962 5523208 5184943 5214122 5035071 4603525 4919337 4915229 4675648
1541 4675648 4866873 4796616 4785297 4778284 4754174 4708812 4647245 4745630 4649315 4411430 3928717
1530 3928717 4184974 4519211 4227498 4307972 4197312 4042962 4045838 3777468 3750388 3838948
1520 3838948 3888529 3670514 3736202 3712300 3591964 3339764 3434561 3574769 3557688 3725573
1510 3725573 3487540 3368958 3555039 3548443 3583313 3126795 3001483 3139164 3307503 3746611
1500 3746611 3873722 3713618 3575147 3509286 3548677 3793798 2846535 2627539 3114063 3233144
1490 3233144 3368778 3312969 2890061 2995045 2999155 2956603 2969839 2732493 2581853 2762061
1480 2762061 2975798 2495954 2427211 2457501 2845486 2861109 2721952 2552493 2405093 2589158
1470 2589158 3050912 2894027 2335633 2373337 2291799 2709432 2664495 2588686 2118869 2471682
1460 2471682 2555083 2812860 2273599 2231948 2156404 2109426 2385865 2489983 2425584 2362109 2537798
1449 2537798 2225607 2131485 2338206 2493196 2585216 2631857 2584925 2724202 2997881 2929762
1439 2929762 2801939 3010315 2481652 2576280 2652769 2453501 2513095 2807853 2981367 2885477
1429 2885477 3169619 3312432 3018644 3036012 2757987 2747668 3095688 2939347 3265121 3303752
1419 3303752 3139653 3692172 4079655 4146172 4094058 4331346 4321229 4292206 4101144 4121058
1409 4121058 4058687 3951808 3684394 3637544 3624568 3262607 3009724 2814772 2678152 2350182
1399 2350182 2717264 2907351 2303697 2264901 2221312 2128174 2068249 1889988 2077764 2239097
1389 2239097 2159981 1878645 1828506 1862372 2314384 2239067 1688128 1631534 1608062 1448154 1335746
1378 1335746 1537330 1511326 1139230 1509159 1640459 1530241 1137620 1413239 1683660 1507628
1368 1507628 1470230 1705168 1717313 1508348 1726169 1571229 1385750 1262649 1720178 1894092
1358 1894092 2137345 1780967 1517446 1799338 1476727 1325039 1727220 1246323 1296634 1200763
1348 1200763 1411538 1488319 1496116 1548724 1450467 1341118 923363 1279594 1305635 905719 784336
1337 784336 962123 1227901 1185064 1015842 1275990 1123710 882504 833966 868759 832828
1327 832828 925975 1210044 1161936 1164508 922142 968064 1189617 1121405 643274 778298 936141
1316 936141 1164829 1162731 945484 991325 650488 581869 476026 625992 401006 616507
1306 616507 582599 988724 970136 738940 782334 865805 669496 771411 707241 735475 937493
1295 937493 856428 818175 824008 920827 850966 622449 305302 509260 612074 825163 1064251
1284 1064251 1313737 1006949 1111098 1300377 1496678 1249092 1114081 1056520 1097568 1206074
1274 1206074 1375175 1055758 1132482 1302210 1126942 840304 1003069 1063392 696607 748091
1264 748091 533484 678737 794383 1126690 771648 957606 1281512 1216257 950384 727307
1254 727307 809261 1285662 1204276 867016 902217 1252724 1170935 1029786 1043331 805189 889757
1243 889757 1011106 814620 412396 563037 621122 939870 993918 856960 1101667 758611
1233 758611 536694 922317 1104867 707670 666861 384036 443889 888173 863010 646737
1223 646737 365684 408406 684956 314951 485454 544153 414042 805255 827819 314636
1213 314636 438138 1052365 1031012 870421 1078846 1085731 716277 881592 623437 240925
1203 240925 250572 420935 612171 840639 685787 790191 520466 586220 900014 940845
1193 940845 914496 1063347 949515 564710 678508 655585 582231 600992 567636 591534 657158
1182 657158 883570 911584 884585 1007536 955874 877430 1282757 1175498 1206628 1249862 1313740
1171 1313740 1485265 1310309 1306261 1048147 786613 749781 862790 954541 1168905 654115
1161 654115 572456 941830 881495 791187 655754 616288 731776 502705 438029 498804 583593
1150 583593 387155 719336 884451 715944 1027600 1165033 958816 829764 508320 429301
1140 429301 720183 746182 866294 704822 484599 1015094 908952 552668 715135 987959
1130 987959 1227091 1165160 931715 1083410 1386479 746609 581378 738372 1017453 1277203
1120 1277203 1156651 1122385 1323350 865965 728132 677035 621234 1061250 1027183 787189
1110 787189 895504 885619 596146 435680 337827 292223 544798 526553 865742 1296216 1195542
1099 1195542 815710 521838 621529 937085 881523 1047609 981600 854639 911767 878307
1089 878307 652441 604332 1141543 1092813 831538 1027617 1169081 1180712 1588880 1833934
1079 1833934 1369619 1279693 1250188 1285733 1318620 1117679 965295 945008 1074110 1168325 1101730
1068 1101730 1119379 1215598 1495667 1693497 1400567 1533619 1490263 1268934 1287711 1500423
1058 1500423 1479832 1671136 1645873 1389553 1407847 1484948 1675287 1762470 1689709 1413407 1175992
1047 1175992 1674036 1824993 1928341 2210437 2089017 1647109 1405677 1522049 1561740 1537501
1037 1537501 1634124 1931431 1657533 1640063 2263669 2247527 2513740 2653021 2305704 2611015
1027 2611015 2894929 3356203 3212824 2846076 2761616 2533615 2711937 2563607 2771313 2987806
1017 2987806 3259574 2733696 2765540 3050241 3149319 3134864 3361620 3648110 3555427 3584268
1007 3584268 3885029 3961886 4031076 3979235 3770448 3999051 4060974 4494067 5058583 4853529
997 4853529 4804506 4875085 4971267 5308671 5775084 6000517 6112113 6436240 6737911 7118956
987 7118956 7473449 8389645 8934949 9223185 10079027 10720733 10785452 11275385 12249235 13043897
977 13043897 13359309 14273140 15582232 16298994 17349073 18536824 20137499 21564749 23486476
968 23486476 25690472 28737965 32070360 35353901 40081912 45207831 49575807 52865819
960 52865819 54694986 54008163 51560526 47058652 41841294 36407484 31723484 27580375
952 27580375 24292769 21741874 19751371 17671748 16392352 15030255 14320659 13316448
944 13316448 12566070 11797038 10673777 10119525 9270054 8679076 8470315 8102015 7321414
935 7321414 7053906 6798229 6568178 6380479 5952678 6096838 5826588 5474923 5316424 4992646
925 4992646 4770713 4552926 4178941 4209767 4275785 3536002 3117573 3396512 3864003 3817899
915 3817899 3461187 3231228 2720727 2851059 3167978 3195816 3165534 3163272 3273707 3013681
905 3013681 3044683 3072526 2992664 2447907 2182446 2357590 2453904 2528690 2526712 2119307 2018877
894 2018877 2047646 2235077 2256638 1760005 2037075 1976218 1843204 2007025 1749377 2040273
884 2040273 1955345 1730023 1695822 1425732 1398618 1454717 1713090 1512362 1270785 1606967
874 1606967 1386811 1657195 1396172 1280534 1607033 1221203 953106 966860 1138842 997846
864 997846 695253 1040765 1099159 1336529 1131575 1340702 920341 702636 679862 582542
854 582542 496687 795708 1077012 959022 779737 619227 907256 805223 826576 709299
844 709299 196300 418330 783808 1086114 1381878 898479 789085 573032 349613 523346
834 523346 751676 763819 793208 701695 625436 1092163 1024607 1031993 1011488 856143 661536
823 661536 380079 302193 434628 347340 679712 621798 354296 704384 827088 649530
813 649530 346664 385475 285123 303490 -24378 108950 405064 597573 723052 497812
803 497812 279837 609571 567490 345866 312486 -53042 3330 219614 81197 479462
793 479462 311192 523773 368250 60328 -20654 80558 27428 75941 -36922 -26796 -51783
782 -51783 -23899 -92818 437548 487328 474071 462254 -75862 29533 -107046 28131 -30586
771 -30586 68515 249103 266932 -851 -223247 61866 271553 564735 527047 736507 399664
760 399664 172109 292753 -171943 -259933 -394546 64442 260570 338152 268922 193637 31402
749 31402 419215 437372 24796 48348 91108 29934 127539 126645 -424289 -171160 102577
738 102577 81567 56692 -22151 -97667 58381 -161355 -286545 -206922 336427 408176 -347183
727 -347183 132869 111618 238258 146229 -22960 -62588 -38489 -131654 30224 186839 -141285
716 -141285 -249547 -200378 -187065 -92573 278886 94455 -172415 -78844 148492 127659 3888
705 3888 -92765 -258562 -416638 -474741 -247110 -271445 -121413 294627 485985 191872 94438
694 94438 281250 372463 313038 298157 99396 -3089 -238717 -687385 -690087 -490406 -213267
683 -213267 -124160 -125416 -72969 -308864 -165297 384055 373733 378838 238681 -16634 287598
672 287598 409191 281489 317989 340427 229600 295602 414895 186367 191426 85794 -194187
661 -194187 361302 466326 -95085 -22170 -253363 -1896 177888 237343 -109086 -184178
651 -184178 -61860 136420 -125999 -251232 109683 -137602 -20808 -154267 -117493 243094
641 243094 -7815 -6601 -107507 -100570 -316167 -287403 287651 266484 33053 -211589 264889
630 264889 -36537 -155455 -50895 13345 -203331 -180161 -75486 -105935 31799 -84442
620 -84442 -233540 -285124 -301541 80284 33433 74182 136515 -345167 -181410 -223115 -82222
609 -82222 -25890 123483 -152038 -53681 109622 230312 437932 129278 -117393 -116855 -163742
598 -163742 -369808 -320741 -602788 -757043 -281081 154171 -178738 -485531 -440610 -315181
588 -315181 -178862 30812 -82399 -58852 -310789 -351014 -399983 -381668 -465335 -341972 -165572
577 -165572 -58541 179575 -152652 -358593 -557982 -377923 -157085 -226735 -458521 -270601
567 -270601 -216812 -426580 -646550 -558204 -400723 -451934 -306124 -32325 -42390 -146415 -306663
556 -306663 -359957 -51588 82688 -47296 -114870 -398026 -109177 155770 122950 -100983
546 -100983 -622446 -449540 -67397 -117624 125372 158079 31826 149395 23586 -245390
536 -245390 -461273 -167148 -168731 1084 118137 61655 -213222 -456095 155476 -153351
526 -153351 -176822 -559904 -802490 -750786 -592462 2425 -182815 -350324 -242264 -51336
516 -51336 94352 -221760 -594863 -357817 -293756 -598524 -735648 -530983 -312712 -391862
506 -391862 -132148 -107172 -696862 -439200 -833814 -669742 -485019 -341392 113009 -126279
496 -126279 -279631 -392155 -369884 -150279 159701 156008 174514 -326911 -302544 -159031 -110613
485 -110613 -130074 178452 330394 29196 -113718 26483 -45340 -248957 -240463 -441317 -261537
474 -261537 -337099 -158790 -98857 -72169 -160392 -97556 25979 39469 -4776 15171 57409
463 57409 153557 20323 38464 107023 293117 5532 61115 -5665 -278258 -297190 -288516
452 -288516 43542 -162447 -204709 -409852 -294224 -543086 -688962 -389186 -322415 -104429
442 -104429 -325853 -191316 -259178 -551831 -367381 -457109 -345054 -42464 -282256 -261823
432 -261823 56938 186601 277532 -152391 -487941 -442083 -340623 -386176 -407273 -263635 -216747
421 -216747 -345759 -642971 -837671 -499904 -563757 -469249 -106919 -344139 -315320 -254855 -574753
410 -574753 -634293 -414293 -341701 -246060 -324448 -319040 -158602 -286647 -279824 -268741 78435
399 78435 -174130 -321869 -541051 -317063 127754 60218 -253059 -141303 -206961 -142504 140256
388 140256 -194548 -192436 30903 -43728 -223925 -470633 -147113 -108189 -86855 -66148 -73815
377 -73815 265288 -261056 -524981 -660612 -78058 -208711 -608191 -577242 -280113 -525297
367 -525297 -655986 -694348 -819682 -670865 -494897 -340107 -183825 -256358 -466011 -233650
357 -233650 -156987 60276 3325 -350320 -265100 -195732 -296624 -598646 -169297 10052 316005
346 316005 -143894 -128514 -25599 -605246 -544759 -747267 -434856 -288206 -414759 -715019
336 -715019 -508415 -348783 -367940 -116203 -155995 -493495 -559900 -421783 -359296 -365652 -239500
325 -239500 -180849 -452043 -323891 -407402 -337065 -351920 -340864 -68888 -361549 -323745 -357487
314 -357487 -186653 -251264 -500550 -186311 -329974 -390756 -265753 -551543 -314032 -152072
304 -152072 160298 -238574 -402003 -339727 -319795 12520 -117921 2845 682 -64635 124686
293 124686 -147542 -227806 -256048 19147 -183050 -552635 -1042199 -508801 -389857 -543436
283 -543436 -300843 -166961 -196115 -420300 -467272 -522822 -627624 -793836 -643128 -877004
273 -877004 -600157 -468963 -630290 -834405 -736795 -574239 -294803 -127482 -236304 -382231
263 -382231 -582393 -372431 -332828 -511355 -380955 -234348 -469573 -631833 -338166 -385567
253 -385567 -534435 -357226 -456545 -451991 -384845 -330975 -243634 -653702 -308489 -179897 -373437
242 -373437 -550929 -615572 -604462 -620172 -588053 44072 -145286 -107588 -216709 -487771 -367218
231 -367218 -730126 -957652 -725290 -705504 -689876 -860622 -700932 -440113 -311162 -45080
221 -45080 -270266 -460610 -605473 -617361 -721893 -314198 -242569 -894965 -965027 -613662 -340922
210 -340922 -320298 -736235 -315103 122798 -357596 -818831 -853182 -568765 -258356 -362049
200 -362049 -372165 -371741 -764754 -610879 -455876 -264708 -405982 -422010 -488669 -748808 -687123
189 -687123 -304190 150964 -36783 -96129 -645241 -854897 -590261 -166294 -328658 -436419
179 -436419 -337240 -614812 -730929 -492939 -594867 -593749 -539317 -249721 -401909 -46181 -312860
168 -312860 -572353 -392080 -447306 -312844 -130805 -261803 -534475 -122262 76243 -130350
158 -130350 -325596 -433675 -755442 -677499 -414779 -290992 -348696 -396133 -540099 -680783
148 -680783 -629859 -706085 -911552 -541133 -510663 -800481 -794377 -744420 -784638 -807956 -863256
137 -863256 -455624 -717805 -921130 -866012 -612453 -694673 -647937 -291024 -87873 -490620
127 -490620 -569271 -505332 -724361 -987332 -929896 -1077884 -1144443 -804650 -694242 -761551 -812166
116 -812166 -845893 -838214 -810552 -888256 -808844 -656428 -486983 -779335 -796589 -934585 -468430
105 -468430 -517496 -584463 -273720 -490809 -634672 -796841 -658320 -344922 -615807 -790157
95 -790157 -1031940 -1009023 -752069 -604318 -520470 -605450 -436483 -234968 -494443 -389264 -275494
84 -275494 -378341 -384467 -484442 -400189 -330306 -366772 -443661 -586589 -835313 -859999 -819796 -686539
72 -686539 -491722 -625451 -646782 -805575 -720002 -694317 -583513 -440674 -474627 -138401 -191822
61 -191822 -424226 -633309 -715111 -892103 -822225 -921287 -784252 -687912 -879106 -714382 -556180
50 -556180 -540825 -649211 -776272 -775198 -818155 -1003187 -768185 -611076 -638656 -618091 -632771
39 -632771 -961485 -808114 -694686 -951185 -965184 -624282 -569229 -569480 -462857 -449875 -498047
28 -498047 -648250 -742679 -708259 -525904 -827223 -1028717 -776220 -672541 -720152 -647739 -663946
17 -663946 -827327 -478446 -551242 -841114 -799815 -928269 -800540 -714117 -942861 -921917 -797834
6 -797834 -645916 -664399 -712456 -616412 -644158 -934594
0 -934594
$$ Imaginary data points
##PAGE= N=2
##DATA TABLE= (X++(I..I)), XYDATA
16383 -6083517 -5933731 -5975975 -5861935 -5934765 -6088955 -5994501 -6042646 -5713987 -5691041 -5766225
16373 -5766225 -5708255 -5546143 -5425639 -5219366 -5179817 -5283992 -5016807 -4942076 -5133062 -4940400
16363 -4940400 -4780646 -4708003 -4665470 -4225268 -4321547 -4492342 -4228377 -4079550 -4245512 -4237105
16353 -4237105 -4280081 -4216363 -3879338 -3604614 -3359297 -3503273 -3714291 -3613867 -3600074 -3737162
16343 -3737162 -3614878 -3639698 -3641374 -3374987 -3224985 -3089145 -3043392 -3082457 -3377672 -3299719
16333 -3299719 -2805774 -2912962 -2793958 -2869691 -2889033 -2757388 -2536551 -2397490 -2171917 -2293865
16323 -2293865 -2175199 -2192933 -2279017 -2236883 -1907519 -1615226 -1618987 -1822956 -2045038 -2129476
16313 -2129476 -1765905 -1882381 -1819745 -1337368 -1384834 -1273632 -1285341 -1008087 -955292 -1095919
16303 -1095919 -697961 -752463 -688293 -664395 -682853 -875250 -911496 -862342 -619797 -642605 -428622
16292 -428622 -513173 -599751 -371827 -400081 -306309 -482699 -453009 -345753 -610033 -464968
16282 -464968 -185544 117400 75716 -277149 -198620 -328564 -228610 211285 151218 268912
16272 268912 399905 337388 297187 367646 442201 590259 498411 594830 537144 259097 383631
16261 383631 416304 516040 617924 775733 945663 1154131 999648 1204542 1164572 1196266
16251 1196266 1228987 1324000 1485121 1288024 1262071 1329090 1234735 1713356 1589011 1818540
16241 1818540 1932761 1587109 1396553 1545425 1451715 1616157 1852838 2093347 2057761 1731405
16231 1731405 2135431 2133845 2089206 2076610 1825342 1963784 1875211 2351801 2550421 2562057
16221 2562057 2255609 2443679 2541255 2268596 2446204 2533454 2484616 2380623 2566281 2564243
16211 2564243 2655387 2415482 2316179 2606173 2503582 1990795 2537212 3004782 3035460 2885616
16201 2885616 2861658 2858825 3068817 2927755 2958633 2881712 2676487 2837842 2563295 2559501 2605013
16190 2605013 2809197 2784686 2966090 2906829 2791148 2992877 3342394 3221806 3072427 2666502
16180 2666502 2477466 2539034 2487965 2587447 2640093 3106771 3104820 3178890 2891611 3247290 3575375
16169 3575375 3340623 3224572 3197019 3464596 3519537 3140013 3729100 3716860 3567636 3751035
16159 3751035 3674902 3385050 3468326 3622512 3679407 3705494 3650919 3825687 3290266 3210965
16149 3210965 3498039 3697611 3619337 3526051 3421945 3704586 3642167 4145264 4221726 3961311
16139 3961311 3617258 3346610 3419666 3650137 3326531 3233967 3917959 3784798 3539227 3711038
16129 3711038 3820196 3815873 3800463 3539838 3553212 3425596 3597361 3742181 3762026 3809896
16119 3809896 3908297 3976279 3734226 3715361 3856206 3834449 4241227 4046680 3922003 3630261
16109 3630261 3592061 3716911 3780966 3813657 3900694 3665830 3509532 3853024 3669739 3666236
16099 3666236 3797330 4189571 4433037 3860719 3764643 4045488 4242819 4223569 4241381 4024754
16089 4024754 3852873 3816702 3655039 3920316 3941659 4268232 4354667 4166245 4259522 4117291
16079 4117291 4011861 3978191 4114297 3994278 3590254 3744248 3726043 3586738 3700472 3897677
16069 3897677 3885794 4054282 4103524 3795443 3884011 4008916 4245869 4478751 4310513 4402532
16059 4402532 4678836 4590265 4096663 3865761 3768154 3744715 3853485 3917350 4053440 4193054
16049 4193054 4050130 4080299 3926348 4241508 4324177 4258004 4274607 4261229 4036621 4177467
16039 4177467 4198890 3953691 4209212 4002175 3808280 4064180 4478645 4576106 4260736 4015788
16029 4015788 4205455 4165663 4013705 3957385 4182904 3908244 3876483 4360455 4018950 3736355
16019 3736355 3847578 3522023 3655658 4046282 4123592 3837018 3858273 3934255 3611530 3741213
16009 3741213 3907271 3629037 3824961 3953918 4209360 4680871 4450539 4053253 3752623
16000 3752623 4059123 4252507 4129104 4337225 4126874 4171584 4406846 3946334 3616959 3755454
15990 3755454 4102614 4362447 4294806 4360050 4396977 4235377 4022978 4056412 4163668 3940684
15980 3940684 3720099 3698055 4187663 4074103 4067492 4002943 3848328 3788297 3713388 4036401
15970 4036401 4060141 4087061 4212024 4083427 4145657 4376391 4136087 3947669 3795937 3587247
15960 3587247 3755426 4078572 4233312 4326426 4395545 4250347 4798116 4753899 4592531 4289761
15950 4289761 4186585 4457872 4149912 4041446 4217836 4117282 3697688 3638005 3646526 3573512
15940 3573512 3906347 4006272 3960657 4172273 4184495 3957963 4029061 3789583 3658804 3881951
15930 3881951 3986309 4105985 3957379 4082338 4353622 4266607 3732126 3982087 4328961 3999150
15920 3999150 4043726 4578900 4165157 4120557 4064384 4013959 4097003 4213557 3835454 4094246
15910 4094246 4335667 3768870 3856636 3882899 4201314 4253036 3981610 3806694 3864067 3879097
15900 3879097 4146152 3853375 3488001 3801421 4000513 4075622 3893058 3979051 3773926 3730754
15890 3730754 3828390 3789204 4145375 4527466 4596071 4192736 4299579 4158119 4068262 4455922
15880 4455922 4174256 4223048 4299653 4154477 4030564 4430260 4439168 4295446 3973469 3870509
15870 3870509 3795481 4012325 3934663 4129242 4107774 4247682 4196836 4179388 4437393 4072052
15860 4072052 4152600 3817075 3913580 3728343 3671337 3994638 4024979 3889861 3973344 4145890
15850 4145890 4231601 3784034 3688698 3854176 4101733 4227748 4031295 3875915 4148826 3997306
15840 3997306 3957116 3976381 4030703 3816160 4060671 4198559 4154555 4404812 4564191 4461028
15830 4461028 4102119 4138488 4411159 4212451 4172034 3840135 4213299 4563249 4447350 4013685
15820 4013685 3885282 3865878 4021893 4227598 4552196 4606842 3809382 3555245 3782757 3746356
15810 3746356 3937409 4327751 4261853 4164009 4003785 4556619 4205495 3830775 4230485 4224648
15800 4224648 4169208 4441240 4146713 4170798 4084036 4124668 4004132 4284379 4274469 4184320 4075884
15789 4075884 4035632 4177211 4189146 4299452 4351439 3973097 3984896 4183175 4403837 4198061
15779 4198061 3962399 3946479 4137389 4376369 4573235 4549827 4501290 4867718 4404744 4357169
15769 4357169 4540416 4364353 4197776 3861695 3742542 4420399 4330213 4467151 4471082 4357979
15759 4357979 4606655 4488036 4237112 4484686 4168041 4146272 4337327 4025137 4366021 4578029
15749 4578029 4584861 4495012 4430816 4046155 4304651 4206039 4012712 4258834 4313970 4107716
15739 4107716 4086779 4289535 4123595 4203615 3953671 3825808 3897106 4096823 4213454 4522342
15729 4522342 4506441 3988410 3930491 4016201 3908229 3511491 3761758 4244113 4373407 4347396
15719 4347396 3832226 3630958 3919745 4023187 4123975 4250869 4054285 3927332 4028631
15710 4028631 3989987 3826821 4053511 4142825 3894275 4029137 4474973 4165323 3952875 4123243
15700 4123243 4041428 4647732 4614638 4405117 4003961 3599410 3643332 4099747 4323887 4176982
15690 4176982 4029316 4053608 3907999 4058425 4053741 3949072 4211139 4377578 4495619 4431439
15680 4431439 4304411 4224710 4412593 4322280 4628885 4272965 4219660 3938790 3995504 4270485
15670 4270485 4393686 4271236 4161379 4193533 4348934 4585589 4851013 4419198 4611593 4700259
15660 4700259 4515705 4340627 4247254 4432437 4306041 4447392 4122258 4102109 4165803 4420868
15650 4420868 3982467 3991696 4300019 4521256 4517613 4442958 4503538 4537452 4170050 4163197 4440591
15639 4440591 4379305 4122893 4202351 4116177 4189047 4630967 4251426 3894321 4131042 4060522
15629 4060522 4054346 4057788 4092253 4166004 4182916 4129460 4227869 4590633 4209147 4046647 4074082
15618 4074082 4098165 4248306 4173270 4416438 4109817 3989188 4005941 4326521 4546106 4186250
15608 4186250 3886733 3896800 4007462 4203397 4115419 3854089 4002161 4013396 3993656 4011326
15598 4011326 4169985 3715203 3604021 3591019 3765416 3859629 4063204 4151783 3966203 4210400
15588 4210400 3975622 3792318 4199941 4297901 4647968 4484005 4417373 4046625 3912863 4299556
15578 4299556 4151725 4137380 4296518 4219001 4296793 4724248 4770709 4401105 4441039 4685101
15568 4685101 4513110 4456840 4273173 4182865 4064418 3719199 3655618 3848766 3880915 4225366
15558 4225366 4327124 4521831 4501381 4734565 4829369 4608418 4386795 4367936 4552069 4496767
15548 4496767 4407757 4184759 3987376 4275256 4119923 4260074 4486074 4237788 4134488 3848677
15538 3848677 4079892 4094166 4052176 3866424 4058346 4334755 4145298 4133683 4338099 4400065
15528 4400065 4148768 4567026 5040185 4826963 4446805 4708707 4550203 4454807 4394019 4320499
15518 4320499 4395616 4275913 4253534 4245951 4431646 4667540 4486644 3907879 3916224 3933947 4591118
15507 4591118 4728321 4405724 4106908 4401045 4209059 3934555 4003652 4227932 4797032 4890668
15497 4890668 4781105 4944097 4548526 4200470 4322161 4424447 4909165 4608161 4588046 4323303
15487 4323303 4204983 4278825 4271062 4432128 4258613 4090914 4303585 3987889 3874139 4095314
15477 4095314 3957029 4055888 3706281 3968994 4259196 4427887 4705139 4522021 4384581 4662877
15467 4662877 4934780 4690234 4702535 4830953 4627629 4468690 4106413 4187854 4396626 4138998
15457 4138998 4550363 4469590 4257062 3821690 3612911 3562803 3761304 4186512 4251455 4086711
15447 4086711 3910261 4257184 4507922 4833198 4748012 4356364 4234997 4154271 4399977 4676935
15437 4676935 4699696 4293609 3879728 3860922 3730952 4013416 4228707 4447656 4192866 3955537
15427 3955537 4393542 4325470 4198280 4244339 4363919 4285898 4303706 3946879 3901977 4288913
15417 4288913 4484333 4370662 4407386 4642474 4606987 4855504 4733138 4353263 3907848 4179199
15407 4179199 4320104 4427188 4246284 4280841 4395260 4538517 4613997 4537046 4250380 4274255
15397 4274255 4307602 4332099 4315585 4031115 3797959 4160279 4116834 3998459 4196352 4082307
15387 4082307 4175772 4258108 4297735 4324125 4663784 4184374 4272840 4247623 4040422 4311105
15377 4311105 4416976 4527912 4560711 4615198 4327741 4146645 4399194 4245324 4043726 4186961
15367 4186961 4330746 4172030 4716274 4810593 4735965 4805366 4839909 4644350 4805473 4479585
15357 4479585 4708030 4926564 4444969 4282005 4064567 4342343 4365131 4085761 4330264 4397229
15347 4397229 4521248 4283564 4145932 4071211 4111209 4299078 4301552 4047463 3896295 4010225
15337 4010225 4080062 4363295 4521594 4579575 4540196 4303972 4451930 4466525 4493371 4590527
15327 4590527 4334497 4196280 3920375 4635641 4895681 4526984 4265223 4390643 4332865 4281794
15317 4281794 4565975 4312685 4388077 4581206 4572015 4534221 4714306 4722354 4481626 4575655 4166034
15306 4166034 4253766 4366977 4386788 4538599 4788255 4199662 3987336 4068500 4281119 4169190
15296 4169190 4347113 4194006 4288932 4189946 4404659 4407042 4354814 4436822 4331026 3898765
15286 3898765 4054983 4139216 4208340 4420654 4409960 4466017 4125866 4479698 4523410 4463971
15276 4463971 4296789 4263437 4125950 4364556 4219700 4133035 4272555 4524682 4170573 4196908
15266 4196908 4209405 4340978 4303319 4173105 4032680 3800901 4046350 4071013 4292802 4315003
15256 4315003 4022025 4492349 4590296 4408803 4270519 4378504 4427019 4429080 4203086 4263988
15246 4263988 4395656 4395295 4268397 4029391 4292811 4405069 4227974 4281797 4511003 4451363
15236 4451363 4214336 4201853 4545221 4265175 4303383 4404829 4165359 4274560 4211261 4292905
15226 4292905 4602393 4447671 4204718 4384876 4399454 4542620 4323987 4024433 3976551 4151029
15216 4151029 4335250 4195774 4197416 4489544 4566636 4312184 4307854 4260534 4219932 4271910 4114977
15205 4114977 3920253 4131690 4518077 4522292 4494460 4556775 4628833 4691840 4585938 4427316
15195 4427316 3996869 3994770 4276793 4387475 4319981 4394245 4596225 4874356 4543967 4499305
15185 4499305 4496550 4317969 4403025 4484247 4396174 4323473 4670937 4343744 4353369 4438291 4321764
15174 4321764 4108465 4319702 4351902 4166678 4236718 4273286 4412112 4552166 4438353 4562823
15164 4562823 4550540 4537273 4830261 4372405 4258349 4475401 4279144 4341082 4363701 4022756
15154 4022756 4056995 4012036 4509429 4393430 4352808 4261139 4212437 4429829 4215866 4130592
15144 4130592 4276816 4599285 4640510 4712641 4836228 4491113 4451406 4285838 4202401 4597433
15134 4597433 4379154 4496105 4093063 3983297 4233011 4578409 4683165 4738621 4643346 4490620
15124 4490620 4702686 4537594 4397640 4411994 4334568 4097486 3911895 3831687 3916798 3820935
15114 3820935 4144217 4618100 4694409 4799479 4870280 4629833 4539706 4482403 3691848 3718873
15104 3718873 4265740 4117032 4193807 4261366 4692144 4546064 4368343 4023210 3943735 4169464
15094 4169464 4385326 4381955 4356786 4107765 4224386 4596543 4575005 4264800 4179702 4224302
15084 4224302 4104063 4362359 4330204 4347548 4296258 4182278 4369540 4635056 4559439 4221357
15074 4221357 4310631 4443393 4584311 4957658 4509175 4193645 3960957 4053749 4295017 4493355
15064 4493355 4735532 4470410 4478578 4513835 4395609 4080762 4136075 4521206 4187529 4053434
15054 4053434 4048532 4293584 4146645 4384652 4727928 4865863 4735031 4370345 4410250 4387976
15044 4387976 4501371 4571515 4582409 4578417 4199833 3859831 4221362 4555121 4867425 5097416
15034 5097416 4751105 4670236 4531969 4575511 4300530 4081980 3995574 4158434 4193547 4328724
15024 4328724 4705278 4779209 4787476 4565455 4617772 4514360 4576369 4625014 4266773 4414917
15014 4414917 4611057 4804622 4790762 4897259 4540947 4539854 4619032 4573986 4535162 4118746
15004 4118746 3928464 4081402 4134722 3753617 3912516 4350363 4780654 4739508 4457781 4647938
14994 4647938 4706277 4581636 4628754 4408296 4457368 4167013 4707199 4780084 4622473 4793566
14984 4793566 4919984 4515691 4377333 4371701 4434520 4540769 4505115 4420722 4442195 4492418 4746308
14973 4746308 4783653 4822425 4972773 4383192 4373355 4794950 4823889 4616063 4881080 4866550
14963 4866550 4568177 4549575 4370652 4454862 4724440 4795290 4683434 4546377 4586640 4737393
14953 4737393 4693635 4303467 4179075 4537808 4433776 4210469 4299134 4314577 4056227 4285134
14943 4285134 4740689 4419199 4535549 4508916 4300516 4262990 4209586 4441772 4712041 4549102
14933 4549102 4580750 4472291 4633402 4458141 4494255 4564122 4462447 4392206 4458595 4403997
14923 4403997 4232080 4136213 3903068 4073532 4070041 4132347 4483944 4379821 4099238 4356220
14913 4356220 4780511 4617175 4665114 4897721 4584717 4519579 4454437 4366482 4536346 4827785
14903 4827785 4605343 4872193 4440899 4221673 4757515 4851160 4556724 4277852 4266954 4459066
14893 4459066 5007109 5056668 4952051 4998511 4861988 5096124 4894945 4831828 4813377 4443124
14883 4443124 4295572 4498916 4741060 4685230 4812667 4852487 4476773 4509189 4472809 4240571
14873 4240571 4252177 4245391 4416800 4409558 4347191 3651394 3550617 4226562 4252892 3890002 3995707
14862 3995707 4218605 4563775 4388175 4304479 4334101 4272456 4380679 4663461 4745312 4526555
14852 4526555 4176131 4488382 4637381 4371976 4639233 4571330 4821988 4974799 5012801 4450910
14842 4450910 4423899 4559469 4237746 4367521 4420381 4374146 4129873 4199627 4028783 4184463
14832 4184463 4106142 4158730 4459188 4565910 4539555 4344166 4449379 4128869 4038037 4274880
14822 4274880 4562211 4674689 4206184 4055474 4045157 4012031 3961627 3992862 4009002 4140245
14812 4140245 4220983 4405257 4443640 4352959 4612879 4519139 4216017 4400452 4633402 4582159
14802 4582159 4418019 4420895 4277822 4471379 4592527 4176518 4673030 4737445 4759753 4677375
14792 4677375 4506338 4470157 4646797 4680052 4285353 4142559 4585065 4824798 4517652 4748125
14782 4748125 5341843 5324033 4966459 4734462 4342861 4459234 4407711 4490649 4560111 4562193
14772 4562193 4604313 4354224 4384047 4188521 4211812 4420174 4343356 4127116 4223464 4341187
14762 4341187 4285814 4220112 4656252 4479466 4290867 4119583 4224825 4378949 4325834 4537584
14752 4537584 4628600 4631443 4508296 4638791 4758327 4566293 4562574 4913852 4730719 4541889
14742 4541889 4453358 4435923 4441996 4673257 4410521 4621736 4227429 3956377 4071237 4238675
14732 4238675 4471054 4559693 4541273 3993816 4447976 4834021 4663609 4732482 4589972 4971016
14722 4971016 5190131 4784643 4690705 4501415 4620689 4549447 4722534 4839480 4676542 5093134
14712 5093134 5194631 4592775 4452883 4464480 4702689 4659500 4677254 4730199 5007600 4832003
14702 4832003 4716174 4592670 4303452 4410184 4632706 4971899 5042053 4937312 4853669 4776763
14692 4776763 4645655 4442374 4617720 4871330 5086202 4647183 4556821 4097291 4159054 4531095
14682 4531095 4818803 4825179 4462606 4880194 4640265 4676229 4424857 4582716 4407117 4487947
14672 4487947 4698267 4223830 3975980 4166885 4227949 4293626 4320011 4516025 4726993 4912393
14662 4912393 4865575 4663605 4574536 4572813 3994118 4290086 4569839 4565645 4600350 4912737 4710717
14651 4710717 4711294 4423522 4453571 4591181 4615462 4816184 4483797 4754716 4354063 4686363
14641 4686363 4564664 4539194 4590300 4864899 4876208 4874247 4961092 4749804 4604588 4490649
14631 4490649 4467259 4377511 4284184 4016484 4765220 5211190 4742566 4920643 4841977 4635771
14621 4635771 5126847 4642478 4498958 4537243 4411495 4553168 4690028 4720304 4756409 4979493
14611 4979493 4765484 4616929 4395930 4350913 4749929 4767071 4489496 4041107 4240303 4354106
14601 4354106 4462917 4711432 4701709 4771311 4820387 4793558 4771526 5075713 5277555 4876470
14591 4876470 4722925 4789139 4797392 5010038 4599001 4370450 4704922 4810927 5062002 4700652
14581 4700652 4471648 4705496 4452055 4558786 4634442 4690148 4725161 4429300 4483062 4997393
14571 4997393 4405040 4574717 4950926 4707097 4771305 4884188 4778685 4635581 4479212 4531040
14561 4531040 4630526 4660773 4807622 4912640 4483231 4693909 4684061 4437289 4467994 4616858
14551 4616858 4606862 4612570 4526845 4521517 4979326 5108093 4522778 4333702 4656263 4863372 5101159
14540 5101159 4866604 4910610 4898521 4806733 4791662 4693803 4823399 4812692 4693190 4356432
14530 4356432 4662329 5153879 5272148 5064159 5054496 5099316 4989227 4668663 4425709 4461290
14520 4461290 4297704 4466142 4465200 4467924 4475302 4714218 4958088 4842461 4639545 4675546 4545176
14509 4545176 4420484 4571689 4656048 4733375 5325978 5136337 4926284 4516124 4424761 4516815
14499 4516815 4798031 4588298 4678953 4641806 4663570 5073564 4835290 5099877 4680737 4315200
14489 4315200 4865567 5105762 4602937 4636597 4750069 4621126 4911084 5019424 4710752 4640080
14479 4640080 4653405 4549297 4648788 4728693 4789263 4842127 4681579 4684201 4678280 4567731 4604996
14468 4604996 4383970 4293066 4599758 4905839 4948403 4973621 4730203 4274675 4079331 4605038
14458 4605038 4479972 4344836 4562017 4476160 4394087 4366946 4570188 4818432 4888208 4952624
14448 4952624 5085012 4746514 4856314 4825700 4791645 4649629 4297925 4004311 4255759 4507743
14438 4507743 4413936 4626206 4623149 4528363 4761374 4969525 5145872 5198999 5221475 5404363
14428 5404363 5090556 4996822 5046149 4860321 4753027 4565308 4816367 4922380 5092938 4999828
14418 4999828 4631823 4766177 4893888 4909468 4533240 4712804 4789431 4791557 4443219 4430079
14408 4430079 4967904 5075675 4833894 4683226 4486459 4907675 5218096 4990016 4952173 4951181
14398 4951181 4955307 4931874 4986026 4928559 4972740 4579079 4418660 4633739 4926380 5077712
14388 5077712 4721231 4472243 4760978 4749606 4825297 4799606 4389616 4381438 4457641 4262483
14378 4262483 4599627 4372620 4685825 4762879 4782476 4554599 4889648 5018483 4998670 4812675
14368 4812675 4617731 4980605 5224234 5228981 4920107 4664068 4728557 5016497 5038598 4984758
14358 4984758 4850930 4664011 4520269 4572433 4565958 5232862 5032055 4989654 4934665 4950272
14348 4950272 4793990 4691640 4698618 4759596 4847491 4470223 4247577 4377315 4629770 4545368
14338 4545368 4994701 5274715 5123413 5225710 4842952 4622705 5048136 4720902 4613509
14329 4613509 4965997 4746364 4397628 4473269 4706649 4798351 4764308 4763091 4653802 4565961
14319 4565961 4719920 4650097 5255624 5160409 4989734 4891596 4734262 4542851 4679136 4851263
14309 4851263 4716526 4378874 4579125 4910995 4898297 5016948 5083939 5201291 5019460 4927568
14299 4927568 4776223 4629600 4267820 4453407 4692047 4623185 4544369 4479241 4919626 5006077
14289 5006077 4767940 4775747 5078032 4896539 4828445 4763628 4485889 4614887 4748564 4717347
14279 4717347 4777195 4999227 5006558 4650271 4616177 4941612 4792840 4814141 4819059 4986659 5106109
14268 5106109 4709456 4528660 4744936 4943628 4520146 4467686 4797383 4611983 5014075 4618303
14258 4618303 4692310 4925247 4928740 4979052 4770953 4444246 4628572 4796787 5098189 5007380
14248 5007380 4708643 4796425 4810857 4722579 4651941 4783085 4896002 4666916 4528184 5088161
14238 5088161 4984565 4841581 4805238 4999138 5007836 4859490 4670231 4387286 4299349 4376553
14228 4376553 4647652 4610394 4625907 4999602 4479140 4294878 4630996 4638622 4806866 4665890
14218 4665890 4379302 4736941 5278474 5373627 4984493 4666062 4674257 4497591 4680614 4881310
14208 4881310 4997082 5130036 4791739 4985725 5128511 5111507 5220628 5168664 5136134 4975700
14198 4975700 5072131 5099996 4699557 4796678 4760805 4648406 4933624 4844336 4519719 4629364
14188 4629364 4589669 4646297 4450177 4374275 4293987 4365581 4599715 4626484 4429809 4428598 4489479
14177 4489479 4727483 4407452 4421498 4781705 4554745 4756648 4607477 4797203 5189057 5172433
14167 5172433 4621818 4286489 4546096 4550019 4843396 4964865 4850447 4714262 4663947 4850954
14157 4850954 4718910 4533887 4541710 4929318 4707657 5139647 4964930 5171014 5628381 5220321
14147 5220321 4808210 4790009 4871205 4623337 4416489 4624873 4505043 4708183 4890307 4810728
14137 4810728 4586888 4542722 4968767 5252284 5105673 4838668 4652590 4898411 4878285 4827950
14127 4827950 4803866 4985084 5146365 4654190 4450722 4609213 4358625 4347096 4436435 4493435
14117 4493435 4742369 4672183 4719036 4817775 5196070 4919410 4843843 4485715 4641964 4834467
14107 4834467 4806044 5051429 5057720 4665419 4673052 4586429 4333512 4377226 4599116 4980927 4858635
14096 4858635 4467130 4475869 4359598 4614770 4704027 5034527 5073878 4752205 4258361 4546292
14086 4546292 4949654 4770869 4593925 4980358 4821384 4910979 4646750 4293106 4583703 4631638
14076 4631638 4883522 4762959 4943155 4948225 5115796 4808899 4602636 4901069 5040624 5070039
14066 5070039 4803671 4527888 4789096 4912719 5280104 5123264 4873218 4523822 4593049 4611902
14056 4611902 4431739 4565164 4993383 5036859 5101456 4840621 4564090 4679562 5170676 5186962
14046 5186962 5238341 5114888 5069553 5166803 5139010 5255766 4933858 4880583 4979961 4727830
14036 4727830 4516147 4687018 4677701 4776448 5102146 5257146 5174561 5090886 4722864 4746242
14026 4746242 4800512 5145450 4767952 4673052 4428579 4657420 4696752 4860434 4864756 4734100
14016 4734100 4881957 5256282 5285055 4933112 5236403 5251283 5147283 4856344 5082891 5028936
14006 5028936 5476185 5333407 5358289 5467123 5383516 5105311 5031337 5058394 5190463 5411650
13996 5411650 5189616 4673107 4777868 4414685 4715923 4999836 4710141 4959301 5090070
13987 5090070 4742213 4834895 4914429 4960802 5081776 4658560 4859019 4901529 4915158 5011770
13977 5011770 5188095 4908153 5146290 4824011 4752737 4643584 4747372 4789425 5032727 4742577
13967 4742577 5171309 5385852 5000087 5035701 5172712 5428267 5108065 4746526 4740806 5072571
13957 5072571 5220077 5305146 5265931 4891699 4457291 4430422 4893014 4909896 4539997 4859467
13947 4859467 4965288 5056084 5315796 5111308 5379836 5362793 5140472 4965904 5056528 5164982
13937 5164982 4902682 4927330 5023427 5223829 4710001 4591480 4522386 4762987 4884761 4515834
13927 4515834 4432561 4557346 4923619 5407850 5337583 5371109 5358154 5277128 4875135 5094661
13917 5094661 5262021 5163826 4993723 4552114 4672536 5085038 4868941 4950229 4817916 4686734
13907 4686734 4720575 4559163 4680876 4690122 4665443 4470317 4328431 4356849 4857196 4924461
13897 4924461 4835431 4804308 4506347 4739777 4728442 4546234 4681796 5037614 4950140 4745832
13887 4745832 4553228 4482479 4843116 4679981 4973573 5111853 4990740 4921147 4844667 4839843
13877 4839843 5124897 5307832 5204179 5382126 5430720 5101006 4912631 5013708 5004287 5011473
13867 5011473 5099133 5067508 5049364 5238356 5161938 4986114 4887914 4663062 4793000 4422849
13857 4422849 4505142 4811663 5244036 5024751 5241156 5401736 5111557 5008584 4704703 4825328
13847 4825328 4768121 4869326 5003128 5380827 5242845 5059163 5124093 4831509 4838502 4967927
13837 4967927 5158165 5157588 5002054 5068704 5016271 4721660 4651955 5122638 5248835 4953586
13827 4953586 4865827 4718650 4819905 4767138 5068278 4899847 4551367 4731248 4929952 5206590
13817 5206590 4895886 4945287 5069859 5106844 5363624 5319622 5146824 4940793 5180553 4942250
13807 4942250 4750044 5155340 5303498 5294629 5191465 5145869 5039456 5073241 5231928 5293477
13797 5293477 5295095 5433359 5543082 5383591 5022787 5183127 5259639 5251342 5269060 5114259
13787 5114259 5018183 5259413 5300923 5058452 5114927 5338690 5177197 4832315 4624541 4591087
13777 4591087 4816845 4917961 4841458 5170523 4948114 4477081 4629274 4700877 4920220 4991147
13767 4991147 4934449 4849070 4507134 4911359 4906778 5019418 5162911 5274224 5081262 5174677
13757 5174677 5280793 4743128 4643011 4668917 4447338 5035463 4991402 4779726 4914543 5069896
13747 5069896 5026699 4811307 4611342 4491840 4695769 4833590 5033850 5320023 5470862 5116444
13737 5116444 5118962 5220689 5074758 4756947 4845182 5157196 5281528 5277766 5575731 5565759 5540176
13726 5540176 5341543 4820623 4623080 4644622 4722798 4770538 4861908 5316214 5596212 5463695
13716 5463695 5328068 5106309 5030284 5212461 5187077 5237040 5002695 5579430 5392944 5348966
13706 5348966 5181119 5255865 5149693 5296302 5454033 5160902 5342517 5684693 5544390 5407175
13696 5407175 5653502 5573087 5603858 5511402 5191820 4776700 4776023 5310338 5497747 4999454
13686 4999454 5024133 5042899 4902802 4978663 5283309 5441643 5098923 5113810 5144865 5497836
13676 5497836 5537538 5333388 5363339 4884692 5144057 5332324 5148193 5432352 5386277 5238403
13666 5238403 4973022 4550045 4596453 5002531 5061991 5099062 5087809 4904062 4802746 4603295
13656 4603295 4918073 4767863 4573710 4668106 4894241 4686099 4628207 4624495 4878452 4876396
13646 4876396 5023194 4918312 4932686 5346799 5251688 5378844 5206710 4902784 5333695 5376762
13636 5376762 5435001 5697488 5725357 5445515 5611949 5480197 5432223 5290240 5245679 5444411
13626 5444411 5193370 5282692 5144585 5022493 5190016 5434271 5078770 4787757 4994282 4862294
13616 4862294 4656388 4829019 4848224 4725224 4648565 5066237 5251874 5220810 5052354 4787792
13606 4787792 4857039 4749692 4688089 4779920 4695774 5163805 5356957 4766225 4998103 5161459
13596 5161459 5132859 4911425 4559319 4628669 4837610 4970877 5187362 5116545 5054360 4860475
13586 4860475 5198890 5381680 5261241 5277799 5329074 5135202 5007598 5121335 4732566 4773750
13576 4773750 4847162 4735746 4792003 5022347 5001937 4982763 4718488 4846064 4958145 5127215
13566 5127215 4956093 4893334 4868962 4846248 4613721 4745967 4891214 5254986 5532830 5314463
13556 5314463 5351911 5721842 5512145 5446356 5366366 5212686 5046426 5052187 5357662 5320529
13546 5320529 5582850 5545516 5176806 4999100 4873496 5070767 5154188 5458960 5223391 5166402
13536 5166402 5525522 5312366 5002270 5144303 4891068 5188401 5531435 5233003 5298494 5049569
13526 5049569 5319796 5192469 5187327 5115755 5338052 5494599 5363976 5350114 5307268 5237070
13516 5237070 5482979 5084803 4876613 4933607 5264291 5142054 4972998 4909744 4960422 4878796
13506 4878796 5193071 5168231 5175787 5363037 5213630 5225854 4850465 5030144 5160567 4952554
13496 4952554 5081124 5069699 5221609 5286836 5159738 5124370 4992384 5197727 4863200 4767921
13486 4767921 5032078 5250080 5157834 4724592 4817562 5010319 5035990 5033265 4727108 4638735
13476 4638735 5032102 5119287 5147091 4959700 4603620 5001712 5346675 5003799 5224682 5401217
13466 5401217 5266133 5369083 5312350 5248243 4885712 4858028 5110799 5547249 5626450 5637594
13456 5637594 5470545 5426184 5402645 5214460 5544987 5609392 5296465 5236166 5127763 5043055
13446 5043055 5182215 5338462 5365223 5175647 5247291 5292740 4972280 5360614 5463424 5403368
13436 5403368 5168559 5215738 5305113 5145259 4992783 4897810 5035577 4789972 5037597 5056327
13426 5056327 5322179 5404528 4980469 5174581 5421543 5397295 5333784 5237769 5097687 5680502
13416 5680502 5345400 5019062 5106078 5339962 5479025 5292770 5222548 5101192 5198892 5000927
13406 5000927 4730070 4423594 4857244 5426175 5521521 5660882 5279753 5348204 5276216 5543665
13396 5543665 5661890 5276572 5314448 5128608 4741570 4707980 5108523 5121152 5130703 5138283 5196496
13385 5196496 5022230 5041223 5168908 5123262 5019068 5086124 5001028 5060908 5213147 5530584
13375 5530584 5730982 5605953 5152186 5105290 5356724 5380371 5348891 5290787 4906806 5039854
13365 5039854 5175306 4997299 5120534 5292263 5185068 5133014 5256734 5252165 4780963 5063824
13355 5063824 5300833 5230319 5322334 5522738 5130451 5389907 5276387 5096425 5189618 4593258
13345 4593258 4758517 4897452 5142980 5066931 5296581 5419696 5553187 5361754 5044714 5261373
13335 5261373 5227918 5092874 5116929 5037618 5007719 4823321 4971626 5157347 5402592 5448718
13325 5448718 5495101 5279320 4796723 5021877 5387176 5654859 5545128 5283215 5370313 5489364
13315 5489364 5262035 5323772 5432800 5008142 5123443 5391189 5114316 5016607 5570205 5285152
13305 5285152 5203588 5288628 5251440 5432683 5375475 5422899 5622699 5445902 4998313 5010843
13295 5010843 5184625 5237482 5130713 5417996 5575144 5555667 5364104 5360771 5247942 5433147
13285 5433147 5395786 5273302 5288474 5338543 5395894 5151899 5235825 5587238 5680893 5209223
13275 5209223 5249696 5229272 5298079 5053297 5243373 5260032 5141378 5341972 5143266 4894062
13265 4894062 5089767 5204949 5051057 4935700 5238923 5049262 4883110 5000851 5084597 5229017
13255 5229017 5469601 5129963 4751749 5052922 5049415 5485579 5591825 5221956 5169367 5920686
13245 5920686 5612406 5239297 5247811 5521056 5966131 5632860 5577322 5356754 5152304 5302027
13235 5302027 5020359 5103226 5278762 5293197 5193329 5099665 5116778 4913691 5110767 5286129
13225 5286129 5451249 5507260 5741868 5755246 5168310 5498537 5953614 5542415 5211545 5487414
13215 5487414 4986587 5017342 5306968 5492479 5388525 5410185 5561813 5379542 5143484 5375994
13205 5375994 5569518 5539278 5489429 5304744 5240206 5427184 5457920 5444405 5340569 5410250
13195 5410250 5734331 5279121 5320104 5527444 5451775 5342536 5636740 5581547 5536681 5415869
13185 5415869 5356380 5149750 5424763 5283060 5183769 5182611 5384014 5667864 5686427 5279531
13175 5279531 4935993 4855720 4892673 4866281 4905762 5143268 5586842 5496861 5168720 5547146
13165 5547146 5930632 5592827 5476135 5688499 5440889 5406482 5447593 5275029 4967514 5211540
13155 5211540 5191752 5152133 5158432 5422127 5397429 5454610 5362884 5432991 5574290 5394969 5322152
13144 5322152 5546017 5529121 5456066 5256342 5105779 5109292 5114806 5208981 5330928 5405609 5341243
13133 5341243 5674970 5428673 5206979 5679327 5419626 5535922 5553514 5456568 5546627 5738348
13123 5738348 5674347 5800337 5899898 5673751 5508680 5503188 5586117 5573461 5617977 5713811 5411899
13112 5411899 5522905 5289483 5070823 5254962 5053956 5120602 5370660 5229965 5497126 5279608
13102 5279608 5395947 5723200 5534008 5747786 5957495 5800360 5470657 5286735 5058294
13093 5058294 5004935 5268075 5649297 5591692 5583053 5302787 5722946 5837980 5628596 5217021
13083 5217021 5299179 5400483 5531868 5540636 5774922 5719619 5369317 5069867 5068746 5508080
13073 5508080 5560692 5277563 5426322 5272279 5835348 5834849 5405813 5582125 5671909 5699102
$$ [...]
##END NTUPLES=NMR SPECTRUM
##END=
