##TITLE=1H_CA-8840-2
 DMSO, 8 sc, 
 30.04.2021
##JCAMPDX= 6.0         $$ Bruker NMR JCAMP-DX V2.0
##DATA TYPE= NMR SPECTRUM
##DATA CLASS= NTUPLES
##ORIGIN= UXNMR, Bruker Analytische Messtechnik GmbH
##OWNER= root
$$ XWIN-NMR		Version 3.5
$$ Fri Apr 30 14:33:57 2021 Russian Standard Time (UT+4h)  she@DPX200
##.OBSERVE FREQUENCY= 200.131506
##.OBSERVE NUCLEUS= ^1H
##.ACQUISITION MODE= SIMULTANEOUS
##.ACQUISITION SCHEME= undefined
##.AVERAGES= 8
##.DIGITISER RES= 18
##SPECTROMETER/DATA SYSTEM= spect
##.PULSE SEQUENCE= zg30
##.SOLVENT NAME= DMSO
##.SHIFT REFERENCE= (INTERNAL, DMSO, 0, 16.0248)
##AUDIT TRAIL= $$ (NUMBER, WHEN, WHO, WHERE, WHAT)
$$ ##TITLE= Audit trail, XWIN-NMR		Version 3.5
$$ ##JCAMPDX= 5.01
$$ ##ORIGIN= Bruker BioSpin GmbH
$$ ##OWNER= she
$$ F:/spectra/data/she/nmr/H-F/1/pdata/1/auditp.txt
$$ ##AUDIT TRAIL=  $$ (NUMBER, WHEN, WHO, WHERE, WHAT)
(   1,<2021-04-30 14:33:10.67 +0400>,<she>,<DPX200>,
      <created by zg, POWCHK disabled, PULCHK disabled
       configuration hash MD5:
       00 E9 B6 7A A2 85 ED C7 34 08 36 98 17 FE 4E 26
       data hash MD5: 16K
       F6 B2 1D 7C 4F 41 E0 5A A1 50 6F D3 A2 CE 49 6C>)
(   2,<2021-04-30 14:33:12.73 +0400>,<she>,<DPX200>,
      <Start of raw data processing
       efp BC_mod = 2 LB = 0.24 FT_mod = 6 PKNL = 1 PHC0 = -11127.49 PHC1 = 18.80103 SI = 16K 
       data hash MD5: 16K
       82 FC 1E 9A 9C C4 C1 6F 0F 5F 2A 58 08 F8 F9 A0>)
(   3,<2021-04-30 14:33:24.21 +0400>,<she>,<DPX200>,
      <pk PHC0 = -1.365474 PHC1 = 0 
       data hash MD5: 16K
       63 04 C8 28 1C 70 F3 A4 64 3A D0 61 4C FC 99 63>)
(   4,<2021-04-30 14:33:27.14 +0400>,<she>,<DPX200>,
      <abs ABSG = 5 
       data hash MD5: 16K
       F4 83 91 D0 4B 40 AC 1F CB 53 A4 78 D5 D0 67 54>)
$$ ##END=
$$ 
$$ hash MD5
$$ 2F 60 8F CD 45 B5 38 F8 4B 62 7F C3 0D DE 1E B4
##$RELAX= 
##$RELAX= 
##$RELAX= 
##$RELAX= 
##$RELAX= 
##$RELAX= 
$$ Bruker specific parameters
$$ --------------------------
##$DU= <F:/spectra>
##$EXPNO= 1
##$NAME= <H-F>
##$PROCNO= 1
##$TYPE= <nmr>
##$USER= <she>
##$AMP= (0..31)
100 100 100 100 100 100 100 100 100 100 100 100 100 100 100 100 100 100 
100 100 100 100 100 100 100 100 100 100 100 100 100 100 
##$AQSEQ= 0
##$AQ_mod= 1
##$AUNM= <au_zg>
##$AUTOPOS= <>
##$BF1= 200.13
##$BF2= 200.13
##$BF3= 200.13
##$BF4= 200.13
##$BF5= 200.13
##$BF6= 200.13
##$BF7= 200.13
##$BF8= 200.13
##$BYTORDA= 1
##$CFDGTYP= 0
##$CFRGTYP= 5
##$CHEMSTR= <none>
##$CNST= (0..31)
1 1 145 1 1 1 1 1 1 1 1 1 1 1 1 1 1 1 1 1 1 1 1 1 1 1 1 1 1 1 1 1 
##$CPDPRG= <>
##$CPDPRG1= <>
##$CPDPRG2= <>
##$CPDPRG3= <>
##$CPDPRG4= <mlev>
##$CPDPRG5= <mlev>
##$CPDPRG6= <mlev>
##$CPDPRG7= <mlev>
##$CPDPRG8= <mlev>
##$CPDPRGB= <>
##$CPDPRGT= <>
##$D= (0..31)
0 1.2 0 0 0 0 0 0 0 0.06 0 0.03 0 0 0 0 0.0002 0 0 0 0 0 0 0 0 0 0 0 0 
0 0 0 
##$DATE= 1619778790
##$DBL= (0..7)
120 120 120 120 120 120 120 120 
##$DBP= (0..7)
150 150 150 150 150 150 150 150 
##$DBP07= 0
##$DBPNAM0= <>
##$DBPNAM1= <>
##$DBPNAM2= <>
##$DBPNAM3= <>
##$DBPNAM4= <>
##$DBPNAM5= <>
$$ [...]
##$SUBNAM3= <"">
##$SUBNAM4= <"">
##$SUBNAM5= <"">
##$SUBNAM6= <"">
##$SUBNAM7= <"">
##$SUBNAM8= <"">
##$SUBNAM9= <"">
##$SW= 16.9725357007746
##$SWIBOX= (0..15)
0 0 2 0 0 0 0 0 0 0 0 0 0 0 0 0 
##$SW_h= 3396.73913043478
##$TD= 16384
##$TD0= 1
##$TE= 0
##$TE2= 300
##$TE3= 300
##$TEG= 300
##$TL= (0..7)
0 120 120 120 120 120 120 120 
##$TP= (0..7)
150 150 150 150 150 150 150 150 
##$TP07= 0
##$TPNAME0= <>
##$TPNAME1= <>
##$TPNAME2= <>
##$TPNAME3= <>
##$TPNAME4= <>
##$TPNAME5= <>
##$TPNAME6= <>
##$TPNAME7= <>
##$TPOAL= (0..7)
0.5 0.5 0.5 0.5 0.5 0.5 0.5 0.5 
##$TPOFFS= (0..7)
0 0 0 0 0 0 0 0 
##$TUNHIN= 0
##$TUNHOUT= 0
##$TUNXOUT= 0
##$USERA1= <user>
##$USERA2= <user>
##$USERA3= <user>
##$USERA4= <user>
##$USERA5= <user>
##$V9= 5
##$VALIST= <valist>
##$VCLIST= <CCCCCCCCCCCCCCC>
##$VD= 0
##$VDLIST= <DDDDDDDDDDDDDDD>
##$VPLIST= <PPPPPPPPPPPPPPP>
##$VTLIST= <TTTTTTTTTTTTTTT>
##$WBST= 1024
##$WBSW= 4
##$XGAIN= (0..3)
0 0 0 0 
##$XL= 0
##$YL= 0
##$YMAX_a= 527928
##$YMIN_a= -430404
##$ZGOPTNS= <>
##$ZL1= 120
##$ZL2= 120
##$ZL3= 120
##$ZL4= 120
##$ABSF1= 16.02479
##$ABSF2= -0.9478741
##$ABSG= 5
##$ABSL= 3
##$ALPHA= 0
##$AQORDER= 0
##$ASSFAC= 0
##$ASSFACI= 0
##$ASSFACX= 0
##$ASSWID= 0
##$AUNMP= <proc_1d>
##$AZFE= 0.1
##$AZFW= 0.1
##$BCFW= 0
##$BC_mod= 2
##$BYTORDP= 0
##$COROFFS= 0
##$CY= -3
##$DATMOD= 1
##$DC= 0
##$DFILT= <>
##$DTYPP= 0
##$F1P= 0
##$F2P= 0
##$FCOR= 1
##$FTSIZE= 16384
##$FT_mod= 6
##$GAMMA= 0
##$GB= 0
##$INTBC= 1
##$INTSCL= 1.334414e-10
##$ISEN= 128
##$LB= 0.24
##$LEV0= 0
##$LPBIN= 0
##$MAXI= 10000
##$MC2= 0
##$MEAN= 0
##$ME_mod= 0
##$MI= 1.114404
##$NCOEF= 0
##$NC_proc= -6
##$NLEV= 6
##$NOISF1= 3.799351
##$NOISF2= 2.8
##$NSP= 0
##$NTH_PI= 0
##$NZP= 0
##$OFFSET= 16.02479
##$PC= 1
##$PHC0= -11128.86
##$PHC1= 18.80103
##$PH_mod= 1
##$PKNL= yes
##$PPARMOD= 0
##$PSCAL= 0
##$PSIGN= 0
##$REVERSE= no
##$SF= 200.129997328994
##$SI= 16384
##$SIGF1= 3
##$SIGF2= 2
##$SINO= 5.538805
##$SIOLD= 16384
##$SREGLST= <1H.CDCl3>
##$SSB= 0
##$STSI= 16384
##$STSR= 0
##$SW_p= 3396.73913043479
##$SYMM= 0
##$S_DEV= 0
##$TDeff= 16384
##$TDoff= 0
##$TI= <>
##$TILT= no
##$TM1= 0
##$TM2= 0
##$TOPLEV= 0
##$USERP1= <user>
##$USERP2= <user>
##$USERP3= <user>
##$USERP4= <user>
##$USERP5= <user>
##$WDW= 1
##$XDIM= 16384
##$YMAX_p= 408817177
##$YMIN_p= -342136
$$ End of Bruker specific parameters
$$ ---------------------------------
##NTUPLES= NMR SPECTRUM
##VAR_NAME=  FREQUENCY,     SPECTRUM/REAL,   SPECTRUM/IMAG
##SYMBOL=    X,             R,               I
##VAR_TYPE=  INDEPENDENT,   DEPENDENT,       DEPENDENT
##VAR_FORM=  AFFN,          ASDF,            ASDF
##VAR_DIM=   16384,         16384,           16384
##UNITS=     HZ,            ARBITRARY UNITS, ARBITRARY UNITS
##FACTOR=    0.207333158178282, 1,           1
##FIRST=     3207.04114190915, 0,            0
##LAST=      -189.697988525643, 0,           0
##MIN=       -189.697988525643, -342136,     0
##MAX=       3207.04114190915, 408817177,    0
$$ Real data points
##PAGE= N=1
##DATA TABLE= (X++(R..R)), XYDATA
$$ [...]
7619A2091k1471L088n7259n2181L3283N245m9838J953P5837J85168j25750J6686
7607B6852J280R8579J434j07915n5838k8885j3736l3835N9864P4149J42778m1013
7595A23714j60673j675J03768P4008r8233m6212M1685l0096j09907l3202R9991
7584c6832K2369L5411j4776q8586r521K0918J4928m499M5704j65972l5069P8951
7572a36974M4373L4256k3216L9906n9208Q123l122Q517N0369M3576o366k3928
7560b3694j9638P9614o2071M1083J6825j9753L373n6376r9683O7489m9638L5761
7548h6708P6372l0186j0055m9972k1643l1909Q3946j10301K274N880k6174J51726
7536d6750M561l1247k0125l34P827m018P6373M844K6521n0325Q204L4867k0901
$$ y = [12091, -9380, -6292, -63551, -115732, -82449, -77204, -127042, -125089, -49252, 135916, 10166, 26852, 28132, 126711, 128145, 20230, -35608, -64493, -78229, -112064, -52200, 21949, 164727, 123714, -36959, -38634, 65134, 139142, 40909, -5303, 36382, 6286, -103621, -136823, -36832, -14463, 20948, 6172, -82414, -91935, -71017, -56089, -60588, -14884, -180856, -215925, -136974, -92601, -58345, -81561, -41655, -100863, -92740, -95862, -87345, -36976, 6600, 234, -23694, -43332, 36282, -25789, 15294, 32119, 12366, 15739, -40637, -140320, -72831, -122469, -86708, -10336, -40522, -50577, -100549, -122192, -154101, -70155, -180456, -178182, -172302, -198476, -46750, -42189, -73436, -93561, -93895, -86068, -90086, -13713, -8869, 17652, -32673, -24469, 10398, -10503]
7523a0503r6511j7039J09084J6357L017p3800R732L4022n7594m9161K2557n2417
7511a62256J64505N585q1122J6498n3441j1978N736o4728L1125O5544M5850j12270
7499a50952J19749k0084o0579k1582k9036K9215l0400N7042N4646N1957r9438
7488i9462J08380q552j13259O557J6115q3342J18646L6407m6943M2595m7375L030
7476f7203J7314K1674k7084P322M8520l594l3720o4873r3188k4889O9584m2030
7464a92167M8326M6471O3362n8742p4924J4501P0234k7040m9036N0034j9525J2664
7452a15842l243P1607Q944n8243P7582P2091j26680k4330o6977O1355K3761J3820
7440f6155M273J5312J06001K6081j59576j50289K0846J46107M8850p4079j6498
$$ y = [-10503, -107014, -124053, -14969, 1388, 4405, -69395, -59663, -25641, -83235, -132396, -109839, -162256, 2249, 7834, -73288, -56790, -110231, -122209, -116473, -181201, -150076, -84532, -38682, -150952, -31203, -51287, -111866, -133448, -162484, -133269, -163669, -106627, -51981, -24, -99462, 8918, 366, -112893, -106336, -90221, -173563, -54917, -18510, -65453, -22858, -70233, -67203, -49889, -28215, -55299, -47977, 543, -3051, -36771, -101644, -194832, -219721, -150137, -192167, -143841, -97370, -34008, -92750, -167674, -153173, -82939, -109979, -159015, -108981, -128506, -115842, -119085, -47478, -38534, -96777, -19195, 52896, -73784, -98114, -165091, -103736, -79975, -66155, -61882, -46570, 59431, 85512, -74064, -224353, -203507, -57400, -8550, -82629, -99127]
7429i9127p7004N7959M1343J0299J227J918r8512L4506j0404p7031j1764q611
7417b35201j2425O1154O5546l964r7962P7090Q3831n9968n1838J29722P7005j32016
7405i9026K6820J43341q3523m7869o1898o2188L8344o4633J6769J10784j05208
7394a88287N9148o20m7185M8337j23076n3181K1692P9306L9013M3212M2250m1005
7382a20396l0626L723J3560R0256L3768q8821l1700p6708J8040R3927p2330J674
7370a65633k7535N3653J46771o2060n6786Q8815k5418j845o2375m1502N3990M4963
7358e4962M783N6338j9645o5762J7923l6868n5191l6191R4170l4870q554J10925
7346b7904o5946m8542o5729L876J41400L4748j16451J17p026L2741Q3743o5977
$$ y = [-99127, -176131, -118172, -76829, -66530, -65303, -63385, -161897, -127391, -137795, -214826, -226590, -235201, -247626, -186472, -120926, -124890, -222852, -145762, -61931, -121899, -173737, -44015, 32990, -99026, -72206, 71135, -12388, -60257, -122155, -184343, -145999, -210632, -193863, -83079, -188287, -129139, -129759, -176944, -128607, -251683, -304864, -283172, -203866, -164853, -121641, -79391, -120396, -151022, -147299, -133739, -43483, -9715, -98536, -130236, -206944, -188904, -94977, -167307, -165633, -193168, -139515, 7256, -54804, -111590, -22775, -48193, -50038, -112413, -153915, -99925, -54962, -50179, 6159, -13486, -79248, -61325, -98193, -153384, -189575, -95405, -130275, -138829, -27904, -93850, -142392, -208121, -204245, -62845, -28097, -144548, -144431, -151457, -118716, -34973, -100950]
7334a00950P0028O5287l8749j02386J0880k6816J1710K4046j0605Q6051J369k1901
7322c2036o3489N912J12462K6585j15943K937j6324q5509k5265M2010p198J6515
7310a39343j322L4278K5296J9627k0428m7284l6993J04415M9564J611j45795M5662
7298a10712Q8037l1722O412M7861j1131m0261o4715j8662k1059O3709J50099O7841
7286A25697q5999o3356j0510k7003P708J34309l5375j24212j2767M6546J3696
7275c1266M0531O7408n7515j32920m2387M708L4257J04332l5430l7741k6578J2420
7263a00181k0932J42870n2281r7706O2187m7935k5288J09484n9208m737n1011
7252a44738Q9025j3366k8149n2253p266N0762m6308l2389j5228J07502J971L392
$$ y = [-100950, -30922, 34365, -4384, -106770, -95890, -122706, -110996, -86950, -97555, -11504, -10135, -32036, -95525, -89613, 22849, 49434, -66509, -63572, -79896, -165405, -190670, -148660, -155858, -139343, -140665, -106387, -81091, -61464, -81892, -129176, -166169, -61754, -12190, -10579, -156374, -110712, -22675, -54397, -47985, -124, -11255, -51516, -116231, -134893, -155952, -92243, 57856, 125697, 39698, -23658, -34168, -61171, -53463, 80846, 45471, -78741, -91508, -44962, -31266, 9265, 76673, 19158, -113762, -156149, -151441, -117184, -12852, -48282, -86023, -112601, -100181, -121113, 21757, -30524, -128230, -66043, -113978, -139266, -29782, -88990, -93727, -144738, -55713, -69079, -97228, -149481, -156747, -105985, -152293, -184682, -199910, -92408, -90437, -87045]
7240h7045K5402N2780O2146q5047k6780n59L1724M1574k5019n1024o3292j3674
7228a38814m1343M7669R0337p5355M5065P3647k8966r1269P0013K4724O0196J5096
7216E1000P2689o5569M5451M1243j42316j9989Q2638n6846M1476R8216l7593N9471
7204A69871n5794k0443N349K5670M3756M3405j39358p0877L7569M980m8202L1234
7192B7160j7657o1068M4383k2671J3370o1344L5806M5810q145r778K2758O4797
7180G3421j4989O5142j5651K9646L0782p3741K1640K841J6454K5899O96N0577
7168B12717l0699r3743o681J53357o0931k7368l1396j01976Q875O4499Q090N3175
7156A47919J541j20652K6637L6290q5839K0929J02769l4808n4931l5546o139J06850
$$ y = [-87045, -61643, -8863, 53283, -31764, -58544, -59103, -27379, 14195, -10824, -61848, -125140, -138814, -180157, -132488, -42151, -117506, -72441, 1206, -27760, -119029, -49016, -24292, 35904, 51000, 123689, 58120, 103571, 144814, 2498, -17491, 65147, 8301, 49777, 147993, 110400, 169871, 114077, 93634, 98983, 124653, 168409, 211814, 72456, 1579, 39148, 44128, -4074, 27160, 9503, -51565, -7182, -29853, -16483, -77827, -42021, 3789, -4356, -14134, 8624, 73421, 58432, 123574, 107923, 137569, 168351, 94610, 116250, 119091, 135545, 161444, 162140, 212717, 182018, 88275, 81594, 234951, 174020, 146652, 115256, 13280, 22155, 86654, 94744, 147919, 149460, 28808, 55445, 91735, 5896, 26825, 129594, 94786, 39855, 4309, -1830, 105020]
7144A05020o5351q5994O9321O8876j2201J5665l8746r9769M913P1769N3018L7859
7132A24380K3601j706l8736m5033J1084J01069m6756J0387m3574k3565k3786P9242
7120A26607m131O0629l7858q0209P9947m3391K2128n2969J3249p2961j6297m61
7108e717l687l3741P448J02308q6737J2709J13383l2450r034k5626o1333k1890
7096d4367P9346J2713m2571J02104K6306O0206l1350j13680L5246j04585n5015
7085g5647O206q017J1744O519j28O5381l1262L0093Q2369j1922P71o0930o2040
7072d6863J16956N9630m5953j8680m0874l8181K4468m048j63022Q3981M6866p7830
7060a03550P3858r768L9980j5108j2536k798O8946J3493j07367J09482k5147j2277
$$ y = [105020, 39669, -46325, 22996, 91872, 79671, 95336, 56590, -43179, -38266, 33503, 86521, 124380, 147981, 146275, 107539, 62506, 73590, 174659, 127903, 138290, 94716, 71151, 47365, 126607, 122476, 183105, 145247, 65038, 144985, 101594, 123722, 70753, 84002, 11041, -5256, -5717, -9404, -43145, -35697, 66611, -20126, -7417, 105966, 73516, 64482, 38856, -22477, -44367, 34979, 47692, 5121, 107225, 133531, 193737, 162387, 48707, 83953, -20632, -75647, -69441, -77458, -65714, -59195, -59323, 6058, -25204, 4889, 87258, 75336, 76107, 15177, -46863, 70093, 129723, 83770, 65090, 24216, -13965, 10503, 6455, -156567, -72586, -25720, -103550, -29692, -39460, 520, -14588, -27124, -29922, 39024, 52517, -54850, 54632, 29485, 17208]
7048A7208J7463M927p334n4448l7886R1402P6449l2992j44729N6398N5201n9172
7036a7513n8594l8488L6084P1944O542N1498j21950p3374J82334N5326j42527
7025d8718r148J1934n1836J19960m4592k2124Q4798m3631K102L7959p4869M0090
7013A925R636K0127n5017J7531l6795R603O0278R3125j08597j7423O7013L0423
7001I1829p8718o3741R840j1307J8241p358j35587N8319L1861j0176l7144J00464
6989c3477N4558O0698m8414L7017K4953j17268L0749J9139l0727l0096P8640r879
6977C5893o0453l215O9246j9986J4534p2301r1081N914L8823m5507J7603o2954
6965a73484O6813J02606L0865J1443k5186K829Q7396m3330l3702K8242l841L003
$$ y = [17208, 34671, 39598, 32264, -22184, -60070, 31332, 107781, 74789, -69940, -13542, 41659, -17513, -76107, -114595, -78511, -6567, -25, 51473, -70477, -143851, 38483, 93809, -48718, -57866, -45932, -97768, 22192, -22400, -44524, 40274, -3357, -1255, 36704, -38165, 1925, 11561, 31688, -23329, -5798, -42593, -32990, 27288, 120413, 11816, -5607, 61406, 91829, 13111, -50630, -40790, -52097, -33856, -41214, -176801, -118482, -86621, -96797, -133941, -33477, 21081, 81779, 33365, 70382, 95335, -21933, 8816, 27955, -2772, -32868, 45772, 35893, -24560, -27775, 41471, 21485, 36019, -36282, -127363, -121449, -82626, -128133, -110530, -173484, -106671, -4065, 26800, 38243, 13057, 15886, 103282, 59952, 26250, 54492, 50651, 53654]
6953E3654k2006j40079O4702J17376o5761M5716P3825n4062r3645k2818o0131
6942a03229P3173J3140p5506M2142P4039K5282j1589r8892Q0634J07261j25835
6931F20R117J8966k6012P802q1362l8951J07932M0183m1499l9106J7616N1709
6919B7015L1141n8953O1047K2141l6296j7305Q6164j754l3326L8124l8358n4741
6907B4899p4407J1593M0448J47652K2579o0280o6650j36972K667Q3806l5218m9213
6895h9096J56614R306j6158o1888L6579P8988o3460o8680p3647p026N7265J6383
6883b4820l8265p680p8316q375J42280N7550k9582L3612j9521k2034J38117q950
6871A34016k4497o1600m0464n5196J63474L5401k3244L1991j17791j2536Q8283
$$ y = [53654, 31648, -108431, -43729, 73647, 7886, 53602, 127427, 73365, -20280, -43098, -103229, -30056, -16916, -92422, -50280, 23759, 49041, 37452, -61440, 19194, 126455, 620, 9737, 28703, 2691, 10493, -70869, -109820, -1888, 38295, -3204, -42310, -24694, 27015, 58156, -797, 60250, 82391, 46095, 28790, 114954, 113200, 79874, 117998, 79640, 24899, -49508, -37915, 2533, 150185, 172764, 112484, 45834, -91138, -88471, -4665, -39883, -89096, 67518, 76824, 60666, -1222, 35357, 114345, 50885, -17795, -91442, -98468, -41203, -24820, -63085, -70765, -149081, -157456, -15176, 42374, 12792, 46404, 26883, 4849, 142966, 134016, 109519, 47919, 7455, -47741, 115733, 151134, 127890, 159881, 42090, 29554, 117837]
6860A17837p6230J6571n939m3837j0999K7987k4516n7583P6419K8475R1875o3872
6848G6188m7390J5981m1839O193R7734O4075j3946m4089p7876L167J8941r500
6836D7639l748p8999M5112j2024l8962p981Q4853L8101M431p5351M8986p779l7555
6823F723K5203J8015L6360k3556j302J14151n3686m3335M1412M5484n9170n7440
6811D8859L6358K3948n8770K7713Q5307m56q9264l0513J6727Q0627q9288j76862
6799a25614J04656N6995l7168L6179j28380Q2557O2575k3877o5190K7975k736
6788a2028L1104k2026P3661L7739m0053m9946l8290P0911P6896l5816r5029k6201
6776b9078j507P176j8228L3639M4180k0225l9078J9491L5512L2726l6225P3238
$$ y = [117837, 41607, 58178, 52239, 8402, -2597, 25390, 874, -56709, 19710, 48185, 140060, 76188, 28798, 44779, 2940, 9133, 106867, 170942, 156996, 112907, 35031, 38198, 57139, 47639, 43891, -35108, 10004, -2020, -40982, -48963, 35890, 73991, 78422, 3071, 52057, 44278, 6723, 31926, 49941, 86301, 62745, 61443, 175594, 121908, 78573, 119985, 165469, 106299, 48859, 85217, 109165, 50395, 78108, 163415, 162959, 73695, 43182, 59909, 140536, 51248, -125614, -20958, 36037, -1131, 35048, -93332, -10775, 51800, 27923, -37267, -9292, -12028, 19076, -2950, 70711, 108450, 68397, 18451, -19839, 51072, 127968, 92152, -2877, -29078, -30585, -23409, -41637, -7998, 36182, 15957, -23121, -3630, 31882, 64608, 28383, 101621]
6764A01621k9370j2247M4106M4730p1607p4616J7355O6413K447O1681j15639N7952
6752I2826N5028K6747j6108m0943p1629P5227J9273q508j11921j756J19325j9257
6740A18304j00811N8671j7674m9422J2168N2603q915L7369O4244r7530J8601M743
6728I2351l9477o6176J4911P2625N6132r8651o176L2680n2746m964P9145j6806
6716F2848k2312n534J03290J3874k1854r7765Q9076J2008l8683Q1733m1756j14438
6704B0487k6776J03686J1539O556J554r1384k7056N6669p1490k477L9006j12630
6692i2316M7708N1274k2057J39871o2587N6030j16769J05378J01873m9444n4710
6681A04251Q117J0275j04466J4131J38349q61m3476j4783P261l2715o7130J50315
$$ y = [101621, 72251, 60004, 104110, 148840, 77233, 2617, 19972, 86385, 88832, 150513, 34874, 92826, 147854, 174601, 158493, 117550, 45921, 121148, 140421, 131913, 19992, 18236, 137561, 118304, 17493, 76164, 58490, 9068, 21236, 73839, 64924, 102293, 166537, 69007, 87608, 92351, 52874, -13302, 1609, 74234, 130366, 31715, 25539, 58219, 5473, 509, 79654, 62848, 40536, 35002, 138292, 152166, 130312, 32547, 121623, 133631, 94948, 176681, 134925, 20487, -6289, 97397, 108936, 115492, 117046, 25662, -1394, 55275, -16215, -18692, 20314, -92316, -44608, 6666, -15391, 124480, 61893, 117923, 1154, 106532, 208405, 158961, 104251, 112368, 122643, 18177, 32308, 170657, 169796, 126320, 111537, 118798, 86083, 18953, 169268]
6669A69268M5136o2860K8113j6486m5920k1490n1268J1784L2004l0137M4819J8384
6657A21347j11123J21872K3017l4590o0746R834K350Q2429n897j5636K0122o6876
6645H6103l2599O0371r360M9709P6293J1305n1782M4513J1587M0390j31865O429
6633A61094k8759p9770Q7014L5217K9385p8729K0231m732J17625R504r7909n1880
6621A18291N1101j04953M6843p0309k3869J45579J0607K5924M1779j6608p0212
6610A54173m3680m1865m5311P6826O5959o3432N8866j4761P2618J4331l5411m771
6598A93542n6220o9110K0679N6705l6380l6660j7639J2432R9040j11348m053J86599
6586B37587M9506l7855k4247q3885j9727O5605l9745O5494K4963j58924M4100
$$ y = [169268, 214404, 151544, 179657, 163171, 117251, 95761, 44493, 56277, 88281, 58144, 102963, 121347, 10224, 132096, 155113, 120523, 59777, 69611, 71961, 154390, 148493, 132857, 152979, 86103, 53504, 113875, 104515, 154224, 230517, 241822, 190040, 234553, 246140, 286530, 154665, 161094, 132335, 52565, 139579, 174796, 204181, 125452, 145683, 140951, 258576, 268080, 170171, 118291, 169392, 64439, 111282, 40973, 17104, 162683, 173290, 199214, 240993, 224385, 154173, 110493, 68628, 23317, 100143, 166102, 102670, 161536, 146775, 219393, 233724, 198313, 193542, 137322, 68212, 88891, 145596, 109216, 72556, 54917, 67349, 166389, 55041, 50988, 237587, 287093, 249238, 224991, 141106, 121379, 186984, 147239, 212733, 237696, 78772, 122872]
6575A22872P394j4411Q9231o3421l0612L0004J3821O2605j7133o0852J6055l258
6563A52295q6586K1393P7338j0545J2349k1426q731k2957l1212k6089M3685J16294
6551B15808R718n5302L6679m7566O885l9390n4183p8331O8203P0401M6951m0867
6539A39006O3356Q6876o2164j08404q050k1174k7013P4160Q992M8937K4637j7424
6527B01735J2059k072j32041M3128j00935L4520J33727p8274k0154N0848q9450
6516E3091O1205J22615j27716K5445K4383j09976J42004j15078p2073J17348k7953
6505I3295J6261J9193k6174n4690K7235j6367L3529J85959n3773m4019P3013j4666
6493B38796l6753j04471M3406M14k6639O9901j795M778N4686M1954j07332p8115
$$ y = [122872, 130266, 115855, 205086, 141665, 111053, 141057, 154878, 217483, 200350, 139498, 155553, 152295, 65709, 87102, 164440, 153895, 166244, 144818, 136087, 113130, 81918, 55829, 99514, 215808, 225526, 170224, 206903, 159337, 166222, 126832, 72649, -5682, 62521, 132922, 179873, 139006, 202362, 289238, 227074, 118670, 110620, 89446, 62433, 136593, 145585, 194522, 219159, 201735, 213794, 211722, 79681, 122809, 21874, 56394, 190121, 111847, 91693, 142541, 53091, 114296, 236911, 109195, 134640, 159023, 49047, 191051, 75973, 3900, 121248, 93295, 109556, 128749, 102575, 47885, 75120, 58753, 92282, 278241, 224468, 180449, 253462, 238796, 202043, 97572, 140978, 141392, 114753, 184654, 182859, 187637, 242323, 284277, 176945, 98830]
6481I8830J39872j026j1945K9787j4020p7525N758m7014J18335P3837J1478j11811
6469B14556j5982l9489Q1844J7991j27707J04973k8261K4173n2332p5493O4984
6458A69257M4137q0080m3111L5283J01337k4353J6809M9651l1704j03862k5276
6447A08088P3840Q3438q5476N778J9064j06929Q879O6949N314m8956k95j2039
6435A17655N7317n4413J22357J5668k09611N7926O3407J1118J7363l1242O0500
6424B28045J4538k016j026n656j16305M9281N2451k2030j7043N4594n8590j32942
6412D3301J05067O6955l4441J0691L832m5475O7621r6188J15793L3227p3243O3931
6400B61071L4659k8011M5119q5861K1316l2818r848P400o1117j4784O1693M1210
$$ y = [98830, 238702, 237676, 225731, 255518, 241498, 163973, 169731, 122717, 241052, 314889, 326367, 214556, 198574, 159085, 240929, 258920, 131213, 236186, 207925, 232098, 179766, 104273, 169257, 213394, 133314, 90203, 125486, 226823, 202470, 219279, 268930, 237226, 133364, 108088, 181928, 265366, 179890, 185668, 204732, 97803, 106682, 173631, 178945, 129989, 129694, 117655, 174972, 120559, 242916, 258584, 48973, 106899, 170306, 181424, 198787, 167545, 228045, 242583, 240567, 239541, 233885, 117580, 166861, 219312, 197282, 180239, 234833, 176243, 43301, 148368, 215323, 180882, 191573, 195405, 149930, 217551, 121363, 237156, 270383, 197140, 261071, 295730, 267719, 312838, 226977, 248293, 215475, 205627, 213027, 151910, 137126, 198819, 240029]
6388B40029q530O451M2804m2566K4743Lp1010j5051o7205J0668J07892K7721n1565
6375B04384K7770O4356n9138J05769l1440j33587O9035j7889Q7969n141j2702
6364B99386M4380m0227j22901L4598N3878O4036l4522n2579N674M4750q1904R4
6352B14663P0938k708j4417n310j89404N5810L9428J16719K4946j12863L6696
6341B34498P3023Q6301r2718L295N0655j28037M3188P795o4994J04813j07805
6330B10014k5942M2073K7896j1236M0492J151L441j9129j33199p86J57406l1102
6318B61079k3817N2501R0468j9677n0445j1830K7387j5504p2091J4271q250n1721
6306A92371J30295m3745n0795L9947L6315L0071l1758n2459m1620K6934m3337
$$ y = [240029, 231499, 237950, 280754, 238188, 262931, 262934, 191924, 176873, 109668, 120336, 228228, 255949, 204384, 232154, 296510, 237372, 343141, 311701, 178114, 247149, 229260, 317229, 312088, 299386, 343766, 303539, 180638, 215236, 269114, 333150, 298628, 246049, 251723, 296473, 214569, 214663, 285601, 282893, 268476, 263166, 73762, 129572, 169000, 285719, 310665, 197802, 234498, 307521, 393822, 301104, 304399, 355054, 227017, 270205, 278000, 213006, 317819, 210014, 184072, 226145, 254041, 242805, 283297, 284448, 287889, 268760, 135561, 134775, 292181, 261079, 237262, 289763, 380231, 360554, 310109, 298279, 325666, 310162, 238071, 252342, 244092, 192371, 322666, 278921, 228126, 268073, 304388, 334459, 302701, 250242, 208622, 235556, 192219]
6295A92219O9917m6254j7968R6444k3886R456M3065j28722N578M5609r1827j602
6283A52029J2766L7098L7284P2704n1339o9343L6840k1409M0182M6425m8978o713
6271B37546O454J7594J00680n875m1950n5675N0012l5740M3481N0209n0579k393
6259C13764J5160q4857k5533N0655N2197r9963j09549J0422Q6688L5678j21748
6248A22914J22214k3590L5690n9878k8343J09163Q6426j2016m4318k7170r69K407
6236B82530j7070P1393j8417P5630P3270o5453m5819R6824o0005o2527J7893J2398
6224C60647o0379L908q0439N4019o642o7432L1865l1477j378l9361L5260L778
6212B02369P5195J0558j14861J18054n194K9924M5360o4523J1231N5584o7806
$$ y = [192219, 262136, 215882, 197914, 294358, 270472, 279928, 322993, 194271, 199849, 245458, 153631, 152029, 164795, 201893, 239177, 311881, 260542, 191199, 228039, 206630, 246812, 293237, 244259, 237546, 244000, 261594, 362274, 356399, 314449, 258774, 308786, 273046, 316527, 366736, 316157, 313764, 328924, 244067, 218534, 269189, 321386, 221423, 111874, 122296, 208984, 244662, 122914, 245128, 221538, 257228, 197350, 169007, 278170, 364596, 352580, 308262, 281092, 280123, 282530, 265460, 336853, 318436, 394066, 467336, 401883, 356064, 452888, 392883, 330356, 348249, 360647, 300268, 304176, 223737, 277756, 271114, 203682, 235547, 204070, 202692, 163331, 198591, 202369, 277564, 288122, 173261, 291315, 286121, 316045, 361405, 296882, 308113, 363697, 295891]
6201B95891j33370J06831J04699r4405k9515N2010l5235q6526J2836Q1972k1935
6190B53253Q2819N0635j5238j5198j1729m9336p3523L8964J63538r751k8342j52266
6178B33826J04095Q9709m5328q830J1335m5052k7718N1772j07906L8626L3340
6167C27869o7097M7602Q5038q165R3362j07414m7143k4558q0675L8689j4956N826
6155B48378P4176n8221k1683M2115l7621p146n242N0395J8527N0758p2388j480
6143B80568R6462j24615r257r6678K1643P9201L1018j16419K4741R5131K7730
6132C09525M1721j3339L7042n5364j4383Q4267R0016r0206M4114j15925k5853
6121B91615k0236J04730O7002j00283o4528K9382k2738K6531K5054k618K8304
$$ y = [295891, 162521, 269352, 374051, 279646, 250131, 302141, 266906, 180380, 193216, 275188, 253253, 336072, 386707, 371469, 356271, 344542, 295206, 221683, 260647, 424185, 414434, 386092, 233826, 337921, 427630, 382302, 373472, 384807, 339755, 312037, 363809, 255903, 294529, 327869, 260772, 308374, 393412, 385247, 478609, 371195, 324052, 299494, 218819, 257508, 242552, 248378, 322554, 264333, 242650, 284765, 247144, 239998, 234756, 285151, 303678, 354436, 282048, 280568, 377030, 252415, 243158, 146480, 168123, 247324, 278342, 161923, 186664, 281795, 309525, 351246, 337907, 374949, 319585, 305202, 389469, 479485, 389279, 433393, 317468, 291615, 271379, 376109, 443111, 342828, 278300, 307682, 284944, 311475, 336529, 333911, 362215]
6110C62215M721m0108k5948l0703L3382O7611p8776N1112J14118o9843q8026k9174
6098B70581O0693O0364l1668l9229l4230n437O5103J6066p9162L7692L1148J2360
6086C64281q6530L9848p00R2322R888K0880K4024q2355l4594n980N9264K5942
6074D26290p7049j12769L7115R5435J5624j3392M3226q948n1853j976j0876p101
6062C33726L465P8002j8198m7867O7386p3757Q8765K9119l2580K2597p4534j1830
6050C64294J25991K4615m0566L7825P461n3042j17967L6262q775p805o0988N7657
6038C64962K6123M2108o193o6109k4567L6565l6808o6230M9392K1299k9502j9585
6026B91455J0349J6975J13277k7058n171O1953k6760q1765j3452N9396Q7426k4935
$$ y = [362215, 366936, 326828, 300880, 270177, 303559, 371170, 292394, 343506, 457624, 387781, 299755, 270581, 331274, 391638, 359970, 320741, 286511, 281074, 346177, 362243, 283081, 320773, 351921, 364281, 277751, 317599, 316899, 409221, 419109, 439989, 464013, 381658, 347064, 341084, 400348, 426290, 349241, 236472, 273587, 369022, 384646, 371254, 414480, 405532, 353679, 351703, 340827, 333726, 337191, 415193, 396995, 349128, 416514, 342757, 431522, 460641, 428061, 450658, 376124, 364294, 490285, 514900, 474334, 512159, 519620, 466578, 348611, 384873, 376098, 368293, 307305, 364962, 391085, 433193, 427000, 360891, 336324, 372889, 336081, 269851, 319243, 340542, 311040, 291455, 301804, 318779, 432056, 404998, 399827, 461780, 435020, 353255, 339803, 399199, 486625, 461690]
6014D61690q3152k8325p256K0726J2458o320P1823O7060K5260p875j28303O6359
6002D64145L4464k269p5754m3681k4582M4807L8633l7916n1209m2830j4287J9789
5990C09310o200O1318q733p001N0819m2625O0768k9988N1244Q8496J1164j59184
5978C79388M4607J0521k0930N7533o7784K2431n2648O0662R3588j09399k4559
5967C93410m1016J02144L118j5971R2993M6797q0133q2066R4655n7294r1947N8358
5955D23048k0524M8301N1160l2613n878l939l4816L6872k1308j7732j925N5623
5943D76269k9396M4607o9108l9067M6878K9707k7202r1736J20317P6877l9857
5932D98289L6206P8919J4930L8734o6951l5780j2292J5839l0496k0625p1942M0882
$$ y = [461690, 378538, 350213, 342957, 363683, 376141, 369821, 441644, 508704, 533964, 526089, 397786, 464145, 498609, 496340, 420586, 376905, 352323, 397130, 435763, 397847, 346638, 303808, 289521, 309310, 303110, 364428, 355695, 348694, 399513, 356888, 417656, 387668, 438912, 527408, 538572, 379388, 423995, 434516, 413586, 471119, 403335, 425766, 373118, 433780, 527368, 417969, 393410, 352394, 454538, 457656, 441685, 534678, 581475, 501342, 419276, 513931, 456637, 364690, 423048, 402524, 450825, 501985, 469372, 463494, 459555, 424739, 461611, 440303, 422571, 420646, 476269, 446873, 491480, 422372, 383305, 430183, 459890, 432688, 340952, 461269, 538146, 498289, 534495, 613414, 628344, 667078, 600127, 564347, 552055, 567894, 537398, 516773, 444831, 485713]
5920D85713l7366j7507N4411q0231R554K5533J7667J5001m760k4028j537K4952
5908D67402N9639J9861q7783M8190N1255n4552r913l3359q605J47374n586j81845
5896D12078O5885m691Q4559M7141j16314K6928N7505M4100m4918j4459L801k5863
5884E35752n3075K3495m2289K5034K4907j5689k4743n136K3932o1311J33963O779
5872E71619j06209K1428P1664O5560O711j15360k6480P8540n9778j0322J14160
5861F11533n955L5707o780j8342k6303m2470R8296m1905m3297J586l625r2346
5849D66099n093R4185R6759l2714l9557n8758R0205R1005J05594K4732j15678
5838G16779j3989J8153l8638m2699j4408R4930k966m9589j1469M5650Q0497N0392
$$ y = [485713, 448347, 430840, 485251, 405020, 414574, 440107, 457774, 472775, 468015, 443987, 442450, 467402, 527041, 546902, 459119, 507309, 558564, 504012, 494099, 460740, 452135, 599509, 593923, 412078, 477963, 473272, 557831, 604972, 488658, 515586, 573091, 617191, 572273, 557814, 561615, 535752, 482677, 506172, 463883, 488917, 513824, 498135, 473392, 468256, 492188, 430877, 564840, 571619, 465410, 486838, 558502, 624062, 630773, 515413, 488933, 567473, 507695, 497373, 611533, 605578, 641285, 634505, 616163, 589860, 547390, 645686, 603781, 560484, 562070, 558445, 466099, 461006, 555191, 651950, 619236, 579679, 520921, 611126, 702131, 807725, 832457, 716779, 702790, 720943, 682305, 639606, 625198, 720128, 717162, 667573, 656104, 701754, 782251, 832643]
5826H32643L325p9071R3883q9986J795J60301k3189k2638j18947J9281N687j00270
5814F82814J2668Q5322j494K0420P0602p9312j7220k6208K070n030M4995P3306
5802H62933J7806m0494K355J12725j08990j2464R309j2059K7922l2339q071k01971
5790F16662O9612N5094l5795J8453p5162j1063K8254r3572L2635M0370Q2018j9783
5778G07723O6784K2793p3772j13011M4342Q4106o0685m6581P7686p2191m8632
5767E88562J30708r1040j04172P4675n0045r1787R6701l665J15404p816j61582
5756D95943P2187k557p1746j191N2662J59744m7173m5684K3374N6878j13550p3873
5744E05014N4331o4308J1676J13737o809J8865j3331l7438l9802l1353N7381Q5404
$$ y = [832643, 835968, 756897, 850780, 760794, 762589, 922890, 899701, 877063, 758116, 777397, 783084, 682814, 695482, 780804, 779310, 799730, 870332, 791020, 773800, 747592, 749662, 744632, 789627, 862933, 880739, 840245, 842600, 955325, 846335, 833871, 843180, 831121, 859043, 826704, 818633, 616662, 686274, 741368, 705573, 724026, 648864, 637801, 666055, 572483, 605118, 645488, 727506, 707723, 774507, 797300, 723528, 610517, 654859, 738965, 678280, 631699, 709385, 637194, 588562, 719270, 628230, 524058, 598733, 548688, 456901, 553602, 549937, 665341, 657525, 495943, 568130, 565573, 493827, 492636, 545298, 705042, 657869, 612185, 635559, 692437, 578887, 505014, 559345, 495037, 506713, 620450, 613641, 632506, 619175, 581737, 541935, 510582, 567963, 653367]
5732F53367n424n1424k0195O9256O450l8336P5265O3443N930j0638K8402r4015
5720F82081n2743Q1669n3179q01N7159J23477o2670r1412M4154L6538p5663j4671
5708F73939N1782N1413L699r1328M7019J7407O0703p6495p6091N846P1360M430
5696G43684l5785n3258m2811O665l8228Q3621L8093r7995j5431J44253o0515m5781
5684F26512O8087N4725J4895p6577j07106m573J07969Q9854L1631Q792q4671k5881
5672G03657Q4594r936o7074L3912J34162j13662k7863M1118J0375p4996M5224
5661G59511q416Q955l1225j14991K9049L172J8131P6313m7536j27285J4158J65912
5649G45748L8631p2826O4623j88081n7068J4919J95704J03135q9987j26832p7678
$$ y = [653367, 647943, 596519, 576324, 645580, 652030, 613694, 688959, 752402, 758332, 747694, 776096, 682081, 629338, 711007, 657828, 657027, 714186, 837663, 774993, 683581, 727735, 764273, 688610, 673939, 725721, 777134, 780833, 689505, 736524, 753931, 814634, 738139, 662048, 667894, 739254, 743684, 707899, 654641, 611830, 618495, 580267, 663888, 701981, 603986, 588555, 732808, 672293, 626512, 694599, 749324, 764219, 687642, 580536, 575963, 683932, 773786, 805417, 814209, 729538, 703657, 788251, 778315, 711241, 745153, 879315, 765653, 737790, 778908, 789283, 714287, 759511, 751095, 760050, 728825, 613834, 642883, 646055, 664186, 740499, 692963, 565678, 579836, 745748, 784379, 711553, 776176, 588095, 531027, 545946, 741650, 844785, 754798, 627966, 550288]
5638E50288J79136r993K1442q289p5740K9639N4894l3260Q947j888Q7626P125
5626H09927p6232N8383j6360j50920M6126N0584o077M5477P4506p6409j879l8245
5614G18881p662O2882r4270n8153L51m5374O7884K09272j02016k0287K2954O0312
5602H14774j03314M3837m3283O2663O9914J7457P1422r0832j03167r3011p606
5591F38854O6770M2853j5606K2726R4277k2786r5702K0938m1326J27497M6033
5580H84528j18264K3277N9220M037l6916p7757p0773K3023j4613R161J45616J4367
5568H44906k9382m3444K827P0641M669p4275R1739j6261r7935J00353L9155j7087
5556H75906m8894L7559K5358l8082J3184j39233j3949J39960P6974k6848m2660
$$ y = [550288, 729424, 719431, 740873, 732584, 656844, 686483, 741377, 708117, 717064, 715176, 802802, 809927, 733695, 792078, 775718, 624798, 670924, 721508, 715431, 760908, 835414, 759005, 757126, 718881, 711219, 774101, 679831, 621678, 622029, 576655, 644539, 853811, 751795, 731508, 754462, 814774, 711460, 755297, 712014, 774677, 844591, 862048, 933470, 842638, 739471, 646460, 638854, 705624, 748477, 732871, 755597, 849874, 827088, 731386, 752324, 710998, 838495, 884528, 766264, 789541, 848761, 852798, 815882, 738125, 667352, 690375, 675762, 684923, 830539, 844906, 815524, 772080, 774907, 845548, 850217, 775942, 867681, 851420, 753485, 853838, 892993, 875906, 827012, 864571, 889929, 851847, 865031, 725798, 711849, 851809, 928783, 901935, 859275]
5545H59275j21626K2821Q5025K2447q0749n7096J53326O5377n4076n4153Q8081
5534I28652p6995M9992L0782j02865O3431P5544o9544J08840j78430j2325J25183
5523I42265P825m0613p8817o9767k1621Q8605j71499J15825J25297p5898n174
5512H16428J58951k8735j00453o2081N6060J68431j08763j24608Q3856L3l563
5501H55556q1320r4238J09742R1150j2049M6704j35572K11466J25531j04964M2743
5490A054749K3182o8978K4332M3572l9163o4565o5263k8674K1392P9243n4916
5479I24911K2026Q3230j51165l1115K9357o273L5401L8396r0N6355K796m6997
5467I56832P8924n9684R2792N366N0055q1683l0721l9440l8183N280K4714l8842
$$ y = [859275, 737649, 760470, 845495, 867942, 787193, 730097, 883423, 948800, 894724, 840571, 928652, 851657, 901649, 932431, 829566, 892997, 968541, 898997, 1007837, 829407, 817082, 942265, 950090, 909477, 830660, 760893, 739272, 827877, 656378, 772203, 897500, 821602, 816428, 975379, 946644, 846191, 784110, 840170, 1008601, 899838, 775230, 859086, 859119, 855556, 774236, 679998, 789740, 880890, 868841, 915545, 779973, 991439, 1116970, 1012006, 1054749, 1077931, 1008953, 1033285, 1076857, 1037694, 973129, 907866, 879192, 900584, 979827, 924911, 946937, 1030167, 879002, 847887, 877244, 870971, 906372, 944768, 944678, 1001033, 1003829, 956832, 1035756, 976072, 1068864, 1074230, 1124285, 1042602, 1011881, 972441, 934258, 939538, 964252, 925410]
5455I25410Q2758n1053M5880l4767o8552J43025L6343j02506Q728L9856n0446
5444I74676p307Q6604o1866j6671m0472L4405J26650j65249M1952K211Q3392k1439
5432A036886k2645L777n3951L0777J4677O0499Q3564n1974K7135o6574J7015O3196
5420A142382J6065N0305m8858N1636J40388l3057j13782n0553j9232k4447K7658
5409A138505M06N8632L3040l8305O529l7335P9991Q4085j6951N627p2723r835
5397A231666L8348n1756O1935M1809r3565M5776o662Q924L6128M8786N7733j00776
5385A318346K0418J26807p9201p5887P4723j00827l0756K00720J5693j02317o4601
5374A303118K2694O235m946q2498m3254J9739J01807N3074l4358o8668k7269P7107
$$ y = [925410, 1008168, 957115, 1002995, 968228, 899676, 1042701, 1079044, 976538, 985266, 1025122, 974676, 967369, 1053973, 992107, 975436, 934964, 969369, 1096019, 930770, 972722, 974933, 1058325, 1036886, 1014241, 1018018, 964067, 994844, 1009521, 1070020, 1153584, 1101610, 1128745, 1062171, 1079186, 1142382, 1158447, 1208752, 1159894, 1211530, 1351918, 1318861, 1205079, 1154526, 1135294, 1110847, 1138505, 1138911, 1197543, 1230583, 1192278, 1198807, 1161472, 1241463, 1325548, 1308597, 1314224, 1241501, 1231666, 1270014, 1218258, 1280193, 1322002, 1228437, 1274213, 1267551, 1276475, 1312603, 1361389, 1419122, 1318346, 1338764, 1465571, 1386370, 1310483, 1385206, 1284379, 1253623, 1454343, 1470036, 1367719, 1303118, 1325812, 1332047, 1327101, 1244603, 1201349, 1221088, 1322895, 1375969, 1341611, 1272943, 1245674, 1322781]
5362A322781n9403Q0348R5508j08533N6853l7140r321P9425p8262j8736J4324
5351A337844p116P105k9723j4812j346p3280l6891J11305M1456m6944J9073p9444
5339A227227O5024J7322J02391r2148K7562O6761l5208m1290n5232N0806J52621
5328A485836j992l2264k852j6402k5650Q5555J8650L5637l2698q0063Q966j40358
5316A302365k7266N8376M1962J11875J03186l3541l9378o2219K571L7681p8124
5305A417488n2651R2192j1151Q2142L1586m2783m7445M0086k7720L9582R7049
5294A618375M1461L9308p4672L1251J30143l2736q2906O7976n8545q4170L9103
5283A634588j3654k7533J6183r138J24799O3203L7787M9647k0610l1257n6883
$$ y = [1322781, 1263378, 1343726, 1439234, 1330701, 1387554, 1350414, 1341093, 1420518, 1342256, 1323520, 1337844, 1330728, 1337833, 1308110, 1293298, 1291952, 1218672, 1181781, 1293086, 1334542, 1287598, 1306671, 1227227, 1292251, 1309573, 1411964, 1319816, 1347378, 1414139, 1378931, 1337641, 1282409, 1333215, 1485836, 1483844, 1451580, 1448728, 1432326, 1406676, 1492231, 1510881, 1546518, 1513820, 1433757, 1442723, 1302365, 1275099, 1333475, 1375437, 1487312, 1590498, 1556957, 1517579, 1455360, 1457931, 1495612, 1417488, 1364837, 1457029, 1445878, 1528020, 1559606, 1516823, 1469378, 1509464, 1481744, 1521326, 1618375, 1659836, 1699144, 1624472, 1655723, 1785866, 1753130, 1670224, 1738200, 1679655, 1595485, 1634588, 1620934, 1593401, 1609584, 1600446, 1725245, 1788448, 1826235, 1875882, 1855272, 1824015, 1767132]
5272A767132k6526M311k1866j2866Q6257J03799L0133r1196j39112O8920J09610
5261A878596p320O2069K1487l371J9060m7640p1350J18353L4249J9696j1314j3235
5249A999280O3249R18l3001j4808J0538n893l9549k0904m1830P88P2319K9623
5237B020730j2422k1445q7823N0082Q2946Q5627M1470Q8758O0688m8908K2435
5226B282138J74763M6055m0528j3095O8686n422q2524L6223Q1487K21j04969O8422
5214B511457q3001n6615M898j1958n796N80j7182l8881O8318O4632o7284L2694
5202B401862k6077o2630P3038Q5233N2334P7704K8236j08022O7878M1224M1448
5191B672228O6083p0102L1422L7584m3569j8609O8550N9791r0625L808j6499l3106
$$ y = [1767132, 1740606, 1744917, 1723051, 1710185, 1796442, 1900241, 1930374, 1839178, 1700066, 1768986, 1878596, 1871276, 1933345, 1954832, 1951461, 1970521, 1922881, 1851531, 1969884, 2004133, 2023829, 2012515, 1999280, 2062529, 2063447, 2030446, 2015638, 2026176, 2020283, 1980734, 1959830, 1918000, 1918788, 1991107, 2020730, 2008308, 1986863, 1899040, 1949122, 2032068, 2117695, 2159165, 2247923, 2308611, 2259703, 2282138, 2456901, 2502956, 2462428, 2449333, 2518019, 2512597, 2430073, 2466296, 2547783, 2548004, 2443035, 2511457, 2428456, 2371841, 2376739, 2364781, 2358985, 2359565, 2342383, 2303502, 2371820, 2436452, 2369168, 2401862, 2375785, 2313155, 2386193, 2471426, 2523760, 2601464, 2629700, 2521678, 2589556, 2630780, 2672228, 2738311, 2668209, 2699631, 2737215, 2693646, 2675037, 2743587, 2803378, 2712753, 2716561, 2700062, 2666956]
5179B666956J7776L0797J35147n5447j05833M6129J27532o4320r5337L6173M0387
5168B779960P0596O1383n9677l2088J29435n4003k4407J2058p2476j8399P6217
5157B868599k5n2876N3866l5735j8959N984p3943m6083n0919k4185N9080n2353
5145B632451n1151k3845K3224M5708M3347q991n678q213N0140p9153M9987K8131
5133B695957o0455q598l5480l4951j1810N1686M0181mm1041K4553N7709j35542
5121B542205J9594p1737N0812J37155n2488J4048K3039J6174m2957R1551O8071
5110B795467j02821n1024N9154m7942j2110k7044N1027o7617k5572L0853K0774
5099B623145l1471n0916P4083L8537j1384O7327o6945k4647K3420P489q4161N9819
$$ y = [2666956, 2684732, 2715529, 2850676, 2795229, 2689396, 2735525, 2863057, 2798737, 2703400, 2739573, 2779960, 2850556, 2911939, 2852262, 2820174, 2949609, 2895606, 2871199, 2883257, 2810781, 2792382, 2868599, 2868574, 2815698, 2869564, 2833829, 2814870, 2820854, 2746911, 2700828, 2649909, 2625724, 2684804, 2632451, 2581300, 2557455, 2580679, 2626387, 2669734, 2660743, 2655065, 2646852, 2696992, 2617839, 2667826, 2695957, 2635502, 2626904, 2591424, 2556473, 2544663, 2596349, 2636530, 2636526, 2595485, 2620038, 2677747, 2542205, 2561799, 2490062, 2540874, 2678029, 2625541, 2639589, 2662628, 2678802, 2635845, 2727396, 2795467, 2692646, 2641622, 2700776, 2652834, 2640724, 2613680, 2664707, 2597090, 2571518, 2602371, 2623145, 2591674, 2540758, 2614841, 2653378, 2641994, 2709321, 2642376, 2617729, 2641149, 2648638, 2564477, 2624296]
5087B624296J7690J17420J3560o7540K2745j04623M3590n2756P5966J07583o6944
5076B730987n7805K551R4683K6125J1124l336l8235O4840N491Q135n1163r9300
5064B694097J498N3629m068N3414l1347O1248o7176L6464P444k0527j1238L7450
5052B810888r676k3055p5228Q3764J08099r5216O2402J3762l9395J05791J36870
5041C079006q1288m4000k0385K5449L4040n225Q4881k6423j2274K1802r345R7237
5029C143475k9775k5516L2672J36326m8364l0941K384m9743M1042K1407j00462
5018C092505P4534Q5454J2665L149L1101n0952J20657J2663q905o4841J6880N5936
5006C380846N6094j280p6832P5285O8340M5148k4085P5590Q5066R182p0913N225
$$ y = [2624296, 2641986, 2759406, 2772966, 2705426, 2728171, 2623548, 2667138, 2614382, 2690348, 2797931, 2730987, 2673182, 2675733, 2770416, 2796541, 2807665, 2804329, 2766094, 2830934, 2836425, 2844560, 2793397, 2694097, 2695595, 2749224, 2745156, 2798570, 2767223, 2828471, 2761295, 2797759, 2805203, 2784676, 2773438, 2810888, 2801212, 2778157, 2702929, 2786693, 2894792, 2799576, 2861978, 2875740, 2836345, 2942136, 3079006, 2997718, 2953718, 2933333, 2958782, 2992822, 2987597, 3072478, 3046055, 3033781, 3055583, 3046238, 3143475, 3113700, 3088184, 3120856, 3257182, 3208818, 3177877, 3180261, 3130518, 3171560, 3192967, 3092505, 3167039, 3252493, 3265158, 3268307, 3299408, 3248456, 3369113, 3381776, 3372871, 3308030, 3324910, 3380846, 3436940, 3435660, 3358828, 3434113, 3502453, 3547601, 3523516, 3599106, 3684172, 3693354, 3622441, 3627666]
4994C627666K1845q2757M7401M7118J8952K711m9590L0609L2423P7130Q412n500
4982C776420J71488K1877q0521N3766L084P2475j05024K0393J03068N904K6132
4971D069062J45069k6971n0239J1999O0900N5441K1797k5864P7212p881J16011
4960D446536Q2848q1727R3888j2412Q6469Q5437Q2674K9602k8986l5757P2776
4949D821348P8945Q9931R6152K647P7742P3055J36017M7624M2803J37496J44964
4938E748724Q4381M716J33203J13467J08784J14458J26643J47276J37345M1569
4928F760566J36859P0299M8008J27517J15386J20649J45533J55333k0836J75082
4918G834396J03037J41140J74209J57318J20014q197J27342K26642J89026J71558
$$ y = [3627666, 3649511, 3566754, 3614155, 3661273, 3680225, 3682936, 3633346, 3663955, 3696378, 3773508, 3781920, 3776420, 3947908, 3969785, 3889264, 3943030, 3946114, 4018589, 3913565, 3933958, 4037026, 4042930, 4069062, 4214131, 4187160, 4136921, 4148920, 4209820, 4265261, 4287058, 4261194, 4338406, 4330525, 4446536, 4529384, 4447657, 4541545, 4529133, 4615602, 4701039, 4783713, 4813315, 4784329, 4748572, 4821348, 4900293, 4990224, 5086376, 5089023, 5166765, 5239820, 5375837, 5423461, 5466264, 5603760, 5748724, 5833105, 5837821, 5971024, 6084491, 6193275, 6307733, 6434376, 6581652, 6718997, 6760566, 6897425, 6967724, 7015732, 7143249, 7258635, 7379284, 7524817, 7680150, 7659314, 7834396, 7937433, 8078573, 8252782, 8410100, 8530114, 8521917, 8649259, 8875901, 9064927, 9236485]
4908I236485J85853K01406P7627J97739K67379J34394P7319K00336O7232K2358
4898A0668128J03820R8704J16896J02798Q4740K01877O6724Q4253J00493O1188
4888A1689621K05500K01599J29379R6208N2107m1851J697Q40J28881m8356p4654
4877A2340971M7555j0569R880m3895Q3750O6242k9926J02048J36921P4291k8114
4866A2749154J88181R6479J15794M6494K5678K9908Q8462L8460k0566j34986m6345
4855A3176713r3750j87783j76365j01636n4516j09465m3200o7295j13598l1861
4845A2197244R151j02587k7323k828j21263j57231r6789j24864r9858n8962n2614
4834A1362076j43671j18850j17745p8199m4592J2080j73849p3845p2268j44215
$$ y = [9236485, 9422338, 9623744, 9701371, 9899110, 10166489, 10300883, 10378202, 10578538, 10645770, 10668128, 10771948, 10870652, 10987548, 11090346, 11175086, 11376963, 11443687, 11527940, 11628433, 11689621, 11895121, 12096720, 12226099, 12322307, 12374414, 12332563, 12334260, 12335100, 12463981, 12415625, 12340971, 12388526, 12377957, 12387837, 12343942, 12427692, 12493934, 12464008, 12566056, 12702977, 12777268, 12749154, 12937335, 13033814, 13149608, 13196102, 13221780, 13251688, 13340150, 13378610, 13358044, 13223058, 13176713, 13082963, 12895180, 12718815, 12617179, 12562663, 12453198, 12409998, 12342703, 12229105, 12197244, 12206395, 12103808, 12076485, 12073657, 11952394, 11795163, 11698374, 11573510, 11473652, 11414690, 11362076, 11218405, 11099555, 10981810, 10903611, 10859019, 10871099, 10697250, 10623405, 10551137, 10406922]
4824A0406922k7719N2939o9000j23471Q3695l6131r8183j02256n5343o8847r2147
4813I870459j13162q0002p7288n8485j23499r8630n3978l2156j78278p3266o4504
4802H917211m5418j2863o1623p2151Q0777O0119n5169l1002L457j15966k6956
4791H640416o794j4455K6294N5061J71726P9199K4623m1145R5719q17O2834o7982
4779I024679n528Q5152k5251Q5012J14884j08821N3267R7709K7871Q081N9186
4768I416241L2482N2879O75R3621J96037M2523J1183R6925K1794L873N7032P565
4756A0032830J1702N64O8693k1754M4718Q6250J27603R0194J96305P4988M324
4745A0716417k1443J09778J64310O6354J06906N5662J61745K0583J14062J70300
$$ y = [10406922, 10379203, 10432142, 10363142, 10239671, 10323366, 10287235, 10189052, 10086796, 10031453, 9962606, 9870459, 9757297, 9677295, 9600007, 9541522, 9418023, 9319393, 9265415, 9233259, 9054981, 8981715, 8917211, 8871793, 8858930, 8797307, 8725156, 8805933, 8866052, 8810883, 8779881, 8783338, 8667372, 8640416, 8633622, 8619167, 8645461, 8700522, 8872248, 8951447, 8976070, 8934925, 9030644, 9029827, 9092661, 9024679, 9019151, 9104303, 9079052, 9164064, 9278948, 9170127, 9223394, 9321103, 9348974, 9357055, 9416241, 9448723, 9501602, 9502277, 9595898, 9791935, 9834458, 9845641, 9942566, 9964360, 9968233, 10025265, 10032830, 10044532, 10045096, 10113789, 10092035, 10136753, 10223003, 10350606, 10440800, 10637105, 10712093, 10716417, 10694974, 10804752, 10969062, 11035416, 11142322, 11197984, 11359729, 11380312, 11494374, 11664674]
4735A1664674J64793J27718J21307J36145o4259M4625J23710J93253J74238J30087
4725A2816291J95319J52415J20601n4431J80059K38512J04375P9369M2861Q2060
4715A3957431l47j2464J05094J21753J24954J17983L3165K198J35571Q355O6660
4704A4660353Q2719J22433J52471J85458J29121J54399K60243J20862J33637K38637
4694A6240333R5673J66423J37316J12506K36851P6534J02056R6847J9026J535
4684A7285100Q0325J05836R3555R5083M5423m4561L6425Q6546K02452N6583O8387
4673A8111154k243J26853J08645O0011N5093J39952J70333M4637J39370K41529
4663A9195334J35670K7026J39433J40097J74169J84725M6284J22362P6178K16358
$$ y = [11664674, 11829467, 11957185, 12078492, 12214637, 12150378, 12195003, 12318713, 12511966, 12686204, 12816291, 13011610, 13164025, 13284626, 13230195, 13410254, 13648766, 13753141, 13832510, 13875371, 13957431, 13957084, 13944620, 14049714, 14171467, 14296421, 14414404, 14447569, 14449767, 14585338, 14593693, 14660353, 14743072, 14865505, 15017976, 15203434, 15332555, 15486954, 15747197, 15868059, 16001696, 16240333, 16336006, 16502429, 16639745, 16752251, 16989102, 17065636, 17167692, 17264539, 17283565, 17285100, 17365425, 17471261, 17564816, 17659899, 17705322, 17660761, 17697186, 17783732, 17986184, 18042767, 18111154, 18108911, 18235764, 18344409, 18404420, 18459513, 18599465, 18769798, 18814435, 18953805, 19195334, 19331004, 19358030, 19497463, 19637560, 19811729, 19996454, 20042738, 20165100, 20241278, 20457636]
4653B0457636K26888J64758J27365R9802K17521O3324K12160J82465J35041J55893
4643B2042853K13850O0440Q3438K32668R4844K33545J26863N0671L46847J87951
4633B3673970K15481K24829J17831K04570K16236K83476L18411K68181P7738J65295
4623B5766018K70146K50852K02487K61305J92367K03927K44120K75502L70470
4614B8037194K36989K16024L35824L28882K97965L60564L11194L05838M11760
4605C0842234K98172L56869M33563M55305L93855L27240L47236L45625L49448
4596C4149547L12175K23684M33871L79405L48356L70748L45842M85807M06387
4587C7455822M43190N10366L11342M54666M94630M12812O02507N55785N45171
$$ y = [20457636, 20684524, 20849282, 20976647, 21076449, 21293970, 21357294, 21569454, 21751919, 21886960, 22042853, 22256703, 22317143, 22400581, 22633249, 22728093, 22961638, 23088501, 23139172, 23486019, 23673970, 23889451, 24114280, 24232111, 24436681, 24652917, 24936393, 25254804, 25522985, 25600723, 25766018, 26036164, 26287016, 26489503, 26750808, 26943175, 27147102, 27391222, 27666724, 28037194, 28274183, 28490207, 28826031, 29154913, 29452878, 29813442, 30124636, 30430474, 30842234, 31140406, 31497275, 31930838, 32386143, 32779998, 33107238, 33454474, 33800099, 34149547, 34461722, 34685406, 35119277, 35498682, 35847038, 36217786, 36563628, 37049435, 37455822, 37899012, 38409378, 38720720, 39175386, 39670016, 40082828, 40685335, 41241120, 41786291]
4578D1786291M89731M82242N13770N92832O07029N54132N70994P31653N99872
4569D6928546O46373O05416Q18907O91164O69531O03018N25275O02997P27410
4560E2818637O97235N84043O49935P73336P99232Q40449P72671P86012R27029
4551E9648579Q59741Q47625Q57792P80522Q50360Q55350R96335J019359R69846
4542F7685509J137184R61036J035491J044156J041518J115104J138612J125167
4534G6283777J337266J220081J290726J337221J394141J519350J489056J577434
4526H7449052J682606J576516J704232J899978J951292J915753K146597K233469
4518A02559495K402750K470595K557433K805263K620872K741755K610958K506374
$$ y = [41786291, 42276022, 42758264, 43272034, 43864866, 44471895, 45026027, 45597021, 46328674, 46928546, 47574919, 48180335, 48999242, 49690406, 50359937, 50962955, 51488230, 52091227, 52818637, 53515872, 54099915, 54749850, 55523186, 56322418, 57162867, 57935538, 58721550, 59648579, 60508320, 61355945, 62213737, 62994259, 63844619, 64699969, 65696304, 66715663, 67685509, 68822693, 69783729, 70819220, 71863376, 72904894, 74019998, 75158610, 76283777, 77621043, 78841124, 80131850, 81469071, 82863212, 84382562, 85871618, 87449052, 89131658, 90708174, 92412406, 94312384, 96263676, 98179429, 100326026, 102559495, 104962245, 107432840, 109990273, 112795536, 115416408, 118158163, 120769121, 123275495]
4510A23275495K286880K253154K255465K043086K072227K170662K446857K495523
4502A41299349K388751K352021K269198K146771K120885J942483K162877K393491
4494A59075826K444152K507275K828501K961207K971186L077323L095294L183381
4486A82144145K964668K835333K926425L040586L250543L407263L531280L795641
4478B07895884L859404M030739M140566L962673L756111L798453L776511L793216
4470B39013557L888813M019619M168448M378799M572263M685737M781046M953429
4462B74461711N120849N204487N370609N452899N512721N548641N629620N628509
4454C17930046N797198N716051N795124N763878N569639N526590N385573N293956
$$ y = [123275495, 125562375, 127815529, 130070994, 132114080, 134186307, 136356969, 138803826, 141299349, 143688100, 146040121, 148309319, 150456090, 152576975, 154519458, 156682335, 159075826, 161519978, 164027253, 166855754, 169816961, 172788147, 175865470, 178960764, 182144145, 185108813, 187944146, 190870571, 193911157, 197161700, 200568963, 204100243, 207895884, 211755288, 215786027, 219926593, 223889266, 227645377, 231443830, 235220341, 239013557, 242902370, 246921989, 251090437, 255469236, 260041499, 264727236, 269508282, 274461711, 279582560, 284787047, 290157656, 295610555, 301123276, 306671917, 312301537, 317930046, 323727244, 329443295, 335238419, 341002297, 346571936, 352098526, 357484099, 362778055]
4446C62778055N120945M960443M599937M444334M215276L983230L513131L327819
4438C96943170K950625K507473K114071J802766J264179P76690M50435P768n30784
4429D08286393j055003j335603j856539k214531k662109l134665l423619l819006
4421C88785318m211513m311908m812637n181316n298076n559782n686878n783652
4413C47939556n903122n958163o002998o080498o114845o150096o045477o009994
4405B99674363o011518o013148o025339n808068n607824n590576n533335n522142
4397B53562413n354996n245957n207005n017869m986204m871768m650091m542711
4389B13685812m539191m475621m369445m159581m028081l979310l903798l777291
$$ y = [362778055, 367899000, 372859443, 377459380, 381903714, 386118990, 390102220, 393615351, 396943170, 399893795, 402401268, 404515339, 406318105, 407582284, 408358974, 408809409, 408817177, 408286393, 407231390, 405895787, 404039248, 401824717, 399162608, 396027943, 392604324, 388785318, 384573805, 380261897, 375449260, 370267944, 364969868, 359410086, 353723208, 347939556, 342036434, 336078271, 330075273, 323994775, 317879930, 311729834, 305684357, 299674363, 293662845, 287649697, 281624358, 275816290, 270208466, 264617890, 259084555, 253562413, 248207417, 242961460, 237754455, 232736586, 227750382, 222878614, 218228523, 213685812, 209146621, 204671000, 200301555, 196141974, 192113893, 188134583, 184230785, 180453494]
4381A80453494l754927l568221l530262l478976l149257l223447l269328l136048
4373A53343028k997616k925287k938976k803273k665681k567656k658873k561044
4365A31224622k398882k441183k315906k218602k221062k213424k013556k063149
4357A13338858k082856k032015j995968j739232j809581j758312j763959j804968
4349I8351967j721438j540566j648958j420926j481071j568795j449151j467587
4341H6053475j362006j385425j358554j253549j226081j252159j126609j107157
4333G5981935j216697j219529j194022j100373j140491j052029j045055j202977
4325F6810762j075133q90594r36700r67196r20045r03727p92139r09060q84123
$$ y = [180453494, 176698567, 173130346, 169600084, 166121108, 162971851, 159748404, 156479076, 153343028, 150345412, 147420125, 144481149, 141677876, 139012195, 136444539, 133785666, 131224622, 128825740, 126384557, 124068651, 121850049, 119628987, 117415563, 115402007, 113338858, 111256002, 109223987, 107228019, 105488787, 103679206, 101920894, 100156935, 98351967, 96630529, 95089963, 93441005, 92020079, 90539008, 88970213, 87521062, 86053475, 84691469, 83306044, 81947490, 80693941, 79467860, 78215701, 77089092, 75981935, 74765238, 73545709, 72351687, 71251314, 70110823, 69058794, 68013739, 66810762, 65735629, 64845035, 63908335, 62941139, 62021094, 61117367, 60325228, 59416168, 58532045]
4316E8532045q32695q68573q65906p02009p57228q05258p57205q59204o97985
4307E1385982n92559p13241p20777p25584o42451o20944o97942o30548n97508
4298D5444428o49122n43981p12755n39058n08017n56806m94083n35544n52732
4289D0352330n99491m27456n30463o28438l68919m83289m56652l43151n65294
4280C5949177n08737m09439l68916m43959m26394l61534l63453m94503l77361
4271C2194881l71043m58446l45119m05884l68494k45319k85109k89478l37023
4262B9088966m05802l31122m14470l28457k56180k95329j96070l09173k74314
4253B6278049j70447l31383l07028l24012k56854l00903j68048k00298k53964
$$ y = [58532045, 57699350, 56830777, 55964871, 55262862, 54505634, 53700376, 52943171, 52083967, 51385982, 50793423, 50080182, 49359405, 48633821, 47991370, 47370426, 46672484, 46041936, 45444428, 44795306, 44251325, 43538570, 42999512, 42491495, 41934689, 41440606, 40905062, 40352330, 39752839, 39325383, 38794920, 38166482, 37797563, 37314274, 36857622, 36514471, 35949177, 35440440, 35031001, 34662085, 34218126, 33791732, 33430198, 33066745, 32572242, 32194881, 31823838, 31365392, 31020273, 30614389, 30245895, 30000576, 29715467, 29425989, 29088966, 28683164, 28352042, 27937572, 27609115, 27352935, 27057606, 26861536, 26552363, 26278049, 26107602, 25776219, 25469191, 25145179, 24888325, 24587422, 24419374, 24219076, 23965112]
4244B3965112l52572k69693j82985k12898l08889k59274j74267l54340j88835
4235B1661359j40252k26507j76717k05953k30670k22944j96222k02051j71510
4226A9888533k04952j76849j73439k81001j38908r4493j69550k46465k24914j68968
4216A8008994j06335j89002k34256k15733n0410j25841j63446k14318j65355k63223
4206A6281075j53152k179j02477j83613o9659q8903k21905r7024j52629k21516
4196A4988018j08382p1492q4983j66789j24617j29799k30507j32693r1643j27914
4186A3719199j72131n5720p9505r8057j56891p9578j41768k48026p8858l6696
4176A2571969j18401k43131q0087J1117j42597k13488K2513l4128k60537r9060
$$ y = [23965112, 23612540, 23342847, 23159862, 22946964, 22638075, 22378801, 22204534, 21850194, 21661359, 21521107, 21294600, 21117883, 20911930, 20681260, 20458316, 20262094, 20060043, 19888533, 19683581, 19506732, 19333293, 19052292, 18913384, 18818891, 18649341, 18402876, 18177962, 18008994, 17902659, 17713657, 17479401, 17263668, 17213258, 17087417, 16923971, 16709653, 16544298, 16281075, 16127923, 16125744, 16023267, 15839654, 15769995, 15681092, 15459187, 15362163, 15209534, 14988018, 14879636, 14808144, 14723161, 14556372, 14431755, 14301956, 14071449, 13938756, 13847113, 13719199, 13547068, 13491348, 13411843, 13313786, 13156895, 13077317, 12935549, 12687523, 12608665, 12571969, 12453568, 12210437, 12130350, 12141467, 11998870, 11785382, 11807895, 11773767, 11513230, 11414170]
4166A1414170n4522K8376j86546j46660Q9863p7783j14030p0680j45732p6052
4156A0660404p0664r3893k8717j31187j17532m0696L5465j97455r6742J05591
4146A0024574p1318m1809j23605N726p4028j12110p0549o633n6682j53730P4785
4135I394621j88192r5298r01n5900r8074m3801k5364l4800j81310p5850l71q3063
4123H511697o1002k8614j8661n6779k7114L4177m4440j23892j3175j25753r6937
4112G949507N2532j19901p6206O574j2850j5153p7949r3410j09990j5830k1959
4101G465365J6035o299J7657k8313l3877j32811j07561K9965o2635J0881k4089
4090G144318n6370j1421l6479j7885j90281k4721l6387o6674M3467m7953p7209
$$ y = [11414170, 11359648, 11388024, 11201478, 11054818, 11144681, 11066898, 10952868, 10882188, 10736456, 10660404, 10589740, 10495847, 10467130, 10335943, 10218411, 10177715, 10213180, 10015725, 9918983, 10024574, 9953256, 9911447, 9787842, 9793568, 9719540, 9607430, 9536881, 9530248, 9473566, 9319836, 9394621, 9206429, 9111131, 9110230, 9054330, 8956256, 8912455, 8887091, 8852291, 8670981, 8595131, 8594760, 8511697, 8450695, 8422081, 8403420, 8346641, 8319527, 8353704, 8309264, 8185372, 8172197, 8046444, 7949507, 8002039, 7882138, 7805932, 7812506, 7799656, 7784503, 7706554, 7613144, 7503154, 7487324, 7465365, 7481400, 7475101, 7492758, 7464445, 7430568, 7297757, 7190196, 7220161, 7157526, 7168407, 7144318, 7087948, 7076527, 7040048, 7022163, 6831882, 6807161, 6770774, 6704100, 6747567, 6699614, 6622405]
4079F622405j5059K1935p828k8444q8993j8244M2064l8417N0141q082j9137K7647
4067F539988p1771o5131p3493n9116J20533j00545m0638K9545n024m4201j07883
4056F122264J7027O1324J2748m1912M2712m5136q0945K3666M613m8276J1031J9082
4044F098198n9151m6623n219p4254o3404L764L8285O5375N9401k8378j66995J2343
4032E833342P1097J2109J9719j6853R170J1930N6137J5184K77390k5462q8028
4021F175735j00842j9858J27106L692J10777J14478Q3130q821R9735N0107L8173
4010F673412J13019J41281J9868R6331J39353K58916J16443J26333K33848J58267
4000H077071J36453L42079M11625K36517M21769L29817K34327K5787j99926k63852
$$ y = [6622405, 6607346, 6629281, 6621453, 6593009, 6504016, 6485772, 6527836, 6489419, 6539560, 6531478, 6512341, 6539988, 6468217, 6403086, 6329593, 6270477, 6391010, 6290465, 6249827, 6279372, 6274348, 6230147, 6122264, 6139291, 6200615, 6213363, 6171451, 6214163, 6169027, 6088082, 6111748, 6116361, 6068085, 6079116, 6098198, 6039047, 5992424, 5987205, 5912951, 5849547, 5853311, 5891596, 5956971, 6016372, 5987994, 5820999, 5833342, 5904439, 5916548, 5936267, 5919414, 5928584, 5940514, 5996651, 6011835, 6289225, 6263763, 6175735, 6074893, 6055035, 6182141, 6185833, 6296610, 6411088, 6494218, 6485397, 6585132, 6635239, 6673412, 6786431, 6927712, 6947580, 7043911, 7183264, 7442180, 7558623, 7684956, 7918804, 8077071, 8213524, 8555603, 8967228, 9203745, 9625514, 9955331, 10189658, 10215445, 10015519, 9751667]
3990I751667l59007l19477j57416j33727k4828j19500j42550j12505l8106K539
3980H347090n5952j70468j1632J6235j03390k0691j24209j5749J7180l6703k7658
3969G814053k1591j1790Q494l3917P1226k9844q9551Q6469N7892m3556J14859
3958G922744J09499j0168J31535R4420R51L5659K09383J08431L5896M8024J36666
3947H823040J65724O6114Q0918J32940Q4371J17443Q5950N7629J61145R8388R6754
3936I970416L6340k2351K1863N205j5556m111P5386K1254j17135k4707J4245o9268
3924I891581j2300j04158j04630j16124m2874Q465o0137j19742j46578j38588
3914I054915q5734j37440q2334n2050j51216n6145j18575q0426j12777j22934
$$ y = [9751667, 9392660, 9073183, 8915767, 8782040, 8757212, 8637712, 8495162, 8382657, 8344551, 8347090, 8291138, 8120670, 8109038, 8125273, 8021883, 8001192, 7876983, 7861234, 7878414, 7841711, 7814053, 7792462, 7780672, 7789166, 7755249, 7826475, 7796631, 7707080, 7793549, 7851441, 7807885, 7922744, 8032243, 8022075, 8153610, 8248030, 8248981, 8284640, 8494023, 8602454, 8638350, 8686374, 8823040, 8988764, 9054878, 9135796, 9268736, 9353107, 9470550, 9556500, 9614129, 9775274, 9873662, 9970416, 10006756, 9984405, 10006268, 10011473, 9995917, 9991806, 10067192, 10088446, 9971311, 9946604, 9960849, 9891581, 9879281, 9775123, 9670493, 9554369, 9511495, 9519960, 9459823, 9340081, 9193503, 9054915, 8969181, 8831741, 8749407, 8697357, 8546141, 8489996, 8371421, 8290995, 8178218, 8055284]
3904H055284l8232L3934L6697q4088Q1194J05866k6284n1720p7492J00347R486
3893H144992j8945O9630m3566r7292J31891M4433j08989m1955k9027N5007M304
3882H110483j8514k813k7864p9263j4702p6336j25428q2485p7759j13492j32469
3871G359358k7518j02722j42691j17794j66484k14918p2548l0032l2732j82547
3861F269372j48910j40395j19647r8727R155p6701q3292n8874r3572o4383o2537
3850E331489o6895Q875k0678j24730L6107J6032k4965p9919j42062K2686J40453
3839E096393O6974K8891M0293J36465M8896J16957J13220J67834K28580K49082
3829F293585K68593K52818J62977l6474j91349k63627k65197j38257j55875j91361
$$ y = [8055284, 8017052, 8050986, 8087683, 8003595, 8084789, 8190655, 8164371, 8112651, 8035159, 8135506, 8144992, 8126047, 8195677, 8152111, 8054819, 8186710, 8231143, 8122154, 8080199, 8051172, 8106179, 8110483, 8091969, 8089156, 8061292, 7982029, 7967327, 7890991, 7765563, 7683078, 7605319, 7491827, 7359358, 7331840, 7229118, 7086427, 6968633, 6802149, 6587231, 6514683, 6484651, 6451919, 6269372, 6120462, 5980067, 5860420, 5761693, 5770848, 5694147, 5610855, 5551981, 5458409, 5394026, 5331489, 5264594, 5273469, 5252791, 5128061, 5164168, 5180200, 5155235, 5075316, 4933254, 4955940, 5096393, 5163367, 5192258, 5232551, 5369016, 5417912, 5534869, 5648089, 5815923, 6044503, 6293585, 6562178, 6814996, 6977973, 6941499, 6750150, 6486523, 6221326, 6083069, 5927194, 5735833]
3819E735833m8534j62872k05382o1774m682O1275M518Q482q8914p4271Q6334O5623
3807E315636l9838l9505L586K8747Q003P1975j46o6914j1015J26425M9870N0805
3795E497629K7398J598M1742m791n3342j0720J34192P92k8330m785M6620J13888
3783E761891M5659j3725p2900m1717l9973l4129J14797j00915l4736J31074J74975
3772E890301P3276J4535p5234o3754J11578N6382J2337J24764J92185J63003J42012
3761F641385K07228J07584J84388J71049K02236K35041J75617K29459K09375K99907
3751H663269K00674J69868K97602M66240L00820L12169L51429L70503L55948M55933
3741A1944455N14885N01800P34556P24144Q33021R20528J181816J455892J597019
$$ y = [5735833, 5687299, 5524427, 5319045, 5257271, 5252589, 5313864, 5318382, 5326864, 5237950, 5163679, 5250013, 5315636, 5275798, 5236293, 5239879, 5268626, 5276629, 5348604, 5348458, 5281544, 5270529, 5396954, 5446824, 5497629, 5525027, 5526625, 5568367, 5563576, 5510234, 5499514, 5633706, 5634498, 5606168, 5601383, 5648003, 5761891, 5807550, 5793825, 5720925, 5679208, 5639235, 5605106, 5719903, 5618988, 5584252, 5715326, 5890301, 5963577, 5978112, 5902878, 5839124, 5950702, 6007084, 6019421, 6144185, 6336370, 6499373, 6641385, 6848613, 6956197, 7140585, 7311634, 7513870, 7748911, 7924528, 8153987, 8363362, 8663269, 8863943, 9033811, 9331413, 9797653, 10098473, 10410642, 10762071, 11132574, 11488522, 11944455, 12459340, 12961140, 13695696, 14419840, 15252861, 16173389, 17355205, 18811097, 20408116]
3732B0408116J884520K096039K229880K242663J461276L05333o91967j642830
3724B8293030k339554k433381k230165j840259j607551j316033j004528p75885
3716A4745674o81248o25261m20642m56327l13131j71291k95489k68032r3087j04084
3706A1317082Q106p0940r7000k6400q9729m9724o4294j62518j6290l8893l8778
3695A0670622K9049O9434l2096j65651j06087q2798k7690j46986j29402j38268
3685I940127j22015j48707k10828j70438q7256r9866j56300n1582p9525k23733
3675H589877r5950K8912o4439j24606j18771n5825N5763K4266j07382p559J1825
3664H136111k7102j9194m1381K1715Q2065q2306O0021R0330M5483J4907q8694
$$ y = [20408116, 22292636, 24388675, 26618555, 28861218, 30322494, 30627827, 29935860, 28293030, 25953476, 23520095, 21289930, 19449671, 17842120, 16526087, 15521559, 14745674, 14064426, 13439165, 13018523, 12562196, 12249065, 12077774, 11782285, 11514253, 11421166, 11317082, 11325188, 11254248, 11157248, 11130848, 11041119, 10991395, 10927101, 10764583, 10748293, 10709400, 10670622, 10699671, 10769105, 10737009, 10571358, 10465271, 10382473, 10354783, 10207797, 10078395, 9940127, 9818112, 9669405, 9458577, 9288139, 9200883, 9101017, 8944717, 8893135, 8813610, 8589877, 8493927, 8522839, 8458400, 8333794, 8215023, 8159198, 8214961, 8239227, 8131845, 8124286, 8136111, 8109009, 8089815, 8048434, 8070149, 8152214, 8069908, 8129929, 8220259, 8265742, 8280649, 8191955]
3653H191955J0839J27866m1709N4058R662O2741k9915j6235j25917j09197N4635
3642H188783k7922k2394M7932j14745j00913p9432j09267o2361m5077o1879m0091
3631G572634N0j36772r6921j26469j3463j08564n8232p6825r1j54767q9386m5496
3619F665698j53006o7999k757p0527J5844k7106r544J5587P4829j528O3207N8254
3607F560952O57K30176J54122J33565J57312m6123n620J93424Q4201J28345J14771
3596G705782O5631K79893K31099J69828K21309K71642K70763J64666L34790M44245
3586A0159648M85887L36177M77229N75429P03516Q41898J029777J218558J539891
3577A7368010J851195J914940K072278J811538J136533K76974l85493j224693
$$ y = [8191955, 8202794, 8330660, 8288951, 8343009, 8352671, 8415412, 8385497, 8369262, 8243345, 8134148, 8188783, 8160861, 8138467, 8186399, 8071654, 7970741, 7891309, 7782042, 7719681, 7674604, 7612725, 7572634, 7572684, 7435912, 7338991, 7212522, 7199059, 7090495, 7032263, 6955438, 6955347, 6800580, 6711194, 6665698, 6512692, 6444693, 6441936, 6371409, 6387253, 6360147, 6350603, 6366190, 6441019, 6439491, 6502698, 6560952, 6561609, 6791785, 6945907, 7079472, 7236784, 7190661, 7185041, 7378465, 7462666, 7591011, 7705782, 7771413, 8051306, 8282405, 8452233, 8673542, 8945184, 9215947, 9380613, 9715403, 10159648, 10645535, 10981712, 11458941, 12034370, 12737886, 13579784, 14609561, 15828119, 17368010, 19219205, 21134145, 23206423, 25017961, 26154494, 26431468, 26045975, 24821282]
3569B4821282j915046k320197k200960j921331j705484j505603j099136r88461
3561A1165064p95334n91081o22424n37909m10169n42613k60632j96521l56127
3552F852254l05393j75616j61622j97750n4451j14546o6829q6243j59775o4750
3542E465279j87364j03334L9496m6784j06001j35436m9895o729R983j31306m4215
3531D703694K8762k6461k3251K1538j42608k7184O1901m1543p4835M4618j14204
3520D410427m5218k3450m2917L4277N4554K192K6302k2244K4910K1331J5106m5116
3508D410154P1341N160j683o1433k6831J65607m5966K9549N0762N4248n3151m4249
3496D553508m431M4442J83887k1004p3658m075l0124Q4535J24779K2769R5758
$$ y = [24821282, 22906236, 20586039, 18385079, 16463748, 14758264, 13252661, 12153525, 11165064, 10369730, 9778649, 9156225, 8618316, 8208147, 7665534, 7404902, 7208381, 6852254, 6546861, 6371245, 6209623, 6011873, 5957422, 5842876, 5776047, 5689804, 5530029, 5465279, 5277915, 5174581, 5214077, 5167293, 5061292, 4925856, 4875961, 4869232, 4879215, 4747909, 4703694, 4732456, 4705995, 4682744, 4704282, 4561674, 4534490, 4596391, 4554848, 4480013, 4524631, 4410427, 4365209, 4341759, 4298842, 4333119, 4387673, 4389865, 4416167, 4393923, 4418833, 4440164, 4455270, 4410154, 4481495, 4486655, 4484972, 4423539, 4396708, 4562315, 4516349, 4545898, 4596660, 4650908, 4597757, 4553508, 4549077, 4593519, 4777406, 4756402, 4682744, 4678669, 4648545, 4733080, 4857859, 4880628, 4976386]
3485D976386J28562j0102Q703J01991N5591L0103M1156N1785J04457m3047K18167
3474E663752J64350l4840J20908J3978m8570J46470K11912M4691P1654J23254
3464F477559J80530J08262L1113R9255J71673K52582J76184J32765R4017K12817
3454G936757K78739J8521J25110R3094K17108K41850J92082K59918J56426J83688
3444I703293J82734K02402K81070K76064K18460L60563L69377K69038M10594M74244
3434A2747839N09218M51338M68378N76569N81438O13188O39089O88820P44398
3425A8020275Q05209P52938Q92465Q77937Q85174J103280J288377J247469J353123
3416B7226247J435641J606445J823088J963217K129978K551055K865992L348536
$$ y = [4976386, 5104948, 5094846, 5103549, 5205540, 5261131, 5291234, 5332390, 5384175, 5488632, 5445585, 5663752, 5828102, 5793262, 5914170, 5928148, 5879578, 6026048, 6237960, 6282651, 6354305, 6477559, 6658089, 6766351, 6797464, 6896719, 7068392, 7320974, 7497158, 7629923, 7723940, 7936757, 8215496, 8234017, 8359127, 8452221, 8669329, 8911179, 9103261, 9363179, 9519605, 9703293, 9886027, 10088429, 10369499, 10645563, 10864023, 11224586, 11593963, 11863001, 12273595, 12747839, 13257057, 13708395, 14176773, 14753342, 15334780, 15947968, 16587057, 17275877, 18020275, 18825484, 19578422, 20470887, 21348824, 22233998, 23337278, 24625655, 25873124, 27226247, 28661888, 30268333, 32091421, 34054638, 36184616, 38735671, 41601663, 44950199]
3408D4950199L972741M755597O011951P133546Q163217Q758169R246544Q770477
3400A01762441N117407j229121o244750q386848q507877p556366o272162m881880
3392F3800844l929038k990595k149426j655040j094895p23707m80256l9750L54050
3383E1092187O52177P49991P91964R73750Q31193P83993J134978J444793J641905
3374F0096931J619079J403028P08260P4983n49845q26530p39502m36720l13451
3365F1036233O2100L5827l76268q26162j246696j603915j663964j448363j374619
3356E2594173j246243j137197j150332j534388j844282j905888j843202j700252
3348D0232389j584883j425070j491589j690600j868954j896521j978603j797345
$$ y = [44950199, 48922940, 53678537, 59690488, 66824034, 74987251, 83745420, 92991964, 101762441, 106879848, 105650727, 99405977, 91019129, 82511252, 74954886, 68682724, 63800844, 59871806, 56881211, 54731785, 53076745, 51981850, 51258143, 50777887, 50738137, 51092187, 51744364, 52494355, 53286319, 54260069, 55091262, 55875255, 57010233, 58455026, 60096931, 61716010, 63119038, 63827298, 63902281, 63352436, 62525906, 61786404, 61349684, 61036233, 61098333, 61134160, 60757892, 59931730, 58685034, 57081119, 55417155, 53968792, 52594173, 51347930, 50210733, 49060401, 47526013, 45681731, 43775843, 41932641, 40232389, 38647506, 37222436, 35730847, 34040247, 32171293, 30274772, 28296169, 26498824]
3340B6498824j733603j655277j354317j371758j043843q82705q92922p95920o07521
3331A6160958n67238n98512n78915n21796m46711m12607l53412k94995m51661
3322A1935111k25251k74053l01861l21665l09564l10431j84777l24970j50115
3313I532424k37604k03353k17507q1667r7625j74214r7671l00340r7248k25884
3303G799311j91812j19229j63752r0065k5457j40838j91279k19404n1914j02082
3293F503479j45671r6962j62801r6054j19448m4142l5098j42316j12378N7826
3283E606435j27693j63077J1924q7242j15463j13357k6508o5553k9885j70152
3273D719429q9316M2202K2143j67307j20503M2194j3773j49193j06654m7708l4258
$$ y = [26498824, 24765221, 23109944, 21755627, 20383869, 19340026, 18457321, 17564399, 16768479, 16160958, 15593720, 14995208, 14416293, 13894497, 13447786, 13035179, 12681767, 12386772, 11935111, 11709860, 11435807, 11133946, 10812281, 10502717, 10192286, 10007509, 9682539, 9532424, 9294820, 9091467, 8873960, 8792293, 8694668, 8520454, 8422783, 8122443, 8025195, 7799311, 7607499, 7488270, 7324518, 7234453, 7208996, 7068158, 6876879, 6657475, 6605561, 6503479, 6357808, 6260846, 6098045, 6001991, 5882543, 5838401, 5803303, 5660987, 5548609, 5606435, 5478742, 5315665, 5327589, 5240347, 5124884, 5011527, 4985019, 4919466, 4889581, 4719429, 4630113, 4672315, 4694458, 4527151, 4406648, 4448842, 4435069, 4285876, 4179222, 4131514, 4097256]
3262D097256l4461o0399m9161q8440q6473l9379l6798n6162n186q354o4255M4556
3250C612744l0984j38785l3908o5271m4901r156k2745j47547M4127l8772L9787
3239C164589O8601R593N4047j06657j43927j0927K7897j01017m9269q3278m2224
3228B787428K2886n7836o2689J5050r9711m3260n8333L6111l6435L5296q572m3387
3216B486548K5521k4531j30299m2512J6587k4016R7911m3744k1680j15122m2871
3205B181792L2884M3317k2162P5586M0783J4401j7428j34860J7738K1058M2227
3194B295336n8089p4963o3773O7035N4999q7473j18901q3961Q5435q713j8455
3183A988477M7078J6944p9741k1778J14433L9733l8508Q355p0714p7345j4253
$$ y = [4097256, 4062795, 4002396, 3953235, 3864795, 3778322, 3738943, 3702145, 3645983, 3640797, 3632443, 3568188, 3612744, 3581760, 3442975, 3409067, 3343796, 3298895, 3289739, 3266994, 3119447, 3163574, 3124802, 3164589, 3233190, 3242783, 3296830, 3190173, 3046246, 3035319, 3063216, 2962199, 2912930, 2829652, 2787428, 2810314, 2752478, 2689789, 2704839, 2605128, 2561868, 2503535, 2539646, 2503211, 2538507, 2529935, 2486548, 2512069, 2487538, 2357239, 2314727, 2331314, 2307298, 2405209, 2361465, 2339785, 2224663, 2181792, 2214676, 2257993, 2235831, 2311417, 2352200, 2366601, 2349173, 2214313, 2232051, 2253109, 2295336, 2237247, 2162284, 2098511, 2165546, 2220545, 2133072, 2014171, 1930210, 2015645, 2006932, 1988477, 2035555, 2052499, 1972758, 1950980, 2065413, 2105146, 2066638, 2074993, 2004279, 1926934, 1912681]
3172A912681m2230P7189N8800r4083l4411J09757K210q3811m863M5473K0812j2062
3160A955462O3430L9076q2014j24161m6002J4860J3491m928P224M3413J26779
3149B006630m8270l7625j08302K9252K0726l3183J8371M1562m5953r9356J09385
3138A853237J01394k0700l5394M5144n0417k2457k0797P4728P0540N5565p7715
3127A973128M2440m285R552N9383r4716l734O5276j223M0743K0613j11552l6709
3115A958916Q7636P4028O4378k8301L2939M0415l42M5235l6218o2061R8095L433
3103B278153l8513N8465k7325J06496L3321k8468N2077K1854O7142P6405K9582
3092B629189N7944J9181k0852M1214L5835K9849o5283J23944O4317J4216j1849
$$ y = [1912681, 1870451, 1947640, 2006440, 1912357, 1877946, 1987703, 1989913, 1906102, 1901239, 1946712, 1967524, 1955462, 2018892, 2057968, 1975954, 1851793, 1805791, 1820651, 1834142, 1829214, 1836438, 1879851, 2006630, 1958360, 1920735, 1812433, 1841685, 1862411, 1829228, 1847599, 1889161, 1843208, 1743852, 1853237, 1954631, 1933931, 1898537, 1943681, 1893264, 1870807, 1850010, 1924738, 1995278, 2050843, 1973128, 2015568, 2011283, 2020835, 2080218, 1985502, 1981768, 2047044, 2045821, 2086564, 2107177, 1995625, 1958916, 2046552, 2120580, 2184958, 2156657, 2189596, 2230011, 2229669, 2274904, 2238686, 2176625, 2274720, 2278153, 2239640, 2298105, 2270780, 2377276, 2410597, 2382129, 2434206, 2456060, 2523202, 2599607, 2629189, 2687133, 2706314, 2685462, 2726676, 2762511, 2792360, 2727077, 2851021, 2915338, 2929554, 2917705]
3081B917705N8631J53597o358M1705J39706J46127R421j6723K8173P2016R8767
3070C642767L6762J69345N1435N7868J37980K8312M6166l043J02283K1875j380
3059D290370K8223j4396k6994R9728J53927J54690K2938L5489R185M1741Q1100
3048D876001J65185J07804J32239J16784J83752N3923M6594K10892J53520J30596
3038F177290Q0278J56301J35464J15470J59375J24311K53281J45621J74831L45860
3028G868082K65759K13176K87338J74708K08042M04947L32776L11089K83622L85568
3018A0735107L75957K61790L58225N06408M41838M70682N38416M64509N40607
3009A4693539N40344O09926N93284O32400O18884O12036O97302O42959P98559
$$ y = [2917705, 2976336, 3129933, 3123575, 3165280, 3304986, 3451113, 3460534, 3443811, 3471984, 3544000, 3642767, 3679529, 3848874, 3900309, 3958177, 4096157, 4124469, 4170635, 4167592, 4269875, 4291750, 4290370, 4318593, 4304197, 4277203, 4376931, 4530858, 4685548, 4708486, 4743975, 4753160, 4794901, 4876001, 5041186, 5148990, 5281229, 5398013, 5581765, 5635688, 5682282, 5893174, 6046694, 6177290, 6257568, 6413869, 6549333, 6664803, 6824178, 6948489, 7201770, 7347391, 7522222, 7868082, 8133841, 8347017, 8634355, 8809063, 9017105, 9422052, 9754828, 10065917, 10349539, 10735107, 11111064, 11372854, 11731079, 12237487, 12679325, 13150007, 13688423, 14152932, 14693539, 15233883, 15843809, 16437093, 17069493, 17688377, 18300413, 18997715, 19640674, 20439233]
3000B0439233P24936O39314P09651Q46924Q41948O75560Q05343P83214O52174
2991B7118297Q40951Q14756P67814P66973O43201O40566P06107O49177N79069
2982C3526911N16835N82036M54831M11950L29108L73411L17177L10916K13860
2973C7037035J46538O6257m3934o1468r5866k46871k79760k25159m19354l21233
2963C5556185m22566m56249l99778o16929o48832n26192n75083o43185p07757
2954C0559614p96132p10157p50880q09284n98810q57535q91815p13863p91091
2945B3640047p39065p72192p28235n65674p34154p21045n29406o38589o65351
2936A7546336n45735n38091o10264n56660m53453k95154m47159m91512m27013
$$ y = [20439233, 21164169, 21803483, 22513134, 23360058, 24202006, 24877566, 25682909, 26466123, 27118297, 27959248, 28774004, 29541818, 30308791, 30951992, 31592558, 32298665, 32947842, 33526911, 34043746, 34625782, 35080613, 35492563, 35821671, 36195082, 36512259, 36823175, 37037035, 37183573, 37249830, 37205896, 37144428, 37048562, 36801691, 36521931, 36296772, 35877418, 35556185, 35133619, 34677370, 34277592, 33660663, 33011831, 32485639, 31910556, 31267371, 30559614, 29763482, 29053325, 28302445, 27493161, 26894351, 26036816, 25145001, 24431138, 23640047, 22900982, 22128790, 21400555, 20834881, 20100727, 19379682, 18850276, 18211687, 17546336, 17000601, 16462510, 15852246, 15295586, 14842133, 14546979, 14099820, 13608308, 13181295]
2927A3181295l35214m62393l96121l29372m16207k21670j86182k69251j48816
2918A0416069k44179k02571p0754j45961j58301k39417j51174j87746k32388k22048
2908H561530j98509l01729j76699k10042k79176r7267p1837m7158m4943k51658
2898F882512l0657k6931j15766l2088j42036j19409p8326r3401L1185j60j25727
2887F149196j6173n0463o5268l0238N1864r9658r2842J5249L2081J6452K0675
2876E930875k1042n5271J8356p5177K8315L1512J5724O7272r499j34946j6987
2865E779132P2804M5950R0582N288p255O4339L797o4455L2351J19408r4190O8505
2853F116256O1961Q5394J61229m4882J14512J38981K5418J71952k772o968K01818
$$ y = [13181295, 12846081, 12383688, 11987567, 11658195, 11241988, 11020318, 10834136, 10564885, 10416069, 10171890, 9969319, 9898565, 9752604, 9594303, 9354886, 9203712, 9015966, 8783578, 8561530, 8363021, 8061292, 7884593, 7674551, 7395375, 7298108, 7226271, 7179113, 7134170, 6882512, 6851855, 6824924, 6709158, 6677070, 6535034, 6415625, 6337299, 6243898, 6275083, 6274923, 6149196, 6133023, 6082560, 6017292, 5987054, 6038918, 5939260, 5846418, 5861667, 5893748, 5910200, 5930875, 5909833, 5854562, 5872918, 5797741, 5826056, 5857568, 5873292, 5940564, 5931065, 5796119, 5779132, 5851936, 5897886, 5988468, 5993756, 5986501, 6050840, 6054637, 5990182, 6022533, 6141941, 6047751, 6116256, 6178217, 6263611, 6424840, 6379958, 6494470, 6633451, 6658869, 6830821, 6828049, 6821081, 7022899]
2842G022899Q0370J43851J71613J32382n516J79675J23609J78736N8093J16223
2832H201935K06949J45468J90631J94380K07882J94113L39641K99808K10833J83407
2822A0375047J77548J91738K94102K80581K71793K82513K85248J59034J81972
2813A2499576K30004K57415K05556J89340K73980K01921J78728L11531K62068
2804A4610119K40312K71455K74109J93458K12977L10366L77371L86755K81790
2795A7158712K52413L91203N68360M72305M00905M34752N65955N80598O64814
2786B1490017Q72222Q27835Q20965R65537Q17983P34381O40552O72361O29423
2777B8471276P40779R53404R63619J150979J284355J391429J455430J331227J593537
$$ y = [7022899, 7103269, 7247120, 7418733, 7551115, 7545599, 7725274, 7848883, 8027619, 8085712, 8201935, 8408884, 8554352, 8744983, 8939363, 9147245, 9341358, 9680999, 9980807, 10191640, 10375047, 10552595, 10744333, 11038435, 11319016, 11590809, 11873322, 12158570, 12317604, 12499576, 12729580, 12986995, 13192551, 13381891, 13655871, 13857792, 14036520, 14348051, 14610119, 14850431, 15121886, 15395995, 15589453, 15802430, 16112796, 16490167, 16876922, 17158712, 17411125, 17802328, 18370688, 18842993, 19243898, 19678650, 20244605, 20825203, 21490017, 22362239, 23190074, 24011039, 24976576, 25794559, 26528940, 27169492, 27841853, 28471276, 29212055, 30165459, 31129078, 32280057, 33564412, 34955841, 36411271, 37742498, 39336035]
2768C9336035J848532J719008J941998K022092J924699K129008K168068K083865
2760E5173305K161124K022009K088135K017425J785624J639425J714520J336669
2752F9938236J159603J054354P40404O16663L01951Q8552j18704l67192n82439
2743G2831428p15777q25675j060447j243944j369026j551490j649587j764506
2735F2650976j746581k047264j989217j854188k103205k112746k021941k031606
2727D6744228j945741j911952j763063j756258j790823j655882j466506j428548
2719C3025455j478047j302282j143028j077172j039781q42626q33561q98858q09126
2710B3600974o63259o19364n70991n49906n02447n83039m33345l49871l24496
$$ y = [39336035, 41184567, 42903575, 44845573, 46867665, 48792364, 50921372, 53089440, 55173305, 57334429, 59356438, 61444573, 63461998, 65247622, 66887047, 68601567, 69938236, 71097839, 72152193, 72892597, 73509260, 73811211, 73899763, 73781059, 73413867, 72831428, 72115651, 71289976, 70229529, 68985585, 67616559, 66065069, 64415482, 62650976, 60904395, 58857131, 56867914, 55013726, 52910521, 50797775, 48775834, 46744228, 44798487, 42886535, 41123472, 39367214, 37576391, 35920509, 34454003, 33025455, 31547408, 30245126, 29102098, 28024926, 26985145, 26142519, 25308958, 24410100, 23600974, 22937715, 22318351, 21747360, 21197454, 20695007, 20111968, 19678623, 19328752, 19004256]
2701A9004256k83822k81909l75984l58358j57932j79287k24247j69581n5174k61865
2691A6656097k25415l21635l07836j18584k67572k03808n1158j76977j79361j5927
2681A4787824k16811k6541k09759j23226j5781k19766k23624j09551j22975j16779
2671A3403011m389j50513j19285k15043q6281p5225q3114m1951p9112r3274j17587
2660A2337237j51608q0897r4882m1178L3478n2716m2062o0969j26855J07174Q4444
2649A1911166Q6646Q9946L3522J59781K44334J3843J11410J77283L33544J56517
2639A3317992J93342K84563K49782K94529J67982J85634J57603L4035P3488N1870
2629A5010820j12255p8890n3463m1110j0054o7346n7480K4966j43902j08186j58264
$$ y = [19004256, 18720434, 18438525, 18062541, 17704183, 17546251, 17366964, 17142717, 16973136, 16917962, 16656097, 16430682, 16109047, 15801211, 15682627, 15415055, 15211247, 15160089, 14983112, 14803751, 14787824, 14571013, 14544472, 14334713, 14211487, 14195706, 13975940, 13752316, 13642765, 13519790, 13403011, 13398622, 13248109, 13128824, 12913781, 12827500, 12752275, 12669161, 12627210, 12548098, 12454824, 12337237, 12185629, 12104732, 12009850, 11968672, 12002150, 11949434, 11907372, 11846403, 11719548, 11826722, 11911166, 11997812, 12087758, 12121280, 12281061, 12525395, 12539238, 12650648, 12827931, 13161475, 13317992, 13511334, 13795897, 14045679, 14340208, 14508190, 14693824, 14851427, 14885462, 14958950, 15010820, 14898565, 14819675, 14766212, 14725102, 14715048, 14647702, 14590222, 14615188, 14471286, 14363100, 14204836]
2618A4204836k00941j00704k30839l60493k59138k97431k32223k80817k83985
2609A1958265k37691k41217j78265j78625k10155n6352j04147j04295l1844m3774
2599A0571900N4210J320L2573N3846M0659J36249J40579o0207M0196J97772J75144
2588A1384241J44775K12859K09025J68275K21147K51019K51508J01900K23436
2579A3168185K51950K55985J78035K96715J78187O2044J70463L48273L7175J07160
2569A5054172J84766J58779J71573J14716K22300J14725j20344J39686J57466
2560A6197839n7468Q3343J01355J37779P5866P0442J82760J16879J30286J40621
2550A7179702J67406J84456J53692L22271L10263K60221K61354L69004L61661
$$ y = [14204836, 14003895, 13903191, 13672352, 13311859, 13052721, 12755290, 12523067, 12242250, 11958265, 11720574, 11479357, 11301092, 11122467, 10912312, 10855960, 10751813, 10647518, 10615674, 10571900, 10626110, 10627430, 10660003, 10713849, 10754508, 10890757, 11031336, 10971129, 11011325, 11209097, 11384241, 11529016, 11741875, 11950900, 12119175, 12340322, 12591341, 12842849, 12944749, 13168185, 13420135, 13676120, 13854155, 14150870, 14329057, 14391101, 14561564, 14909837, 14947012, 15054172, 15238938, 15397717, 15569290, 15684006, 15906306, 16021031, 15900687, 16040373, 16197839, 16140371, 16223714, 16325069, 16462848, 16538714, 16609156, 16791916, 16908795, 17039081, 17179702, 17347108, 17531564, 17685256, 18007527, 18317790, 18578011, 18839365, 19208369, 19570030]
2541A9570030M94073M57884N54365M68876O48042P33379P14143P90974Q84185
2532B5315951R02858Q66625J021560J093071J230570J164552J210186J267559
2524C4072932J194016J367366J356994J447977J325939J258736J346104J360023
2516D4730087J306981J275988J372691J378924J361289J213964J194513J119145
2508E4953582J178328J105619Q39994Q87979Q15029P07126O85028N63876M40273
2499F2176834K93112K93099J41226J37248J00881K4905j30126l52897l36563j98144
2489F2149575n10552n34667n04079o42542o88036p92108r42836r81078r98402
2480E5555275j173842j194857j202342j196449j360074j322427j274267j208371
$$ y = [19570030, 20064103, 20521987, 21076352, 21545228, 22193270, 22926649, 23640792, 24431766, 25315951, 26218809, 27085434, 28106994, 29200065, 30430635, 31595187, 32805373, 34072932, 35266948, 36634314, 37991308, 39439285, 40765224, 42023960, 43370064, 44730087, 46037068, 47313056, 48685747, 50064671, 51425960, 52639924, 53834437, 54953582, 56131910, 57237529, 58077523, 58965502, 59780531, 60487657, 61172685, 61736561, 62176834, 62469946, 62763045, 62904271, 63041519, 63142400, 63167305, 63037179, 62684282, 62347719, 62149575, 61639023, 61104356, 60600277, 59957735, 59269699, 58477591, 57534755, 56553677, 55555275, 54381433, 53186576, 51984234, 50787785, 49427711, 48105284, 46831017, 45622646]
2472D5622646j351516j377077j344700j305906j278481j237642j358112j247107
2464C5122105j270358j186098j115925j281026j118185j073115j101694j037460
2456B5938244q72314p56759q00760p32509o44418o52081n87154n02582n19438
2447A9870229m37103k96311l64857k56314k27657l11430j89404j88787k36041
2438A7362325j77346k39800k26470o0302j92594j09454N698j94601k17276p0432
2428A5879748j57911j14860j24109j67825k25549j19265j38175k11043j60876
2419A4460135k86918k06231k49034l13107k20021l82400l60150j10869k70194
2410A2061211l14468k89324k78537k19244k95774l13395m23956k20253j67291
$$ y = [45622646, 44271130, 42894053, 41549353, 40243447, 38964966, 37727324, 36369212, 35122105, 33851747, 32665649, 31549724, 30268698, 29150513, 28077398, 26975704, 25938244, 25065930, 24309171, 23508411, 22775902, 22131484, 21479403, 20892249, 20389667, 19870229, 19433126, 19136815, 18771958, 18515644, 18287987, 17976557, 17787153, 17598366, 17362325, 17184979, 16945179, 16718709, 16658407, 16465813, 16356359, 16362057, 16167456, 15950180, 15879748, 15721837, 15606977, 15482868, 15315043, 15089494, 14970229, 14832054, 14621011, 14460135, 14173217, 13966986, 13717952, 13404845, 13184824, 12802424, 12442274, 12331405, 12061211, 11746743, 11457419, 11178882, 10959638, 10663864, 10350469, 9926513, 9706260, 9538969]
2401I538969k61055k71254l40474k91816k02391m5358k06143j75987k33137k38044
2391G273310j95174j22418k09384k44303j26810m2862o7564j20057j95214j47482
2381E802042j40437n1978r4174j10502m3332j23408j24945l7669n4313L3235j45770
2370D908749j59820r5212N4514j19403j64658k25912j11969P2067k8864l3942
2360D095550J8039j17364p8047j6997j11992L4479j0609j11580l0621j02205o7363
2349C501290K7236j36822M1188L8217k12978m4161P641O495k6732j20924k498
2338C077952m2030O6349k588j63987j01023P2332k7392K0793j29813O1007j25036
2327B706564p4316m761M7998j3984k2385m0640L4289O975j03854m7912k2296j8480
$$ y = [9538969, 9277914, 9006660, 8666186, 8374370, 8171979, 8126621, 7920478, 7744491, 7511354, 7273310, 7078136, 6955718, 6746334, 6502031, 6375221, 6332359, 6264795, 6144738, 5949524, 5802042, 5661605, 5609627, 5515453, 5404951, 5361619, 5238211, 5113266, 5075597, 5021284, 5054519, 4908749, 4748929, 4653717, 4708231, 4588828, 4424170, 4198258, 4086289, 4158356, 4129492, 4095550, 4113589, 3996225, 3918178, 3901181, 3789189, 3823668, 3813059, 3701479, 3670858, 3568653, 3501290, 3528526, 3391704, 3432892, 3471109, 3258131, 3213970, 3221611, 3228106, 3201374, 3080450, 3077952, 3035922, 3102271, 3099683, 2935696, 2834673, 2907005, 2879613, 2900406, 2770593, 2831600, 2706564, 2632248, 2627487, 2675485, 2661501, 2639116, 2598476, 2632765, 2639740, 2535886, 2487974, 2465678, 2447198]
2315B447198Q687r0031j1520P0855n596j3117j09690j2665o6712N9415m8065j43532
2303B085227O5416K6928j31050N6875m8920O040l1427j3149K3218K7547n2168
2292B014537Q915k8536q7624k1822N3370m644q732m8440L0338N4076q1919p247
2280A872272N589M1685Q365o4307q4202N732M7727o0553o8687K3456j50800N4717
2268A630994Q6924K9174L9035j09306q8299K04686l1262o1506J747M0491j7461
2257A725217k7965J5514O22p0438m7553O7411j4110k5371n6080n9938j454L2573
2245A538428k1704p8097J39503L9248o76l828j01121k0844K0319l5405r9290q945
2233A367588K6267O4498m6319L295p4889N7289R648K7319O0203j11126N2076P1450
$$ y = [2447198, 2455885, 2365854, 2354334, 2425189, 2419593, 2406476, 2296786, 2284121, 2217409, 2276824, 2228759, 2085227, 2150643, 2177571, 2046521, 2103396, 2054476, 2060516, 2029089, 2015940, 2039158, 2066705, 2014537, 2023452, 1994916, 1907292, 1885470, 1938840, 1934196, 1925464, 1877024, 1907362, 1961438, 1879519, 1872272, 1877861, 1919546, 1927911, 1863604, 1779402, 1785134, 1832861, 1772308, 1703621, 1727077, 1576277, 1630994, 1717918, 1747092, 1786127, 1676821, 1588522, 1793208, 1761946, 1700440, 1702187, 1742678, 1725217, 1697252, 1712766, 1713388, 1642950, 1595397, 1662808, 1648698, 1623327, 1567247, 1507309, 1505855, 1538428, 1516724, 1438627, 1578130, 1617378, 1616702, 1612874, 1511753, 1490909, 1511228, 1475823, 1376533, 1367588, 1393855, 1458353, 1412034, 1415329, 1340440, 1397729, 1407377, 1434696, 1494899, 1383773, 1435849, 1507299]
2221A507299n4399K3124n915l3013k2715j6640m539J17788L8940j6168o0723r954
2209A463085P5367P517j31235k7786R2491R5534L9991o934k8967q448Q1457M5969
2197A698041l3579l6817m0785O275K5975J24348K0716p4082K4926j6884Q86n662
2185A693358r433o5481o345N2990o0020o7195m7687O0075Q2100m0840p9139K1195
2173A533578j0738L1411L4002o3391j5241K2252N7942L6617K4288n5162l0871
2162A564687N5131q7079O8290j7732n4840M34p7527K1179P7826P3362P242j967
2150A629006p4934O6640k3414k4264N6616K6423p6067L6594j0280l1723j08445
2139A466152L0774L3660j4228k2346J7549Q4746k2354n5932P1216q4516M792L8549
$$ y = [1507299, 1452900, 1476024, 1470109, 1437096, 1414381, 1397741, 1393202, 1510990, 1549930, 1533762, 1473039, 1463085, 1538452, 1545969, 1414734, 1386948, 1479439, 1574973, 1614964, 1608030, 1579063, 1570615, 1652072, 1698041, 1664462, 1627645, 1586860, 1593135, 1619110, 1743458, 1764174, 1690092, 1715018, 1698134, 1699020, 1693358, 1683925, 1618444, 1612099, 1665089, 1605069, 1537874, 1490187, 1550262, 1632362, 1591522, 1512383, 1533578, 1522840, 1554251, 1588253, 1524862, 1509621, 1531873, 1589815, 1626432, 1650720, 1595558, 1564687, 1619818, 1532739, 1601029, 1583297, 1528457, 1528891, 1451364, 1472543, 1550369, 1623731, 1630973, 1629006, 1554072, 1620712, 1597298, 1573034, 1629650, 1656073, 1580006, 1616600, 1606320, 1574597, 1466152, 1496926, 1530586, 1516358, 1494012, 1511561, 1596307, 1573953, 1518021, 1589237, 1504721, 1509513, 1548062]
2127A548062q2567J38370J820p3889M9952N5158N915k0843o7802o771j433r5040
2115A450932r0389M7139K68m7339j1139Q104m6710j4358o7020J4015K1459m5573
2103A219389l6366M9288n1422n5328j7312p0707N5606L1426J3389j7228j07791
2092A012944p4025R3042K1627j2835k5219q1761m7279j7581P123K3141o5291l6248
2080G97638M0736P6394Q221n2107j6820n9354L3490o7293Q0976N6471j17135L989
2068G85206O8161n3202L6703q4927k5465l510k0252J49917p257j7346k5686l1270
2056G71072K9684M8082n4975o4100J47163L0641j27404r481L1248K9018L5385
2045H66333M8620p8529l8920J3306k1227q9820k7998K6145O08j4224l8787P9970
$$ y = [1548062, 1465495, 1603865, 1605685, 1531796, 1581748, 1636906, 1642821, 1621978, 1554176, 1547405, 1545972, 1450932, 1360543, 1407682, 1407950, 1360611, 1349472, 1357576, 1310866, 1296508, 1229488, 1243503, 1264962, 1219389, 1183023, 1232311, 1180889, 1125561, 1108249, 1037542, 1093148, 1124574, 1137963, 1120735, 1012944, 938919, 1031961, 1053588, 1040753, 1015534, 933773, 886494, 868913, 876036, 899177, 833886, 797638, 838374, 914768, 922989, 870882, 854062, 794708, 828198, 760905, 841881, 898352, 781217, 785206, 853367, 800165, 836868, 751941, 726476, 722966, 702714, 852631, 845374, 828028, 802342, 771072, 800756, 848838, 793863, 729763, 876926, 907567, 780163, 770682, 801930, 830948, 866333, 914953, 836424, 797504, 810810, 789583, 699763, 671765, 697910, 698518, 684294, 645507, 725477]
2033G25477k6809M9497L5112Q004n2338M4405L5665j4457p5024M2028J1336p2291
2021G10605J05180j09915m1229j06558N980J52885L845J0189p183j36157R6557
2010F84199L9790l170M9612P3218k2240L889q2921o3000l9886j1887Q0567M6601
1998G54772k7534O9053j05748j15863J7571l9347N5933o1744j02k4742P431P5649
1986F05329R5414j03274j25858Q5206q1486N8091O2644k1304J22912L5205n7955
1975F74924j50182R1558R00L967j7797q7958L0922k9296L0077p0883k0742N0543
1963E06033J23716J7371n0480q3457N8912N1184k5699R6459n5840R858l1386p5543
1951E41128N5315L9338n3940K9125J7955m4609J9488Q3632j20205q3667Q1779
$$ y = [725477, 698668, 748165, 783277, 791281, 738943, 783348, 819013, 804556, 729532, 771560, 782896, 710605, 815785, 705870, 664641, 558083, 564063, 716948, 720793, 730982, 723799, 587642, 684199, 723989, 720819, 770431, 843649, 821409, 825298, 742377, 679377, 639491, 627604, 708171, 754772, 727238, 796291, 690543, 574680, 592251, 552904, 608837, 547093, 546991, 522249, 529680, 605329, 700743, 597469, 471611, 556817, 475331, 533422, 596066, 574762, 697674, 732879, 674924, 524742, 616300, 617200, 621167, 603370, 515412, 546334, 517038, 547115, 476232, 455490, 506033, 629749, 647120, 596640, 513183, 572095, 623279, 597580, 694039, 638199, 648057, 616671, 541128, 596443, 635781, 581841, 610966, 628921, 584312, 603800, 687432, 567227, 483560, 565339]
1940E65339p550k7237m2468P4279l4287k1977L9778n4387k2485Q3490j38578j4015
1928C99902L1234O9630R4168q6028L7014j578L8293j40235k3961P4610O5962j33991
1916D25020l5507p606R959n0789M3310M0373J9424J4354q77l4047J11024p6350
1904D58288J6042k5970l0347K9358K5683p7668n3570L6198J1822Q4300l0267q675
1892D35194L8460J3888J7342k267n0725P7838o1919n2153k7550K1430j5251l119
1880C91168j02370Q1907j7942L3073q666m294j4930k6841J2317N4904M4058l1888
1868D10496k0465k5838k4410j1737K4661M5095p1140O1905M1884N6280o2770M9475
1856D73436P8308J1784M7609j14135p3211N9364l1860j050L3203m34L9363k0534
$$ y = [565339, 557789, 530552, 488084, 562363, 528076, 506099, 545877, 491490, 469005, 552495, 413917, 399902, 431136, 500766, 594934, 508906, 545920, 544342, 582635, 442400, 418439, 493049, 559011, 425020, 389513, 381907, 391866, 341077, 384387, 424760, 444184, 458538, 457661, 423614, 534638, 458288, 474330, 448360, 418013, 447371, 473054, 395386, 341816, 378014, 389836, 474136, 443869, 435194, 473654, 487542, 504884, 502617, 451892, 529730, 467811, 415658, 388108, 409538, 394287, 391168, 288798, 370705, 352763, 385836, 377170, 372876, 357946, 331105, 343422, 398326, 442384, 410496, 390031, 364193, 339783, 328046, 352707, 397802, 326662, 388567, 430451, 486731, 423961, 473436, 551744, 563528, 611137, 497002, 423791, 483155, 451295, 450245, 483448, 483014, 522377, 501843]
1844E01843j55179r422Q2022m4061P1473L5019m3881l1680k0329j2018P2192J1065
1832D57044J1283O7475p281K8085r1968P3626n7583l493Q3522k5882Q5475m9302
1820E71001n6111P3546M5595l6943J06326p4261p5687J06333M4828r246J06796
1809H02177n1255J4677o1017o619P7029L8390q8345K0701J07936J3181R8960q301
1797I57514n1168J4109R2270Q3868M6604r002j10792J56641L9535m8685N1224
1786A222118j05725o521P9780N6914n342l2550R9902N0362M545J10094k0118k6052
1774A427407J6116m5205J09656P7709m0815M5757O0459j4450J9423J7933q000
1763A665990m4432R9547l241J0496O4417r5009j13761j5163O347l9143n5055p2456
$$ y = [501843, 346664, 337242, 419264, 375203, 446676, 481695, 437814, 406134, 385805, 373787, 445979, 457044, 468327, 535802, 528521, 556606, 464638, 538264, 480681, 477188, 560710, 534828, 620303, 571001, 514890, 588436, 634031, 597088, 703414, 629153, 553466, 659799, 704627, 695381, 802177, 750922, 765599, 704582, 697963, 774992, 813382, 725037, 745738, 853674, 866855, 965815, 957514, 906346, 920455, 1012725, 1096593, 1143197, 1134195, 1023403, 1180044, 1219579, 1170894, 1222118, 1116393, 1109872, 1189652, 1246566, 1241224, 1208674, 1308576, 1358938, 1363483, 1473577, 1453459, 1427407, 1443523, 1398318, 1507974, 1585683, 1544868, 1590625, 1651084, 1636634, 1656057, 1673990, 1665990, 1621558, 1721105, 1717864, 1728360, 1792777, 1697768, 1584007, 1568844, 1575191, 1536048, 1480993, 1408537]
1751A408537m5176K840m3256l7192n8887k2330l6117m6170R6765j53823n6568
1740A008623Q2248O6501J6795p2148M9210P1050j34815n698Q688j40843o116J8761
1728I62256j06967R9247j5176p8190l9755L7682J7054L171j17415l0648L6688
1717G67947q0296M3843k0138m7442o90l0041o6436j4859k7056O7759n9098l3174
1705E00319K6483M5827k3212k7192r3674Q6776l8320K2206l3330L2584j0668m8651
1693D39148N8080l4413j4774K7787K7869n4013J8231p8469j6630J1652L9490m6535
1681C77423K711n7170J9043N1927J09516k3827n5481P9063J08597j42144q9380
1670C80278L7316m3447q3257Q9008K8035p0914O7013p62l2188m3370l3978j18434
$$ y = [1408537, 1363361, 1366201, 1322945, 1285753, 1226866, 1204536, 1168419, 1122249, 1219014, 1065191, 1008623, 1090871, 1157372, 1174167, 1102019, 1151229, 1222279, 1087464, 1081766, 1090454, 949611, 943495, 962256, 855289, 954536, 939360, 861170, 821415, 859097, 876151, 879322, 761907, 731259, 767947, 687651, 731494, 711356, 663914, 663224, 633183, 566747, 551888, 524832, 592591, 533493, 500319, 526802, 572629, 549417, 522225, 428551, 515327, 477007, 499213, 465883, 498467, 487799, 439148, 497228, 462815, 448041, 475828, 503697, 449684, 467915, 389446, 372816, 384468, 423958, 377423, 380134, 322964, 342007, 393934, 503450, 479623, 424142, 503205, 611802, 469658, 380278, 417594, 374147, 290890, 379898, 407933, 337019, 404032, 403270, 371082, 327712, 293734, 175300]
1658A75300K306L2033K4498L7346j9472o3158J20864M1829q1918N1328l4139O0954
1646C47771O669m2996R1138n5791j22450j1770K6497J5388q4313K0521l6087R7911
1634B52488M663N5671n7873p1900J25441j4715K4422K9648p9058N2805k5275j18980
1622A77337O1319l6619L8340k1215J7850j3764r348k6379J4656o9728O4908J30278
1610C27635r7033P0584J2430j41307q647O6101J6659O5486p588m8894q1262J6278
1598A90442J0447m609K8128p4535O6275J04997k4376k6333j3261j47139k7812
1587H2224P2967K6421j06881P4826M4457J1167N8944k0466N8612j9775j47983
1576A34513J02238J0005p1352q3609J36256j7737l5056n4865J5226J23875n0746
$$ y = [175300, 177606, 209639, 234137, 271483, 252011, 188853, 309717, 351546, 269628, 320956, 286817, 347771, 354440, 311444, 402582, 346791, 224341, 212571, 239068, 254456, 170143, 190664, 154577, 252488, 257151, 312822, 254949, 183049, 308490, 293775, 318197, 347845, 268787, 321592, 296317, 177337, 238656, 202037, 240377, 219162, 237012, 223248, 213900, 187521, 202177, 132449, 197357, 327635, 230602, 301186, 313616, 172309, 163662, 229763, 246422, 311908, 304320, 255426, 174164, 190442, 200889, 196280, 224408, 149873, 216148, 321145, 296769, 270436, 257175, 110036, 82224, 155191, 181612, 74731, 149557, 194014, 205181, 264125, 243659, 302271, 282496, 134513, 236751, 246756, 175404, 91795, 228051, 210314, 175258, 120393, 135619, 259494, 208748]
1565B08748m4449J3248l6350j02062R9126Q3284r775l5165R3385o9186k0875j7225
1553A62704Q2254K2176j38113O569J6604k2008m8506O0096Q4231k1113L9327j8332
1541B25889k1274n3474Q179M8646m0681j16102J46502J1368o1484N1056k1869
1530A76756q7337O7416P9255l7900J0113k6442p4533n4404J3860K9811L0278j12425
1518A4448K9626N9177n0099k1056O989K0418P8554l4437R992R8667j8037j0671
1506A83571L4928j03160q4152p183P2330m4896o3435M6649N7521L037N0600R3007
$$ y = [208748, 164299, 177547, 141197, 39135, 138261, 221545, 211770, 176605, 269990, 200804, 179929, 162704, 244958, 267134, 129021, 135590, 152194, 130186, 81680, 141776, 226007, 204894, 244221, 225889, 204615, 151141, 159320, 207966, 167285, 51183, 197685, 209053, 147569, 198625, 176756, 89419, 156835, 236090, 198190, 208303, 181861, 107328, 52924, 66784, 96595, 126873, 14448, 44074, 103251, 53152, 32096, 39085, 59503, 138057, 103620, 113612, 212279, 194242, 183571, 218499, 115339, 31187, 24004, 96334, 51438, -11997, 34652, 92173, 95210, 145810, 238817]
$$ [...]
##END NTUPLES=NMR SPECTRUM
##END=
