##TITLE=1H_CA-8840-1
 CDCl3, 8 sc, 
 29.04.2021
##JCAMPDX= 6.0         $$ Bruker NMR JCAMP-DX V2.0
##DATA TYPE= NMR SPECTRUM
##DATA CLASS= NTUPLES
##ORIGIN= UXNMR, Bruker Analytische Messtechnik GmbH
##OWNER= root
$$ XWIN-NMR		Version 3.5
$$ Thu Apr 29 14:35:34 2021 Russian Standard Time (UT+4h)  she@DPX200
##.OBSERVE FREQUENCY= 200.131506
##.OBSERVE NUCLEUS= ^1H
##.ACQUISITION MODE= SIMULTANEOUS
##.ACQUISITION SCHEME= undefined
##.AVERAGES= 8
##.DIGITISER RES= 18
##SPECTROMETER/DATA SYSTEM= spect
##.PULSE SEQUENCE= zg30
##.SOLVENT NAME= CD3CN
##.SHIFT REFERENCE= (INTERNAL, CD3CN, 0, 16.0041)
##AUDIT TRAIL= $$ (NUMBER, WHEN, WHO, WHERE, WHAT)
$$ ##TITLE= Audit trail, XWIN-NMR		Version 3.5
$$ ##JCAMPDX= 5.01
$$ ##ORIGIN= Bruker BioSpin GmbH
$$ ##OWNER= she
$$ F:/spectra/data/she/nmr/H-F/1/pdata/1/auditp.txt
$$ ##AUDIT TRAIL=  $$ (NUMBER, WHEN, WHO, WHERE, WHAT)
(   1,<2021-04-29 14:34:29.98 +0400>,<she>,<DPX200>,
      <created by zg, POWCHK disabled, PULCHK disabled
       configuration hash MD5:
       00 E9 B6 7A A2 85 ED C7 34 08 36 98 17 FE 4E 26
       data hash MD5: 16K
       F1 35 FB AD 0D F9 D0 D2 66 61 2E 57 0A 55 DD BF>)
(   2,<2021-04-29 14:34:32.46 +0400>,<she>,<DPX200>,
      <Start of raw data processing
       efp BC_mod = 2 LB = 0.24 FT_mod = 6 PKNL = 1 PHC0 = -11122.15 PHC1 = 12.40102 SI = 16K 
       data hash MD5: 16K
       0F 42 5F 36 EE 5A E2 14 8F 23 54 73 F5 CE 84 DD>)
(   3,<2021-04-29 14:34:49.50 +0400>,<she>,<DPX200>,
      <pk PHC0 = -2.884307 PHC1 = 4.6 
       data hash MD5: 16K
       F7 B2 01 41 68 E9 62 A7 A9 11 18 AD B3 E4 29 E2>)
(   4,<2021-04-29 14:34:52.93 +0400>,<she>,<DPX200>,
      <abs ABSG = 5 
       data hash MD5: 16K
       DF 81 A4 7A C6 74 7C 9F 09 8D 51 63 AE B5 28 69>)
$$ ##END=
$$ 
$$ hash MD5
$$ BA CA D8 B9 BA F1 A5 52 E4 91 36 C4 42 3D 66 84
##$RELAX= 
##$RELAX= 
##$RELAX= 
##$RELAX= 
##$RELAX= 
##$RELAX= 
$$ Bruker specific parameters
$$ --------------------------
##$DU= <F:/spectra>
##$EXPNO= 1
##$NAME= <H-F>
##$PROCNO= 1
##$TYPE= <nmr>
##$USER= <she>
##$AMP= (0..31)
100 100 100 100 100 100 100 100 100 100 100 100 100 100 100 100 100 100 
100 100 100 100 100 100 100 100 100 100 100 100 100 100 
##$AQSEQ= 0
##$AQ_mod= 1
##$AUNM= <au_zg>
##$AUTOPOS= <>
##$BF1= 200.13
##$BF2= 200.13
##$BF3= 200.13
##$BF4= 200.13
##$BF5= 200.13
##$BF6= 200.13
##$BF7= 200.13
##$BF8= 200.13
##$BYTORDA= 1
##$CFDGTYP= 0
##$CFRGTYP= 5
##$CHEMSTR= <none>
##$CNST= (0..31)
1 1 145 1 1 1 1 1 1 1 1 1 1 1 1 1 1 1 1 1 1 1 1 1 1 1 1 1 1 1 1 1 
##$CPDPRG= <>
##$CPDPRG1= <>
##$CPDPRG2= <>
##$CPDPRG3= <>
##$CPDPRG4= <mlev>
##$CPDPRG5= <mlev>
##$CPDPRG6= <mlev>
##$CPDPRG7= <mlev>
##$CPDPRG8= <mlev>
##$CPDPRGB= <>
##$CPDPRGT= <>
##$D= (0..31)
0 1.2 0 0 0 0 0 0 0 0.06 0 0.03 0 0 0 0 0.0002 0 0 0 0 0 0 0 0 0 0 0 0 
0 0 0 
##$DATE= 1619692469
##$DBL= (0..7)
120 120 120 120 120 120 120 120 
##$DBP= (0..7)
150 150 150 150 150 150 150 150 
##$DBP07= 0
##$DBPNAM0= <>
##$DBPNAM1= <>
##$DBPNAM2= <>
##$DBPNAM3= <>
##$DBPNAM4= <>
$$ [...]
##$SUBNAM3= <"">
##$SUBNAM4= <"">
##$SUBNAM5= <"">
##$SUBNAM6= <"">
##$SUBNAM7= <"">
##$SUBNAM8= <"">
##$SUBNAM9= <"">
##$SW= 16.9725357007746
##$SWIBOX= (0..15)
0 0 2 0 0 0 0 0 0 0 0 0 0 0 0 0 
##$SW_h= 3396.73913043478
##$TD= 16384
##$TD0= 1
##$TE= 0
##$TE2= 300
##$TE3= 300
##$TEG= 300
##$TL= (0..7)
0 120 120 120 120 120 120 120 
##$TP= (0..7)
150 150 150 150 150 150 150 150 
##$TP07= 0
##$TPNAME0= <>
##$TPNAME1= <>
##$TPNAME2= <>
##$TPNAME3= <>
##$TPNAME4= <>
##$TPNAME5= <>
##$TPNAME6= <>
##$TPNAME7= <>
##$TPOAL= (0..7)
0.5 0.5 0.5 0.5 0.5 0.5 0.5 0.5 
##$TPOFFS= (0..7)
0 0 0 0 0 0 0 0 
##$TUNHIN= 0
##$TUNHOUT= 0
##$TUNXOUT= 0
##$USERA1= <user>
##$USERA2= <user>
##$USERA3= <user>
##$USERA4= <user>
##$USERA5= <user>
##$V9= 5
##$VALIST= <valist>
##$VCLIST= <CCCCCCCCCCCCCCC>
##$VD= 0
##$VDLIST= <DDDDDDDDDDDDDDD>
##$VPLIST= <PPPPPPPPPPPPPPP>
##$VTLIST= <TTTTTTTTTTTTTTT>
##$WBST= 1024
##$WBSW= 4
##$XGAIN= (0..3)
0 0 0 0 
##$XL= 0
##$YL= 0
##$YMAX_a= 374308
##$YMIN_a= -283959
##$ZGOPTNS= <>
##$ZL1= 120
##$ZL2= 120
##$ZL3= 120
##$ZL4= 120
##$ABSF1= 15.99371
##$ABSF2= -0.9789543
##$ABSG= 5
##$ABSL= 3
##$ALPHA= 0
##$AQORDER= 0
##$ASSFAC= 0
##$ASSFACI= 0
##$ASSFACX= 0
##$ASSWID= 0
##$AUNMP= <proc_1d>
##$AZFE= 0.1
##$AZFW= 0.1
##$BCFW= 0
##$BC_mod= 2
##$BYTORDP= 0
##$COROFFS= 0
##$CY= -3
##$DATMOD= 1
##$DC= 0
##$DFILT= <>
##$DTYPP= 0
##$F1P= 0
##$F2P= 0
##$FCOR= 1
##$FTSIZE= 16384
##$FT_mod= 6
##$GAMMA= 0
##$GB= 0
##$INTBC= 1
##$INTSCL= 1.334414e-10
##$ISEN= 128
##$LB= 0.24
##$LEV0= 0
##$LPBIN= 0
##$MAXI= 10000
##$MC2= 0
##$MEAN= 0
##$ME_mod= 0
##$MI= 1.114404
##$NCOEF= 0
##$NC_proc= -7
##$NLEV= 6
##$NOISF1= 3.799351
##$NOISF2= 2.8
##$NSP= 0
##$NTH_PI= 0
##$NZP= 0
##$OFFSET= 16.00407
##$PC= 1
##$PHC0= -11125.04
##$PHC1= 17.00102
##$PH_mod= 1
##$PKNL= yes
##$PPARMOD= 0
##$PSCAL= 0
##$PSIGN= 0
##$REVERSE= no
##$SF= 200.130001475074
##$SI= 16384
##$SIGF1= 3
##$SIGF2= 2
##$SINO= 5.538805
##$SIOLD= 16384
##$SREGLST= <1H.CDCl3>
##$SSB= 0
##$STSI= 16384
##$STSR= 0
##$SW_p= 3396.73913043479
##$SYMM= 0
##$S_DEV= 0
##$TDeff= 16384
##$TDoff= 0
##$TI= <>
##$TILT= no
##$TM1= 0
##$TM2= 0
##$TOPLEV= 0
##$USERP1= <user>
##$USERP2= <user>
##$USERP3= <user>
##$USERP4= <user>
##$USERP5= <user>
##$WDW= 1
##$XDIM= 16384
##$YMAX_p= 380881733
##$YMIN_p= -552809
$$ End of Bruker specific parameters
$$ ---------------------------------
##NTUPLES= NMR SPECTRUM
##VAR_NAME=  FREQUENCY,     SPECTRUM/REAL,   SPECTRUM/IMAG
##SYMBOL=    X,             R,               I
##VAR_TYPE=  INDEPENDENT,   DEPENDENT,       DEPENDENT
##VAR_FORM=  AFFN,          ASDF,            ASDF
##VAR_DIM=   16384,         16384,           16384
##UNITS=     HZ,            ARBITRARY UNITS, ARBITRARY UNITS
##FACTOR=    0.207333158178282, 1,           1
##FIRST=     3202.89460914033, 0,            0
##LAST=      -193.844521294459, 0,           0
##MIN=       -193.844521294459, -552809,     0
##MAX=       3202.89460914033, 380881733,    0
$$ Real data points
##PAGE= N=1
##DATA TABLE= (X++(R..R)), XYDATA
$$ [...]
7676 19081332 19044792 19121199 19376809 19337882 19222162 19202992 19130412 19173836 19177584 19121843 19147015
7665 19147015 19176441 19191967 18983164 19014708 18962565 18760577 18733874 18762264 18592937 18603921 18769302
7654 18769302 18846901 18689740 18507723 18384193 18209967 18306014 18365788 18198531 18185159 18210481
7644 18210481 18153812 17942442 17815303 17884298 17924755 18127326 18128474 18062069 18075969 17979902 17920714
7633 17920714 17882258 17984700 17871499 17756577 17991162 18042454 18085934 18008514 18006867 18016074 17899283
7622 17899283 17671965 17713377 17650553 17755030 17851168 17833273 17760238 17763500 17703830 17843692 17846545
7611 17846545 17844103 17710575 17607214 17863418 17791190 17784225 17872644 17898720 18077231 17983336 17925383
7600 17925383 18169777 18109455 17858876 17812307 17944373 18028365 17960450 17989046 18024826 17885726
7590 17885726 18006978 18096476 17912690 18050308 18158999 18388194 18238660 18070949 18154321 18029548
7580 18029548 18370969 18246729 18242612 18256768 18323184 18347420 18423651 18257424 18116835 18370531
7570 18370531 18389561 18637541 18663696 18597317 18561549 18574028 18624922 18826926 18815626 18896354 18916857
7559 18916857 18733020 18653313 18840328 18891507 18844869 18884282 18721674 18792984 18898244 18953346
7549 18953346 18973566 18987122 18770450 19029331 19195031 18953495 19015652 19280370 19366414 19400349
7539 19400349 19364714 19255288 19188028 19214808 19345113 19323671 19234627 19324815 19456661 19369680 19527781
7528 19527781 19759533 19723629 19818721 19856557 19699075 19829529 19968883 20084405 20069772 20070168 20084205
7517 20084205 20167089 20322436 20409160 20516815 20503734 20501672 20424646 20571896 20703161 20703350 20717727
7506 20717727 20801626 20929678 20962237 21068373 21068811 21028368 21122312 21145858 21173879 21337871 21451119
7495 21451119 21406754 21491448 21446021 21611181 21746328 21787908 22044076 22161063 22253204 22540996
7485 22540996 22656337 22726666 22951446 23084266 23309574 23016016 22903796 22740177 22611957 22633305
7475 22633305 22759554 22780827 22699533 22886260 23035122 22920856 22950366 22968817 22984729 23345733
7465 23345733 23487734 23475115 23280517 23452206 23591465 23738901 23648168 23666606 23827528 24050623
7455 24050623 23924185 23870249 23864485 23924965 24037198 24305258 24392390 24424535 24846731 25025824
7445 25025824 25058420 24967797 25214199 25565727 25814663 25861130 25754168 25751985 25734133 25641583 25611549
7434 25611549 25583497 25448164 25509556 25643644 25618674 25546298 25593575 25542288 25733295 25910660
7424 25910660 25857399 25867372 26149263 26314012 26296633 26124328 26154935 26261422 26209239 26369625
7414 26369625 26404965 26676747 26934807 27050205 26953894 26903845 27004779 26923366 27118588 27359179
7404 27359179 27103142 27329797 27629554 27894733 27629763 27687299 27882356 28026231 28229301 28156931
7394 28156931 28081604 28261632 28274492 28466471 28587568 28553577 28668411 28644847 28878084 29019885
7384 29019885 28930058 28861134 28920707 29031150 29028631 29205784 29327572 29345892 29371602 29485623 29497982
7373 29497982 29551704 29644775 29544717 29545025 29571034 29791101 29951735 29967784 29820269 30120641 30107668
7362 30107668 30082899 30298286 30274757 30253916 30292466 30268323 30399578 30486934 30336309 30418387 30580177
7351 30580177 30679507 30606572 30792325 31013727 30940810 30971683 31066719 30923891 31069450 31352867
7341 31352867 31399536 31114009 31038493 31295039 31475434 31628828 31460222 31379503 31474044 31451119
7331 31451119 31326870 31268684 31289556 31381993 31470663 31352338 31345919 31353292 31518991 31640683 31553164
7320 31553164 31532556 31367364 31428918 31716097 31739820 31726001 31823320 31599123 31549439 31506033 31527594
7309 31527594 31490390 31545523 31797338 31747304 31411103 31451541 31377224 31339330 31442907 31369818 31482867
7298 31482867 31549965 31445721 31269744 31229585 31384831 31328966 31254871 31046334 30797657 30854187
7288 30854187 30994671 30910618 30842276 30612862 30689257 30750356 30522367 30572991 30683805 30653747
7278 30653747 30742973 30648138 30417264 30314279 30207461 30243543 30274231 30092364 29769136 29700541
7268 29700541 29714651 29586476 29250342 29279125 29272556 29236354 28937407 28954170 28870725 28687372 28726230
7257 28726230 28812256 28593723 28401144 28365500 28167427 27962248 27888116 27886241 27665051 27594939
7247 27594939 27696504 27754139 27632173 27455448 27251051 27058156 26962290 26984191 26732688 26731336
7237 26731336 26502981 26261735 26180077 26138971 26032276 25844298 25654808 25442738 25233140 25146488
7227 25146488 25193962 24947900 24795010 24705894 24712355 24563911 24381590 24203415 24070267 23839530
7217 23839530 23632709 23582599 23583975 23179562 23099139 23108941 22793697 22671365 22588784 22455856 22416287
7206 22416287 22084227 22026209 22128709 22028428 21665442 21436544 21318934 21051524 21046298 20994533
7196 20994533 20876537 20701704 20740415 20396398 20078022 19911686 19792714 19771430 19803056 19479669
7186 19479669 19236544 19437762 19345490 19089421 18877949 18665687 18658830 18726891 18560161 18440709
7176 18440709 18445976 18056836 17858328 17797005 17709258 17382440 17228250 17147666 17202865 17091705
7166 17091705 17004505 16899218 16618674 16353700 16174071 16140967 15984383 15969056 15833577 15670615
7156 15670615 15529605 15513185 15390982 15384129 15146520 14980129 14971501 15006891 14717216 14563411
7146 14563411 14495005 14401488 14283423 14107823 13940362 13830794 13788198 13647327 13636863 13438811
7136 13438811 13154183 13289402 13199454 12975173 12831359 12822138 12776569 12724493 12704591 12508879
7126 12508879 12393953 12075725 11747630 11860521 12045332 11767271 11773025 11661868 11791142 11847739
7116 11847739 11563477 11385683 11129798 11099631 11121813 10934342 10702345 10628328 10626574 10555125
7106 10555125 10590962 10479902 10495456 10419615 10297621 10328737 10301070 9923527 9675755 9852389
7096 9852389 9831763 9640844 9550823 9457724 9376358 9317155 9196178 8940677 8993714 9218542 8941738
7085 8941738 8756884 8806109 8870747 8653336 8697150 8673329 8506903 8283288 8378773 8335884 8099148
7074 8099148 8032586 7973205 8029157 8026466 8015622 7958812 7949785 8009246 7891279 7819073 7787805 7335076
7062 7335076 7264772 7455895 7373069 7284860 7266090 7151085 7119953 6908416 6978173 7010123 6938770
7051 6938770 6851315 6954071 6924357 6462299 6375438 6368712 6355106 6337620 6353519 6394737 6303709
7040 6303709 6291274 6249612 6114549 6159943 6133399 5857745 5939311 6070657 5839561 5914367 5993254
7029 5993254 5784824 5760462 5736021 5530030 5400058 5429444 5503110 5537689 5434480 5151345
7019 5151345 5057145 5204919 5323251 5167574 4996585 4921802 5068809 5044855 4992933 5042922
7009 5042922 5014963 5037038 5046458 4992574 4771929 4625675 4674721 4599507 4534214 4525124 4594643
6998 4594643 4626192 4462041 4311455 4195244 4116985 4278358 4243613 4137658 4300895 4168768
6988 4168768 4190870 4081574 3950211 4041444 4070702 4193246 4113934 3843946 3892146 3908029 3873899
6977 3873899 3969045 3863009 3798665 3764439 3843516 3753026 3886788 3719984 3811423 3812467 3782298
6966 3782298 3649098 3584067 3487271 3480855 3554822 3412463 3312825 3207817 3172388 3209745 3186761
6955 3186761 3056416 3022217 3108928 3223563 3016667 3137676 3026138 3095632 3083911 2968877
6945 2968877 3024629 3054354 2995036 3044331 3066317 2865741 2806374 2891435 2800204 2717893 2877744
6934 2877744 2963981 2802938 2730677 2596221 2766490 2738010 2629311 2686378 2835663 2764483
6924 2764483 2618564 2550601 2609821 2623971 2486661 2498296 2506062 2472426 2529329 2480030 2439205
6913 2439205 2299971 2380994 2312524 2209718 2225359 2291811 2079756 1959424 2176869 2197893
6903 2197893 2361790 2211078 2103163 2062845 2161472 2180362 2127111 2084266 2047765 2031766 1829345
6892 1829345 2025037 1929368 1910400 2106811 2143885 2052608 1963967 2099964 2174782 1962340 1818773
6881 1818773 1670758 1685494 1761239 1716026 1930148 1956496 1939155 1865054 1902311 1777691 1746984
6870 1746984 1746462 1753307 1582424 1589864 1727089 1717853 1649507 1622685 1447775 1421328 1270730 1260168
6858 1260168 1402077 1505992 1582576 1519095 1590388 1618499 1700515 1725093 1484215 1469779 1473997
6847 1473997 1571039 1678610 1742501 1687771 1558157 1479434 1292470 1407354 1471798 1446271 1496270
6836 1496270 1358891 1292443 1467229 1606954 1320228 1420854 1340740 1270658 1306532 1242924
6826 1242924 1287617 1198783 1313623 1347724 1248084 1182231 1079959 1182540 1420659 1246112
6816 1246112 1139009 1203788 1057472 918756 1009328 1099857 1080076 1220414 1192888 1070280
6806 1070280 1126754 1333682 1198761 1255550 1189019 1038744 992513 996393 1080271 1065040 1128426
6795 1128426 853101 726856 776792 947794 879829 879263 810803 990463 1043819 1084120 1064217
6784 1064217 1058438 1188964 1203220 1343612 1093752 852343 964577 956127 911832 997152 803674
6773 803674 852401 920838 800871 776623 775532 860686 887231 800109 645848 840956 882188
6762 882188 1011152 786293 731996 1005873 978838 840019 755464 792440 701583 531262 520763
6751 520763 709428 770379 649473 634651 674655 982786 755564 576331 699005 772002
6741 772002 673101 521384 555354 574154 664098 608848 721111 700258 900250 952596 768171
6730 768171 708172 658411 877276 714521 670633 444519 499828 701448 784346 712749 699067
6719 699067 633621 577797 618289 609238 789225 617448 647546 758650 755785 654568 508934
6708 508934 495987 569624 579146 453605 432816 503850 479328 558929 497183 409470 500391 550736
6696 550736 631506 607121 410057 251573 423576 626504 304621 379333 365439 476243
6686 476243 494532 421290 484867 535358 473784 412318 412664 337927 263071 503192 401774 481821
6674 481821 540159 382805 465567 458031 555290 672751 555198 626043 650610 462325 450665
6663 450665 457150 450065 537287 637496 486184 511972 443453 364626 338269 229225 527946
6652 527946 515812 457716 306185 191682 521045 645758 502951 456978 476592 389879 432785
6641 432785 527085 528233 293347 171396 302916 289041 116968 35413 238127 347974 361079
6630 361079 226584 152456 53220 -561 56001 134126 37445 5319 75777 268776 295583
6619 295583 188513 246814 182569 263779 205133 180373 100640 227511 319659 185014 47533
6608 47533 90412 145840 182911 115503 142533 239604 104979 141918 246867 46411 150094
6597 150094 216261 335776 249437 211064 107840 5406 104406 238537 199927 85695 58144
6586 58144 207362 69271 -167046 178388 360106 117522 -69262 -55765 54965 73701
6576 73701 -33519 -113908 -113191 131471 306470 293252 210121 82891 33038 -44190 -1862
6565 -1862 -68518 -148575 20040 87874 239440 250874 152177 58005 47732 54828 -51489 -50205
6553 -50205 72774 179111 241075 -13363 111916 176733 27084 5604 -25940 -123187 66316
6542 66316 234094 241350 121158 -62000 -44038 62437 34006 -133618 -307077 -171407 75464
6531 75464 -53870 -83701 -21227 99287 -14981 -7152 -170143 -66058 -40368 -26308 -158156
6520 -158156 -426510 -344931 -222441 29637 111307 -88240 35925 17763 -122373 -38662
6510 -38662 -42897 -81590 -23296 156238 77423 -5880 -12420 -235106 -53982 192870 -10320
6499 -10320 -111722 114398 332374 45327 -102121 -55456 212285 53528 14381 4556 87718
6488 87718 54467 -215508 -144436 -79548 -21905 -32388 43166 77730 -117852 -43478 157220
6477 157220 155908 124569 -66367 4702 -46112 80411 96023 -68185 -120663 -116781 -59902
6466 -59902 -116795 -355275 -343969 -217407 76242 124801 91241 106013 -17635 119146 75699
6455 75699 -46413 -47694 119118 15174 -12433 3264 38270 37191 86323 21321 -44556 -81872
6443 -81872 -122631 -26030 -62014 -126198 -107585 -133438 13391 134437 96406 -38611 -94439
6432 -94439 -22813 13356 19319 4148 96067 227223 127073 46669 135780 229546 71899
6421 71899 -72623 -273693 144747 67055 -128101 -169588 -93821 -104141 -204415 -20037 -116058
6410 -116058 -62853 34478 -28930 -181874 -252504 -41854 8878 73279 87658 -34182 -99424
6399 -99424 -130354 77715 131486 158845 83057 9587 -152021 -76125 -8923 -104144 -52985
6388 -52985 100150 9390 78145 -97219 -64809 -149223 -203611 -6707 164482 89361 128063
6377 128063 159779 118329 61349 -25953 94384 124541 266317 360883 289258 310067 257770
6366 257770 189007 134268 144230 198243 266057 426420 411610 496717 343482 243992 244650 346545
6354 346545 346485 308423 468399 273316 182440 117145 257385 106172 89972 159858 274376
6343 274376 298110 171140 116635 158910 53479 69603 180957 89705 73781 -11598 -29358
6332 -29358 -76051 -244970 -326705 -177810 -144553 -76307 -179526 -27044 172117 152389 238951
6321 238951 243595 293232 -7347 -189708 -61394 -96387 13043 21988 -6049 -5366 -17858 -207689
6309 -207689 -269476 -322760 -327725 -344908 -340735 -194413 -167201 -340634 -299097 -249436 -315318 -312643
6297 -312643 -212165 20204 8532 -90313 -92843 -230719 -263640 -151550 54705 66757 -184968
6286 -184968 -181393 -121141 -31832 -69321 -315715 -196387 -47144 -121365 -222969 -295864 -192319
6275 -192319 35383 -40603 -9683 42428 49532 -39964 -179262 -215183 -101832 -186558 -212503
6264 -212503 803 -78915 -72761 -85474 -292028 -333826 -193272 -111702 -63921 -19996 65696
6253 65696 -1483 -42780 -109122 -200693 -119131 -125285 -160246 -175127 -264176 -237587 -383549 -341114
6241 -341114 -176905 -320489 -221614 -87381 -106017 -140339 -250997 -177751 -91581 -618 -71864
6230 -71864 -98896 28993 -83914 -71827 -170125 -293168 -207191 -191175 -336436 -271964 -1792
6219 -1792 110954 -160043 -175228 -36652 -42720 -52217 -147556 -229498 -167972 -174444 -409971 -419032
6207 -419032 -347218 -426921 -306749 -37939 -106120 -161992 -69387 -94573 137711 190261 -7843
6196 -7843 -31969 -152156 -103700 -65677 8920 -54091 -7552 -184556 -107360 -45740 -105700 -156796
6184 -156796 -264374 -46533 -33734 -128304 -102561 -176559 -187772 -346517 -334445 -228604 -210313
6173 -210313 -85818 -57640 34528 -16837 -55616 -175111 -4750 -79988 -185450 -51830 -49947
6162 -49947 41786 115876 111299 -248491 -268043 -139770 -67608 56157 -76462 -149447 29375
6151 29375 93219 77894 -4626 619 139211 99091 116595 171519 104106 97778 307385 381750
6139 381750 235220 207028 207522 -2144 -45407 -96957 -108999 3717 104649 546 108565
6128 108565 71047 -1776 20099 84855 -130158 -202239 -88644 -7871 -73330 -67833 15630
6117 15630 38702 121259 48405 53627 105778 85353 -8440 -1487 258251 193865 -114902 -117151
6105 -117151 -1977 42791 62636 150500 65180 43354 40477 -33608 89796 131695 83052
6094 83052 200026 292384 355881 167696 2875 56840 212857 276095 168623 -63716 -77034
6083 -77034 32081 -59921 -142997 96830 61864 -30922 -83738 -148398 -129122 -198478 -146029
6072 -146029 36514 -10702 40735 66669 46150 26614 69323 -19388 -105391 -161430 -145623
6061 -145623 -239468 -192140 -37068 155076 174876 87824 -10357 -75736 -43067 -37288 92308
6050 92308 -225221 -250912 -27613 -29892 -65387 -82496 -128042 -96024 -171858 -272443 -364541
6039 -364541 -360176 -102368 -14053 -163298 -295405 -98789 -149 158456 282167 74930
6029 74930 -10230 62032 116655 54814 3865 101246 19252 -54606 -73467 -148129 -111579 56188
6017 56188 161438 -87352 -356789 -371185 -28563 35671 54669 -2106 -26519 -34055 39156
6006 39156 -84090 -199564 49171 221804 123502 102415 175839 273474 239828 79865 13395
5995 13395 46945 -31795 122929 -30009 -209453 -117544 59707 255435 163338 77671 137107
5984 137107 181260 101287 -33663 -155969 -24272 210017 150493 34801 -13500 81089 209746
5973 209746 321195 171689 57076 -19124 127400 212897 204039 104889 -33631 280127 130734
5962 130734 321159 197631 177479 408153 214418 230451 169492 224151 283212 393095 348050
5951 348050 306157 290993 427744 395176 284047 150649 231898 425063 482681 619159 493887
5940 493887 458689 370609 592603 418171 139467 252829 499500 558579 532273 269564
5930 269564 263539 262081 394309 355472 158419 427039 493566 365725 255428 341669 327962
5919 327962 360020 485800 349535 223955 231994 202746 266512 357311 231772 279280 288000
5908 288000 323977 346057 156764 139471 274468 270934 273247 196973 78495 158670 307806
5897 307806 309563 218410 194414 449783 520151 391530 399039 245057 281214 429752 351074
5886 351074 199536 335184 468649 444536 473300 249648 206644 242885 188287 212288 26557
5875 26557 -119211 -28968 58652 153389 148749 86944 -70042 -51981 41927 66608 120827 156772
5863 156772 177535 47495 101565 75969 -129560 119153 336256 354932 227116 138362 -6713
5852 -6713 117604 302758 173140 396696 390499 161495 27968 66571 122508 133620 226901
5841 226901 288888 203311 158753 139300 210248 182873 284026 155430 89552 129297 292104
5830 292104 207799 181616 230572 251079 219747 283288 214919 67624 99542 208731 269218
5819 269218 442697 494513 408368 267097 175082 286882 228614 383055 448427 233347 182226
5808 182226 164846 190007 278843 446359 378028 116837 -40971 275381 489152 546503 549756
5797 549756 381628 271864 332011 504833 499203 514973 396402 236527 367630 345300 175985
5786 175985 326529 480710 561843 364805 313754 358748 491357 590853 525312 391681 387464
5775 387464 377519 537359 526501 567038 524271 405906 506859 481085 441097 745629 719644
5764 719644 546910 545201 662759 563398 557301 651934 676614 777375 762761 723303 567391
5753 567391 547803 593604 543546 572088 618486 643356 748198 857185 860678 756956 548734
5742 548734 586225 683220 600450 666620 949701 1010798 1040124 1100395 1069013 907361 962552
5731 962552 880260 899361 937251 987206 1068942 996924 1115120 943819 991923 1210816 1192885
5720 1192885 966757 956174 1102475 1288983 1332107 1368551 1316817 1260929 1315321 1402391 1523585
5709 1523585 1498521 1472190 1528332 1564856 1511461 1432746 1503507 1394805 1392418 1389910 1469204 1437146
5697 1437146 1386082 1599063 1686555 1712151 1776154 1843668 1752304 1842483 2128023 2026749 1999225
5686 1999225 1900557 2074274 2099442 2341306 2260663 2240138 2330080 2233527 2525957 2614799 2518740
5675 2518740 2445855 2459836 2398965 2501064 2687186 2949252 2794723 2777848 2779393 2908944 2988443
5664 2988443 2867222 3148364 3333679 3457533 3377937 3450368 3611048 3520520 3745309 3817081
5654 3817081 3762016 3975992 4207081 4272117 4230232 4334572 4572402 4579765 4656930 4918953 5143181
5643 5143181 5344004 5413492 5518794 5636048 5813721 6134930 6247464 6486646 6594377 6743175
5633 6743175 6880315 7186400 7525351 7678327 7942574 8144241 8414487 8745048 9090605 9375499
5623 9375499 9630378 10126962 10189144 10501335 10739432 10763786 11064626 11379887 11729556 12155351
5613 12155351 12635794 12916754 13044382 13176986 13462096 13946001 14378666 14755934 15195987
5604 15195987 15526833 16045905 16603915 17130634 17738665 18358430 19019463 19612291 20065810
5595 20065810 20777547 21419447 21944807 22598506 22879849 23139207 23430378 23616808 23969339
5586 23969339 24087794 24214399 24425561 24349285 24616075 24851662 24794475 24956971 25038092 25070802
5576 25070802 25436572 25847596 26083528 26435535 26919802 27448404 27862050 28428050 29032491
5567 29032491 29733161 30291792 30919073 31573462 31916246 32120046 32320048 32354255 32667228 32767464
5557 32767464 32655321 32422029 32127820 31578460 30977881 30522254 30089318 29602619 28996489
5548 28996489 28423179 27802074 27533914 27402111 27048886 26538238 26355095 26343426 26317559 26063905
5538 26063905 25971067 26027231 26164432 26225331 26078375 25966933 26175561 26277327 25891998 25624402
5528 25624402 25389893 24880842 24324324 24059496 23518156 22838839 22067722 21512089 21012352
5519 21012352 20338200 19670985 18967018 18236650 17700890 17102536 16412541 15982848 15581955
5510 15581955 15018206 14641011 14517501 14274873 13947091 13502258 13178221 12818985 12581293
5501 12581293 12292626 12260892 12083100 11751728 11299473 11094872 10880039 10610836 10323699 9980862
5491 9980862 9746232 9498511 9103595 8590793 8381469 8155903 7879746 7645456 7272959 6759224
5481 6759224 6631016 6434794 6373491 6196449 6022037 6013327 5924979 5738983 5475168 5221364
5471 5221364 5017633 4969007 4795050 4643526 4419782 4134913 4223110 4262784 4100093 3946192
5461 3946192 4012092 3882214 3858744 3889359 3626215 3653694 3629540 3563934 3346232 3079799 3086338
5450 3086338 3210485 3073799 3086201 2943222 3088955 3122103 2868432 2821396 2704648 2560094
5440 2560094 2674684 2771368 2675023 2642188 2651528 2582473 2618554 2558336 2631799 2677642 2430228
5429 2430228 2476021 2533327 2397329 2176982 2258578 2426364 2458699 2507984 2346632 2300224 2233583
5418 2233583 2212061 2138808 2117843 2327936 2415809 2367304 2230976 2249027 2172351 2134628 2100840
5407 2100840 2177349 2254295 2291608 2137857 2123400 2090117 2142788 2130762 2119040 2254372 2220772
5396 2220772 2288595 2149491 2139075 2109605 2085350 2087050 1956380 1931514 1885752 1835173 1777946
5385 1777946 2017706 1958061 1812775 1656204 1631582 1754633 1824277 1828873 1508997 1493733 1811285
5374 1811285 1985449 1972138 1695176 1675475 1583467 1596025 1644591 1481655 1390805 1604092 1716882
5363 1716882 1527522 1336849 1427540 1662628 1693257 1598220 1498620 1614750 1661344 1466803
5353 1466803 1408603 1461011 1450312 1599895 1629194 1652416 1538268 1428691 1527234 1789608 1690883
5342 1690883 1686482 1819292 1870743 1801894 1960120 2117185 2098438 1903816 1985280 1957337 1834855
5331 1834855 1981695 2081297 2036677 2107403 2266724 2328085 2374227 2220654 2330986 2302814 2329956
5320 2329956 2468402 2361609 2442648 2410426 2353123 2421307 2493245 2509004 2440328 2607647 2680837
5309 2680837 2652155 2693462 2878237 3068447 2976750 2977606 2882466 2842467 2863667 2771178 2896416
5298 2896416 2905905 2958120 2910460 3051164 3168228 3173387 2954106 2837507 2842811 2978958 3251490
5287 3251490 3049137 3046077 3209287 3312398 3295180 3332725 3338223 3202895 3324274 3426302 3524373
5276 3524373 3670099 3508537 3502441 3545471 3556330 3715312 3716067 3742145 3879497 3838490 3692927
5265 3692927 3825298 3820766 3599679 3475809 3360770 3366754 3605209 3607356 3720882 3566417 3611210
5254 3611210 3682345 3519141 3442858 3516183 3210863 3155341 3303860 3279930 3322973 3250065 3267809
5243 3267809 3224155 3370826 3529809 3396953 3337618 3373339 3194511 3313537 3272742 3224365
5233 3224365 3132606 3146538 2950016 2906583 2982416 2878263 2864713 3002789 2858680 2747964
5223 2747964 2747943 2618752 2608378 2571473 2532380 2641500 2497906 2648434 2594644 2416589 2399394
5212 2399394 2308994 2275049 2429754 2625493 2632271 2463508 2440206 2257436 2203279 2195322 2301124
5201 2301124 2393206 2371112 2457147 2219698 2033028 1853724 2033423 2097034 2064824 1974157 2000531
5190 2000531 1931522 2104214 2071017 1969330 1856945 2086416 2069824 1938726 1855622 1959237
5180 1959237 1952122 1845034 1786526 1810447 1771799 1977839 2021965 1825016 1910434 1779421 1834312
5169 1834312 2049052 2051571 1927755 2046276 1874519 1831690 1942913 2162742 1972110 2047840
5159 2047840 2044529 2148943 2024596 1975957 2264734 2201982 2228249 2118078 1977819 2095501
5149 2095501 2059892 2137023 2191389 2135528 2305445 2270613 2088695 2035842 2057466 2004466 2117239
5138 2117239 2181362 2239861 2415164 2494229 2413802 2357072 2391134 2393404 2320117 2485197 2650952
5127 2650952 2527905 2406351 2621750 2682511 2573852 2510349 2636636 2700925 2622051 2508716
5117 2508716 2452448 2712923 2755195 2861965 2653892 2648534 2754613 2863117 2904985 3039850
5107 3039850 2963119 2954790 3019185 2865974 2887740 2951123 3136954 3273683 3270503 3259899 3399510
5096 3399510 3464330 3461715 3501200 3526080 3436859 3474802 3530298 3623380 3622262 3700387 3807935 4037863
5084 4037863 4041832 3936031 4047390 4261271 3996523 4146639 4082321 4070695 4153135 4204094 4232375
5073 4232375 4419867 4565197 4608903 4714872 4691602 4573969 4581791 4681833 4777316 4912211
5063 4912211 4991295 5068408 5058461 5026788 5095370 5309289 5488487 5324161 5146655 5388820 5460724
5052 5460724 5623718 5641955 5747346 5834837 6033334 6151517 6316040 6543221 6487017 6304194
5042 6304194 6461410 6836781 6891406 6598717 6590012 6631729 6774287 6991452 7284147 7147805
5032 7147805 7190448 7445770 7349629 7265655 7320047 7530688 7743176 7861285 7965325 8131623
5022 8131623 8116562 8377424 8452860 8570254 8756777 8910220 9025039 9117527 9106357 9021176
5012 9021176 9242451 9430924 9625830 9768234 9837141 9970711 10338983 10592789 10797000 11014216
5002 11014216 11192558 11140524 11436973 11686037 12020864 12440171 12823947 13294888 13330845 13569864
4992 13569864 14068085 14527962 14992276 15523610 15990558 16412564 17056500 17590625 17975800
4983 17975800 18455162 19004664 19449349 19871424 20557509 21223567 21761381 22558814 23329771
4974 23329771 24138549 25164489 26184346 27210924 28379496 29839944 31319445 32921207
4966 32921207 34582200 35965045 37408680 39102133 40674124 42079547 43404434 44694021
4958 44694021 45564329 46079699 46520942 47009191 46945170 46832418 46476307 46184911 45766552 45223741
4948 45223741 44883430 44693623 44428913 44207415 43850749 43661815 43756763 44112032 44392964 44516235
4938 44516235 45133290 45668103 46382673 47384297 48238680 49468481 50848492 52175019 53608985
4929 53608985 54861383 56497064 57904750 59079267 60516480 61648193 62621965 63454447
4921 63454447 63874465 64588466 65277205 66055773 66724307 67472349 67903387 68552703 69231435
4912 69231435 69750877 70164570 70455712 70747349 70903293 70851848 70672836 70211361 69501944 68658289
4902 68658289 67461343 66227630 64385057 62729021 60925083 59208680 57626118 56105420
4894 56105420 54953321 53953454 53296604 52516536 51766651 51341926 51260469 51300742 51246775 51461164
4884 51461164 51733579 52136842 52864259 53342154 53737963 54084087 54421663 54601745 54522937 54353899
4874 54353899 54030208 53826696 53204701 52142462 50990279 49551903 47742727 45917145 43998511
4865 43998511 41564827 39607587 37781335 35737003 33768674 31969931 30562458 29184077
4857 29184077 27649709 26360080 25226488 24188670 23140134 22310143 21571436 20726370 20045666
4848 20045666 19394047 18757778 18080034 17700019 17354107 16922258 16193461 15735971 15220645
4839 15220645 14876563 14635265 14458211 14205110 13817724 13565549 13278463 13023260 12670309
4830 12670309 12402960 12193085 12101243 12012663 11773902 11543970 11334010 11269730 11149687 11020053
4820 11020053 10847765 10708584 10751980 10772271 10525748 10323496 10221670 10267816 10145245 10070734
4810 10070734 10069072 10022678 9923690 9804625 10035342 9954312 9876412 9724601 9876070 10031095
4800 10031095 9994456 9947026 9824402 10003613 9994559 10065260 10101816 10128080 10050722 10157412 10446300
4789 10446300 10476356 10487029 10576446 10669851 10756776 11037507 11317716 11283539 11124412 11217118 11221585
4778 11221585 11537091 11684073 11799289 11759843 11987763 12023402 12306511 12625380 12896409 13046341
4768 13046341 13149739 13575065 13796884 13984350 14403227 14811771 15112812 15517400 15632304
4759 15632304 15994433 16410837 16727684 17298031 17568620 17907852 18562664 19407639 19966399
4750 19966399 20279630 20803317 21530895 22450751 23213305 24063636 24946666 25929720 27266984
4741 27266984 28414237 29607813 30840874 32071827 33709914 35497964 37226235 39035842
4733 39035842 41222223 43125806 45172237 47260209 49292928 51522468 53736055 55636673
4725 55636673 57019291 58222943 59239222 59766445 60112327 59971145 59824975 59794700 59573541
4716 59573541 59137548 58611701 58092478 57791416 57522647 57158003 57273187 57184051 57265493 57533571
4706 57533571 57866812 58601388 59310851 60179028 61259211 62408933 63693602 64749432 65737026
4697 65737026 66621829 67398491 67897750 67986572 68031049 67793798 67105059 66333499 65612671 64750733
4687 64750733 63980838 63268915 62370238 61652534 61205173 60650588 60157880 59635884 59149669
4678 59149669 58712706 58630233 58305456 57670648 57303551 57197888 56783160 56151776 55287555 54255707
4668 54255707 53381721 52374852 50837542 49592564 48401296 47083245 45984413 45057665
4660 45057665 44414002 43680587 43303768 42970969 42575263 42103775 41946676 41906197 41917091 42168588
4650 42168588 42242175 42382122 42278382 42224119 42221590 41992339 41766765 41061272 40371845 39466504
4640 39466504 38298936 36651738 35115202 33563198 32008838 30348307 28752821 27206503
4632 27206503 25562728 24383775 23304575 22168388 21042293 20057096 19047299 18337487
4624 18337487 17591870 17015466 16391916 15638931 15185838 14549415 14080079 13870444 13451481
4615 13451481 12935917 12366257 12119795 11919514 11629511 11081861 10812814 10630855 10319120
4606 10319120 9773502 9673558 9411380 9079247 9023106 8925364 8724657 8423134 8284890 8187713
4596 8187713 8003730 7851021 7520360 7240304 7329632 7176815 7065796 7010501 6976105 6900987
4586 6900987 6749324 6606321 6366221 6244000 6209890 5948905 5839159 5896785 5820054 5708646
4576 5708646 5447198 5355946 5255783 5442026 5500896 5284234 5478855 5254844 5092686 4900245
4566 4900245 5017560 4937133 4663246 4592667 4637001 4681683 4815930 4690578 4493850 4501571 4573523
4555 4573523 4522308 4522576 4500778 4250107 4353844 4357216 4327989 4368437 4381314 4615207 4704866
4544 4704866 4524478 4246739 4180208 4208248 4294065 4232442 4219459 4077822 4110702 4154817 4414898
4533 4414898 4438930 4030774 4074414 4232385 4477799 4431404 4033633 4000021 3971537 4100129
4523 4100129 3991891 3812716 3594234 3682623 3634675 3696990 3759471 3745443 3843043 3900759 3837359
4512 3837359 3933505 4164860 3971182 4046007 4036120 3956491 4052188 4243877 4114725 4230938 4261806
4501 4261806 4225505 4369643 4500176 4501758 4549499 4485325 4606233 4725053 4878409 4952709 4988742
4490 4988742 5206725 5349481 5343274 5128980 5291900 5270242 5367075 5329491 5229823 5473615 5569778
4479 5569778 5750540 5674081 5543946 5575545 5735769 5949498 6108644 6030236 6089691 6006045
4469 6006045 5949966 5902888 5933894 5667620 5587564 5357874 4938621 4686926 4682693 4472519 4462464
4458 4462464 4356492 4219626 4105947 4116621 4117836 4087615 4087003 3923470 3882451 3969509 4196480
4447 4196480 4230817 4348600 4389446 4317410 4272769 4137194 4231591 4102250 3921980 3679902
4437 3679902 3626978 3578750 3473004 3441584 3299881 3245164 3126553 3031907 3036053 2947128 2905143
4426 2905143 2904861 2871468 2736952 2845580 2969002 2954485 2903097 2634948 2645984 2440263 2388688
4415 2388688 2559558 2556316 2602657 2532385 2546844 2711984 2615235 2637620 2612254 2870990 3000527
4404 3000527 2971258 3069348 3018885 3014228 3037006 3011793 3209398 3094305 3316409 3412362 3268350
4393 3268350 3316402 3194706 3077912 3273427 3299596 3299480 3478283 3329695 3264292 3269261 3290447
4382 3290447 3382630 3401640 3335981 3269695 3412452 3099127 3054373 3199901 3239111 3119107 3094416
4371 3094416 2900137 2861311 2973514 2959028 2931617 3037504 2847628 2740173 2869063 2935541
4361 2935541 2951581 2797786 2731398 2846316 2644314 2381947 2246082 2264594 2395830 2358844
4351 2358844 2423068 2400713 2345117 2308111 2167818 1998790 2065034 2076478 1933359 1933180 1927415
4340 1927415 1865469 1857263 1745622 1706563 1782042 1729169 1747133 1800190 1857476 1768843 1785483
4329 1785483 1603843 1496779 1537585 1433234 1607728 1609139 1595817 1483708 1243452 1322656
4319 1322656 1409184 1515496 1398714 1290520 1442287 1395000 1414048 1300377 1252061 1178589
4309 1178589 1180305 1155110 961425 894332 1079702 1072803 983695 963950 961916 882821 919634 981298
4297 981298 1200778 1091140 1091147 1045882 1066126 884939 913598 974811 992614 857389 925292 1121556
4285 1121556 1296852 1296442 1072322 1082703 969757 839542 761601 840610 938954 894902 1004449
4274 1004449 913487 835154 847759 899473 971316 852874 786670 730405 691932 813274 730998
4263 730998 753771 744322 708260 778548 835921 736703 680763 866325 935281 998937 738913
4252 738913 504989 569135 764408 763086 756892 760228 781964 757307 659087 615623 597747 559586
4240 559586 686921 685847 730419 776249 819411 882436 880582 700858 822145 1062122 1005871
4229 1005871 916899 1003552 898310 735243 784591 849306 1034524 1061276 965682 993393 849138
4218 849138 609356 665705 774774 1032063 1153018 1035824 1150888 1050168 1037327 952610
4208 952610 929607 861653 850062 835231 839039 983287 964872 869947 900120 1072586 1043028
4197 1043028 1071297 982376 813968 878177 850383 786269 1032832 951916 918479 1120403 923965
4186 923965 822829 791439 976011 984812 988408 1069551 910529 920489 945386 767289 957032
4175 957032 1044515 1138094 1304960 1106605 1048648 1298162 1429036 1485397 1236175 1258638 1400836
4164 1400836 1272060 1219058 1358998 1469172 1486161 1436085 1376606 1376000 1464621 1587362 1419244
4153 1419244 1569259 1612873 1638729 1705443 1725519 1661286 1815487 1862741 1897955 1970628 1967171
4142 1967171 2095320 1830076 1713917 1837419 1795976 1950865 1774183 1946287 2116304 2159102
4132 2159102 2201802 2087639 2283916 2219747 2165476 2219156 2365736 2461967 2286486 2201900 2294811
4121 2294811 2328967 2139483 2140913 2384001 2499927 2546878 2753942 2919533 2783659 2852583
4111 2852583 2572465 2495623 2689834 2953060 2866354 2793235 3061682 3186722 3072174 3060501
4101 3060501 3201667 3103947 3053971 3092403 2917386 2892390 3135787 3167132 3140620 3066253 2811269
4090 2811269 2594706 2829943 2780439 2832891 2859031 2957507 3057219 3119774 3065480 3047754 2922368
4079 2922368 2740070 2792218 2785303 2753988 2950408 2974505 2924700 2812031 2775831 2912766 3025833
4068 3025833 3136323 2955722 3015132 2872165 2872493 2994319 3070905 2973845 2969137 3321332 3400901
4057 3400901 3242179 3393730 3410756 3500184 3632027 3273014 3361988 3389696 3726915 3848824
4047 3848824 3571979 3558237 3638832 3767772 3896169 3663058 3644171 3691714 3614849 3571655 3560317
4036 3560317 3385344 3121311 3183382 3104206 3047052 3026101 3027738 3042463 2990204 2808500 2773171
4025 2773171 2776465 2738642 3017577 3017909 2826952 2687774 2621283 2681848 2597362 2560298 2851881
4014 2851881 2941902 2797476 2663267 2665492 2773869 2887728 3019948 3020671 2870271 2815043 2979590
4003 2979590 2866895 2820390 2881941 2851775 2947198 3093286 2800282 2626806 2647753 2718212 2735649
3992 2735649 2591615 2452132 2789374 3001309 2857274 2759031 2695126 2722517 2848488 2731188
3982 2731188 2637196 2603892 2694143 2649311 2527781 2663512 2716156 2701465 2808456 2938980 2967964
3971 2967964 2887931 2889902 3084021 3159884 3128121 2997034 2852754 2985629 3198652 3216803 3161606
3960 3161606 3313940 3569200 3531412 3379908 3481427 3674227 3892214 3844007 3952873 4179040
3950 4179040 4245780 4437357 4683748 4612360 4535964 4610128 4778323 4848572 4899953 5097185 5268258
3939 5268258 5265179 5354776 5464709 5644003 5539379 5601997 5572228 5296183 5116675 5155961 5249817
3928 5249817 5206518 5160913 4943671 5023249 4902216 4811796 4807679 4901517 5069153 5195395 5179256
3917 5179256 5159566 5227404 5328228 5145073 5301522 5262138 5379776 5327216 5314511 5295860 5373871
3906 5373871 5448012 5306553 5174589 4958658 5004860 5310771 5517620 5262151 5097900 5219346
3896 5219346 5047314 4946382 4811153 4612147 4587331 4400617 4538127 4505953 4376604 4357004
3886 4357004 4339784 4438405 4427575 4372966 4489505 4400247 4349705 4410636 4366332 4317189 4332815
3875 4332815 4397062 4306185 4305605 4389793 4499337 4550696 4637402 4770581 4636457 4606780 4659195
3864 4659195 4733162 4839695 4833376 4843188 4898316 4780041 4825045 4846861 4842470 4817530 4659022
3853 4659022 4545039 4431230 4536609 4530063 4437758 4307115 4228728 3950539 3929100 3750785
3843 3750785 3641780 3564075 3703313 3638629 3367967 3214830 3080671 3377145 3212562 3067496
3833 3067496 2969401 3219302 3211953 3215380 3374615 3296473 3050952 3101048 3219090 3114898 2995172
3822 2995172 3084538 3181433 3227015 3262609 3285529 3399731 3371648 3479309 3484263 3449849 3668876
3811 3668876 3696810 3702271 3631813 3633175 3424089 3241561 3261285 3045613 2794886 2740676 2874014
3800 2874014 2952436 2935951 2687843 2654615 2664913 2486009 2600080 2661876 2617842 2694054 2696148
3789 2696148 2512634 2310653 2272370 2283625 2456617 2390729 2180265 2097065 2234302 2130769
3779 2130769 2137626 2279115 2296448 2317474 2236409 2120925 2201361 2304100 2174000 2061650 2184846
3768 2184846 2112408 1949373 1937210 2015127 1799670 1536574 1582909 1746181 1635256 1579886
3758 1579886 1510700 1606980 1815253 1860839 1716519 1729502 1723831 1822196 1890765 1697104 1654861
3747 1654861 1620165 1658862 1765218 1765103 1613376 1767471 1742968 1682975 1631581 1589984 1413655
3736 1413655 1426833 1426543 1489879 1422696 1468058 1443510 1422598 1284936 1305126 1550318 1636241
3725 1636241 1492486 1350794 1413894 1455474 1508706 1484931 1545986 1577078 1475514 1656495 1643825
3714 1643825 1502354 1376724 1387280 1511139 1462662 1403149 1425118 1604971 1525760 1398498
3704 1398498 1367361 1256676 1351162 1428591 1125724 1011013 1102586 1170368 1117727 1178560 1432732
3693 1432732 1364780 1291973 1127857 1107043 1249113 1186250 1107344 1115253 1181269 1086105 1138259
3682 1138259 1007923 895883 933814 917619 885178 835952 914678 1020335 864826 992074
3672 992074 1161827 1147996 1026573 904335 709783 827419 1027065 956594 821850 810476
3662 810476 932923 1095167 1233467 1137664 912290 760875 792594 784883 604946 504812
3652 504812 548540 862505 692102 750146 846414 596815 512741 697179 1023797 832115
3642 832115 859239 921398 851820 616971 685453 902742 1114689 1038176 929828 863978 932280
3631 932280 1083354 919801 816355 935351 904913 871909 928392 713659 821848 929410
3621 929410 1086025 1022583 1103820 977604 1025427 923089 779092 834300 701937 921534
3611 921534 991402 931406 841718 619604 677018 801361 751519 607511 656435 705905 749136
3600 749136 998538 802515 819479 975010 982698 1016431 954957 750953 798822 896880 855485
3589 855485 770438 827905 615674 464600 639806 652927 781806 704195 608220 833749 948472
3578 948472 938421 879759 902921 1054008 1085318 831867 713799 832880 758877 838697 942525
3567 942525 675834 614407 805466 779655 782079 941361 853524 885362 788990 742065 677698
3556 677698 760443 906562 879695 835391 764211 796255 813372 750994 782122 811062 855614
3545 855614 859034 906724 775312 851787 999350 1015038 920899 896187 1010194 1029302 1062644
3534 1062644 921367 893800 928613 964174 1032198 1052522 916981 937318 791478 778248 725296
3523 725296 616619 761510 864494 899835 1081719 1156424 1158384 1016066 1048048 1160856 1054916
3512 1054916 982923 951295 953887 1085270 1034685 909393 895563 851218 956059 842332 940298
3501 940298 1041537 878710 941963 898361 928580 839486 1131404 1196121 1046341 1160300 1115632
3490 1115632 1127955 1218353 1473443 1317909 1094807 1188111 1291803 1444991 1378188 1138895
3480 1138895 1070920 1176695 1296087 1285818 1203265 1167864 1340158 1387640 1236697 1013511
3470 1013511 1083348 1177080 1149419 1089180 1150568 1241960 1183566 1071339 895559 928502 1056508
3459 1056508 1018067 1141528 1073295 1122810 1260760 1429907 1341784 844418 815513 1101967
3449 1101967 1163673 930794 903219 943320 1104378 1125466 1090464 912558 920876 1005746 962573
3438 962573 1206630 1159869 1101359 1174358 1258822 1389818 1067358 1090580 1291611 1120472 1000937
3427 1000937 986519 1039276 1149714 1223245 1070416 935123 996394 1114980 1084585 1164491 1118419
3416 1118419 1188531 1390617 1280662 1196277 974710 972580 1099317 1317950 1340865 1331625 1424791
3405 1424791 1408482 1325050 1216457 1270837 1189540 1219762 1456295 1428901 1073172 953094 1087836
3394 1087836 1110669 1009779 767829 507589 929355 1111513 1053164 1035072 898376 914522
3384 914522 1123725 1153281 857405 1034880 1180571 1240037 1205248 1247300 1297144 1199916 1224096
3373 1224096 964466 1102253 1098598 1128396 1358978 1318955 1176494 1241050 1534543 1480474 1504448
3362 1504448 1455168 1297870 1474988 1655691 1530376 1404313 1351699 1534090 1701999 1514521
3352 1514521 1465754 1344201 1351507 1669794 1824709 1920831 1803921 1630377 1785201 1896421
3342 1896421 1747242 1762670 2027594 1910134 1811155 1754007 1665447 1732339 1702672 1788168 1683920
3331 1683920 1673474 1795662 1980655 2016130 1752363 1743127 1919940 1945613 1981649 1909086 1960081
3320 1960081 1902529 2004300 2050302 2055962 2132419 2056653 2080635 2040439 2115797 2015673 1916162
3309 1916162 2032724 2072229 1932685 1932435 2025624 1951151 1942197 1829541 1871089 2011566 2119201
3298 2119201 1977392 1947337 2224829 1994582 1884871 1957700 2042653 2040877 2048917 2066038 1957826
3287 1957826 1825658 2016218 2155781 2030829 1888629 1927956 2004348 2037797 1933007 2107861
3277 2107861 2071240 1872015 1927337 2067252 2170349 2146650 2111517 2109435 2174482 2157247 1993194
3266 1993194 1953601 2008333 2316639 2436495 2154862 2106874 2084273 2256512 2212466 2453673
3256 2453673 2513151 2180211 2107463 2398168 2406008 2381357 2369145 2387789 2393864 2267703 2273454
3245 2273454 2386487 2424366 2433998 2526707 2583768 2539158 2645319 2819571 2887082 2904791 2942248
3234 2942248 3026479 3004047 3055743 3136155 3346776 3318301 3307671 3553032 3727071 3643548 3801242
3223 3801242 4130038 4185819 4313686 4670381 4915408 4978599 5063811 5189206 5177036 5040380
3213 5040380 4860049 4755391 4705455 4685416 4568729 4371493 4546623 4593212 4270116 4106628
3203 4106628 4105671 4259838 4248339 4262279 4326437 4264895 4174263 4200955 4259159 4136828 4333479
3192 4333479 4567361 4464095 4324976 4359478 4270194 4236953 4308472 4434171 4408026 4365409 4523002
3181 4523002 4561327 4441756 4648018 4731227 4594897 4389490 4476824 4792504 4933499 4995884
3171 4995884 4935404 4767008 4756373 4855722 4956411 5082296 5001980 4954245 5110278 5335002
3161 5335002 5336627 5381640 5448625 5560284 5582517 5652068 5760722 6017620 5916956 5874459 5805745
3150 5805745 5996863 6154593 6343860 6475392 6594827 6633769 6388051 6474764 6662286 6784789
3140 6784789 6738172 6872814 7177902 7345337 7340929 7300859 7308973 7598443 7976296 8125493 8220501
3129 8220501 8152763 8271017 8657476 8896295 8979127 9169727 9589609 9577781 9669719 9872085
3119 9872085 10138327 10369876 10685383 10699433 10486315 10580942 10789548 11061744 11076305 11093715
3109 11093715 11313460 11847393 11983635 11925359 12013251 12156054 12592867 12820993 12924886 13153243
3099 13153243 13597165 13930734 14179145 14285508 14547483 14991551 15314213 15617989 15787275
3090 15787275 16098940 16555831 16981082 17519806 17864033 18326938 18845604 19415644 19968932
3081 19968932 20406782 20715272 21264470 21846980 22258853 22491673 22739401 22851451 23019826
3072 23019826 23325275 23575201 24067058 24508997 25097105 25811752 26205989 26902885 27556497
3063 27556497 28140860 28796804 29502021 30441523 31441164 32374399 33430955 34690388 35723233
3054 35723233 36932081 38268329 39495428 40996005 42399275 44009699 45798354 47720665
3046 47720665 49730481 51774251 53922390 56119909 58395328 60927106 63446913 66004552
3038 66004552 68946958 71858128 74800403 77831657 80972223 84318081 87811179 91088179
3030 91088179 94666450 98176053 101833068 105490964 109041607 112901585 116825099 120617533
3022 120617533 124434869 128066521 131738044 135358961 138868246 142216462 145429616 148487521
3014 148487521 151628299 154435345 157051113 159398499 161603290 163826347 165676814 167152502
3006 167152502 168700564 169781444 170799178 171306223 171568824 171427794 170996333 170566444 169951367
2997 169951367 168928391 167576227 165918023 164249657 162677973 160648408 158262279 155900350
2989 155900350 153644311 151272633 148634564 145571823 142649796 139729240 136868424 133862841
2981 133862841 130673286 127628388 124802895 121892894 119081045 116169834 113454442 110842160
2973 110842160 108227012 105643212 102980368 100786589 98707164 96530580 94367622 92408502
2965 92408502 90677712 88992545 87302219 85865279 84211094 82697292 81790159 80570388
2957 80570388 79495794 78417404 77352819 76746166 76102317 75373151 74892432 74239244 73653854
2948 73653854 73248987 72984806 72628307 72309806 72048140 71866311 71809220 71809774 71774368 72338551
2938 72338551 72644670 72933124 73392050 73913976 74672794 75412970 76185506 77053586 78010465
2929 78010465 79103866 80244209 81972846 83583798 85428167 87675939 90405851 93631964
2921 93631964 97289481 101183572 105499028 110463937 115871102 121971670 128933087 136488459
2913 136488459 144549930 153147352 162258068 171234801 179057146 184590203 186392237 182959915
2905 182959915 174575573 164238983 154182282 145452536 138343769 132817148 128256601 124535615
2897 124535615 121720180 119031988 116400670 113875456 110703910 106674958 102438055 98589936
2889 98589936 95147662 91875210 89015972 86294715 83762482 81468623 79127359 77227477
2881 77227477 75253420 73420358 71613363 69950767 68095921 66669396 65148084 63747452
2873 63747452 62234863 60857595 59386335 58008146 56704335 55301416 54270964 53279228
2865 53279228 52197110 51073530 50154087 49215033 48127680 47429531 46597198 45824965 45213693
2856 45213693 44366660 43663852 43223522 42664341 41947132 41359523 40718278 40464131 39881605
2847 39881605 39511372 39257550 38743894 38423968 37927304 37317849 37004406 36894925 36655257
2838 36655257 36263286 35938283 35779282 35669459 35322711 35012878 35109454 34972325 34831638 34674253
2828 34674253 34554200 34419529 34167551 34038498 33839776 33661515 33441122 33365724 33453450 33321794
2818 33321794 33210266 33068042 32824474 32695484 32393724 32207014 31863523 31436056 31096474
2809 31096474 30577090 30296352 29994025 29606213 29015939 28563260 28146949 27749497 27360224
2800 27360224 27054891 26684397 26193104 25904697 25439902 25147433 24776018 24248704 23974585
2791 23974585 23811986 23363346 22933650 22635743 22542143 22462449 22207623 22158035 21981225 21805969
2781 21805969 21806368 21761686 21577880 21603773 21429437 21160442 21055408 21023349 21150714 21104160 21207457
2770 21207457 21264465 21238676 21205840 21328263 21426856 21571083 21591184 21541870 21654306 21641555 21708656
2759 21708656 21789944 22006645 22192042 22278567 22279480 22325561 22661706 22803977 23225566 23419828
2749 23419828 23361663 23616925 23930907 24012012 24081836 24178745 24556762 24818264 25028960 25154974
2739 25154974 25677137 25952303 26065873 26293527 26481197 26762039 26961175 27374809 27736622
2730 27736622 28012570 28237380 28442701 28809815 29067082 29377767 29691033 30264835 30762993
2721 30762993 31125701 31587177 32032916 32748756 33217258 33715720 34203845 34636823 35130160
2712 35130160 35970183 36531641 36967616 37481554 38182170 38768775 39476247 40201402 40725703
2703 40725703 41326637 42026817 42778578 43378978 44239750 45180847 46200429 47068590 47664546
2694 47664546 48371101 49335513 50213604 51145107 52186473 53320327 54407817 55480407 56665059
2685 56665059 57974300 59286603 60826928 62408228 64011052 65586867 67405533 69520032
2677 69520032 71514371 73566570 75721980 78141491 81099928 84103884 86993054 90342285
2669 90342285 93735964 97508110 101377720 105633328 110254758 115242839 120328649 126157479
2661 126157479 132271729 138890773 146317132 154141689 162657609 171721264 181480341 192240233
2653 192240233 203540471 215529754 227825985 240978952 254769448 268911303 283226570
2646 283226570 297282331 311111101 324360735 336623716 347463451 357025939 364843813
2639 364843813 371051808 375358995 378346034 380152683 380881733 380711861 379757600 378148352
2631 378148352 375963784 372872516 368870040 363898266 357719747 350468501 341652470 331657285
2623 331657285 320338439 307719137 294682635 281613213 268517319 255390077 242927082
2616 242927082 231165601 220150117 210016884 200553620 191811649 184279140 177372697 171036764
2608 171036764 165396217 160442621 156029583 152074925 148349534 145260559 142733965 140434941
2600 140434941 138398202 136512638 135009551 133575374 132102612 131038902 130219925 129197337
2592 129197337 128309392 127710509 127128994 126556127 125957145 125368960 125078537 124580936 124217328
2583 124217328 123659652 123156409 122673892 121984865 121419212 120825551 119994803 119256770 118694163
2574 118694163 117945320 117134492 116293452 115551167 115045842 114432291 113715170 113532564 113363668
2565 113363668 113127250 112815285 112673930 112781231 112882191 113040688 113346267 113917970 114996655
2556 114996655 115922917 116996190 118197835 119430633 121178536 123194084 125490597 127819871
2548 127819871 130191386 132648514 135545619 138614821 141824222 145307685 149039881 152738058
2540 152738058 156851771 160646415 164696960 169071146 173495637 178021655 182115092 186037948
2532 186037948 189871753 193786287 197651462 201067957 204298917 207332918 210221295 212861756
2524 212861756 215229807 217482961 219349142 220907111 222083380 222749520 222761406 222635212 221801150
2515 221801150 220744149 219194625 217216215 215067891 212887737 210335266 207623374 204954097
2507 204954097 202207922 199502220 196420496 193250128 190011628 186638275 184006800 180946031
2499 180946031 177875063 175287480 172772926 170558271 168438868 166636388 165236813 163940136
2491 163940136 163292395 162950345 162607412 162684860 163094718 163622806 164361114 165382785 166222029
2482 166222029 167442486 168647315 169703700 170908042 172212015 173529081 174803975 175685990
2474 175685990 176620817 177489245 178421910 179170908 179343262 179549701 179501835 179250021 178474785
2465 178474785 177314378 175936861 174085238 172262618 169938079 167271622 164313951 161213831
2457 161213831 157917458 154709279 151042003 147097407 143283560 139601608 135962725 131809474
2449 131809474 127721970 123690666 119875273 116197416 112149785 108205647 104494511 100903819
2441 100903819 97637518 94315976 90953035 88124955 85402252 82855635 80794256 78860806
2433 78860806 77226878 75847204 74654318 73347352 72389194 71517994 71008532 70645072 70144094
2424 70144094 69966419 69930666 69982999 70102601 70057420 69974558 69957117 70141156 70217629 70071776
2414 70071776 69961481 69923056 70215191 70223730 70401947 70000961 69904341 69909244 69405969 68945503
2404 68945503 68299296 67752061 67088882 66333703 65330584 63922368 62819368 61900800 60708824
2395 60708824 59135337 57474803 55997750 54875209 53489159 51976915 50429167 48757356
2387 48757356 47380873 46018490 44433910 42800099 41422503 40151524 38921774 37440230
2379 37440230 35856838 34596710 33631851 32580605 31439068 30498552 29663344 28800503 27842165
2370 27842165 27018762 26226264 25390685 24807209 24211170 23777268 23396587 22882058 22313059
2361 22313059 21883159 21439634 21008574 20459105 20056552 19888011 19575147 19263844 19071607
2352 19071607 18832610 18390553 18010393 17763780 17590213 17528894 17232165 17111762 16857759 16697310
2342 16697310 16932975 16814402 16451514 16340364 16558116 16509052 16250385 16182813 16202374 16325920
2332 16325920 16333077 16324159 16328436 16273506 16411513 16500440 16598635 16488662 16548975 16619765 16946244
2321 16946244 17155637 17454289 17904921 18200861 18767172 19153172 19856389 20633953 21551357
2312 21551357 22715071 23741375 24482317 25305984 25449807 24460436 22304675 20137461 18473162
2303 18473162 17314114 16536743 15875948 15450731 14920574 14413241 14068300 13697751 13253680
2294 13253680 13039066 12899123 12513804 12424727 12100982 12053288 12081196 11967430 11915933 11863712
2284 11863712 11577691 11485734 11825593 11722919 11719192 11641848 11594820 11679446 11698804 11648304 11631254
2273 11631254 12043726 12279152 12333484 12254726 12172920 12197185 12190167 12388159 12416057 12253680 12269855
2262 12269855 12354713 12334639 12469067 12562809 12593001 12789484 12935872 12901391 13104103 13244976
2252 13244976 13593964 13561215 13538540 13887957 14077370 14258112 14422270 14562608 14750310 15184832
2242 15184832 15496807 15689288 16083697 16272600 16451815 16775084 17294699 17737999 17714286 17571786
2232 17571786 17671762 17654329 17575423 17530005 17709952 17768899 17969618 17907702 18050005 18169325
2222 18169325 18359855 18777196 18910867 19275568 19703454 19993282 20532308 20920256 21358287
2213 21358287 21660089 22210669 22944308 23357750 23752552 24243432 25022093 25314364 25699248
2204 25699248 26286827 26786537 27201068 27715240 28085363 28602376 29160053 29557209 30031716
2195 30031716 30421030 30712805 31183586 31975475 32568093 33101822 33590858 34382757 35257390
2186 35257390 36288745 37159277 38050758 39181460 40257690 41510033 42638820 43520566 44843957
2177 44843957 46378555 47489551 48800166 50213514 51920021 53796289 55956910 58075763
2169 58075763 60457213 63047344 65911787 69065629 72185353 75482715 78613764 81573332
2161 81573332 84183530 86386843 88023965 88962795 89158870 88442586 87020496 84967039 82876420
2152 82876420 80119529 76996109 74107383 71326080 68640682 66146658 63881221 61515767
2144 61515767 59114824 57063004 55052448 52924753 50507015 48377970 46498152 44644581
2136 44644581 42968696 41251852 39467102 37963812 36607432 35088259 33314589 32021185
2128 32021185 30742439 29491995 28282259 27122634 26040629 25121211 24316006 23426225 22614792
2119 22614792 21789541 21136130 20546566 19857213 19086569 18390699 17792148 17443284 16871789
2110 16871789 16274084 15813131 15460743 15032202 14777823 14343369 13841877 13587639 13277871
2101 13277871 12836775 12600603 12323151 11884403 11741009 11514056 11143740 10841587 10724153
2092 10724153 10516757 10106247 9970772 9717973 9506039 9275704 9074111 8884110 8712985
2083 8712985 8498132 8416918 8306775 7980535 7713667 7579470 7355687 7266278 7190700 6929027
2073 6929027 6830813 6783064 6681631 6534661 6342648 6238684 6477649 6477818 6242302 6073939
2063 6073939 5699064 5586813 5744424 5603008 5288800 5458244 5426346 5151150 4968036 4946691
2053 4946691 4823557 4811569 4608258 4699122 4762149 4517354 4481330 4471228 4410916 4352328 4443904
2042 4443904 4336136 4239914 4196970 3962527 4042506 4297733 4171910 4158989 4130238 4114057 3864192
2031 3864192 3773754 3611718 3527308 3658507 3649637 3598852 3687525 3533650 3434938 3415568 3588528
2020 3588528 3531667 3472159 3383446 3305043 3278907 3257985 3371987 3330938 3321972 3106247 3213683
2009 3213683 3110454 3116231 3320077 3241163 3167813 3068895 3054386 3126293 3132552 3013743 2948303
1998 2948303 2918152 2714584 2709795 2854005 2872181 2767745 2828796 2865564 2857428 2734394 2634885
1987 2634885 2810580 2892519 2933526 2811779 2823916 2768423 2750545 2822154 2885899 2855634 2759214
1976 2759214 2842257 2961678 2920112 2939171 2887174 2718322 2783073 2795875 2858516 2850073 2856253
1965 2856253 2620869 2632740 2714429 2740395 2680846 2604564 2634033 2752525 2837175 2811880 2859577
1954 2859577 2783512 2755305 2690198 2647404 2575000 2636220 2550159 2689366 2953847 2933086 2933208
1943 2933208 2853704 2750713 2855043 2797601 2778459 2875264 2845345 2753239 2873378 2885518 2877850
1932 2877850 2951034 2935874 2907357 2910925 2810688 2824439 2873841 2890606 3042163 3054519 3178422
1921 3178422 3131757 3048327 3006931 3039485 3009341 2816430 3007548 3319627 3355705 3413039 3349404
1910 3349404 3356874 3437655 3579982 3535001 3592743 3667060 3868580 3840737 3814829 3836690 3817959
1899 3817959 3998235 4204545 4287090 4157227 4367663 4503580 4505500 4541810 4675650 4835310
1889 4835310 4796407 4716487 5109173 5167725 5452575 5534647 5568972 5540168 5617531 5782866 5691524
1878 5691524 5676077 5618062 5639933 5794014 6097494 6317110 6073550 6171025 6362132 6276408
1868 6276408 6588779 6686823 6913429 7016865 7134100 7282929 7449290 7589683 7683443 7871794
1858 7871794 7960817 8169679 8478902 8683566 8938806 9065422 9277908 9564360 9702585 9918725
1848 9918725 10179329 10274210 10524321 10891337 11181685 11400863 11770982 12140634 12469706 12839685
1838 12839685 13305768 13947144 14398662 14728779 15267081 15859176 16563927 17337809 18194071
1829 18194071 19285192 20216809 21118317 22077656 23400440 24816299 26165434 27418319 28817733
1820 28817733 30173030 31231231 32447739 33331297 34040453 34430556 34392037 34748472 34749830
1811 34749830 34698737 34948906 35046786 35187293 35482259 35879897 36173512 36563807 36809900 37270376
1801 37270376 37875648 38602788 39262289 40201142 41344953 42396945 43610207 45337685 47207006
1792 47207006 49469590 51998455 54533626 57349146 60353512 62867464 64320850 63662720
1784 63662720 60211726 55616144 51233108 47470482 44067510 41335673 39183852 37262358
1776 37262358 35680274 34569992 33460177 32261069 31389099 30698417 29952252 29621015 29259119
1767 29259119 28761909 28587666 28452833 28379560 28510816 28776125 29286772 29300318 29392282 29628573
1757 29628573 29879564 30200184 30176253 30020570 29599611 28609938 27175734 25543251 24135622
1748 24135622 22779433 21353665 20158163 19038690 18080897 16911883 16196874 15588285 14730825
1739 14730825 13931335 13384373 12996490 12652006 11942341 11498836 10986594 10479834 10325342
1730 10325342 9748207 9396695 8964877 8611878 8389225 8077019 7757094 7506515 7270183
1721 7270183 7193666 7037640 6718387 6250981 6217545 6209239 6083790 5791306 5584156 5361800
1711 5361800 5190211 5148953 5131656 5011669 4861663 4858148 4755707 4652426 4474237 4450340
1701 4450340 4224140 4034617 3928655 3874721 3830052 3779052 3620712 3547820 3765381 3612772
1691 3612772 3162418 3077740 3250211 2979995 2734525 2895547 2946148 2858861 2813993 2747016
1681 2747016 2759268 2801711 2503140 2502279 2364126 2310226 2333788 2292292 2218090 2201732 2361154
1670 2361154 2205607 1943188 2083896 2137706 2135543 1949223 1915593 1995151 1883800 1890317 1754554
1659 1754554 1704435 1689996 1831484 1877060 1772749 1507944 1230504 1420138 1708625 1756393
1649 1756393 1606571 1552059 1590412 1405395 1518356 1456960 1416699 1438950 1423018 1236472 1142074
1638 1142074 1290451 1382661 1358453 1290655 1110100 1084360 1285409 1358259 1225446 1202725 1337731
1627 1337731 1510374 1294434 1177019 1164410 1061261 1179846 960884 990918 854822 921394
1617 921394 921636 950072 935313 872534 1013642 873788 786763 900198 950422 912358 958982
1606 958982 778394 814365 842607 788719 803310 636988 840424 883532 753382 575712 586897
1595 586897 580357 727667 607166 711174 774806 729629 733684 706867 561313 717171 862194
1584 862194 955364 767047 563207 661609 642551 718375 604975 667466 597402 544165 660363
1573 660363 591047 469167 659971 468784 362656 331807 494370 609335 569262 712031
1563 712031 624860 428749 623346 615262 574248 654596 597178 515504 503689 401131 396271
1552 396271 425200 546210 572268 490544 503004 395973 282154 552697 480344 430790 343820
1541 343820 300334 287023 274212 292261 381773 482829 551418 481746 468724 533932 680759
1530 680759 718436 639289 546259 525022 525816 468607 500735 392498 486629 528616 609589 613174
1518 613174 650795 643569 582023 614617 670316 764438 618541 444521 618781 673402 502893
1507 502893 591519 686814 704399 537459 359619 402256 479788 343452 404345 575578 446234
1496 446234 456297 518223 551513 422692 465425 561471 688774 651841 534851 419965 610548
1485 610548 685384 713437 757021 691369 850921 714894 624149 644277 392968 416450 485852
1474 485852 495752 445017 391408 383842 412789 333133 524214 588601 672579 491275 351613
1463 351613 373302 358050 634436 626028 380124 344757 372924 592912 479509 390873 432647
1452 432647 596285 808371 583332 465252 473944 495685 418285 335827 349438 377318 420594
1441 420594 540413 434050 417841 289421 324410 350514 399921 316412 309665 329108 247329
1430 247329 163178 247493 295653 298832 378275 302768 371959 161007 271379 528021 367383
1419 367383 1293 19664 280700 339412 227790 129383 67408 49696 224319 73666 -72476
1408 -72476 -147242 68527 235343 274728 197524 208601 163408 80023 247992 511260 520051
1397 520051 243482 320429 305963 276620 304451 311164 309407 245288 119355 -21409 192917
1386 192917 173980 -191180 -52932 47358 79452 184435 196883 233709 99327 -32040
1376 -32040 64202 38220 -20834 40807 188042 195573 170277 87754 212219 391871 214529
1365 214529 54901 -108770 -82647 136861 231286 -46450 -58211 47681 234354 193412
1355 193412 -103765 -363158 -412744 -159772 170090 107145 -3319 77696 126110 97170 83481
1344 83481 197907 32924 18913 38934 -35457 -180317 -384170 -195790 53482 152476 275554
1333 275554 216605 40867 150560 68556 -82637 -2895 144010 207534 167316 43273 2368
1322 2368 -13267 89193 45293 87276 108360 283102 242450 184182 163010 126795 168507 153227
1310 153227 7573 -183981 -73885 66335 66653 66328 136378 65010 312265 289532 314534
1299 314534 67667 123652 261477 179468 96772 -36434 -144755 -175617 -141994 -96936 -115099
1288 -115099 32047 238249 149029 52956 11516 46252 125302 280653 126328 -46762 56125
1277 56125 165305 82587 -24162 45156 37448 299023 473783 277574 5813 4724 163773
1266 163773 137699 100219 75425 69199 302852 171161 114365 245757 321803 293403 141826
1255 141826 -102716 32752 108068 157074 201014 67262 -92580 -98266 -22317 69653 92249
1244 92249 4271 -123289 -65491 -34728 -22540 -56183 -141845 47603 41708 136908 181554 148495
1232 148495 -12906 -83122 28105 92162 82946 148395 -61424 -52864 58314 41913 184735
1221 184735 291585 95111 94312 200371 440734 398242 223220 126635 73493 21656 220008
1210 220008 108586 41088 -51382 51634 188037 26622 11913 -82711 -131139 -440 94813
1199 94813 49589 83250 189840 238726 115810 54531 17231 -66953 -19661 94021 126434
1188 126434 108045 2587 -12227 -173748 -36989 -84494 16627 64221 -45256 -176068
1178 -176068 -34174 217524 155259 -75459 -163493 -239537 -29102 71387 78844 190487 94323
1167 94323 115374 -36167 -40818 75442 47398 69689 9706 -554 61058 133598 98646 562
1155 562 151198 130319 160377 229450 300995 247023 272959 245080 160392 -95494 61192 54842
1143 54842 116998 75454 123593 313671 160656 -30922 -126468 -201727 -97116 286663 408514
1132 408514 188860 235351 140313 10731 -70845 19206 78797 72534 253220 282647 141530
1121 141530 228346 271019 -74384 39509 37298 122869 48859 40030 143211 263810 260017
1110 260017 272662 273963 182630 104475 187733 22298 117911 117724 259076 399121 168199
1099 168199 -13779 91170 93608 133533 176066 108502 190075 434505 186201 193567 349149
1088 349149 425456 451315 397172 447241 530418 669478 578190 531575 450690 345583 426934
1077 426934 506545 280383 287612 191928 165591 251565 231939 347458 297947 176786 168170
1066 168170 106910 139672 354799 405099 366504 517018 557048 677342 695126 654440 698072
1055 698072 486966 341752 544262 534724 588479 352935 363530 486456 595123 536586 573813
1044 573813 439996 411438 344931 492055 579227 516542 541958 527592 585936 734975 757570
1033 757570 640938 746825 971762 1005484 865229 720613 956002 965676 900581 1127155
1023 1127155 886782 946024 1063747 1149528 1262801 1236489 1121671 1062167 1213259 1221084 1335854
1012 1335854 1515735 1525692 1325658 1228540 1337024 1519254 1767425 1558814 1477572 1547639
1002 1547639 1674791 1609440 1606207 1736752 1761357 1922261 1872872 1528280 1580427 1779282 2131952
991 2131952 2223966 2150794 2052121 2096438 2160155 2207758 2133616 2219224 2277131 2488249 2544817
980 2544817 2675999 2727541 2856287 3025416 2849610 2652387 2825427 3180413 3405266 3687314
970 3687314 3754260 4090489 4485930 4513467 4690725 4922431 5012443 5373340 5913828 6286993
960 6286993 6482756 6860361 7316640 7737510 8158909 8793568 9498904 10027393 10897784 11856773
950 11856773 12702491 13844353 14825500 15977352 17397036 18998356 21032911 23547413 26509231
941 26509231 29955156 33730216 37797529 42443421 47709527 52835256 57204285 58099214
933 58099214 51282499 41147931 33529926 28046268 24339120 21365973 19135927 17459012
925 17459012 16000735 14628536 13634477 12528490 11693682 10994257 10320776 10011301 9407484
916 9407484 8626189 7854016 7377738 7158526 6621735 6311141 5983269 5407990 5112895 5070220
906 5070220 4970185 4793797 4434363 4311267 4390432 4329481 4052326 3968076 3842402 3384986
896 3384986 3282146 3234462 3068126 3067770 2957334 2861419 2829698 2622302 2441976 2322706 2295034
885 2295034 2199960 2176641 1969727 1844750 1769892 1744463 1713456 1740674 1643383 1697102 1844215
874 1844215 1563947 1477486 1449646 1317456 1422387 1353041 1497194 1504442 1342275 1254612 1108838
863 1108838 1102094 1124827 1170536 1293288 1114084 963408 1086490 1144432 1287282 1089798 990926
852 990926 1089409 990891 880438 1080190 1101726 832894 645654 588382 711829 659358 828120
841 828120 642519 684295 814794 696547 595969 604211 652625 526875 358753 302166 552283
830 552283 589202 603766 547040 458530 393064 381229 371355 393105 342357 352099 437013 493375
818 493375 575614 469025 219397 296653 298448 202037 350910 357515 408758 253984 281509
807 281509 361399 379487 398290 385190 459578 292072 202932 325387 338618 94079 42101
796 42101 289613 304629 482542 541704 417792 443180 298235 -41157 15243 267710 261325
785 261325 100307 141694 161151 -65501 81547 124492 81694 238667 38158 97117 262166
774 262166 134628 186930 130964 34707 -171500 -175274 6076 -119095 -116222 -88518 31793
763 31793 109944 -218074 -271525 -210148 -114155 85149 27740 -22606 99938 -63894 -121583
752 -121583 8168 -71106 -34289 55050 77148 -27970 -70002 -126654 -77748 -215927 -137032
741 -137032 -36054 -170654 -210980 -174324 -60246 79975 132073 -90643 -170227 -178400 65536
730 65536 89293 -8875 -158909 -35794 44330 181617 127737 152096 2004 -332013 -144806
719 -144806 22901 -31958 23597 -25015 121259 84585 14598 -60861 -40510 9052 -33375
708 -33375 51918 -106355 -166826 66125 90967 175030 136280 86150 50184 25546 76061 72994
696 72994 252940 198974 91586 -20561 -14351 -30764 131613 22498 18848 116025 18592
685 18592 -84067 -170486 -51031 -45083 -109258 -180262 -160270 10349 -228273 -64610 11310
674 11310 -151464 -182214 -49780 -14740 -165946 -187821 -71134 -225940 -262538 -90682 79662
663 79662 49777 -41665 -102677 -190355 -72545 -76854 -168313 -259924 -271758 -16802 142812 319153
651 319153 400869 98733 36125 219603 48213 33821 24275 24485 -94705 -162628 5065
640 5065 -23251 49363 203763 288937 191362 -56901 -182467 -124729 -153481 -92615 -166320 -318783
628 -318783 -234665 -111028 -37866 -226462 -289134 -129151 -46347 -128099 20456 69572 -177569
617 -177569 -18177 -160276 -247870 -90222 5613 -168484 -218587 -186364 -202670 -304362 -249319
606 -249319 -245865 -278784 -145476 -170073 -252977 -359808 -434676 -361311 -159585 -175150 -252761
595 -252761 -145991 -106253 -304286 -208368 -215128 -309738 -247479 -33468 -83299 -312982 -336688
584 -336688 -203211 114862 -69039 -161271 -232012 -199926 -116798 -73404 -254169 -170591 -99121
573 -99121 -66541 98995 -29949 -59993 -272154 -126122 -151409 -349169 -247855 -199855 -52707
562 -52707 -212893 -492686 -444298 -244986 -98774 -242922 -241451 -234574 -281603 -268674 -215237
551 -215237 -357134 -497942 -449320 -208851 -61610 -275536 -265882 -82219 1542 -210056 -272654
540 -272654 -334127 -261852 -85677 -155972 -241873 -172308 -71195 -112201 -201182 -426551 -369366
529 -369366 -247028 -304196 -259931 -317163 -141382 -56933 -118857 -228223 -415873 -385318 -224323
518 -224323 -63230 -27605 -282912 -325981 -95537 -23406 -124101 -222236 -329148 -369680 -261985
507 -261985 -398373 -340461 -222531 -351913 -174842 -207660 -385853 -448539 -186214 4679
497 4679 -351 -80514 -220103 -142914 -125247 -318026 -431420 -210770 -161930 -135902 -190546 -398222
485 -398222 -552809 -172696 -91278 -206334 -288882 -311533 -194042 -11304 -199080 -303067
475 -303067 -205741 22522 134993 -79088 -165161 43330 141070 57467 23795 -19199 18371
464 18371 18356 9268 -180264 -416500 -234949 -96470 -161863 -213822 -144754 -234176 -156388 -17461
452 -17461 -148560 -414321 -344994 -300838 -313207 -148522 -152279 93876 73706 -52663 -118177
441 -118177 -57426 5425 125476 125512 -73616 -166891 -216864 -293412 -322525 -313394 -216893 -183514
429 -183514 -58475 -36208 -149874 -294083 -285817 -91451 -243697 -345501 -269023 -232714 -47521
418 -47521 -240597 -399876 -333374 -100073 -92814 -128042 -90193 -129127 21838 12562 -180821
407 -180821 -163258 -143186 -146201 -186013 -213448 -320084 -183443 -160209 -206543 -39818 -107366
396 -107366 -140072 -236157 -215775 -25102 -64665 -225813 -142519 -42580 -113722 -245041 -153086
385 -153086 -107885 -72054 -11149 -269572 -513561 -413448 -318303 -222933 -65594 72428 -131495
374 -131495 -198073 9600 -3664 -254159 -253761 -82438 -255776 -399238 -492707 -215172 6005
363 6005 -121138 -380100 -465164 -398149 -317378 -414538 -359944 -290590 -269666 -238569 -285769 -281961
351 -281961 -242825 -177723 -184258 -240832 -296733 -220430 -205916 -219899 -81710 -125045 -199942 -172513
339 -172513 -268703 -146190 -365622 -292513 -26626 -72923 -218951 -225072 -337617 -100785 38088
328 38088 47066 47514 -24585 -107895 -319029 -231661 -198471 -171124 -60304 -88419 -206356 -402621
316 -402621 -265861 -214966 -290159 -315898 -473737 -504286 -567848 -446841 -337416 -300187 -242905
305 -242905 -110691 -96986 -105762 -190318 -188817 -134065 -245969 -266718 -227008 -276436 -228472 -188574
293 -188574 -176889 -312202 -445954 -440210 -208768 -13244 -127676 -220762 -33791 90675 -44701
282 -44701 -153136 -190847 -137360 -146652 -130218 -128875 -239911 -258150 -162554 -259852 -381152 -134158
270 -134158 -9664 -221596 -226272 -249165 -361359 -356048 -438995 -247748 -41926 -214837 -422025
259 -422025 -368153 -286482 -136742 -232786 -471307 -375501 -225967 -231462 -298408 -208913 -212656 -274972
247 -274972 -312474 -335395 -204963 -164117 -317751 -324160 -338064 -346463 -249529 -346372 -254677 -39474
235 -39474 -211108 -298977 -79828 13732 -328413 -355739 -340220 -316376 -330526 -244622 -219399
224 -219399 -170460 -181834 -268784 -278261 -328345 -310328 -454637 -421860 -593043 -607521 -376457
213 -376457 -449927 -262142 -279145 -519676 -376585 -327241 -342187 -114936 -279599 -331004 -452090
202 -452090 -462042 -269274 -176482 -334638 -371655 -307395 -567445 -503379 -382147 -322421 -410803
191 -410803 -362750 -306105 -347524 -278784 -149481 -271143 -441558 -487408 -379295 -409433 -281977
180 -281977 -268594 -358955 -258756 -291546 -512132 -417535 -414721 -292374 -378633 -563955 -516122
169 -516122 -476721 -539754 -383611 -356729 -228137 -134980 -240562 -157675 -174153 -243231 -306345
158 -306345 -390183 -462722 -423057 -277747 -39460 -25962 -213783 -307082 -252186 -326814 -429572
147 -429572 -385660 -541060 -424504 -448989 -389413 -214777 -108802 -106116 -74658 -55757 -181358
136 -181358 -280057 -356476 -432768 -439514 -400417 -344572 -311396 -277766 -197478 -340703 -310099 -439018
124 -439018 -313190 -135899 -195772 -388012 -415227 -321487 -210789 -268558 -296162 -382613 -254373
113 -254373 -213502 -230556 -314347 -302053 -346512 -282810 -449486 -476290 -286129 -330906 -464950
102 -464950 -392393 -340758 -455881 -407087 -387696 -350096 -284626 -300813 -442142 -435169 -381504 -390417
90 -390417 -474528 -544619 -320637 -383846 -356170 -284832 -225435 -300503 -446399 -524734 -538935 -545507
78 -545507 -459379 -381157 -498051 -360496 -503577 -536161 -510807 -421113 -399713 -476631 -476238 -277530
66 -277530 -274182 -352004 -352429 -367509 -463552 -465265 -387651 -403499 -540041 -520640 -453273 -499528 -479869
53 -479869 -436394 -270713 -353727 -369604 -407148 -570852 -625355 -534502 -432713 -297099 -240701
42 -240701 -332289 -298620 -391072 -485640 -412913 -347183 -370234 -312227 -384289 -309122 -406842 -349205
30 -349205 -392549 -488790 -449307 -343363 -408713 -418463 -445390 -503511 -536398 -503346 -467843 -580103
18 -580103 -494193 -374173 -284400 -379652 -427532 -408657 -268343 -381384 -250645 -326369 -524252
7 -524252 -501233 -493319 -449922 -439667 -443171 -465409 -481084
0 -481084
$$ Imaginary data points
##PAGE= N=2
##DATA TABLE= (X++(I..I)), XYDATA
16383 -4688624 -4632347 -4553150 -4464477 -4486256 -4431855 -4413961 -4272764 -4252734 -4332001 -4203530 -4116041
16372 -4116041 -4013314 -3985190 -4025816 -3931450 -3803342 -3608480 -3592234 -3559119 -3620222 -3532131 -3404414
16361 -3404414 -3489394 -3388509 -3201730 -2988907 -2768117 -2860182 -3024746 -2965275 -2811756 -2750176
16351 -2750176 -2716475 -2609616 -2610009 -2436347 -2400441 -2408042 -2458771 -2368137 -2202824 -2141965 -2080369
16340 -2080369 -2111194 -2002274 -1928709 -1702196 -1679958 -1792232 -1708693 -1636052 -1518087 -1455152
16330 -1455152 -1367339 -1306116 -1222709 -1148598 -1258981 -1265198 -1142595 -1086306 -932441 -882349 -863314
16319 -863314 -970656 -846531 -871213 -877770 -765386 -639888 -572802 -619576 -538629 -409314 -453865
16308 -453865 -354856 -297961 -224378 -76875 -90987 -175592 -21977 6891 -120999 -120513 -99210
16297 -99210 80103 260588 173670 115618 373306 346739 470929 554594 467505 458009 638691
16286 638691 694195 694980 810460 833410 799201 812994 906322 1163233 1267734 1385328 1298217
16275 1298217 1279043 1374292 1265896 1149155 1296850 1343321 1539700 1511731 1625705 1811661
16265 1811661 1750911 1753233 1632705 1925893 2084431 1845181 1748104 1787197 1842679 1888556 1813397
16254 1813397 1883474 2085649 2176311 2137261 2147358 2299487 2305930 2495159 2390425 2308054 2228819
16243 2228819 2205068 2427730 2433489 2438846 2638092 2726511 2761371 2605463 2532369 2375079 2437999
16232 2437999 2780912 2758069 2654333 2566376 2844940 3106772 3142520 3100240 3160372 3074163
16222 3074163 2909502 2944640 3038601 3013940 3139322 3238086 3120042 3008282 3082458 3104706
16212 3104706 3224851 3266087 3307097 3309555 3340282 3246197 3525072 3664624 3446688 3464296 3474119
16201 3474119 3472694 3641542 3590628 3654340 3886045 3746876 3570710 3593631 3727799 3772969
16191 3772969 3788497 3797556 3658555 3724871 3984122 4007656 3907829 3886254 4048932 3982988 4020075
16180 4020075 4155454 4067846 3922466 3926510 4041190 3983983 3909357 3911012 4009891 4029912 4118476
16169 4118476 4085765 3926767 4036469 3988209 4096231 4221921 4071811 4112366 4153256 4218265
16159 4218265 4412133 4409099 4213258 4220098 4151441 4301597 4308084 4362141 4388951 4337520 4435364
16148 4435364 4501981 4599477 4562218 4401061 4392038 4427621 4432315 4425985 4529653 4581717 4478603
16137 4478603 4494517 4522032 4425680 4445362 4539389 4462327 4548014 4512343 4519393 4554027 4730154
16126 4730154 4743095 4433063 4429229 4622580 4824508 4690729 4581169 4643394 4687482 4814989
16116 4814989 4699191 4635069 4478684 4509084 4574137 4672133 4591535 4583382 4528428 4600122 4704323
16105 4704323 4585084 4535219 4493789 4659206 4777313 4762172 4543623 4782945 4725928 4752002
16095 4752002 4590810 4572580 4807328 4807828 4704645 4648083 4844272 5001470 4851097 4722152
16085 4722152 4744867 4743344 4843691 4670342 4865335 4823387 4847024 4937662 4962568 4777032 4729085
16074 4729085 4762640 4849498 4734089 4667102 4812515 4835482 4880573 4683908 4665766 4854661
16064 4854661 4783884 4895786 4907477 4793092 4702344 4699599 4845501 4862084 4939933 4927556 4687684
16053 4687684 4727765 4817997 4897653 4888211 4828183 4866640 4840965 4730107 4787323 4912104 4987964
16042 4987964 5060172 5133183 4998296 4704398 4816745 4978225 4868681 4679840 4817081 4865186
16032 4865186 4937840 4831782 4861999 4859563 4885185 4846596 4837654 4919569 4980852 4995070 4921598
16021 4921598 4867855 4928184 4890611 4810251 4917526 4762036 4847088 4948500 5019851 5106592 5145421
16010 5145421 5090860 5155707 5052892 4951459 4886179 4840096 4897118 4915723 4920069 5037327 5057778
15999 5057778 5130083 5094937 5022487 4994026 5001179 5093192 5122431 4976358 4787930 4856127 4988346
15988 4988346 4914483 4976674 5011088 4809868 4984850 4857683 4943211 4931683 5094920 5142904
15978 5142904 4900195 4824826 4855947 4743967 4815983 5036216 4963552 4914438 4937122 4923750 4953522
15967 4953522 4733772 4813074 5089485 4966355 5096412 5102287 5063635 5115187 5012640 4960010
15957 4960010 4953392 5013653 5063240 5089574 4941809 4890324 4962759 4973563 4806958 4742613 4847348
15946 4847348 5070538 4982568 5212033 5057848 4888543 5033542 4946098 5044768 4879804 4647251
15936 4647251 4829172 4851161 4957347 5053722 4903792 5054427 5045242 4888622 4950880 4924819
15926 4924819 4809498 4919076 5150812 5061380 4969704 4797087 4736428 5095906 5099564 4894436
15916 4894436 5004255 5066549 5100540 5156389 4923724 4988823 5101385 5026484 4911658 4810984
15906 4810984 4924450 5175007 5145249 5195426 5116174 4990819 4891885 4899835 4997848 5000240 5011550
15895 5011550 5157079 5167213 5159958 5102182 5147706 5054124 5064617 5043534 5050059 5238353 5071693
15884 5071693 4804006 4881417 4879280 4960847 5043029 5028954 5209469 5027973 5030366 5174066 5135516
15873 5135516 5107017 5144456 5293485 5096823 5023154 4881097 4972561 5142535 5287879 5266902
15863 5266902 5226008 5103650 5157670 5108027 4856714 4898815 4934573 5086496 5045702 5083288 5034512
15852 5034512 5035708 5072872 4989606 5040266 5122125 5114717 4968248 4926315 4857591 4671820 4805492
15841 4805492 4798575 4915810 4861172 4870772 4908815 4851343 5081127 5109141 5148219 5024183 5002326
15830 5002326 4997478 4945022 4784561 4880013 4935579 4892011 4895003 5130910 5295342 5106099 4990903
15819 4990903 4876970 4893540 5035337 4880438 4728070 4889676 4877837 5007115 4852093 4901795
15809 4901795 4896614 4909497 5056457 5132494 5055599 5061557 5175768 5111580 5120500 4883670 4770368
15798 4770368 4686706 4890936 4833914 4692184 4696488 4885886 4956483 5042990 5154746 5133160 5057268
15787 5057268 4999692 5135621 5126278 5202513 5185553 5239260 5291755 5071704 5101170 4985473 4918961
15776 4918961 5164333 5043955 5015771 5002599 4984169 5008719 5068676 4867731 4801285 5000513
15766 5000513 5235045 5157408 5171853 4950940 4820205 4953695 4985075 5035136 5026310 4955869 5117579
15755 5117579 4903800 4914690 5066390 5330581 5351223 5281043 5194466 5078177 5139595 5019903
15745 5019903 4939523 5074311 5073236 5059123 5065087 4860436 4764770 4903497 5094540 5231458 5136455
15734 5136455 5092131 5059826 4957211 5027267 4865162 4932954 5058500 5113903 5186451 5112635 5051650
15723 5051650 5112733 5262126 5271498 5138737 5116061 5077579 5100255 5148426 5062928 4956052 4909142
15712 4909142 5063343 5077616 5111094 4963085 5099690 5307144 5177043 5151244 5272942 5289308
15702 5289308 5327074 5164760 4998687 5096992 5100649 5271179 5216372 5135870 5287986 5496183
15692 5496183 5273579 5133066 4983081 5242631 5335166 5179310 5054591 5071984 4993856 4997649
15682 4997649 5219853 5265147 4991803 4873461 4728855 4946467 5073257 5108030 5226097 5173824
15672 5173824 5170704 5108888 5060006 5014507 5299813 5432758 5320402 5034892 4889459 4860393
15662 4860393 4816743 4983997 4980449 5022679 5095126 5080571 4993817 5060722 5150407 5100264 4922598
15651 4922598 5025135 4995781 4906338 5117066 5274231 5247349 5058807 4884784 4969839 5055693
15641 5055693 5229665 5070118 5045335 4925897 5021282 5062005 5000355 5037105 5133917 5137617 5147982
15630 5147982 5200499 5168556 4978715 4934308 4996304 4910928 5157557 5249213 5294217 5229339 5060234
15619 5060234 4932893 5071280 5083917 4967154 4809507 4962271 5151902 5117602 5280031 5431362
15609 5431362 5209908 5285541 5239278 5163881 5141780 5086404 4978053 5123141 5099568 4993420
15599 4993420 5118427 5210602 5181798 5202163 5060780 5068556 5017038 4998519 5048834 5194814 5125789
15588 5125789 5053418 5047549 4967624 4844686 5162605 5248988 5210846 5381891 5238667 5073735
15578 5073735 5070543 5139129 5113475 4987076 4949969 4914228 5047789 5047914 5150910 5262337 5041184
15567 5041184 4967695 5176769 5250439 5156553 5141177 5168443 5109193 4990902 5143682 5104424 4939889
15556 4939889 4932491 5075303 5068463 5002571 5003369 5089578 5108022 5129157 5091100 5138822 5203389 5171842
15544 5171842 5446271 5393571 5211901 5260588 5150790 5222261 5171011 5138838 5250738 5338896
15534 5338896 5229044 5104484 5055486 5011542 5058289 5152910 5196906 5208828 5205895 5193765 5241930
15523 5241930 5129046 5024378 5053424 5097988 5074465 5226885 5225021 5037777 5187253 5274415
15513 5274415 5463785 5455428 5268368 5354993 5488400 5333427 5318694 5302235 5201061 5146448
15503 5146448 5284938 5266196 5174190 5113199 5277133 5388662 5257508 5240074 5088921 5199081
15493 5199081 5348458 5301873 5138080 5303791 5307075 5184650 5145717 5107446 5287921 5464400
15483 5464400 5390140 5209429 4984073 4982003 5188431 5202589 5178826 5164813 5303226 5295938 5261855
15472 5261855 5223605 5347718 5223816 5120978 5220649 5306210 5139734 5165120 5130996 5153901
15462 5153901 5252311 5299066 5179301 5034057 5117409 5261982 5280554 5158369 5348373 5432518
15452 5432518 5220352 5103300 5148622 5268998 5291486 5297824 5160477 5191850 5236612 5112413
15442 5112413 5222273 5217435 5266996 5168778 5244196 5318206 5391450 5338853 5358753 5282314 5240766
15431 5240766 5250064 5094003 5019579 5316666 5319030 5163843 5115085 5136930 5130954 4944508 4992949
15420 4992949 5194085 5104525 4910135 5035452 5198644 5315062 5209381 5215608 5081265 4928837
15410 4928837 5075869 5395776 5185842 5132854 5183877 5125538 5208034 5218078 5187406 5023233
15400 5023233 5084230 5269839 5385248 5371886 5256804 5124296 5153875 5155598 5124492 5067647 5030343
15389 5030343 5023764 5173278 5151905 4973076 4983066 5218027 5271828 5155688 5186982 5211651 5303101
15378 5303101 5280311 5180184 5165415 5200990 5127451 5037264 5218982 5315844 5379783 5459906 5445432
15367 5445432 5310543 5312549 5192106 5270922 5362218 5452447 5293404 5089832 5209290 5124957
15357 5124957 5086176 5224137 5397845 5296653 5280839 5434457 5362549 5324359 5327842 5126206
15347 5126206 5248536 5238929 5089626 5250189 5370555 5532848 5513601 5410205 5472724 5387957
15337 5387957 5333408 5352537 5415609 5347316 5296784 5100025 5140879 5419014 5370474 5227098 5219550
15326 5219550 5140334 5093086 5320593 5201966 5212706 5091368 5244039 5250371 5185555 5271517 5210166
15315 5210166 5213578 5283500 5368565 5264979 5165256 5203416 5136254 5050083 5077156 5143326 5292284
15304 5292284 5275701 5347160 5250431 5391238 5343767 5340937 5246015 5128431 5127466 5381765 5548198
15293 5548198 5412381 5344728 5219325 5199554 5274904 5072242 5040907 5143689 5148282 5340550
15283 5340550 5293389 5342383 5255503 5307258 5279727 5527827 5525242 5408868 5408752 5446351 5369078
15272 5369078 5087503 5215566 5362920 5416199 5257517 5225585 5177742 5296039 5462763 5462146
15262 5462146 5522447 5438839 5295266 5485744 5611440 5631461 5536177 5353814 5336603 5295114
15252 5295114 5458613 5453931 5440041 5690405 5544078 5409589 5407478 5433890 5414786 5422366 5211355
15241 5211355 5108561 5255135 5374301 5291743 5350183 5310675 5295856 5275414 5347542 5312369 5197340
15230 5197340 5213201 5179771 5362395 5485647 5354483 5576151 5442594 5426999 5372894 5259745
15220 5259745 5457000 5520607 5347991 5278501 5225294 5205410 5227409 5145915 5201861 5246701 5226774
15209 5226774 5210741 5471869 5436399 5589324 5502888 5553154 5379003 5259379 5322537 5522878
15199 5522878 5510569 5463796 5469597 5374437 5319290 5479199 5516475 5413692 5248600 5216777 5111661
15188 5111661 5064464 5184610 5355500 5416543 5324465 5206041 5402047 5340216 5437894 5473568
15178 5473568 5260125 5101264 5101039 5306503 5309562 5459593 5455855 5272356 5144166 5292617 5448621
15167 5448621 5294996 5245351 5517909 5578975 5567999 5398336 5543336 5374969 5370957 5372356 5447588
15156 5447588 5327518 5313493 5530276 5437590 5426504 5362633 5416882 5413063 5620562 5553446 5487656
15145 5487656 5450206 5369071 5347145 5532569 5408702 5290564 5367538 5331217 5104824 5074892
15135 5074892 5327333 5460130 5515822 5432999 5285888 5211964 5450671 5516171 5594053 5464039
15125 5464039 5484690 5632111 5562101 5434176 5356910 5208386 5235087 5500961 5534273 5455247
15115 5455247 5426597 5448960 5542428 5443879 5380867 5286046 5268586 5310105 5359322 5425210 5300100
15104 5300100 5351332 5485198 5542474 5429053 5222487 5376361 5438194 5463074 5375288 5363672
15094 5363672 5474342 5613851 5503569 5471048 5369626 5327071 5566271 5546280 5403318 5419220
15084 5419220 5379753 5671856 5723199 5479705 5433794 5529678 5716663 5647194 5442247 5214951
15074 5214951 5483527 5566133 5506902 5406714 5271680 5364128 5426434 5621273 5538300 5248843
15064 5248843 5262151 5454642 5366751 5424564 5476455 5454460 5392262 5460349 5505101 5517060 5481177
15053 5481177 5529195 5455820 5365016 5437879 5345217 5657954 5363614 5304751 5374066 5270270 5149280
15042 5149280 5394442 5470851 5659473 5485613 5413786 5349515 5151057 5131685 5304916 5458338
15032 5458338 5445880 5363162 5394320 5467791 5526782 5407110 5310728 5472195 5400207 5534840 5400003
15021 5400003 5241972 5141475 5370092 5476172 5443274 5415630 5358476 5420526 5556852 5534476
15011 5534476 5451984 5496743 5469372 5527812 5486552 5402811 5523801 5531948 5547105 5523502 5391238
15000 5391238 5349616 5593116 5795879 5726887 5464214 5453489 5674197 5691312 5591922 5525926
14990 5525926 5414127 5351200 5450346 5358365 5349446 5242651 5317389 5614399 5604896 5506417 5537234
14979 5537234 5529289 5520053 5443268 5171707 5246926 5324022 5316524 5306612 5282515 5259541 5548151 5764008
14967 5764008 5697724 5468521 5299916 5528475 5626040 5599455 5449170 5428044 5403232 5411784 5366195
14956 5366195 5423883 5384662 5494026 5566932 5344275 5201858 5413432 5493932 5342385 5491536
14946 5491536 5388175 5395628 5413261 5245250 5447576 5542095 5601225 5679233 5608965 5529543 5362945
14935 5362945 5501278 5645291 5651068 5700369 5737113 5705098 5686443 5627718 5615236 5454217 5514041
14924 5514041 5634565 5936431 5782416 5610275 5632377 5606622 5627474 5596396 5567901 5510682
14914 5510682 5549392 5589576 5516097 5393974 5623477 5433040 5372996 5457204 5675327 5619734
14904 5619734 5350508 5568668 5645266 5545530 5518562 5583450 5378341 5415231 5666410 5666697 5480299
14893 5480299 5514825 5461952 5589695 5500826 5510660 5400518 5421981 5405189 5448047 5591885 5714802
14882 5714802 5682429 5692292 5664775 5412112 5400157 5558477 5709854 5564681 5514738 5560888 5602258
14871 5602258 5563661 5553309 5702603 5677329 5606761 5546348 5591348 5563261 5632728 5764280 5600968
14860 5600968 5715918 5510672 5387063 5387909 5417583 5578577 5526850 5498150 5492539 5363853 5489034
14849 5489034 5468537 5802337 5772974 5523479 5441228 5506230 5336559 5453957 5471622 5513416
14839 5513416 5410557 5505139 5571242 5540439 5577146 5438988 5436400 5432032 5584991 5600899 5435048
14828 5435048 5453614 5624118 5651833 5542627 5547677 5776980 5592209 5433900 5550042 5607198
14818 5607198 5496981 5319834 5495273 5485128 5250446 5277007 5510388 5520171 5350055 5449280
14808 5449280 5621087 5621939 5474049 5336024 5516918 5453881 5427478 5546273 5624996 5677304 5648259
14797 5648259 5680968 5605861 5589946 5586863 5556635 5584865 5632844 5522598 5534240 5735425 5696778
14786 5696778 5474168 5582532 5681386 5719978 5631864 5653217 5630049 5481086 5274459 5235806
14776 5235806 5262754 5289533 5462095 5530326 5679700 5656695 5571663 5675526 5601113 5489646
14766 5489646 5510290 5457680 5367783 5556614 5617112 5680349 5613254 5646302 5612532 5543500 5550665
14755 5550665 5625231 5619506 5693750 5630619 5645569 5626467 5593890 5759791 5877811 5674710 5476884
14744 5476884 5572274 5504271 5523704 5742012 5751344 5617534 5630806 5734360 5604696 5737606
14734 5737606 5824608 5653152 5727705 5749318 5617575 5500973 5579291 5794059 5678452 5425618
14724 5425618 5451031 5551007 5578485 5699956 5671662 5673754 5651306 5484204 5528843 5491144 5824875
14713 5824875 5808892 5723233 5649240 5623842 5625126 5632168 5727562 5470302 5415064 5556065 5601067
14702 5601067 5727949 5789581 5660637 5626235 5705163 5748381 5729769 5784857 5801559 5728044 5765657
14691 5765657 5839076 5766134 5764443 5638342 5500233 5404566 5464082 5683090 5769022 5743289 5653699
14680 5653699 5550808 5592014 5651733 5736831 5789977 5734986 5683922 5692176 5612759 5588434 5503661
14669 5503661 5466226 5571695 5713723 5577366 5459821 5800394 5977886 5937538 5750250 5452179
14659 5452179 5339605 5370007 5538504 5527303 5605915 5548618 5531904 5655603 5708086 5735746 5783545
14648 5783545 5807940 5550984 5777571 5763565 5701818 5594993 5612760 5434420 5525474 5503395
14638 5503395 5609531 5531783 5551598 5609983 5730739 5744946 5745252 5723333 5734340 5788173 5770005
14627 5770005 5705298 5641655 5460807 5364771 5598101 5559127 5503260 5575348 5753077 5655085 5555424
14616 5555424 5499175 5530280 5668255 5662498 5626608 5600202 5403892 5369762 5449901 5692136 5758169
14605 5758169 5743074 5550754 5585574 5762901 5742782 5723496 5559120 5563939 5624557 5479343 5490942
14594 5490942 5528075 5674657 5620471 5440668 5703299 5847393 5768802 5739581 5608090 5544181
14584 5544181 5557495 5737672 5783557 5615727 5596298 5729514 5640427 5614980 5573374 5388278
14574 5388278 5510076 5554702 5451354 5487643 5718390 5546052 5529300 5492148 5388515 5575542
14564 5575542 5709362 5976783 5744783 5771335 5917848 5876650 5839560 5896238 5810964 5772682
14554 5772682 5617926 5724168 5854128 5691747 5717573 5632432 5736914 5601813 5613760 5782497
14544 5782497 5821088 5807063 5663003 5661749 5646856 5887181 6004432 5720420 5652758 5724055 5667964
14533 5667964 5865178 5821816 5761103 5885627 5897351 5825202 5745707 5734010 5726917 5428356 5518292
14522 5518292 5571756 5519178 5704670 5767708 5782869 5631297 5425620 5499025 5773646 5662981
14512 5662981 5516415 5550768 5751781 5629147 5640574 5673339 5576308 5644289 5728303 5752278 5683468
14501 5683468 5697255 5661448 5710368 5599772 5606486 5628846 5696959 5962575 5899281 5740298 5661722
14490 5661722 5617397 5742058 5909916 5917527 5797343 5836240 5877187 5787211 5851568 5740943 5759669
14479 5759669 5710032 5746507 5706076 5756088 5738378 5478524 5574579 5574810 5478683 5580092 5764688
14468 5764688 5731650 5763649 5948945 5970208 5847958 5703981 5588882 5678056 5675393 5681766 5730309
14457 5730309 5828462 5748367 5683653 5619029 5472284 5770930 5777544 5674252 5615444 5775229 5951358
14446 5951358 6038110 5852386 5739840 5730074 5713083 5786102 5732365 5685776 5780451 5769833 5815030
14435 5815030 5728698 5673159 5732305 5709629 5931678 5993091 6078717 5974123 5746518 5799813 5820791
14424 5820791 5856869 5797508 5761602 5782490 5839438 5738790 5872311 5981335 5878581 5790297
14414 5790297 5806918 5916976 5878301 5979880 5999502 5924902 5851209 5933095 5724330 5665707 5902246
14403 5902246 6130815 5968700 5816832 5700606 5634739 5766404 5849930 5927335 5877248 5859943
14393 5859943 5800809 5893596 5930366 5802947 5718324 5865695 5656122 5722879 5770809 5631459
14383 5631459 5786041 6047109 5953153 5778990 5575511 5582864 5725125 5726405 5764161 5751053 5634781
14372 5634781 5587526 5668358 5612596 5764037 5806912 5744246 5729848 5739999 5901426 5829091 5600264
14361 5600264 5651352 5704428 5844235 5843078 5869710 5918226 5917191 5981040 6073128 5947475 5894837
14350 5894837 6161477 6134585 6110175 6006511 5826215 5849251 5909456 5965623 5937505 6067282
14340 6067282 6014467 5975089 5890615 5933240 5767857 5827409 5897031 5897772 5927853 6021223 5921557
14329 5921557 5893637 5875850 5923476 5862499 5784293 5758235 5621658 5690901 5703259 5674131 5822292
14318 5822292 5782709 5733660 5668259 5825276 5882501 5789118 5898138 5838717 5848061 5835353 5941320
14307 5941320 6017993 5996564 5872247 5996674 6126045 6026055 5976226 5910064 5882819 5842803 5803221
14296 5803221 5713458 5636746 5689753 5986739 6022392 6059221 6110175 6064250 6080489 5960240 6129021
14285 6129021 6292184 6271908 6107963 6123786 5831234 5755954 5775818 5807476 5780589 5839957 5767962
14274 5767962 5904491 5941865 5834754 5970167 6014621 5926553 5943539 5923512 5867383 5843653 5743756
14263 5743756 5873543 5886957 5867957 5791851 5714760 6007065 6002726 5985761 5936662 5915824 6048374
14252 6048374 6041121 5797934 5795065 5948864 5976690 5875224 5888005 5837915 5943881 5972969 5895904
14241 5895904 5865075 5766825 5964459 6097245 5964019 5887418 5930187 5886751 5973395 5926369 6043298
14230 6043298 6087633 6004134 5989859 5838591 6013237 6106827 6162550 6014357 5963979 5986455 5801118
14219 5801118 5863735 6015889 5966258 5873096 6094695 5924636 5898389 5973598 5838309 5738475
14209 5738475 5856365 5867146 6038844 6033153 5845167 5805041 5815552 5849687 5776048 5704916 5675968
14198 5675968 5725029 5995426 5956307 6081275 5982027 5959450 6082311 6081248 6120136 6038924 6033810
14187 6033810 6038898 6028834 6064162 5820265 5756140 5923562 6005857 6160227 6081800 5834012 5839242
14176 5839242 6049151 5985795 6043173 6025776 6078890 6249669 6223224 6135026 6000031 5744847
14166 5744847 5788581 5912665 6014717 5910457 5875999 6074433 6045680 6006712 5870169 5958956
14156 5958956 6125088 6081412 5861938 5758528 5997895 5900687 5934562 5995964 6066204 6115025
14146 6115025 6184012 6318594 6091780 5780481 5889259 5974018 5917974 6045510 6037117 5938365
14136 5938365 5958467 6022592 5900883 5894101 5992154 6225103 6176082 5925651 5805690 5910257
14126 5910257 5954860 6059154 5935375 6167573 6278492 6071986 6053363 6126420 6074892 5925912
14116 5925912 5938414 5951956 5844850 5849961 5927963 6013972 6130055 6032773 5966562 6144990 6299175
14105 6299175 6328028 6083940 5872640 5905315 6049757 6172295 6010736 6118537 6197784 6320150
14095 6320150 6166847 6075286 6113445 6096605 6169313 6125065 6064275 6022958 6045187 6140401 6197882
14084 6197882 6144506 5998847 5975906 6022045 6272017 6059346 5948448 5977601 6112667 6024094
14074 6024094 6004260 5919335 6001547 6171490 6246513 5997909 6020726 5909830 5799403 5870748
14064 5870748 5899806 6056079 6242903 6133800 6028461 6032634 5786436 5889758 5940820 6077332
14054 6077332 6138965 6047830 6090862 6205826 6093607 6014144 5936584 5883113 5835639 5892442 6009321
14043 6009321 6133135 6183621 6278310 6128202 6135958 6153842 6075437 6025035 6113263 5937008 5943890
14032 5943890 5928039 6119568 6170004 6131903 6183818 6051001 6087210 6025357 5983129 6018088 5781442
14021 5781442 5864469 6213559 6148987 6032306 6161609 6190607 6335161 6281674 6199508 6117357
14011 6117357 5994398 5881596 5808615 5854963 6080654 6128738 5930246 6075636 6244059 6231451
14001 6231451 6241204 6114674 5974245 6016252 6000180 6146103 6087465 5997279 6027483 6003693 6005620
13990 6005620 5998859 5853745 5830007 5905735 5947837 6003638 6012833 5906402 5900113 6134490 6272424
13979 6272424 6261897 6209405 6032442 5979917 6005403 6220553 6310357 6043742 6044483 6140151 6265320
13968 6265320 6204089 6260781 6205056 6026873 5980965 6180588 6240817 6090694 6225880 6436844
13958 6436844 6313203 6219921 6407558 6109506 5916272 6101388 6132244 6177825 6184387 6395084
$$ [...]
##END NTUPLES=NMR SPECTRUM
##END=
