##TITLE=1H_CA-8836-1
 CDCl3,8 sc, 
 31.03.2021
##JCAMPDX= 6.0         $$ Bruker NMR JCAMP-DX V2.0
##DATA TYPE= NMR SPECTRUM
##DATA CLASS= NTUPLES
##ORIGIN= UXNMR, Bruker Analytische Messtechnik GmbH
##OWNER= root
$$ XWIN-NMR		Version 3.5
$$ Wed Mar 31 11:06:54 2021 Russian Standard Time (UT+4h)  she@DPX200
##.OBSERVE FREQUENCY= 200.131506
##.OBSERVE NUCLEUS= ^1H
##.ACQUISITION MODE= SIMULTANEOUS
##.ACQUISITION SCHEME= undefined
##.AVERAGES= 8
##.DIGITISER RES= 18
##SPECTROMETER/DATA SYSTEM= spect
##.PULSE SEQUENCE= zg30
##.SOLVENT NAME= CDCl3
##.SHIFT REFERENCE= (INTERNAL, CDCl3, 0, 15.9782)
##AUDIT TRAIL= $$ (NUMBER, WHEN, WHO, WHERE, WHAT)
$$ ##TITLE= Audit trail, XWIN-NMR		Version 3.5
$$ ##JCAMPDX= 5.01
$$ ##ORIGIN= Bruker BioSpin GmbH
$$ ##OWNER= she
$$ F:/spectra/data/she/nmr/H-F/1/pdata/1/auditp.txt
$$ ##AUDIT TRAIL=  $$ (NUMBER, WHEN, WHO, WHERE, WHAT)
(   1,<2021-03-31 11:05:32.43 +0400>,<she>,<DPX200>,
      <created by zg, POWCHK disabled, PULCHK disabled
       configuration hash MD5:
       00 E9 B6 7A A2 85 ED C7 34 08 36 98 17 FE 4E 26
       data hash MD5: 16K
       53 12 D6 2F D7 87 8A B9 00 C7 36 DD F4 94 74 9E>)
(   2,<2021-03-31 11:05:35.07 +0400>,<she>,<DPX200>,
      <Start of raw data processing
       efp BC_mod = 2 LB = 0.24 FT_mod = 6 PKNL = 1 PHC0 = -11122.08 PHC1 = 15.20093 SI = 16K 
       data hash MD5: 16K
       D8 D1 E2 66 2E FA FC 1E 4E 98 6B 48 84 EB 6F AC>)
(   3,<2021-03-31 11:05:59.06 +0400>,<she>,<DPX200>,
      <pk PHC0 = -0.8993632 PHC1 = 0 
       data hash MD5: 16K
       AC CC D6 DA 6C 7F 2F B9 4B EB BE EB 29 E8 7B 89>)
(   4,<2021-03-31 11:06:02.46 +0400>,<she>,<DPX200>,
      <abs ABSG = 5 
       data hash MD5: 16K
       F6 CA BB EB 99 91 F7 8A 71 A2 96 92 12 5A 0A C1>)
$$ ##END=
$$ 
$$ hash MD5
$$ 35 99 F4 67 6A E6 3C 82 6F FB D0 32 81 69 A9 0E
##$RELAX= 
##$RELAX= 
##$RELAX= 
##$RELAX= 
##$RELAX= 
##$RELAX= 
$$ Bruker specific parameters
$$ --------------------------
##$DU= <F:/spectra>
##$EXPNO= 1
##$NAME= <H-F>
##$PROCNO= 1
##$TYPE= <nmr>
##$USER= <she>
##$AMP= (0..31)
100 100 100 100 100 100 100 100 100 100 100 100 100 100 100 100 100 100 
100 100 100 100 100 100 100 100 100 100 100 100 100 100 
##$AQSEQ= 0
##$AQ_mod= 1
##$AUNM= <au_zg>
##$AUTOPOS= <>
##$BF1= 200.13
##$BF2= 200.13
##$BF3= 200.13
##$BF4= 200.13
##$BF5= 200.13
##$BF6= 200.13
##$BF7= 200.13
##$BF8= 200.13
##$BYTORDA= 1
##$CFDGTYP= 0
##$CFRGTYP= 5
##$CHEMSTR= <none>
##$CNST= (0..31)
1 1 145 1 1 1 1 1 1 1 1 1 1 1 1 1 1 1 1 1 1 1 1 1 1 1 1 1 1 1 1 1 
##$CPDPRG= <>
##$CPDPRG1= <>
##$CPDPRG2= <>
##$CPDPRG3= <>
##$CPDPRG4= <mlev>
##$CPDPRG5= <mlev>
##$CPDPRG6= <mlev>
##$CPDPRG7= <mlev>
##$CPDPRG8= <mlev>
##$CPDPRGB= <>
##$CPDPRGT= <>
##$D= (0..31)
0 1.2 0 0 0 0 0 0 0 0.06 0 0.03 0 0 0 0 0.0002 0 0 0 0 0 0 0 0 0 0 0 0 
0 0 0 
##$DATE= 1617174331
##$DBL= (0..7)
120 120 120 120 120 120 120 120 
##$DBP= (0..7)
150 150 150 150 150 150 150 150 
##$DBP07= 0
##$DBPNAM0= <>
##$DBPNAM1= <>
##$DBPNAM2= <>
##$DBPNAM3= <>
##$DBPNAM4= <>
$$ [...]
##$SUBNAM3= <"">
##$SUBNAM4= <"">
##$SUBNAM5= <"">
##$SUBNAM6= <"">
##$SUBNAM7= <"">
##$SUBNAM8= <"">
##$SUBNAM9= <"">
##$SW= 16.9725357007746
##$SWIBOX= (0..15)
0 0 2 0 0 0 0 0 0 0 0 0 0 0 0 0 
##$SW_h= 3396.73913043478
##$TD= 16384
##$TD0= 1
##$TE= 0
##$TE2= 300
##$TE3= 300
##$TEG= 300
##$TL= (0..7)
0 120 120 120 120 120 120 120 
##$TP= (0..7)
150 150 150 150 150 150 150 150 
##$TP07= 0
##$TPNAME0= <>
##$TPNAME1= <>
##$TPNAME2= <>
##$TPNAME3= <>
##$TPNAME4= <>
##$TPNAME5= <>
##$TPNAME6= <>
##$TPNAME7= <>
##$TPOAL= (0..7)
0.5 0.5 0.5 0.5 0.5 0.5 0.5 0.5 
##$TPOFFS= (0..7)
0 0 0 0 0 0 0 0 
##$TUNHIN= 0
##$TUNHOUT= 0
##$TUNXOUT= 0
##$USERA1= <user>
##$USERA2= <user>
##$USERA3= <user>
##$USERA4= <user>
##$USERA5= <user>
##$V9= 5
##$VALIST= <valist>
##$VCLIST= <CCCCCCCCCCCCCCC>
##$VD= 0
##$VDLIST= <DDDDDDDDDDDDDDD>
##$VPLIST= <PPPPPPPPPPPPPPP>
##$VTLIST= <TTTTTTTTTTTTTTT>
##$WBST= 1024
##$WBSW= 4
##$XGAIN= (0..3)
0 0 0 0 
##$XL= 0
##$YL= 0
##$YMAX_a= 182057
##$YMIN_a= -225272
##$ZGOPTNS= <>
##$ZL1= 120
##$ZL2= 120
##$ZL3= 120
##$ZL4= 120
##$ABSF1= 15.96781
##$ABSF2= -1.004852
##$ABSG= 5
##$ABSL= 3
##$ALPHA= 0
##$AQORDER= 0
##$ASSFAC= 0
##$ASSFACI= 0
##$ASSFACX= 0
##$ASSWID= 0
##$AUNMP= <proc_1d>
##$AZFE= 0.1
##$AZFW= 0.1
##$BCFW= 0
##$BC_mod= 2
##$BYTORDP= 0
##$COROFFS= 0
##$CY= -3
##$DATMOD= 1
##$DC= 0
##$DFILT= <>
##$DTYPP= 0
##$F1P= 0
##$F2P= 0
##$FCOR= 1
##$FTSIZE= 16384
##$FT_mod= 6
##$GAMMA= 0
##$GB= 0
##$INTBC= 1
##$INTSCL= 2.992141e-10
##$ISEN= 128
##$LB= 0.24
##$LEV0= 0
##$LPBIN= 0
##$MAXI= 10000
##$MC2= 0
##$MEAN= 0
##$ME_mod= 0
##$MI= 1.114404
##$NCOEF= 0
##$NC_proc= -7
##$NLEV= 6
##$NOISF1= 3.799351
##$NOISF2= 2.8
##$NSP= 0
##$NTH_PI= 0
##$NZP= 0
##$OFFSET= 15.97817
##$PC= 1
##$PHC0= -11122.98
##$PHC1= 15.20093
##$PH_mod= 1
##$PKNL= yes
##$PPARMOD= 0
##$PSCAL= 0
##$PSIGN= 0
##$REVERSE= no
##$SF= 200.130006657494
##$SI= 16384
##$SIGF1= 3
##$SIGF2= 2
##$SINO= 5.538805
##$SIOLD= 16384
##$SREGLST= <1H.CDCl3>
##$SSB= 0
##$STSI= 16384
##$STSR= 0
##$SW_p= 3396.73913043479
##$SYMM= 0
##$S_DEV= 0
##$TDeff= 16384
##$TDoff= 0
##$TI= <>
##$TILT= no
##$TM1= 0
##$TM2= 0
##$TOPLEV= 0
##$USERP1= <user>
##$USERP2= <user>
##$USERP3= <user>
##$USERP4= <user>
##$USERP5= <user>
##$WDW= 1
##$XDIM= 16384
##$YMAX_p= 457443138
##$YMIN_p= -589861
$$ End of Bruker specific parameters
$$ ---------------------------------
##NTUPLES= NMR SPECTRUM
##VAR_NAME=  FREQUENCY,     SPECTRUM/REAL,   SPECTRUM/IMAG
##SYMBOL=    X,             R,               I
##VAR_TYPE=  INDEPENDENT,   DEPENDENT,       DEPENDENT
##VAR_FORM=  AFFN,          ASDF,            ASDF
##VAR_DIM=   16384,         16384,           16384
##UNITS=     HZ,            ARBITRARY UNITS, ARBITRARY UNITS
##FACTOR=    0.207333158178282, 1,           1
##FIRST=     3197.7113475054, 0,             0
##LAST=      -199.027782929387, 0,           0
##MIN=       -199.027782929387, -589861,     0
##MAX=       3197.7113475054, 457443138,     0
$$ Real data points
##PAGE= N=1
##DATA TABLE= (X++(R..R)), XYDATA
$$ [...]
5424A7770O2822k01420J07084L5560J09411j4292Q4026q6666N9255j16008j11773
5413e4231n4109P2018K3046N3323K8360N7481J68022J12066K4078j11145j9192
5402B99717q2429k3626j17181r5110J99270k3378q0638j5319l2213N461M3461
5391G8015M5923K4809P6114r2614m8036j8890J6676R6119q0555P3910l5367k31250
5379i5146L3645M2484j21812J86098R0370j35256L6951J63883J20987K171j84768
5368A39607n3315l4417l3105K24251K1397p3259o8756L8288P8420m0258M2896
5357B41749k5208k07690J00512k4301j67960J64019J68218L0982M0295j35515
5347A85101N948j24736J90171J66224j48727j35999Q8122P1899N1780M0365l58547
$$ plain form
5424 17770 80592 -120828 -13744 21816 131227 116935 200961 114295 173550 57542 -54231
5413 -54231 -108340 -36322 -13276 40047 68407 125888 293910 405976 430054 318909 299717
5402 299717 217288 193662 76481 -18629 180641 157263 76625 61306 29093 34554 78015
5391 78015 123938 148747 224861 132247 84211 65321 81997 178116 97561 171471 136104 -95146
5379 -95146 -61501 -19017 -140829 45269 135639 383 37334 201217 322204 324375 139607
5368 139607 86292 51875 18770 243021 264418 191159 122403 160691 239111 198853 241749
5357 241749 216541 8851 109363 85062 -82898 81121 249339 280321 320616 185101
5347 185101 191049 66313 256484 422708 273981 137982 226104 298003 349783 390148 31601
5336C1601K63924k6956k8013K35596j35250j45389N5879j50028O0605j26179n1392
5325a5602J11218N4802J717K447J25194k41603J10712q3374O9794J35639k5579
5314B45365J37268P239p8101P4784k12748L2045J98145j822l7856q4669M102J36945
5302D20697j18264o7427J7947k057J49666j8679j12716J32892O6824j54884j37079
5291A76920j25727R2595K10058m8964J37572L2413r4636r9550j7305M7215P4948
5280C85539o7548Q4940J20678M1401o1509L257j56928L2206o831j27218J63679
5269D11666k75099K79321O2492j91801Q5715L7515j72727j0685p8310r7670J06257
5258A56674J05755j3528K0659J90575L8792m7219j614J3291N2705r3762r0108
$$ plain form
5336 31601 295525 268569 240556 476152 340902 195513 251392 101364 161969 35790 -15602
5325 -15602 95616 150418 152135 154582 279776 38173 148885 65511 135305 270944 245365
5314 245365 382633 389872 311771 386555 173807 205852 403997 402175 364319 279650 283752 420697
5302 420697 302433 235006 252953 250896 400562 381883 269167 402059 468883 313999 176920
5291 176920 51193 143788 353846 304882 442454 474867 380231 280681 263376 310591 385539
5280 385539 317991 402931 523609 565010 503501 506758 349830 382036 375205 247987 411666
5269 411666 136567 415888 478380 286579 372294 409809 237082 226397 148087 50417 156674
5258 156674 262429 248901 269560 460135 498927 451708 450094 463385 516090 422328 332220
5247C32220o1638Q9828K5970j07881J05193O8601k16653O7615k5690q611L7113
5236C06067L410j41n5261J5325O4986o8207O8775R1032j20863J71360l9230j56752
5224B80501J01880q6153j14471j57972j2963J18159K50756L1122L4593j06409
5214C39043n1540J11855p3640j41223j72557Q2035Q543l8121l7067K6758l7399
5203A6687j0252J05603k0328Q9696K6867j79575o7873j1301P6627j04028J73380
5192I5503L2644r0995O788P0100J39516K1898j65618j17873M5415j29219K50924
5181A59083J30884j22220n9511j94243J33864J33547n8193r7419J48643J84993
5171C59428r4265j99903J85477k45498o2175K42707M4389k3092q9658J25168O5422
$$ plain form
5247 332220 270582 360410 386380 278499 383692 452293 235640 303255 277565 268954 306067
5236 306067 309477 309336 254075 269400 334386 266179 334954 425986 305123 476483 437253 280501
5224 280501 382381 296228 181757 23785 10822 128981 379737 410859 445452 339043
5214 339043 287503 399358 325718 184495 11938 93973 102516 64395 27328 54086 16687
5203 16687 6435 112038 91710 181406 208273 28698 -39175 -50476 26151 -77877 95503
5192 95503 128147 37152 43940 114040 253556 275454 109836 -8037 37378 -91841 159083
5181 159083 289967 167747 108236 -86007 47857 181404 123211 25792 174435 359428
5171 359428 265163 65260 250737 5239 -56936 185771 230160 207068 117410 242578 308000
5160C08000m7820j94637J1861J60707o5452O0482M6405p3961j23848k8182N1399
5149A04954O4314k2782p223P950k148j12593j02070o2209n3379J61955J42180
5138A18949j7351P1548m0245k37058J12746L3596l8132J29138J07493m3700J97057
5127C94041j44733n4237N0943J0358j40257o1349L6100K3791m8959J00913k362
5116A64249R2322n3410k72667p7046J05276J0481k21472K58047K81133j28401
5106A58512N8785o6069N0167K869j62640r7862j52134K55355J87440k00706j16978
5095h3261J31971O0430Q8085o0626J05964l1860J4888J13932L1931p8440k5527
5084B67487J07997j80959o2110J31407j19847J03631J68969p2153k09505N4114
$$ plain form
5160 308000 260180 65543 77404 238111 172659 233141 279546 205585 81737 53555 104954
5149 104954 169268 146486 139263 147213 145065 32472 -69598 -131807 -185186 -23231 118949
5138 118949 101598 173146 132901 -104157 8589 42185 4053 133191 240684 196984 394041
5127 394041 249308 195071 246014 256372 116115 54766 90866 114657 65698 166611 164249
5116 164249 256571 203161 -69506 -146552 -41276 -30795 -252267 5780 286913 158512
5106 158512 217297 151228 201395 204264 41624 -56238 -208372 46983 234423 33717 -83261
5095 -83261 48710 109140 197225 136599 242563 210703 225591 339523 371454 293014 267487
5084 267487 375484 194525 132415 263822 143975 247606 416575 344422 134917 189031
5074A89031K2672j05388p1784Q8388Q528m0602J29901O7759L4237j61449j80099
5063a8806O9690j22996R6568K11943m7805J85041q5224J2241j8952j56317L0264
5052A55647j42093J93876l6887j84152L77158O5146j09771Q4312l00177j32217
5042b9158J35924P5600J82157j09808j9917J22740R0900k44956j85671R1521J17129
5031B26461L22302o8501r1313n3583K8079o6640k43616l5692J15030J06958Q3676
5020C23161K3387N1483J39297k13995n3716O8613j36421j12308R9452R8204R1950
5009C79107j59j29156J77845p9104j38999j05059j09202o619R81j17390J93943
4998F6188P5753N9201M4465j24194j7686O2371R3788r3245J3273j00066R1207
$$ plain form
5074 189031 211703 106315 34531 122919 131447 90845 220746 288505 322742 161293 -18806
5063 -18806 50884 -72112 24456 236399 188594 373635 288411 300652 281700 125383 155647
5052 155647 13554 207430 170543 -13609 363549 428695 318924 403236 103059 -29158
5042 -29158 106766 182366 364523 254715 234798 357538 448438 203482 17811 109332 226461
5031 226461 548763 480262 388949 335366 363445 296805 53189 17497 132527 239485 323161
5020 323161 346548 398031 537328 323333 269617 338230 201809 89501 188953 287157 379107
5009 379107 378948 249792 427637 348533 209534 104475 -4727 -11346 -10365 -127755 66188
4998 66188 141941 201142 245607 121413 103727 166098 259886 166641 179914 79848 171055
4987A71055j1753J82147M6035j98814J72472J2364j34489j65946J35590o1875
4977A46786J33894R5784k43243J12986J4985j20008J47786j82808O3065J15223
4967B84450j28204m7594o5450P7024l9192J84881n727J48654Q3890P960j1378
4956D89314j36819k23775K2572Q8504K19051J9975j47880J71769R2K6353j11459
4945D17697l92675O6076j51780R8966Q6129J37315n0544Q8498K26271J70770n2480
4934F44243k68266p2811Q7144M61R3290j14841j48270K13558n575J40506j61739
4923D07700O4054j1643j91576K62194J9072o1846j00938j28396M8732J28136k7306
4912D08183O8777O0315J22032j71790r6673k4573K570L7215p5030L9050N0442
$$ plain form
4987 171055 159302 341449 387484 188670 361142 373506 239017 73071 208661 146786
4977 146786 280680 376464 133221 246207 261192 141184 288970 106162 169227 284450
4967 284450 156246 108652 43202 120226 81034 265915 260188 408842 492732 500692 489314
4956 489314 352495 128720 151292 239796 458847 478822 330942 502711 502803 529156 417697
4945 417697 25022 91098 -60682 38284 124413 261728 211184 299682 525953 696723 644243
4934 644243 375977 303166 390310 390771 484061 369220 220950 434508 428933 569439 407700
4923 407700 471754 460111 268535 530729 549801 487955 387017 258621 307353 435489 408183
4912 408183 476960 537275 659307 487517 390844 366271 368841 406056 331026 370076 420518
4901D20518K13150q7005j18714o9801j9698j39800O6292N3965O1658j87296q0598
4890A12671J31754L32399o696M599n9613j16763m3253P3704k60156j2385J33480
4879B89741J86325N549j7576K9955k9067k125l64j13868o6705K50924O4808k5451
4867E72146m4336q6009N5874J86547k35880r7172J64571M4769p9348P6563j28550
4856D29175p6655j61095j33663P3308Q5116K35368N4977L7244l4514j24822l8012
4845C46427q8841j26882K47279K55981m6980o3181p2580j08004Q2649l7104j92019
4834A96745j39306Q6647K31893K03332j79169Q9824N7089O3320k8541j23841j41706
4823C16287n0379N0653J63167J88525r7499n4237q8416l3793R7419P1125j74847
$$ plain form
4901 420518 633668 546663 427949 358148 338450 198650 264942 318907 380565 193269 112671
4890 112671 244425 576824 570128 574727 515114 398351 355098 428802 168646 156261 289741
4879 289741 476066 481615 464039 493994 464927 462802 462438 348570 281865 532789 597597 572146
4867 572146 527810 441801 497675 684222 448342 351170 515741 560510 481162 557725 429175
4856 429175 352520 191425 57762 131070 216186 451554 506531 543775 509261 384439 346427
4845 346427 257586 130704 377983 633964 586984 523803 451223 343219 425868 388764 196745
4834 196745 57439 144086 375979 579311 400142 489966 547055 610375 581834 457993 316287
4823 316287 265908 316561 479728 668253 570754 516517 428101 394308 491727 562852 388005
4812C88005K48611j89453l1446Q2241J58014o7907R6550J05478n6550o709M9313
4801G76147j27676j90677K84414L7602J0765r1128j48904n2438J18689J05551
4791G22345K1583J88k1268J99130l0881k43225j19330N4217l9253J00333K24668
4780H68507j64960m6197K11048k1747J07585k8958k05417K26087J95986j06553
4770A035381m6450k21711L2247K85087J36982l97j32792K5076J60390j86480P7646
4759A164979O5163o7295K55634m2435M4868M9378R810j66334j61909r7216R772
4748A064415m3145L4158M1966K26125N0609j56583J6320R3892p241q2846K17605
4737A455275k4465P5030Q1380r3392L0743J77193J03706o553N1077r8767j07385
$$ plain form
4812 388005 636616 447163 415717 497958 655972 588065 684615 790093 733543 726834 776147
4801 776147 648471 457794 742208 779810 790575 699447 550543 498105 616794 722345
4791 722345 743928 744116 722848 921978 891097 647872 528542 582759 543506 643839 868507
4780 868507 703547 657350 868398 846651 954236 925278 719861 945948 1141934 1035381
4770 1035381 988931 767220 799467 1084554 1221536 1221139 1088347 1113423 1273813 1087333 1164979
4759 1164979 1230142 1162847 1418481 1376046 1420914 1470292 1480102 1313768 1151859 1054643 1064415
4748 1064415 1021270 1055428 1097394 1323519 1374128 1217545 1233865 1327757 1320516 1237670 1455275
4737 1455275 1430810 1505840 1587220 1493828 1524571 1701764 1805470 1798917 1849994 1751227 1643842
4726A643842j23509o7020q3572j19840O678O9120R5332J6424l9397j37118J31652
4715A392592o9654m9223P3069j13010k9132K19592l7542J70865J57197j35996
4705A578758K00452j67276j00257J22308l7513R0306J47770j1315R3011j82725
4695A733519j10760K69930J0040P4581J58902J54948O9631n853j33902P7511J1287
4684B309834J04033K39214j07003O20K3158r1680K12396M4501o6031K2321M1607
4673B732970O3689J61428K06832J66088j07427j73008J01323M6027j1992J07872
4663C293802j16039J47758J54557L6463K91944R5595K2216M6678J54216J06289
4653D233479L52513J21612O8214N831N2273K95147N8646N7142K26890L14795J91520
$$ plain form
4726 1643842 1520333 1453313 1369741 1249901 1256579 1325699 1421031 1437455 1398058 1260940 1392592
4715 1392592 1322938 1273715 1346784 1233774 1204642 1424234 1386692 1557557 1714754 1578758
4705 1578758 1779210 1611934 1511677 1633985 1596472 1686778 1834548 1823233 1916244 1733519
4695 1733519 1622759 1892689 1902729 1977310 2136212 2291160 2360791 2354938 2221036 2298547 2309834
4684 2309834 2413867 2653081 2546078 2546698 2569856 2478176 2690572 2735073 2669042 2691363 2732970
4673 2732970 2796659 2958087 3164919 3331007 3223580 3050572 3151895 3197922 3185930 3293802
4663 3293802 3177763 3325521 3480078 3516541 3808485 3904080 3926296 3972974 4127190 4233479
4653 4233479 4585992 4707604 4775818 4781649 4833922 5129069 5187715 5244857 5471747 5786542 5978062
4642E978062L01184K16469L90988M61334M24326M01545N52051P27948M92207O39442
4632A0585556N63380K46943k27414M262l63558k72868o2079j48484J31417L0783
4622A0487938J1132L69832L08790N03931N76578R17431P40388J049920R87266
4613A5953206J340875R97497R61101R10377Q45425P97546N78294L99434K08841
4604B2992596O9600j24307k61008n56837n06204n00274j54031R0708N64767M34634
4594B2049644L50361K98512L43880L75776N51393Q53504R43711J015564Q94731
4585B7677076P28243N58470M71550K63206J77734J77989l1164j21246j692m9957
4575B9850209l75446k43819k52656j34090R1169K22871N7276k39594m89747l47404
$$ plain form
4642 5978062 6279246 6495715 6886703 7348037 7772363 8173908 8725959 9453907 9946114 10585556
4632 10585556 11148936 11395879 11168465 11172727 10809169 10536301 10474222 10325738 10457155 10487938
4622 10487938 10499070 10868902 11177692 11681623 12258201 13175632 13916020 14965940 15953206
4613 15953206 17294081 18291578 19252679 20163056 21008481 21806027 22384321 22783755 22992596
4604 22992596 23062196 22937889 22676881 22120044 21613840 21113566 20959535 21050243 21615010 22049644
4594 22049644 22400005 22698517 23042397 23418173 23969566 24823070 25766781 26782345 27677076
4585 27677076 28405319 28963789 29435339 29698545 29876279 30054268 30023104 29901858 29900166 29850209
4575 29850209 29474763 29230944 28978288 28844198 28935367 29158238 29215514 28975920 28486173 28138769
4565B8138769n31339n83009q45935n94535r2232R3555J57873j41077j70272l98630
4555B5033168n58358j68978Q956M65741K62484M20635N16990K03128l21022Q2660
4545B5945404q8796n75966p82224j006359j062163j087748j527225j700040j351640
4536A6763243j043114r64208q52172l07621r6725m33619k1386K48382K65038K41014
4526A3798832L40217O51091N93924N20918K2081l78069r01739j069471j248219
4517A2329565j071446j113832p77336l37672l75496m73812k73226k56714l66296
4508G283735k02188k20264k75757k2045l3790k47646L418R8249O0238j81070j96071
4497F066809n0136J87389j43756j32690O4886J82127m9329P2870J10425R6177
$$ plain form
4565 28138769 27607430 27024421 26178486 25583951 25491719 25585274 25743147 25602070 25431798 25033168
4555 25033168 24474810 24305832 24314788 24780529 25043013 25463648 25980638 26183766 25862744 25945404
4545 25945404 25856608 25280642 24498418 23492059 22429896 21342148 19814923 18114883 16763243
4536 16763243 15720129 14755921 13903749 13596128 13499403 13065784 13044398 13292780 13557818 13798832
4526 13798832 14139049 14790140 15384064 15904982 15927063 15548994 14647255 13577784 12329565
4517 12329565 11258119 10144287 9366951 9029279 8653783 8179971 7906745 7650031 7283735
4508 7283735 7081547 6861283 6585526 6563481 6529691 6282045 6285463 6383712 6443950 6262880 6066809
4497 6066809 6016673 6204062 6060306 5927616 5992502 6174629 6125300 6198170 6308595 6404772
4487F404772j63275P8485K09901j56846Q9804J00816K56702l4039q5660J05139
4477F805799r7635Q7632L03807J11333M5510J79864K82796j5647l7802L1925L59543
4466H057125K29819K30039K52343K36877L85991K24015M20246J79796N17904O96830
4456A1430985M47039N63063L04158K57888q363k82671o94355m55286n9786j21555
4446A1381117o3915R3262K24580L76977J11261K78341K04032L00608L51767N31088
4436A3789118K87224M29586N68005Q65407O27516P49553Q59140Q42858O51376
4427A9669783M04642J94915K33450N61924O32042N98017O86529J092807R02222
4418B4976331Q30434J486813J692799J693314J716229J771045K179280K668939
$$ plain form
4487 6404772 6241497 6319982 6529883 6373037 6462841 6563657 6820359 6786320 6700660 6805799
4477 6805799 6708164 6795796 7099603 7210936 7256446 7436310 7719106 7703459 7665657 7697582 8057125
4466 8057125 8286944 8516983 8769326 9006203 9392194 9616209 10036455 10216251 10734155 11430985
4456 11430985 11878024 12441087 12745245 13003133 12994770 12712099 12017744 11562458 11502672 11381117
4446 11381117 11317202 11410464 11635044 12012021 12123282 12401623 12605655 12906263 13258030 13789118
4436 13789118 14076342 14505928 15073933 15939340 16566856 17316409 18175549 19018407 19669783
4427 19669783 20074425 20269340 20502790 21064714 21696756 22294773 22981302 24074109 24976331
4418 24976331 25806765 27293578 28986377 30679691 32395920 34166965 36346245 39015184
4410C9015184L163059L588624L893667M729492O033530P013534Q053690Q698224
4402H4189004Q894348Q583075P203611L982191J58285k011609k241026k642477
4394A06115402m602916p881700r557806r107397p531468n474459l912928k368525
4386E5678203j225453q31295n7973Q73249J776471K733560L550012M202389M358114
4377G1057277M021274K896071P79043j836695l705247l548399k098885n63661
4369F7000778K28761J014060R20096r47844l833807o340978p456949o621349n423862
4360C8538906m186612l265728k559918k141655j849053j316447j157463j331319
4352B0730711j008578p69814p57801m80025k41984l78627l08479k48985j75541
$$ plain form
4410 39015184 42178243 45766867 49660534 54390026 60423556 67437090 75490780 84189004
4402 84189004 93083352 101666427 108870038 112852229 113010514 110998905 108757879 106115402
4394 106115402 101512486 93630786 84072980 74965583 67434115 61959656 58046728 55678203
4386 55678203 54452750 53621455 53563482 54436731 56213202 58946762 62496774 66699163 71057277
4377 71057277 75078551 77974622 78753665 76916970 73211723 69663324 67564439 67000778
4369 67000778 67229539 68243599 69163695 68215851 64382044 58041066 50584117 43962768 38538906
4360 38538906 34352294 31086566 28526648 26384993 24535940 23219493 22062030 20730711
4352 20730711 19722133 18952319 18194518 17714493 17472509 17093882 16785403 16536418 16360877
4343A6360877m439k69638n41995p15663r73495p41315r01627q25453k75443l35331
4333A0776478m35770m16793l39737l12582k68044k92965k64729n1159n2036k49601
4323H093062L0580k24706j97193K40152m7675J8739M772O7563R4177O6887n6084
4312H090274k77211k12750n04516o97527m41203k62074k90312l63593j05089q1323
4302D854676k06471p5870j19191L0215j21292k07757j01011j69946k08691n5829
4292C618833j21092k48767p381n1659M7357N5809m0623q9766R0495j24702j90337
4281B938167l801j20918k03918j54159k983J45192O7720o6915J7846J27371Q3104
4270B826706q9828j62066k5526k6739p6784m6430M1584p9256r178L7835q4328
$$ plain form
4343 16360877 16356438 16086800 15544805 14829142 13855647 13114332 12212705 11387252 11111809 10776478
4333 10776478 10340708 9923915 9584178 9271596 9003552 8710587 8445858 8394699 8342663 8093062
4323 8093062 8123642 7898936 7701743 7941895 7894220 7912959 7917731 7985294 8079471 8146358 8090274
4312 8090274 7813063 7600313 7095797 6398270 5957067 5694993 5404681 5041088 4935999 4854676
4302 4854676 4648205 4572335 4453144 4483359 4362067 4154310 4053299 3883353 3674662 3618833
4292 3618833 3497741 3248974 3241593 3189934 3237291 3293100 3252477 3162711 3253206 3128504 2938167
4281 2938167 2934366 2813448 2609530 2455371 2452388 2597580 2665300 2598385 2616231 2743602 2826706
4270 2826706 2736878 2574812 2549286 2522547 2445763 2399333 2440917 2361661 2352483 2390318 2305990
4259B305990J0718M1834p1427j84757j01090Q0487k5390Q5687J38504k65467M8103
4248B063192J88481j17621o2359j25045j32489o6544o6289J81782j1602o2687
4238A788819m5269j17010M3298p6114p9404R4571p2384J27190J4986j06492K857
4227A575048q0073m8563R7034J456r3842j99334j9908j7166n7685J40657L39386
4216A637010n6808M896j39913p9249Q6678n4501k76130Q3568j17851r1795P4618
4205A070523J70976J9708o5839J3480L6196k65358j47787J19707j30757j3008
4195H07841K84655J46545M958m2663M579j44163J58706j32626j42838j82786o2210
4184F99998P8594q1707K05771j1373J59113O2450j07244J9316l1956j73701R375
$$ plain form
4259 2305990 2316708 2358542 2287115 2102358 2001268 2081755 2056365 2142052 2280556 2015089 2063192
4248 2063192 2251673 2134052 2071693 1946648 1814159 1747615 1681326 1863108 1851506 1788819
4238 1788819 1743550 1626540 1669838 1593724 1514320 1608891 1536507 1663697 1678683 1572191 1575048
4227 1575048 1494975 1446412 1543446 1544902 1451060 1251726 1231818 1214652 1156967 1297624 1637010
4216 1637010 1580202 1585098 1445185 1365936 1452614 1398113 1121983 1205551 1087700 995905 1070523
4205 1070523 1241499 1261207 1195368 1208848 1245044 979686 831899 951606 820849 807841
4195 807841 1092496 1239041 1243999 1201336 1205915 1061752 1220458 1087832 944994 762208 699998
4184 699998 778592 696885 902656 891283 1050396 1112846 1005602 1024918 992962 819261 828636
4173H28636j12221q9048O7683K84999K7613N214j60903J13740n8712q9804N0400
4162H67597j43659J45111R4972q0918M9404k57425r1618Q2880K38040M4906J4389
4151I63679j86607j77912R9630n2094p8132J88695J56826j32141j07763K16025
4141H90206j67474n177P517j64975N922P8209n9403L1748J63427R7040p3965j12440
4129F90635m360K56288q0244N7311m8643l7278P0324k2735j60674r1374n5752
4118E73498M1362R7026k9807K14714p1875K6988k3184P292j12510o0824J29291
4107G91971j9954K97122j56038m8617n9046m02112K45094J1596p0851J50057L5503
4096G74725K2398K39877q7967R3186O3107l26693K006p5133j5003M11000J47209
$$ plain form
4173 828636 716415 627367 695050 980049 1007662 1012876 851973 965713 907001 817197 867597
4162 867597 723938 869049 964021 883103 932507 675082 583464 666344 904384 949290 963679
4151 963679 777072 599160 698790 646696 568564 757259 914085 781944 674181 890206
4141 890206 722732 717555 725072 560097 566019 644228 584825 616573 780000 877040 803075 690635
4129 690635 686275 942563 862319 919630 870987 833709 904033 881298 720624 629250 573498
4118 573498 614860 711886 682079 896793 824918 851906 828722 836014 723504 662680 791971
4107 791971 772017 1069139 913101 864484 805438 403326 648420 660016 589165 739222 774725
4096 774725 797123 1037000 949033 1042219 1105326 778633 780639 705506 690503 1101503 1248712
4085A248712J57072j00677N9728K805p2939j35993J44028J9450r0186L14109k12739
4074A333370j40060L29706j00303q59J15612r5310m1965j77163j25642P25N6515
4063A154626N2797K49106Q1853M484J14787Q5607n8782j50063l1327J36634J58242
4052A797964J14970n7510q6517J04259k2131L4348K7699q0380j36921L7597j2091
4041A721287L7728K48393M8096j98161K73123P2211j61188k83299j69568q307
4031A580315J02943o5074k22230Q2399k0640O1297m2381Q8775J56138j08434j37597
4020A475511J96436n0872J90021J07573q4625P5071Q5153k53416j33949l531J15690
4009A719062k9375j6699O99p1149p7391J567J33594j88o6773k47655l8231k6532
$$ plain form
4085 1248712 1405784 1305107 1364835 1367640 1294701 1158708 1302736 1322186 1232000 1546109 1333370
4074 1333370 1193310 1523016 1422713 1421854 1537466 1442156 1400191 1223028 1097386 1098111 1154626
4063 1154626 1207423 1456529 1538382 1542866 1657653 1743260 1684478 1534415 1503088 1639722 1797964
4052 1797964 1912934 1855424 1768907 1873166 1851035 1885383 1913082 1832702 1695781 1733378 1721287
4041 1721287 1759015 2007408 2055504 1857343 2130466 2202677 2041489 1758190 1588622 1580315
4031 1580315 1683258 1618184 1395954 1478353 1457713 1519010 1476629 1565404 1721542 1613108 1475511
4020 1475511 1671947 1621075 1811096 1918669 1834044 1909115 1994268 1740852 1606903 1603372 1719062
4009 1719062 1689687 1672988 1673687 1602538 1525147 1526714 1660308 1660120 1593347 1345692 1307461 1280929
3997A280929K12616q2162j17570j98665K2943j29546r599M5099r6216j6606Q1826
3986I93049J09295k7668j47828O0207J61000j76428J04740O1636j31435J01972
3976A108540j17302p4573K02634l5055k5447K28278m4487j62134j66710p6351
3966H37393K12222J0483P4976K88495J3215j78705j15837j92510M1593P0199k06548
3955H54976q8327J88244q671J07061k78259J81162J61088j44654J43851k02433
3945I14038p9160j24210R3205J80726Q5625m5099n81J83179j5413O6046m8418
3934A209938j90541J7251M9788o672n97k00711J13473Q1418m1036K24732j3168
3923A243875k59936N0238R412n7723L662N8800Q0108R9864j35260K1316P7268
$$ plain form
3997 1280929 1493545 1411383 1293813 1095148 1118091 988545 978946 1024045 927829 911223 993049
3986 993049 1102344 1074676 926848 987055 1148055 971627 1076367 1138003 1006568 1108540
3976 1108540 991238 916665 1119299 1084244 1058797 1287075 1242588 1080454 913744 837393
3966 837393 1049615 1060098 1135074 1423569 1436784 1258079 1142242 949732 991325 1061524 854976
3955 854976 766649 954893 946222 1053283 775024 956186 1117274 972620 1116471 914038
3945 914038 834878 710668 803873 984599 1070224 1025125 1024544 1207723 1192310 1258356 1209938
3934 1209938 1019397 1036648 1086436 1079764 1079167 878456 991929 1073347 1032311 1257043 1243875
3923 1243875 983939 1034177 1043589 985866 989528 1048328 1128436 1228300 1093040 1114356 1191624
3912A191624n6400j5006n4902q7984Q5099N5480j7082K24486Q0958k3639r5787
3901A286847k21596j16442J27735K2434M8204k9409J46790j12781R4308K9221
3891A275311P0685j53732j7375P6948J49603J1378k4534Q674k1207J33815N4352
3880A563918j48513N879K06060j18651o8724l8255Q7879J1318j8504j95784J47735
3869A434358o1757o1804j0431K62991J22578J20452M6326k04285L3548n4114L7634
3858A665496P7330n6831M2717J86768j8010j11736j10925R0166J25650l33367
3848A557258k313J50596L61664l9247j42248k74793Q0792J46316l599J03783k5739
3837A912470Q5536K1798k524L0943J15784j51747J69150k16303j48741L19522
$$ plain form
3912 1191624 1135224 1120218 1065316 977332 1062431 1117911 1100829 1325315 1406273 1382634 1286847
3901 1286847 1065251 948809 1076544 1098978 1147182 1117773 1264563 1151782 1246090 1275311
3891 1275311 1345996 1192264 1174889 1251837 1401440 1412818 1388284 1396958 1375751 1509566 1563918
3880 1563918 1415405 1421284 1627344 1508693 1439969 1401714 1489593 1500911 1482407 1286623 1434358
3869 1434358 1372601 1310797 1300366 1563357 1685935 1806387 1852713 1648428 1681976 1627862 1665496
3858 1665496 1742826 1685995 1728712 1915480 1897470 1785734 1674809 1764975 1890625 1557258
3848 1557258 1554945 1705541 2067205 2027958 1885710 1610917 1691709 1838025 1834426 1938209 1912470
3837 1912470 1998006 2019804 2017280 2048223 2164007 2012260 2181410 1965107 1816366 2135888
3827B135888R2817K8704J07229q6511P0256m0704l1828R2156J4918J19444J44742
3816B647111j32146K25537M4139j39589M4888J07834J904j0796k3887J32465K72945
3805C170405k04519k157n8166j04877K45209K13099j27909N8925n9916J27934
3795C258028K69800o6883K5858l5805N0543J22036l32329m7399K04139m6811K65408
3784C666585L09546m3869L31534J54508L7570J32680j71631J27344P1222K33370
3774D848859L60367J16231J47706m489j42507L54504K53278L07704K79186l2694
3764F488145K19477L71745J47398Q7474L03381L52087J46088M64913L26751K87297
3754I194756M72289M73830N89502P11457P68418R71158R73754J161853J356764
$$ plain form
3827 2135888 2228705 2257409 2364638 2278127 2348383 2307679 2275851 2368007 2382925 2502369 2647111
3816 2647111 2514965 2740502 2784641 2645052 2689940 2797774 2799678 2788882 2764995 2897460 3170405
3805 3170405 2965886 2963729 2905563 2800686 3045895 3258994 3131085 3190010 3130094 3258028
3795 3258028 3527828 3460945 3486803 3450998 3501541 3623577 3291248 3243849 3447988 3401177 3666585
3784 3666585 3976131 3932262 4263796 4418304 4455874 4588554 4416923 4544267 4615489 4848859
3774 4848859 5209226 5325457 5473163 5468674 5326167 5680671 5933949 6241653 6520839 6488145
3764 6488145 6707622 7079367 7226765 7314239 7617620 7969707 8115795 8580708 8907459 9194756
3754 9194756 9667045 10140875 10730377 11441834 12210252 13181410 14155164 15317017 16673781
3745A6673781J480261K101485K048587J894085J949294J346707L91804q90911
3737B6995093k153529k131002j811232j488278j126310o33936l14076L5562K97286
3728A7669578J91494O96550J103840J311318J622108J703289J597192J570059
3720B7465428Q98973j51162j532756k510151k581676k036807j843109j133145
3712A6575595q06850p36503m46690k58362p1578k15690k21096J32980m164j04767
3702A3842875N1578L4361L15720M33430N32798N94236O54547O31003R17944P88708
3692A8797200Q98207J185996J301625J645489K182599K537814L034286L364732
3684C4947948L690557L389093K972170J792875j66826k752466l992791l904971
$$ plain form
3745 16673781 18154042 20255527 22304114 24198199 26147493 27494200 27886004 26995093
3737 26995093 24841564 22710562 20899330 19411052 18284742 17650806 17336730 17372292 17669578
3728 17669578 17861072 18557622 19661462 20972780 22594888 24298177 25895369 27465428
3720 27465428 28364401 28213239 26680483 24170332 21588656 19551849 17708740 16575595
3712 16575595 15768745 15032242 14585552 14327190 14255612 14039922 13818826 13951806 13947642 13842875
3702 13842875 13894453 13928814 14244534 14677964 15210762 15804998 16459545 17090548 18008492 18797200
3692 18797200 19695407 20881403 22183028 23828517 26011116 28548930 31583216 34947948
3684 34947948 38638505 42027598 44999768 46792643 46625817 43873351 39880560 35975589
3676C5975589l351275k473474j698828j102007o26273q1507K05974P73983J030752
3667B8652934J609575K047078K575806K631949K296804J900648P18443j019841
3659D1413396l231860m548684m529415l493326l117573k412992j769669j518607
3651A6791270j201862o26193o99857p19903o45570o52501m69277m53278o17524
3642A0705305j55573k15827m23891m43l23555j73701j39482j64582r648j56436
3632H942167l02770J9127k62780p9547k35030j52933J33592K24416k25773l84852
3622G675617j44477k6006J64819j04563p3833J42031J39246j08420r6318q2010
3612G486086O7395L40359k29634j49459Q840J69266m4362o847K19000M9816o6525
$$ plain form
3676 35975589 32624314 30150840 28452012 27350005 26723732 26642225 26848199 27622182 28652934
3667 28652934 30262509 32309587 34885393 37517342 39814146 41714794 42433237 41413396
3659 41413396 38181536 33632852 29103437 25610111 22492538 20079546 18309877 16791270
3651 16791270 15589408 14963215 14263358 13543455 12897885 12245384 11776107 11322829 10705305
3642 10705305 10549732 10333905 9910014 9909571 9586016 9412315 9272833 9108251 9098603 8942167
3632 8942167 8639397 8658524 8395744 8316197 8081167 7928234 8061826 8286242 8060469 7675617
3622 7675617 7531140 7505134 7669953 7565390 7491557 7633588 7772834 7664414 7568096 7486086
3612 7486086 7553481 7893840 7664206 7514747 7523587 7692853 7648491 7641644 7860644 7910460 7843935
3601G843935j31365L8267J07253K46103P5704K5097j92907M3879L9900J12498
3591H208364J35106k3049r853J47816K56075K6328J59002K7625k98295O9202L19818
3580I018139K71986J9603K93621K77154J3792J19562J13997J30241K74365K52131
3570A0784591K39474K27615L85610L77882L3999J36674L23903K12385K87594L82117
3560A3391844M96602L20396L43048L81692M74231N99502O57838O77037N59843
3551A7902033P35486Q03925J055748J129051J422296J475086K106252J896806
3543B8526683K476972L053828L315285L532494L168132K503623J279840r77941
3535D6878916k951673m204895m171687l350443k432397j858575j512041q24529
$$ plain form
3601 7843935 7712570 7750837 7858090 8104193 8179897 8204994 8012087 8055966 8095866 8208364
3591 8208364 8343470 8320421 8310568 8458384 8714459 8740787 8899789 8927414 8629119 8698321 9018139
3580 9018139 9290125 9309728 9603349 9880503 9894295 10013857 10127854 10258095 10532460 10784591
3570 10784591 11024065 11251680 11637290 12015172 12049171 12185845 12509748 12722133 13009727 13391844
3560 13391844 13888446 14208842 14551890 14933582 15407813 16007315 16665153 17342190 17902033
3551 17902033 18637519 19441444 20497192 21626243 23048539 24523625 26629877 28526683
3543 28526683 31003655 34057483 37372768 40905262 44073394 46577017 47856857 46878916
3535 46878916 43927243 39722348 35550661 32200218 29767821 27909246 26397205 25572676
3527B5572676q44914r09542l78615k31675l46311n8521k22356K35086J88675K38691
3517B3243194K29372M17283Q99012O66212O89809O22627J028930J452930J398201
3508C0647570J851821K005603K414679K807621L067208L249502K990826J837369
3500E0872199M58096j447776l243166l751648l367381k854861k106421j502544
3492C3056498j116027n93637k24316O1969N8018L83978N80373P58719J355484
3483C4321059J549109J620027J746358J688567J093643J11886q90945k312442
3475C8927262k490056j988745j801125j383590r30820o34918m80581l40297k35742
3466B8641388j99129l08898O811P9497J71699J82989n3845K19184N23990M07928
$$ plain form
3527 25572676 24727762 23818220 23439605 23207930 22861619 22803098 22580742 22815828 23004503 23243194
3517 23243194 23472566 23889849 24788861 25455073 26144882 26767509 27796439 29249369 30647570
3508 30647570 32499391 34504994 36919673 39727294 42794502 46044004 49034830 50872199
3500 50872199 51330295 49882519 46639353 42887705 39520324 36665463 34559042 33056498
3492 33056498 31940471 31346834 31122518 31184487 31242505 31626483 32206856 32965575 34321059
3483 34321059 35870168 37490195 39236553 40925120 42018763 42130649 41239704 38927262
3475 38927262 36437206 34448461 32647336 31263746 30332926 29698008 29217427 28877130 28641388
3466 28641388 28442259 28133361 28140172 28219669 28391368 28574357 28520512 28739696 29263686 29671614
3456B9671614M01742M57899M50564N90785O76964O59222Q11795J060970J382114
3447C6163669J630826J769457J915108J769618J816031R87849j3824j058055k013291
3438D2967388k405106k082421j630635j274511p49695o12632m23454m93847m79109
3429C2815978j70034J81604k03817k84238k27591j04061Q8540m7704m1782j65023
3419C1841872l2962J6014k73926j12210K05731j35736m1492O5793r0122r4754
3409C1348208L5736O7041k19502j63802j12474l70545o9298r3927o4728J14006
3399C0470715k58728k27752o1049L5694k48256j64554j46336m21557k55756j81971
3389B8540450k51901k59690j70587k04651k62365k36036k20498l01734k29004
$$ plain form
3456 29671614 30073356 30531255 30981819 31572604 32249568 32908790 33720585 34781555 36163669
3447 36163669 37794495 39563952 41479060 43248678 45064709 46052558 46038734 44980679 42967388
3438 42967388 40562282 38479861 36849226 35574715 34825020 34212388 33788934 33295087 32815978
3429 32815978 32645944 32827548 32623731 32339493 32111902 32007841 32096381 32048677 32006895 31841872
3419 31841872 31808910 31824924 31550998 31438788 31644519 31508783 31467291 31533084 31442962 31348208
3409 31348208 31383944 31450985 31231483 31067681 30955207 30584662 30515364 30421437 30356709 30470715
3399 30470715 30211987 29984235 29923186 29958880 29710624 29546070 29399734 28978177 28722421 28540450
3389 28540450 28288549 28028859 27858272 27653621 27391256 27155220 26934722 26632988 26403984
3380B6403984k19024l72100k11103k14132k51450k01827j90218l19369l45609
3371B4079152l84323j22485j99763k07213l35863l95775k71732j70816k04787
3362B1786395l00266l57440p8550j11936k32133l63123l21643l00635l27759k17954
3352A9174956l18524l08878j58139k42657j68759l80170k91991j06160m29695
3343A6769983o7920j32693r6834j13677k72059q0635o8127k44558k94559k99580
3333A5099341l86582j00921k11461k31216Q261j87158j88526j90711l28633j15707
3323A3166687M6809m08186j46860k19175k46223J51978N5346j71957n8196k02156
3313A1968067j12666j22283k97681j41639l2832m15303l0887o8131k17349j66116
$$ plain form
3380 26403984 26184960 25812860 25601757 25387625 25136175 24934348 24744130 24424761 24079152
3371 24079152 23694829 23572344 23372581 23165368 22829505 22433730 22161998 21991182 21786395
3362 21786395 21486129 21128689 21050139 20938203 20706070 20342947 20021304 19720669 19392910 19174956
3352 19174956 18856432 18547554 18389415 18146758 17977999 17597829 17305838 17199678 16769983
3343 16769983 16702063 16569370 16472536 16358859 16086800 16006165 15938038 15693480 15398921 15099341
3333 15099341 14712759 14611838 14400377 14169161 14177422 13990264 13801738 13611027 13282394 13166687
3323 13166687 13213496 12805310 12658450 12439275 12193052 12345030 12400376 12228419 12170223 11968067
3313 11968067 11855401 11733118 11435437 11293798 11260966 10845663 10814776 10746645 10529296 10363180
3303A0363180O8111P7318j66898k86388N6015q1576j60701N4315k9308k03196
3293I690872k73203j37222j32103j47776L9701o7795j68945j47674j67195p3175
3283H415485J21317p5588k16684r7268J6497r232q0912j54843j69490J25256k45683
3272G628855m3174o1518r6386n481o4940j68060j96276M7330P1993r2847r9850
3261F919646Q1908r7581N4431p3494l77017j41780j18228M1630j12864j35724
3251F040927J14547J65829j17015k74694j01799k15668q857J4787j11197K79443
3241E786303j95239j86973R5616K4909k81703m0906j7339q7353r2636M6505R0860
3230E142044j75003R1003N8740j49018j052K506J9710j93521j92278J8674n536
$$ plain form
3303 10363180 10431291 10508609 10341711 10055323 10111338 10029762 9869061 9923376 9894068 9690872
3293 9690872 9417669 9280447 9148344 9000568 9040269 8972474 8803529 8655855 8488660 8415485
3283 8415485 8536802 8461214 8244530 8147262 8163759 8154527 8073615 7918772 7749282 7874538 7628855
3272 7628855 7585681 7524163 7427777 7422296 7357356 7189296 6993020 7040350 7112343 7019496 6919646
3261 6919646 7001554 6903973 6958404 6884910 6507893 6366113 6247885 6289515 6176651 6040927
3251 6040927 6155474 6321303 6204288 5929594 5827795 5612127 5603270 5618057 5506860 5786303
3241 5786303 5591064 5404091 5499707 5524616 5242913 5202007 5184668 5097315 5004679 5051184 5142044
3230 5142044 4967041 5058044 5116784 4967766 4966714 4969220 4988930 4795409 4603131 4621805 4616269
3219D616269k4346J4839J5920J20466J25386N0578l442l5588k65980k00165j00709
3208D313228Q3476J04929j64969J1000K4963r2346j42765O7321p9064r1658M2851
3197D076966p4382r2125j68927p0175J51715J3349K12435J48660l52772j42781
3187C701963J12294O7667J20209k23653p5691M5007P1560K63165j84749j91052
3177C706720n6922J00506O0137o986l6975P8311l4908j11441Q3834j01626j59630
3166C521020o9768N8329J30384j224o3011J13929J24464q397j18207l24337K00382
3155C563564K7792k58126K75518R0992k1513j78118K2420J6684j21914n1600k0395
3144C345304J01083K72840m2120q8353R3192r1542J21659r3698j10307k1058J67999
$$ plain form
3219 4616269 4591923 4606762 4622682 4743148 4868534 4919112 4915670 4880082 4614102 4413937 4313228
3208 4313228 4396704 4501633 4336664 4347664 4372627 4280281 4137516 4204837 4125773 4034115 4076966
3197 4076966 4002584 3910459 3741532 3671357 3823072 3836421 4048856 4197516 3844744 3701963
3187 3701963 3814257 3881924 4002133 3778480 3702789 3747796 3819356 4082521 3897772 3706720
3177 3706720 3649798 3750304 3810441 3803455 3766480 3844791 3809883 3698442 3782276 3680650 3521020
3166 3521020 3451252 3509581 3639965 3638741 3575730 3689659 3814123 3805726 3687519 3363182 3563564
3155 3563564 3591356 3333230 3608748 3699740 3678227 3500109 3522529 3539213 3417299 3365699 3345304
3144 3345304 3446387 3719227 3677107 3588754 3681946 3590404 3712063 3618365 3508058 3487000 3654999
3133C654999P827M0154R3144p6770J3598J33085R3285j31964j45323k2858L3951
3122C693128k97807p1956K77197K36189m2137J3396J00668M3685j99613J19532
3112C872282L8437m8870J61353j08944k4160K43344k55245K9206L47052P759l0889
3101D231325q1711j37082J07655J67284R9850j21135K5833J61364J02852K09201
3091D765436l38374j26660J24194l8753J99217K52213n0576r0319K01016O1688
3081D959082Q7849K10717L2024k16760P0854N6992K24960J14945J25669O9898
3071E736230l0082J08897J32795Q1606M533P2019K45236K57895K18832J74995
3061G002956J18754J50863J51998R4419N6541Q0973J1062L61699K64501K34919
$$ plain form
3133 3654999 3662826 3702980 3796124 3719354 3732952 3866037 3959322 3827358 3682035 3659177 3693128
3122 3693128 3395321 3323365 3600562 3836751 3794614 3808010 3908678 3952363 3752750 3872282
3112 3872282 3910719 3861849 4023202 3914258 3890098 4133442 3878197 3907403 4254455 4262214 4231325
3101 4231325 4149614 4012532 4120187 4287471 4387321 4266186 4292019 4453383 4556235 4765436
3091 4765436 4427062 4300402 4424596 4385843 4585060 4837273 4786697 4696378 4897394 4959082
3081 4959082 5046931 5257648 5289672 5072912 5143766 5200758 5425718 5540663 5666332 5736230
3071 5736230 5706148 5815045 5947840 6029446 6033979 6105998 6351234 6609129 6827961 7002956
3061 7002956 7121710 7272573 7424571 7518990 7575531 7656504 7667566 8029265 8293766 8528685
3051H528685J63848Q8047O1863J96564J70773K26339l7073K45505J95561K34658
3041A0074770K34734J50366J86326M48935M35227K94780K32018L43371K02463
3032A2602990J88063K36886L52414L67012L93742L12650L21621N10033L85956
3023A5671367O85455O81526M94978L11289M17868P09289O30987P91446R37372
3014B1331577P33381P86034R57866J263645J221298J103213J068900J159811J291014
3005C0916739J419781J550599J719963J683801J674567J823501J947998J975809
2997D4712758K211521K230993K019488K348848K513048K491389K428159K475957
2989F3432161K563306K481498K679822K604191K975698K736119K706729K668081
$$ plain form
3051 8528685 8692533 8780580 8842443 9039007 9209780 9436119 9399046 9644551 9840112 10074770
3041 10074770 10309504 10459870 10646196 11095131 11530358 11825138 12057156 12400527 12602990
3032 12602990 12791053 13027939 13380353 13747365 14141107 14453757 14775378 15285411 15671367
3023 15671367 16356822 17038348 17533326 17844615 18262483 18971772 19602759 20394205 21331577
3014 21331577 22064958 22850992 23808858 25072503 26293801 27397014 28465914 29625725 30916739
3005 30916739 32336520 33887119 35607082 37290883 38965450 40788951 42736949 44712758
2997 44712758 46924279 49155272 51174760 53523608 56036656 58528045 60956204 63432161
2989 63432161 65995467 68476965 71156787 73760978 76736676 79472795 82179524 84847605
2981H4847605K914182K880085K546959K677345K386554K355640K319715J909434
2973A04837519J773155J746499J507685J475527J431489J415657J336939J290509
2965A16814979Q00074O64575N13284K86462k30096n71294q23358j030667j159582
2956A15264377j393711j306032j543391j431853j515088j555511j822729k073264
2948A02622798k117897k428726k731706k734164k723816k729802l017892k950970
2940H1187825k745867k925989k889600k535348k589315k806864k628284k547292
2932E9519266k434868k498510k406572k371703k533770k364218k319731k246328
2924D0343566j691845j963315j844161j822570j737761j402088j215366j061660
$$ plain form
2981 84847605 87761787 90641872 93188831 95866176 98252730 100608370 102928085 104837519
2973 104837519 106610674 108357173 109864858 111340385 112771874 114187531 115524470 116814979
2965 116814979 117615053 118279628 118792912 119079374 118849278 118277984 117454626 116423959 115264377
2956 115264377 113870666 112564634 111021243 109589390 108074302 106518791 104696062 102622798
2948 102622798 100504901 98076175 95344469 92610305 89886489 87156687 84138795 81187825
2940 81187825 78441958 75515969 72626369 70091021 67501706 64694842 62066558 59519266
2932 59519266 57084398 54585888 52179316 49807613 47273843 44909625 42589894 40343566
2924 40343566 38651721 36688406 34844245 33021675 31283914 29881826 28666460 27604800
2916B7604800j312136j298033j224751j153538r07113r78128q15821r37965r84108
2907A7993207n15864o06099o85674o67500o64027m61755l50684l72518m10394
2898A3258692l74568l32555m59870l24912k33583k10392k64695m05146k49320
2889A0403651k41043k49013r6154l93853k37423j3793N3134j44724k58208n8707
2879H763867m6600j4643j88909M8983Q1578p2504k67451m6144j62693m4139O7630
2868H118975r8559L8467j27525k63966k0601L0657k9457j42224O2336o1928k43334
2857G262841j20934n8559p1168p0227n4708n4939J1283k15944j19111m4794o5643
2846F398097k06065L3198p0458l9057k9973q4219N2079Q5237j24242J83625J9005
$$ plain form
2916 27604800 26292664 24994631 23769880 22616342 21709229 20731101 19915280 18977315 17993207
2907 17993207 17477343 16871244 16185570 15518070 14854043 14392288 14041604 13669086 13258692
2898 13258692 12884124 12551569 12091699 11766787 11533204 11322812 11058117 10652971 10403651
2889 10403651 10162608 9913595 9817441 9423588 9186165 9172372 9225506 9080782 8822574 8763867
2879 8763867 8717267 8702624 8513715 8562698 8644276 8571772 8304321 8258177 8095484 8051345 8118975
2868 8118975 8020416 8058883 7931358 7667392 7646791 7677448 7647991 7505767 7568103 7506175 7262841
2857 7262841 7141907 7083348 7012180 6941953 6887245 6832306 6843589 6627645 6508534 6463740 6398097
2846 6398097 6192032 6225230 6154772 6115715 6085742 6001523 6053602 6138839 6014597 6198222 6217227
2835F217227m2407J98414J4144Q2327M1486j89730p1967J41144K61670J68j38551
2824F513925J33394J07212J5217q9249N444p7079j87909l7728M2163j02292j42888
2813F180210j03145m3089R321Q1506J19102l7161j56886o1504j71937N1092q6889
2802E780620l86249j4738l9066R9034k01544r6939J1382J95980n5513k53155j3293
2791E026519j3809k8062m8995j072l3158J52719k1679j52820j14390R3086O4447
2780D922786r6714k2157K36418J62099q2784k18849j35629J40536j27730R4345
2770D872321L3263j05476K18J7662N2552l9034K3869L4803k15470O256M5189p1348
2758D654805J64360P8929M0307n0770j02285M9064j67022k3276Q2507M2840J00958
$$ plain form
2835 6217227 6174820 6373234 6387378 6469705 6511191 6321461 6249494 6390638 6652308 6652476 6513925
2824 6513925 6647319 6754531 6769748 6680499 6685943 6608864 6420955 6383227 6425390 6323098 6180210
2813 6180210 6077065 6033976 6043297 6124803 6243905 6206744 6049858 5988354 5816417 5867509 5780620
2802 5780620 5394371 5379633 5340567 5439601 5238057 5141118 5152500 5348480 5292967 5039812 5026519
2791 5026519 5012710 4984648 4935653 4934581 4901423 5054142 5032463 4879643 4765253 4858339 4922786
2780 4922786 4826072 4803915 5040333 5202432 5119648 4900799 4765170 4905706 4777976 4872321
2770 4872321 4905584 4800108 4800326 4817988 4870540 4831506 4855375 4890178 4674708 4680964 4726153 4654805
2758 4654805 4819165 4898094 4938401 4887631 4785346 4834410 4667388 4644112 4726619 4769459 4870417
2747D870417j05829Q2848J44855K11903m9292j42321k6659J9979K8080K03451
2737E237432J01455K1860K7941N7815k28028M2162K9700J52439L7622R938M6580
2726E536916K20634O406J06879N9263Q3916p3110p1411J13839R555N1393L56600
2715F400880J5524J6980L30284k4767J6817J05234J86606p5099O2430K32778J10315
2704G377982j34196K1950M9488m6229K53452K01215K73251N86J36606O1455p0186
2693H125374J83046j19993L43460j046P7115J62737K55620r6437Q4075J64361
2683I178312J21803J92028K13099K70106J5685K71884K51545Q083J13967K92905
2673A0929417L34286O6469L24977J84500p4354K16871M50811L41358O0588J83048
$$ plain form
2747 4870417 4764588 4847436 4992291 5204194 5154902 5012581 4985922 5005901 5033981 5237432
2737 5237432 5338887 5360747 5388688 5446503 5218475 5260637 5290337 5442776 5480398 5490336 5536916
2726 5536916 5757550 5763956 5870835 5930098 6014014 5940904 5869493 5983332 5992887 6044280 6400880
2715 6400880 6416404 6433384 6763668 6738901 6755718 6860952 7047558 6972459 7034889 7267667 7377982
2704 7377982 7243786 7265736 7315224 7268995 7522447 7723662 7996913 7997499 8134105 8195560 8125374
2693 8125374 8308420 8188427 8531887 8530841 8607956 8770693 9026313 8929876 9013951 9178312
2683 9178312 9300115 9492143 9705242 9975348 9991033 10262917 10514462 10522545 10636512 10929417
2673 10929417 11263703 11330172 11655149 11839649 11765295 11982166 12432977 12774335 12834923 13017971
2663A3017971J89376L92422L91234J65458M03424L95384N75400L91068K11886
2654A6133623L79926M80052M63240N39120L30721N30502Q58726O64831M23020
2645B0803761O95059P40894N72268P18138P74391R49783J103771J182779J015646
2636B8556490J196474J058116J304542J272763J341997J290159J305785J233700
2628C8560026J165037J248240J249969J073119J360977J144739R26893R12447
2620D7641447J076187J153940J301895J171962Q30375J021441Q23898O73571P35039
2611E6429755M59099K71314K25139J49221M96929M4002K10623J82980J45106L73996
2601E8988164O12302M81199O94083M81052M88070Q90671R67151J037938R49587
$$ plain form
2663 13017971 13207347 13599769 13991003 14156461 14559885 14955269 15530669 15921737 16133623
2654 16133623 16513549 16993601 17456841 17995961 18326682 18857184 19715910 20380741 20803761
2645 20803761 21498820 22239714 22811982 23530120 24304511 25254294 26358065 27540844 28556490
2636 28556490 29752964 30811080 32115622 33388385 34730382 36020541 37326326 38560026
2628 38560026 39725063 40973303 42223272 43296391 44657368 45802107 46729000 47641447
2620 47641447 48717634 49871574 51173469 52345431 53175806 54197247 55021145 55694716 56429755
2611 56429755 56888854 57160168 57385307 57534528 58031457 58075459 58286082 58469062 58614168 58988164
2601 58988164 59600466 60081665 60775748 61256800 61744870 62635541 63602692 64640630 65590217
2592F5590217J070048J346398J296055J729621J785421J937692K171669K327197
2584G9254318K383324K660405L111768L119505L363945L762328L950368M165812
2576A05771773M173595M317777M646718M582456N068465N321618N096827N043942
2568A44023171N195864M926352M846161M729779M768060M693639M886264M602976
2560A82672266M754019M683583M517588M486932M233357M269701M039658L627172
2552B17284276L656883L320153L124612L155447L301001L385928L320365L733746
2544B44282411M046661M533452M683763M824388N103874N333648N472003N633036
2536B83913236N689045O164740O754934P207222Q041906R161516J0564779J1847956
$$ plain form
2592 65590217 66660265 68006663 69302718 71032339 72817760 74755452 76927121 79254318
2584 79254318 81637642 84298047 87409815 90529320 93893265 97655593 101605961 105771773
2576 105771773 109945368 114263145 118909863 123492319 128560784 133882402 138979229 144023171
2568 144023171 149219035 154145387 158991548 163721327 168489387 173183026 178069290 182672266
2560 182672266 187426285 192109868 196627456 201114388 205347745 209617446 213657104 217284276
2552 217284276 220941159 224261312 227385924 230541371 233842372 237228300 240548665 244282411
2544 244282411 248329072 252862524 257546287 262370675 267474549 272808197 278280200 283913236
2536 283913236 289602281 295767021 302521955 309729177 317771083 326932599 337497378 349345334
2528C49345334J2444029J3309982J3849598J3939408J3355246J1812555J0237942
2521D38294094P931153N928829L698809J590253j29911k021719l782903n002971
2513D46505634n925520o187687o424178o545658o621705p461973q515115j0013921
2505C88809877j1558181j3369232j5336461j6903263j7539294j8390462j8685757
2498B77027227j8549945j7939699j6813790j5660450j4128163j2736824j1239453
2491A69958903j0110867q937508p802441o889591o277997n519352m687533m173362
2483A15560252l581699l130754k841462k271617k425223k315065k346492k242951
2475I4404989j948517j757292j777797j385803j061205j146280j022476r54103
$$ plain form
2528 349345334 361789363 375099345 388948943 402888351 416243597 428056152 438294094
2521 438294094 446225247 452154076 455852885 457443138 457313227 455291508 451508605 446505634
2513 446505634 440580114 434392427 427968249 421422591 414800886 407338913 398823798 388809877
2505 388809877 377251696 363882464 348546003 331642740 314103446 295712984 277027227
2498 277027227 258477282 240537583 223723793 208063343 193935180 181198356 169958903
2491 169958903 159848036 150910528 143108087 136218496 129940499 124421147 119733614 115560252
2483 115560252 111978553 108847799 106006337 103734720 101309497 98994432 96647940 94404989
2475 94404989 92456472 90699180 88921383 87535580 86474375 85328095 84305619 83351516
2467H3351516r42674r67337j255301j300381j168359j449627j408087j353312
2459G3506438j696613j846262j680875j773039j948215j927564j703895j709671
2451E9220304j607394j393014j536431j505349j540885j616794j476894j828651
2443D6714892j648797j503333j504953j703611j441068j448592j459451j476827
2435C4528260j274286j207691j316988j396134r09770j013488r86442o96989r64979
2426B4761493r67459p74878n72210n59933n90409n95027n87730m50096m41254
2417A9222497r7275n55309n31980m12546o29470m43686k77113k59376k68650k63382
2407A5483710l69400k40811m72760p9039l00073k84446j11465l19997k10564l06811
$$ plain form
2467 83351516 82408842 81441505 80186204 78885823 77717464 76267837 74859750 73506438
2459 73506438 71809825 69963563 68282688 66509649 64561434 62633870 60929975 59220304
2451 59220304 57612910 56219896 54683465 53178116 51637231 50020437 48543543 46714892
2443 46714892 45066095 43562762 42057809 40354198 38913130 37464538 36005087 34528260
2435 34528260 33253974 32046283 30729295 29333161 28423391 27409903 26423461 25726472 24761493
2426 24761493 23794034 23019156 22446946 21887013 21296604 20701577 20113847 19663751 19222497
2417 19222497 19125222 18569913 18037933 17625387 16995917 16552231 16275118 16015742 15747092 15483710
2407 15483710 15114310 14873499 14400739 14321700 14021627 13737181 13625716 13305719 13095155 12788344
2397A2788344l22489r3556k41366j92336j29890k88378k29402k67832l40032o1990
2387A0621073j96172m8385J07973m11361k1487j05476k35728j84358k95263m2411
2377I188405k36114K7862k43145k19275k85354j47927p2851k01649J40453k33698
2367G716707k48869k00962q1010j48444k66206J2649k2772J42181k46848R7445
2357F753871l5126l60777p3036q7885M805j95690j52740o3442M4278r0654j34847
2346E608757o9383j50436j05344k53469Q1055J63692k19451k56331O44Q9646J5188
2335D904568j63076q6421J9214k04094J14162k19412j47367J28439k9642q3426
2325D232945j42023j35650L4760O9022j91896j89784R4228J25020P8707j27830
$$ plain form
2397 12788344 12465855 12372299 12130933 11938597 11808707 11520329 11290927 11023095 10683063 10621073
2387 10621073 10424901 10376516 10484489 10073128 10051641 9946165 9710437 9526079 9230816 9188405
2377 9188405 8952291 8980153 8737008 8517733 8232379 8084452 8011601 7809952 7950405 7716707
2367 7716707 7467838 7266876 7185866 7037422 6771216 6783865 6761093 6903274 6656426 6753871
2357 6753871 6718745 6357968 6284932 6197047 6201852 6006162 5853422 5789980 5834258 5743604 5608757
2346 5608757 5539374 5388938 5283594 5030125 5111180 5274872 5055421 4799090 4799734 4889380 4904568
2335 4904568 4741492 4655071 4674285 4470191 4584353 4364941 4217574 4346013 4316371 4232945
2325 4232945 4090922 3955272 3990032 4059054 3867158 3677374 3771602 3896622 3975329 3847499
2315C847499r3715L4774j11445J37557L2604k97115j54574l3139k4320J36562
2305C474688K9738k8136j14745j01425J2022k3889j0192j9251j46161p3789O5377
2294C064237j42779l0760N2259O376j37496j77577J53230P981L4519K4995k9396
2283B825589j17923K63842j55698p3873o7630p1760N1542j7289o7135n6829R2632
2272B605468L1694K22192r1525n6403l0125o8764l6604K3479J09637j23137J17828
2261B703740J33931J04613l0338p7098R9450j74894l0457P580J4728n2886m6139
2250B652230k577K30432J36136J39117n0774j20918N9751k9931R2639J83780m02349
2239B887536o9050r6838P9935J62300o8515j11710L32423J0881q1923J1077J27794
$$ plain form
2315 3847499 3753784 3788558 3677113 3814670 3847274 3550159 3395585 3362446 3338126 3474688
2305 3474688 3504426 3476290 3361545 3260120 3272142 3248253 3238061 3218810 3072649 2998860 3064237
2294 3064237 2921458 2890698 2942957 2949333 2811837 2634260 2787490 2795471 2829990 2854985 2825589
2283 2825589 2707666 2971508 2815810 2741937 2674307 2602547 2654089 2636800 2569665 2512836 2605468
2272 2605468 2637162 2859354 2767829 2711426 2681301 2612537 2575933 2599412 2709049 2585912 2703740
2261 2703740 2837671 2942284 2911946 2834848 2934298 2759404 2728947 2736527 2751255 2698369 2652230
2250 2652230 2649653 2880085 3016221 3155338 3104564 2983646 3043397 3013466 3106105 3289885 2887536
2239 2887536 2818486 2721648 2801583 2963883 2895368 2783658 3116081 3126962 3045039 3056116 3183910
2228C183910J07623J73155L1452j69700J62887p1709P7789L1844J14200L4906
2218C676357l3641J15522l8132P0326J62828o5414K35294q5994l19469Q2946p3538
2207C727085M0733J07325j22567q3144L7827M5331j05998P9915k53811j18763
2197C353933J11113p4649m5345j76303j31648R9397J2274j6826k94928j70589
2187B666429Q8642j46465j24842p3705q0157L4214O0113n8049j48873j4842M4555
2176B247020O4590l0164j811k352j78178J2800L2387q5215L2956k15198j5710
2165A861125J7452L0749N8016N5517k1459J70928j09630k00252j16138j64489
2155A581819j45378n4003q4951j0825J07981N7530j99081K05389Q4923j32098
$$ plain form
2228 3183910 3291533 3464688 3496140 3326440 3489327 3417618 3495407 3527251 3641451 3676357
2218 3676357 3642716 3758238 3720106 3790432 3953260 3887846 4123140 4037146 3717677 3800623 3727085
2207 3727085 3767818 3875143 3752576 3669432 3707259 3752590 3646592 3726507 3472696 3353933
2197 3353933 3465046 3390397 3345052 3168749 3037101 3136498 3148772 3131946 2837018 2666429
2187 2666429 2755071 2608606 2483764 2410059 2329902 2364116 2424229 2366180 2217307 2202465 2247020
2176 2247020 2311610 2281446 2279635 2277283 2099105 2111905 2144292 2059077 2092033 1876835 1861125
2165 1861125 1878577 1909326 1967342 2022859 2001400 2172328 2062698 1862446 1746308 1581819
2155 1581819 1436441 1382438 1297487 1286662 1394643 1452173 1253092 1458481 1543404 1411306
2145A411306p7799J9240o3953j35111L6760n137l7915K06636o8897l9987J49862
2134A395005j99241j6234k0980L4487j23737j12493N0951J45139J57397K9246
2124A339540j39141j21515j09727M5994J80300M5265k77014J33083j4455q2161
2114A000169j0166Q8305J00417j08195j24898p0470l5558J86373j76527j33473
2104G15977J26271O4728q3089J56047j3920P4851j05204k18668N1047J46995j70024
2093G45011L7929O8089j65689j37414J16664K36513P1271q3335j11917r5464k5058
2082F56600J81580J47580k1345j50860k24507L4658N6422Q716K26612j35580j59166
2071F20710K15953j82362J1747Q0572j65904O625L6344l8770n0930P1639J54271
$$ plain form
2145 1411306 1333507 1352747 1288794 1153683 1190443 1185306 1147391 1354027 1285130 1245143 1395005
2134 1395005 1195764 1179530 1158550 1193037 1069300 956807 1007758 1152897 1310294 1339540
2124 1339540 1200399 1078884 969157 1015151 1195451 1240716 963702 1096785 1082330 1000169
2114 1000169 990003 1078308 1178725 1070530 945632 875162 839604 1025977 849450 715977
2104 715977 842248 906976 823887 979934 966014 1040865 935661 716993 768040 915035 745011
2093 745011 782940 851029 685340 547926 664590 901103 972374 889039 777122 681658 656600
2082 656600 838180 985760 964415 813555 589048 623706 680128 688844 915456 779876 620710
2071 620710 836663 654301 666048 746620 580716 587341 623685 584915 533985 605624 759895
2060G59895J28575k70334L2105j01427k1747O6459K62289j894j91837k83016J48218
2049E27286O4361o8168K609J9517M4260J6105j0788j29010l2564j1475n6744r6594
2037B68795J03656N3051r4738Q2518J45625R3961N7550q737j41499q0800O4353
2026E43735L1082M9508p4255q8331j208J69382j09583p6171J34092J22860L3268
2015G34379k91986J94355n4665q5598l437j12586L6493N487o1609P0121J33352
2004E64306j57952o5527j1858Q1855K90952o9166j93027j67739J45789J82927
1994F00560j61972L3746r7649n3142j977J52562J29308k15030j7231o1699J96320
1983E03796J3448j55911R2783J15105N6429k12806q5613j03803m6903L1098K06883
$$ plain form
2060 759895 888470 618136 650241 548814 527067 593526 855815 853921 662084 379068 527286
2049 527286 591647 523479 526088 545605 589865 605970 595182 466172 433608 422133 365389 268795
2037 268795 372451 425502 330764 413282 558907 652868 710418 701681 560182 479382 543735
2026 543735 574817 624325 550070 461739 460531 629913 520330 444159 578251 701111 734379
2015 734379 442393 636748 582083 496485 493048 380462 416955 422442 360833 430954 564306
2004 564306 406354 340827 328969 410824 701776 632610 439583 271844 417633 600560
1994 600560 438588 472334 374685 321543 319566 472128 601436 386406 369175 307476 503796
1983 503796 517244 361333 454116 569221 625650 412844 327231 223428 176525 207623 414506
1972D14506o9500j27726P8022P5130r5368p8592K69131J34779L9881j73177j88502
1961B78584J06906o8025k7383J58094k0P4804J1698l1100k26933J8981J21392
1950D16998j69240P8776J79020N8894j22355K7114j17457Q3411R5901j42123j07502
1939B81437j08796M2627K70487R3962p7390M1426K582j38941j46670K5776K9000
1928C15500k00149K7105N6043m8263M7689K08698J86810k46396r9739j06674K7268
1917A67892J58350j85752J57337p306q3335J64642R7586R032k8030o8489J30038
1906E11965q6837j01385N4560j6169r8025J53083L6939q3408N6982M9269q530
1895D68444j06974k73495j9547K54178K01084J5944k47252j28038K30482J28429
$$ plain form
1972 414506 345006 217280 295302 370432 275064 196472 465603 600382 640263 467086 278584
1961 278584 385490 317465 290082 448176 448156 522960 534658 503558 276625 295606 416998
1950 416998 247758 326534 505554 564448 442093 469207 351750 435161 531062 388939 281437
1939 281437 172641 215268 485755 579717 502327 543753 546335 407394 260724 286500 315500
1928 315500 115351 142456 198499 150236 197925 406623 593433 347037 247298 140624 167892
1917 167892 326242 140490 297827 290521 207186 371828 469414 478446 450416 381927 511965
1906 511965 425128 323743 378303 362134 264109 417192 454131 370723 427705 476974 468444
1895 468444 361470 87975 68428 322606 523690 539634 292382 164344 394826 523255
1885E23255j77650R06j4788J92408m6392j41062J75453K3175j03422J60237q443
1874E83677j08475R260r6180Q3690J29830j30226l6387n0776k8177J68693j83809
1863C41120j00945J53409O0033P2702j55330K23248J35688j61073n3363M5131
1853E60620k09002N0829Q603m5757J84925k8689n6681J31364p1956l4321J12619
1842F02554j46969n2624j44160m4589J03546J41834J34690J51023L2601j51311
1832F26595r5752j04062M6152M453R80K29069J17556n7748J26933J0854J5366
1821I20396j38137j83577J76859Q9864j77512M5758J4344p0212N7158Q1186l2763
1810G83364M123P4147n6023O2997q7969J7348o9473O6405L4097l3305j00411R1778
$$ plain form
1885 523255 345605 346511 331723 524131 477739 336677 512130 535305 431883 592120 583677
1874 583677 475202 484462 388282 471972 601802 471576 435189 384413 356236 524929 341120
1863 341120 240175 393584 453617 526319 370989 594237 729925 568852 515489 560620
1853 560620 351618 402447 411050 365293 550218 521529 464848 596212 524256 489935 602554
1842 602554 455585 402961 258801 214212 317758 459592 594282 745305 777906 626595
1832 626595 530843 426781 472933 477386 478366 707435 824991 767243 894176 905030 920396
1821 920396 782259 598682 775541 865405 687893 733651 747995 677783 734941 816127 783364
1810 783364 787487 861634 805611 868608 780639 797987 728514 794919 829016 795711 695300 787078
1798G87078J52639J42043J1605k45531r5037J20155q0899j08991j36881K93724
1788H39905R8330n8067p2812n7149J1616q7772n6960j0769J38724O9009J13706
1777I27761j22632k68797j50836Q9516k4525J78645m1653L7030Q7484j28245M73
1766E84221J63183j07623K48040L3517j8381j00083j6962M3287k97452m4704j95049
1755B91994l1291l3240k140J66491l5007K6753J19187o2310j51386m7947Q9847
1744C30951j9276j64328O9072J38654O3613j18629n0660J02635K1677j9010l313
1733C51386k527m942J24741j7643k09714j48442j76040J32336L88101j66773Q8440
1722C58923o4926j25019J14677N0473k29222N7348Q5190k96776J62641j05286
$$ plain form
1798 787078 939717 1081760 1093365 847834 752797 872952 792053 683062 546181 839905
1788 839905 938235 880168 807356 750207 761823 674051 617091 606322 745046 814055 927761
1777 927761 805129 536332 385496 475012 450487 629132 587479 624509 711993 583748 584221
1766 584221 747404 639781 887821 921338 902957 802874 785912 829199 531747 487043 291994
1755 291994 260703 227463 225323 391814 356807 383560 502747 440437 289051 241104 330951
1744 330951 311675 147347 216419 355073 418686 300057 249397 352032 373709 354699 351386
1733 351386 348859 343917 468658 451015 241301 92859 -83181 49155 437256 270483 358923
1722 358923 293997 168978 283655 334128 104906 162254 247444 -49332 113309 8023
1712H023k9934J32636L3933J13909r4045q6328K06366j22485o1913M628j1163
1701I3627J09501J2407k42577J16233J00340k26310J20932j60468L465K90735
1691B17885M1634J2793j52157j62895Q5113j44921J27096Q3648j98605K4187L20899
1680B54677n3494J53082l5975p0821J09684k89146r6803N8167m4697k5290J05069
1669F4453m9028K40011J5138k7423j05108k94718N203L1790o2623K43565M088
1658F5348k01838J98939O9111l8658m6606m5510j5542L7282j07046l3706R3812
1647b4414K450K34906k698j57529k1498j47764K8902m8537N8611j1056J746j15816
1635b02697J46599J13367L3575M1704J16332k04134j88784J9041K37350N9623
$$ plain form
1712 8023 -21911 110725 144658 258567 164522 78194 284560 162075 100162 104790 93627
1701 93627 203128 215535 -27042 89191 189531 -36779 84153 -76315 -72850 217885
1691 217885 259519 272312 120155 -42740 42373 -102548 24548 108196 -90409 -66222 254677
1680 254677 201183 354265 318290 247469 357153 68007 -28796 29371 -15326 -40616 64453
1669 64453 15425 255436 270574 243151 138043 -156675 -151472 -119682 -182305 61260 65348
1658 65348 -136490 62449 131560 92902 46296 786 -14756 22526 -84520 -118226 -24414
1647 -24414 -21964 212942 210244 52715 31217 -116547 -87645 -136182 -77571 -88627 -86881 -202697
1635 -202697 -56098 57269 90844 132548 248880 44746 -144038 -124997 112353 171976
1625A71976k25157j5182j06509J55536J42848m1022P2868k331m1373j91287j9647
1614i9280K23590P867J21460j54865R6769J61051j88278J5314j01514j97237J54850
1603C9727j7748M3888J85954k84109j35090J77556N034k0854o3247L2154K04312
1592A67577r5949J2552J67545j24105j20303j14964n6253m9j7534J00890J71022
1581I0429j89047r1371J64882j5843q0430J42723l205N3517p7217j07771m1795
1570a55128J50776J39280L05597j5267p9521l0717k04561k5433N1381k06296p664
1559g7553J74259J19827J0548k16499K185q9625j70601L79392l6094k89598K86925
1548I3166K4911m343Q9533j70775J85741O4251n6991K5835k57686l8517O7909
$$ plain form
1625 171976 -53181 -68363 -174872 -19336 123512 82490 155358 153027 111654 -79633 -99280
1614 -99280 124310 132177 253637 98772 195541 356592 168314 183628 82114 -115123 39727
1603 39727 21979 65867 251821 -32288 -167378 10178 15212 -5642 -68889 -36735 167577
1592 167577 71628 84180 251725 127620 7317 -107647 -163900 -163949 -181483 -80593 90429
1581 90429 -98618 -189989 -25107 -40950 -121380 21343 18138 71655 -5562 -113333 -155128
1570 -155128 -4352 134928 440525 425258 345737 315020 110459 85026 136407 -69889 -77553
1559 -77553 96706 216533 227081 10582 12767 -76858 -247459 131933 95839 -193759 93166
1548 93166 118077 113734 203267 32492 218233 282484 225493 251328 -6358 -44875 23034
1537B3034J12764L189P7947j02802j10225J0619p9616Q8288o7230J01024L8795
1526I5787j6822l9347r9277o204J1395k2846j38L19312q3458o5398q715l4373
1514D9916J39406k1181r7079J60227l1939k39488R2971j96530L6576J46971Q4947
1503A24797l4684m3791l5322N163k3818k02112J94000K4944M9000M2907N5656
1492A56740n7109k4780j41299n4251j56038o8722L42449n6760L5250O8602m593
1481C9489l5042J74635J6925j87173j57143L3442J67172l3015J37487k18482n455
1470f7160N3043r778o7911O2409J72755j8675k29261p9276l042r0111L6414J57793
1458h2800J80941P4661j20545j85051k52040K42163K31380p5247J32735R6385
$$ plain form
1537 23034 135798 138987 216934 114132 3907 14526 -65090 23198 -44032 56992 95787
1526 95787 78965 39618 -59659 -65863 -54468 -77314 -77452 241860 158402 93004 84289 49916
1514 49916 189322 168141 71062 231289 199350 -40138 52833 -143697 -107121 39850 124797
1503 124797 90113 46322 11000 16163 -7655 -209767 -15767 9177 58177 101084 156740
1492 156740 99631 74851 -66448 -120699 -276737 -345459 -3010 -59770 -24520 44082 39489
1481 39489 4447 179082 196007 8834 -148309 -114867 52305 19290 156777 -61705 -67160
1470 -67160 -14117 -23895 -91806 -29397 143358 124683 -104578 -183854 -186896 -277007 -240593 -82800
1458 -82800 98141 172802 52257 -132794 -384834 -142671 88709 13462 146197 242582
1448B42582q4042P6608l30047p824Q0015O8554J84944p2425k51513L3674m0039
1437i9513N2976J31685R2648l646o4899j70195j72788L0799L3365J59537q1182
1426i1213L489K54369j26936j62522m2603j37606L02165k8506k056p852k22556
1415b61827l9856L70291j4304j62550N7506j01890p3667J61103j73998Q4294L8485
1404a16413Q6559m730Q4376j23298R164l9396R6068N6953n3445J19463j17430
1393b129j18731K1682Q1872j58648r9754J03286m0645k81481J93484L16315M8203
1382F3454j01904q6346l7986J04529O0164k29284P4413k9941J22671Q6542k62807
1371b36495K37153j04818k48212O0488J15595J04030J31019m8661O3372j18074
$$ plain form
1448 242582 158540 235148 -94899 -102723 -22708 45846 230790 158365 -93148 -59474 -99513
1437 -99513 -46537 85148 177796 174150 109251 -60944 -233732 -202933 -169568 -10031 -91213
1426 -91213 -87724 166645 39709 -122813 -165416 -303022 -857 -29363 -31419 -39271 -261827
1415 -261827 -301683 68608 54304 -108246 -50740 -152630 -226297 -65194 -239192 -154898 -116413
1404 -116413 -29854 -34584 49792 -73506 -64342 -103738 -7670 49283 -4162 115301 -2129
1393 -2129 -120860 -99178 -17306 -175954 -275708 -172422 -213067 -494548 -301064 15251 63454
1382 63454 -38450 -124796 -162782 -58253 1911 -227373 -152960 -182901 -60230 26312 -236495
1371 -236495 658 -104160 -352372 -291884 -176289 -72259 58760 10099 73471 -44603
1361d4603k78258J47320n57J33220J57159K5467p1455j43124o9980j023N3552
1350i2282N9996j07600n6786L611J64754j47145m6085o346J08914J61223O8493
1339A10747j00428r0734J27978J8496M5551m0103j33775q3307j3229k1302J65547
1328a4559o7071Q8359J04699P7417N9338k92548P4525r0600k50694J63499j6127
1317a63762n7087Q1059J84604j01732J15310P4375Q3265j34138j15911n7325j15119
1306b06461Q1951l0015j00218J3105J3723J83799Q3187O4365M4414j0336r27R7811
1294B34398q0338n0235o0563r9782J96655J01692k03776J72410Q6528j52104j20575
1283B4310r2073J9142j09459J87776q6629j5855J78815p5839j7311r9920p8727
$$ plain form
1361 -44603 -322861 -175541 -176098 -42878 114281 139748 68293 -74831 -144811 -145834 -92282
1350 -92282 -32286 -139886 -196672 -193061 -28307 -175452 -221537 -227883 -118969 42254 110747
1339 110747 10319 -80415 47563 66059 111610 71507 -62268 -145575 -158804 -180106 -14559
1328 -14559 -81630 6729 111428 188845 248183 -44365 30160 -60440 -311134 -147635 -163762
1317 -163762 -220849 -139790 44814 -56918 58392 132767 216032 81894 -34017 -91342 -206461
1306 -206461 -124510 -154525 -254743 -241638 -227915 -44116 39071 103436 147850 137514 136587 234398
1294 234398 154060 103825 43262 -56520 140135 241827 38051 210461 296989 144885 24310
1283 24310 -67763 -48621 -158080 29696 -56933 -72788 106027 30188 12877 -87043 -165770
1272a65770O6720j8354R9887j15486L9003L9749J41122L0882n8925K5768j28016
1261d3420k6298r1191k22848J57788J68058L6514K16848j13941j71812J43242
1251E2940l4188J19329J33571m7856o3424Q9159P2682Q2077j7365m1116Q3030
1240D28839j80870J5908l2145r9796k7354l9663j30451P9864Q5112O8214n3388
1229A14270j07428J43181J03498J7195j27005k04187q319K53848q9929j30450
1219c5326n3664j32984J81585o5639m6719P3504J16223K19702J91129k67456o2200
1208A18155o3135j57447J71068J1724l1408j20420r1453J15829K2047O4544J26396
1197A65900j46972k15700J05108J6734Q0577J24506k4584M1J77563j76975j28894
$$ plain form
1272 -165770 -99050 -117404 -17517 -133003 -94000 -54251 86871 117753 58828 84596 -43420
1261 -43420 -69718 -160909 -383757 -225969 -57911 -21397 195451 81510 -90302 52940
1251 52940 18752 138081 271652 223796 160372 249531 322213 404290 386925 345809 428839
1240 428839 247969 263877 231732 131936 104582 64919 -65532 14332 99444 167658 114270
1229 114270 6842 150023 253521 270716 143711 -60476 -68795 185053 95124 -35326
1219 -35326 -88990 -221974 -40389 -106028 -152747 -79243 36980 256682 447811 180355 118155
1208 118155 55020 -102427 68641 80365 48957 -71463 -162916 -47087 -25040 39504 165900
1197 165900 18928 -196772 -91664 -74930 5647 130153 105569 105610 283173 106198 -22696
1186b2696J93720j00785j17131j52029n0507K26602J59375j55973R8164K6433
1176A05173n8711K09816j21245L2709L2985j59317J17900J58Q7170k6925K2856
1165B42569j7033k62180j96000K05185L5827j71963J88315J38843p2549q0946
1155A0068N8153L3108M2407Q7397j28593P8334K7602k5854l3096o398l1485j1343
1143A00300j55520J45162J26972J8148j88569O6459j2714j65113R8974K9572J08530
1132A72201R0680K0865O1232K7982k14167j14662P8100R6776o1963n420l5709
1121A15915P7178K75156o8274o9970j91869o9378N4804K0081J39375K93492L487
1110E79997j28044O240m027J32004N372r099J0756j13139j72623J0873J6448J88608
$$ plain form
1186 -22696 171024 70239 -46892 -198921 -249428 -22826 136549 -19424 78740 105173
1176 105173 46462 256278 135033 167742 200727 41410 159310 159468 246638 219713 242569
1165 242569 225536 -36644 -232644 -27459 8368 -163595 24720 163563 91014 10068
1155 10068 68221 101329 143736 231133 102540 180874 208476 182622 149526 143128 111643 100300
1143 100300 -55220 89942 216914 235062 46493 112952 100238 -64875 34099 63671 172201
1132 172201 262881 283746 344978 372960 158793 44131 122231 219007 157044 151624 115915
1121 115915 193093 468249 399975 330005 138136 68758 123562 143643 283018 576510 579997
1110 579997 451953 458193 454166 586170 591542 582443 593199 480060 307437 318310 334758 523366
1098E23366P7099k12965L4790Q6049j24271J42250k40606R1080K41815j99593
1088D19014m9670M2633k28397N1134R9689J4236j7399L6416N491M7573j58044
1077B62676j47239J67906k13552P9048J90466r8406J69923J00670r446J89948
1067F91994p8472k09531n3319m0923O4307L6533j2816J98831p0858M7040O5974
1056F38760n3182J34104J7393o7761p9274J69966J05150J08330j47716p8320J15507
1045H62957j12900K3505L3131j55166J93655k6961j186K14964j17465L812N7752
1034I76098k4182J27740l985O996O0392j74208J29347K60578j95602m280K33072
1023A391966j56061N4936J46868L392N4932Q059m5596k9478j05035O21K07264
$$ plain form
1098 523366 600465 387500 422290 508339 384068 526318 285712 376792 618607 419014
1088 419014 369344 411977 183580 234714 334403 348639 331240 367656 373147 420720 262676
1077 262676 115437 283343 69791 148839 339305 240899 410822 511492 502046 691994
1067 691994 613522 403991 350672 309749 374056 410589 397773 596604 525746 572786 638760
1056 638760 585578 719682 737075 669314 590040 760006 865156 973486 825770 747450 862957
1045 862957 750057 773562 806693 651527 845182 818221 817035 1031999 914534 918346 976098
1034 976098 951916 1079656 1075671 1082667 1143059 968851 1098198 1358776 1163174 1158894 1391966
1023 1391966 1235905 1290841 1437709 1441101 1496033 1504092 1458496 1429018 1323983 1324604 1531868
1012A531868J22278J43482J19062j8806p4902j18277J21614P6184j32035J03295
1002A873763K49246L19405O7061O1700J99237J41452j17728j21515K46158J32108
992C050887K04382K76439J89132J74331K55029K66395K76636J87928O1256J76468
982E118883M70731L67828L60024L16178N69693O66576K14995O07669O55693O66976
972A0015246P33379O15769J062305R07261J165103J674447J948145K523965L371393
963B4017013M190481M666309M690105M767453L738647J317579l667246p408663
955C6311678p134715n701135m029384l050538k520406j695819j347859r21282
947I910540n74369n19346m29191l22634l53107l70730m95060o56464l74305o90003
$$ plain form
1012 1531868 1654146 1797628 1916690 1897884 1822982 1704705 1826319 1902503 1770468 1873763
1002 1873763 2123009 2442414 2509475 2571175 2770412 2911864 2794136 2672621 2918779 3050887
992 3050887 3255269 3531708 3720840 3895171 4150200 4416595 4693231 4881159 4942415 5118883
982 5118883 5589614 5957442 6317466 6633644 7203337 7869913 8084908 8692577 9348270 10015246
972 10015246 10748625 11364394 12426699 13333960 14499063 16173510 18121655 20645620 24017013
963 24017013 28207494 32873803 37563908 42331361 46070008 47387587 43720341 36311678
955 36311678 29176963 23475828 19446444 16395906 13875500 12179681 10831822 9910540
947 9910540 9336171 8816825 8387634 8065000 7711893 7341163 6846103 6189639 5815334 5125331
937E125331m57086k52518m8401k80891n4813l43217j52732n9246j95113J0662
927C291976k06395j19128j19226j03627k3355k51291j58261N4888k58154k51233
917A856194n1410j22561L4331K46615j73176P2683n0473j25591j38659k35797
907A312156n6011L168j46011J93639K62637P3090j76626p6745j04498j74844j42598
896I67357r9644j50544j33692J76495K3734J58474K9000m9394n7957Q993O9303
885I42125j13434p5956k0264J58338j36747n9522J01192j86018m3340j25791k8094
874D12489J57408J57054p5424J5499L757q9954R0215q9476r6251J7143R2306j6222
862E78544l5812r1118L0306J90991k95706r1134O791l4344N5685J37047J69395
$$ plain form
937 5125331 4668245 4415727 4367326 4086435 4031622 3688405 3535673 3476427 3281314 3291976
927 3291976 3085581 2966453 2847227 2743600 2720245 2468954 2310693 2365581 2107427 1856194
917 1856194 1804784 1682223 1716554 1963169 1789993 1862676 1812203 1686612 1547953 1312156
907 1312156 1256145 1259313 1113302 1306941 1569578 1642668 1466042 1389297 1284799 1109955 967357
896 967357 867713 717169 583477 759972 783706 942180 971180 921786 863829 872822 942125
885 942125 828691 752735 732471 890809 754062 694540 795732 609714 566374 440583 412489
874 412489 569897 726951 651527 667026 670783 580829 671044 581568 485317 502460 594766 578544
862 578544 542732 451614 481920 672911 377205 286071 292862 258518 314203 451250 620645
851F20645N1523k57161r2150l675J2785J43157N6180k3244R333Q7768L1642l72359
839B64444k73736L6172J15694R6500J22126j9751j59821J32430k9146m6078k2971
828B15863q4697l0555J53820P5407M0433N8036j07058J1284m1146k41870L3985
817H3502P1118m079J6443J01482m8384j29434O3415n9592J8799j3727l2930M6968
805A13581J64245J12798o0188K1396L2914k44328k05580J04020P1784R0393k50978
794d9943r066K77141j18959J8124o2848O8443j5128j17723j18076K37412J08512
783B17889O7986J40794k95024J19005j4928r5651k37533m6440P9357J24246m7668
772A2033J30292P2850n0150L0005j72272m043K01815j16731j15974R8922q4873
$$ plain form
851 620645 672168 415007 322857 319182 331967 475124 531304 508060 517393 605161 636803 264444
839 264444 -9292 26880 142574 239074 361200 341449 181628 314058 284912 238834 215863
828 215863 131166 100611 254431 329838 370271 428307 321249 332533 291387 49517 83502
817 83502 154620 150541 166984 268466 220082 90648 154063 94471 113270 99543 66613 113581
805 113581 277826 390624 330436 351832 384746 140418 -65162 38858 110642 201035 -49943
794 -49943 -59009 218132 99173 117297 54449 122892 107764 -9959 -128035 109377 217889
783 217889 285875 426669 131645 250650 235722 140071 -97462 -143902 -64545 59701 12033
772 12033 142325 215175 165025 195030 22758 18715 220530 103799 -12175 86747 1874
761A874J34315n3688k99114N3111J47074R7463J30559L3365K6623j93287k43341
750a65046J31J69623j81928n7805K13316P2582q537O8423J27966k0933l03181
739h5389j57359p8609M4780K53164R1317Q5318J50862J71132j54829k72822j90646
728a43081K6964L8650j2545J09609K08199m5906l6396l0157o691j22632j51045
717a65031m5053n0968o6915J14470L35971J26986j23447m7851L312J9204j07500
706f822O747N279j57443N7807j30234J1077J64479Q2633j4931L7654j32921n5261
694a31936J50547p8513j54800J65868J22665P0441j83938N3982m3774n4555R1202
683G189O6926n7313r1075l0049j82814n3061o6690K46018J88092m7035K09016
$$ plain form
761 1874 136189 82501 -216613 -163502 -16428 81035 211594 244959 271582 78295 -165046
750 -165046 -164915 4708 -177220 -235025 -21709 50873 42336 110759 238725 217792 -85389
739 -85389 -242748 -321357 -276577 -23413 67904 153222 304084 475216 320387 47565 -143081
728 -143081 -116117 -77467 -90012 19597 227796 181890 145494 115337 108646 -13986 -165031
717 -165031 -210084 -261052 -327967 -213497 122474 249460 126013 78162 81474 100678 -6822
706 -6822 -75 5204 -152239 -94432 -224666 -213589 -49110 33523 18592 56246 -76675 -131936
694 -131936 18611 -59902 -214702 -48834 73831 144272 -39666 14316 -29458 -84013 7189
683 7189 74115 16802 -74273 -104322 -287136 -340197 -406887 -160869 27223 -19812 189204
672A89204J23140k3711j08706k3733j97793M5748J08310j24959J26563n7976j3694
661D2393k7187j83358j43397L9336K36422K02453k25386o0800K4666O2645r1337
650a23550k9916j33420J70573J28690M7455M1811j41581N4976k8847M6488j16741
639h4062K4393p9695K7313N0550O1837J29521m3540k0370k7049j54673n2874M8531
627a20118m3402K17251N5379j57792O7500j24457J61777Q0178j87525p80K18589
616A66600j65910O1171P857o8734k1965j25588J11935l8782o1807K4317o8447
605a79353L1210J06066J84035N9334l1972o4135j55715j22021k43977K8324O4584
594c23620j4150J77043J31024M6714J57086j06896j49668j58881J49877K9394
$$ plain form
672 189204 312344 288633 179927 156194 -41599 4149 112459 -12500 114063 56087 42393
661 42393 15206 -168152 -311549 -272213 -35791 166662 -58724 -119524 -94858 -32213 -123550
650 -123550 -153466 -286886 -116313 12377 59832 101643 -39938 15038 -13809 32679 -84062
639 -84062 -59669 -139364 -112051 -61501 336 129857 86317 65947 38898 -115775 -168649 -120118
627 -120118 -163520 53731 109110 -48682 18818 -105639 56138 136316 -51209 -51989 166600
616 166600 690 61861 69718 984 -20981 -146569 -34634 -73416 -135223 -110906 -179353
605 -179353 -148143 -42077 141958 201292 169320 105185 -50530 -172551 -416528 -388204 -323620
594 -323620 -337770 -160727 -29703 17011 174097 67201 -82467 -241348 -91471 -62077
584f2077L4954J62167J1254k31349K13340M2731k62831j67329J42670K22674j07193
573i89N8110m5231m696M412r5164J92451Q0053Q1265O9774j49872j62136k5484
561B493l20427J36290K07100k11640m1120J6159j7845m7828o7964J1808n3001
550c85975J31375J0305K5274L3731L34811J42081l33032j54915l4734J9101q1805
539b93783J09802J39701J02125J04338K5002j66580q3515j2177o0643m8447L9471
528a44706q3869J47050q190K02011Q8879Q7353k35854j25946l0356J36002o7687
517c5313k08412J96741J42593J02096k05385j58859J16702o4321j57056j63484
507d34698J26703J57942K61164J06259p985j30281k47972J068o431n490J87670
$$ plain form
584 -62077 -27123 135044 146298 -85051 128289 171020 -91811 -259140 -116470 106204 -989
573 -989 57121 11890 7194 11606 -83558 108893 188946 270211 339985 190113 27977 2493
561 2493 -317934 -181644 25456 -186184 -227304 -211145 -228990 -276818 -344782 -332974 -385975
550 -385975 -254600 -244295 -219021 -185290 149521 291602 -41430 -196345 -231079 -211978 -293783
539 -293783 -183981 -44280 57845 162183 187185 20605 -62910 -75087 -135730 -184177 -144706
528 -144706 -228575 -81525 -89715 112296 201175 288528 52674 -73272 -103628 32374 -35313
517 -35313 -243725 -46984 95609 197705 -7680 -166539 -49837 -114158 -271214 -434698
507 -434698 -307995 -150053 111111 217370 209385 79104 -168868 -167800 -174231 -179721 7949
496G949O8006j42585R596r2510m3404J22312J3768m6912N3162K06552o620k97857
484a48543o9813M6343O8782k249l5686J32334J54517J2337k37222j14799o6846
473b60845k8803M6543j1746J35169J61489m4587L3229k1280j06930J14107j51750
462a35404J2938k6934j20918N8000P4632L27949j6960j41629j09432P6998J20986
451A20226J6325j12181k18861K70943m4566P5500J39919n9419l50911m6994J81969
440b8050K27849k50228p9393j19395J07345J9356j31410o4569m3884J18971J73369
429g0039N0799j70915Q3299n6618J5475p0847j4193J03772n404J14373M4594j63212
417a38916M0580K30970p8215k63536J23038j71269j06131K6355K85541J81586
$$ plain form
496 7949 75955 -66630 -57034 -149544 -192948 -70636 -56868 -103780 -50618 155934 149314 -148543
484 -148543 -218356 -172013 -103231 -105480 -141166 -8832 145685 158022 -79200 -193999 -260845
473 -260845 -289648 -243105 -254851 -119682 41807 -2780 30449 9169 -97761 16346 -135404
462 -135404 -122466 -149400 -270318 -212318 -137686 190263 173303 31674 -77758 -760 120226
451 120226 136551 24370 -194491 76452 31886 107386 247305 187886 -163025 -210019 -28050
440 -28050 199799 -50429 -129822 -249217 -141872 -122516 -253926 -318495 -362379 -243408 -70039
429 -70039 -19240 -190155 -106856 -163474 -147999 -218846 -233039 -129267 -134671 -20298 24296 -138916
417 -138916 -98336 132634 54419 -209117 -86079 -257348 -363479 -337124 -51583 130003
407A30003o6061q6658p9057q4680n0621j0618J33509K072j19785J25699P849J00663
395B315J8381k35713j3297J5005m2234K9373O7011M787n2575p1424J75714J61038
383E8381L2295j13074o9692n3464j59632Q8405J37260n7487k9758l0830J12045
372h5551N0366j17765j8699k7617M1442L5899k1246J22376j04722l2139M6334
361a11322k45152J71388j10614J19695P9885o9622K2599J27205j71621o0482K61571
350A3530J09086k1122j05307j02279m2699J10174r8036r7689j93431J05660J68232
339a53881r8767O3437K60228j15372j58717N3481q2730q950n8119o6362K8271
328c37481J19888Q1353K2501J24004N2513q8682k8291m0061P1528n6684j14602
$$ plain form
407 130003 63942 -22716 -101773 -186453 -237074 -247692 -114183 -112111 -231896 -106197 -98348 2315
395 2315 20696 -215017 -228314 -213309 -255543 -226170 -159159 -154372 -206947 -278371 -102657 58381
383 58381 90676 -22398 -92090 -145554 -305186 -216781 -79521 -137008 -166766 -197596 -85551
372 -85551 -35185 -152950 -171649 -199266 -157824 -121925 -143171 -20795 -125517 -157656 -111322
361 -111322 -356474 -185086 -295700 -176005 -96120 -165742 -143143 -15938 -187559 -248041 13530
350 13530 122616 101494 -3813 -106092 -148791 -38617 -136653 -234342 -427773 -322113 -153881
339 -153881 -252648 -189211 71017 -44355 -203072 -149591 -232321 -241271 -299390 -365752 -337481
328 -337481 -217593 -136240 -113739 10265 62778 -25904 -54195 -94256 -22728 -79412 -194014
317a94014M7791j35150j5132Q7697J02648N2352j48145N8802J07838j468j56688
306a93469j05903J04987J07645k6249L7863m5471j36893r8455J42003L1963P4332
295a07647J55831j87548K1010j0618j15536l5924J0764L8238J87321j31386M6264
284a29231P5676O80j09279j07200j7880M5764M2773J48118p8578L6840Q3186j22073
272a31204M7088j2431L3444O0681o2051r7975j83393L4899J31939P5481R6582
261f940j22514o4303j86627J30046k9155n7574L3290j42372R2130L69239j44011
250a28791J4300J72595j29196j20621r6510O5233M7631N7857k3547J9263N2187
239f9599r3M382j06856O8067J20553l59186P9657n647N1368p7178N685L855L21642
$$ plain form
317 -194014 -146223 -281373 -296505 -208808 -106160 -53808 -201953 -143151 -35313 -36781 -193469
306 -193469 -299372 -194385 -86740 -112989 -75126 -120597 -257490 -355945 -213942 -181979 -107647
295 -107647 48184 -139364 -118354 -128972 -244508 -280432 -269668 -231430 -44109 -175495 -129231
284 -129231 -53555 -52875 -162154 -269354 -287234 -241470 -198697 -50579 -129157 -92317 -9131 -131204
272 -131204 -84116 -96547 -63103 -2422 -64473 -162448 -345841 -310942 -179003 -103522 -6940
261 -6940 -129454 -193757 -380384 -250338 -279493 -337067 -303777 -446149 -354019 15220 -128791
250 -128791 -114491 58104 -71092 -191713 -288223 -222990 -175359 -117502 -141049 -121786 -69599
239 -69599 -69692 -65310 -172166 -104099 16454 -342732 -263075 -268722 -217354 -294532 -288847 -284992 36650
226C6650n0219l39938q1475K49885K34433k12058j75763j3191J03277r1469j420
215c41288N8158J53301J19691l7344Q5809K4192k95058k1660k1019L4726N7637
204a82855P3786n6984N3296L9742o9697n3978P2047j67880J5053O205M3146j22089
192c50208M5697P2476j40341M2406p7781P8384J30774K394K0317k8709p6198N9122
180b21667n3802J76993O5565j18205J73618j95091j1795P9875O4566l3373r1851
169a65167j86519O8410Q7835Q5776N2301j51204l4860p9337j77327J30021K55073
158a14998j3782k2895J8688p1863l467P806j5210J0880L0538O5312M5520n3046
146a16517k9329L0671o657n9636l1788J54461p9234j72321M3851L3194L5391p9665
$$ plain form
226 36650 -13569 -353507 -434982 -185097 49336 -162722 -338485 -351676 -248399 -339868 -341288
215 -341288 -283130 -129829 -10138 -47482 38327 62519 -232539 -254199 -275218 -240492 -182855
204 -182855 -109069 -166053 -112757 -73015 -142712 -196690 -124643 -292523 -277470 -271265 -228119 -350208
192 -350208 -304511 -232035 -372376 -329970 -407751 -329367 -198593 -196199 -175882 -204591 -280789 -221667
180 -221667 -275469 -98476 -32911 -151116 22502 -172589 -184384 -104509 -39943 -73316 -165167
169 -165167 -351686 -283276 -195441 -109665 -57364 -208568 -243428 -322765 -500092 -370071 -114998
158 -114998 -128780 -151675 -132987 -204850 -208317 -200511 -215721 -204841 -174303 -108991 -63471 -116517
146 -116517 -145846 -115175 -121832 -181468 -213256 -58795 -138029 -310350 -266499 -233305 -197914 -277579
134b77579Q3750J01013k40647r925j50683J48313P7852M1610j40314L6739J37021
123a92850k9118J19217j7495j05053j25092J42173q4402l8402J38938N570J548
112a84966j76605q3890J92920Q2947k58012K04376J55625L3342j36424l4571j27010
101c32268M7363r8423j68284J45854J34335R3680P0454p2079P9697j32484o5012
90b97167P5631j29091o0301l5473J29454J16954o9232O1873J55129n9673p5008
79a86904P362o0771k2464K487m90j06786K3317J25602n8400J19740p2925K4773
67b05459n0253k5557P2268L3070J9338p447O2875m306k47095O7422j39358J60792
55b63710J30606M788K4614j15232L3018o0034q8781k5901J25925J4824o0152M1579
$$ plain form
134 -277579 -193829 -92816 -333463 -343388 -494071 -345758 -267906 -226296 -366610 -329871 -192850
123 -192850 -221968 -102751 -120246 -225299 -350391 -208218 -292620 -331022 -192084 -186514 -184966
112 -184966 -361571 -445461 -252541 -169594 -427606 -223230 -67605 -34263 -170687 -205258 -332268
101 -332268 -284905 -383328 -551612 -405758 -271423 -177743 -107289 -179368 -99671 -232155 -297167
90 -297167 -221536 -350627 -410928 -446401 -316947 -199993 -269225 -207352 -52223 -111896 -186904
79 -186904 -179542 -240313 -262777 -260290 -260780 -367566 -344249 -218647 -277047 -157307 -230232 -205459
67 -205459 -255712 -281269 -209001 -175931 -156593 -164040 -101165 -105471 -352566 -285144 -424502 -263710
55 -263710 -133104 -128316 -103702 -218934 -185916 -245950 -334731 -360632 -234707 -219883 -280035 -238456
43b38456N3835N0333m4051m903q8888l8229l8866j6163m673N2815M366K8589P7482
30b06809j3446j0230J4396j6237R858j13472K926J25623M988L2310J4766J1386
18a43941o2836p6137J3962J9454Q2295P720j57132M5942J64371j30598j00549
7c37449P7514K2259R392j44012p0126q245K0991
0d29676
$$ plain form
43 -238456 -184621 -134288 -178339 -183242 -272130 -310359 -349225 -365388 -370061 -317246 -312880 -284291 -206809
30 -206809 -220255 -230485 -216089 -232326 -222468 -335940 -333014 -207391 -202403 -170093 -155327 -143941
18 -143941 -206777 -282914 -268952 -249498 -167203 -159483 -316615 -270673 -106302 -236900 -337449
7 -337449 -259935 -237676 -228284 -372296 -442422 -450667 -429676
0 -429676
$$ Imaginary data points
##PAGE= N=2
##DATA TABLE= (X++(I..I)), XYDATA
16383b676321K0394L3386p8021R9977j8129r6012K8508J6305Q5442k7668R4872
16372b517267O9275K27284p0244k00292J80758J21050j05261n872k2719J1795
16362b311493J74575j24282R7060O5372J82290k6781j48846M1310M1348K35193
16352a774254l2265M5829L7475O324k5165L4135m4058J5212L7949N1413L6119
16341a611286J68320J18455n9462j38906k0351K5164M3269J80051K1237j2926
16331a286435l47M0666J16243j6853K5666l9914L0398p3471J925K04008J6080
16320i82034q1454J04374O5325K3455q152q1632o9288P0501O5910J64979J02024
16309f25992M646j5777j70622k4426k0357P7576J52918O3104M1362O2353j58810
$$ plain form
16383 -2676321 -2655927 -2622541 -2700562 -2600585 -2618714 -2714726 -2686218 -2669913 -2584471 -2612139 -2517267
16372 -2517267 -2447992 -2220708 -2290952 -2491244 -2310486 -2189436 -2294697 -2300569 -2323288 -2311493
16362 -2311493 -2136918 -2261200 -2164140 -2098768 -1916478 -1943259 -2092105 -2050795 -2009447 -1774254
16352 -1774254 -1806519 -1760690 -1723215 -1716891 -1742056 -1707921 -1751979 -1736767 -1698818 -1647405 -1611286
16341 -1611286 -1442966 -1324511 -1383973 -1522879 -1543230 -1518066 -1474797 -1294746 -1273509 -1286435
16331 -1286435 -1286782 -1246116 -1129873 -1146726 -1121060 -1160974 -1130576 -1204047 -1202122 -998114 -982034
16320 -982034 -1063488 -959114 -893789 -870334 -878486 -960118 -1029406 -958905 -892995 -728016 -625992
16309 -625992 -621346 -637123 -807745 -832171 -852528 -774952 -622034 -558930 -517568 -455215 -614025
16298f14025K1572P5328J38055p0196r2860J33546O9803j14114K0150J79371J661
16287b51709m0201k02871O4560L20354o5752j00786J15098j6650K7728j0609q5619
16276b46457o1980J63774J48608m5009Q0013P896L0242o7971o0604k4997j6264
16265i2749J68055r670r2316N0874J51967L5595M9407p994Q544J24447r6002J25418
16253D15576Q6437p6212k6030j6983l3964J70146L4593r9283q8261l9245N0001
16242C76775Q7336r121P3527J72263N9271l69k74539n1878N5200J13052K14442
16231H15959J6005J38879q1550j23176q79P4088l0308J56874j36708Q810J62957
16220A000951m6279m70j03680j29951Q4513J32632n6254q9175L06860O9647j42380
$$ plain form
16298 -614025 -592453 -517125 -379070 -449266 -542126 -408580 -338777 -452891 -432741 -253370 -251709
16287 -251709 -291910 -494781 -430221 -109867 -175619 -276405 -161307 -177957 -150229 -160838 -246457
16276 -246457 -308437 -144663 3945 -41064 38949 46845 77087 9116 -51488 -76485 -92749
16265 -92749 75306 65636 -26680 24194 176161 211756 261163 253169 261713 386160 290158 415576
16253 415576 502013 425801 399771 382788 348824 518970 553563 454280 366019 326774 376775
16242 376775 464111 454990 528517 700780 760051 759682 485143 433265 488465 601517 815959
16231 815959 831964 970843 889293 766117 765238 839326 809018 965892 829184 837994 1000951
16220 1000951 954672 954202 850522 720571 805084 937716 881462 792287 1099147 1168794 1026414
16209A026414Q2430j26937R8361J9579j14448k9177K46039j18436j62893J69385
16199A090317K54779j32162j53768j15914J27883J52971P2858k54590j683J17929
16189A158620r6736J79147j546k21136K6210J14732L5092O8872j40183j26501
16179I96571J47787M0259K64621N2438k40536K39515P4371j41627N5842j65755
16169A323486j04471L9145N8534J7411o3852J5513J47438M4742j03269R731j98840
16158A185568K2666k6945r3482L48064J07534r9779J4071m3660R5315l0955p335
16147A471062j15539j40549J14097J24752J28263J5195P7920k3359L435q0356
16137A574921k40530J68662L4434r6769M8705J45997J7113J39526j33422o0402
$$ plain form
16209 1026414 1108844 981907 1080268 1099847 985399 956222 1202261 1083825 920932 1090317
16199 1090317 1345096 1212934 1059166 943252 1071135 1224106 1296964 1042374 1040691 1158620
16189 1158620 1061884 1241031 1239485 1018349 1044559 1159291 1194383 1263255 1123072 996571
16179 996571 1144358 1184617 1449238 1501676 1261140 1500655 1575026 1433399 1489241 1323486
16169 1323486 1219015 1258160 1316694 1334105 1270253 1285766 1433204 1477946 1374677 1384408 1185568
16158 1185568 1208234 1181289 1087807 1435871 1543405 1443626 1457697 1414037 1509352 1478397 1471062
16147 1471062 1355523 1214974 1329071 1453823 1582086 1597281 1675201 1651842 1655277 1574921
16137 1574921 1334391 1503053 1537487 1440718 1489423 1635420 1652533 1792059 1658637 1598235
16127A598235j15436j80980J17126R44J46335O0465j50646J39996j59846m0000
16117A416193J09393n3792p5145m1013K12286K8613J56299p8187k6865j10038
16107A537744K6848j05579j54700J26687K04584K04391k3258O6374n6257R945
16097A836779q7474q7508n0166q0556j65527N7422J32093J92617l4043k3889O2066
16086A751814L2085j21178q05k142j4884J07033l7847j42861Q3462K1510k99209
16075A376978J61597J17282N7165K1559J01348r4999j65176Q042n3555j78640
16065A351601P7655P2843J73973L7477J55077p9171m080j39976q0033M551M2723
16054A612640J05295Q4639n3679p3993Q9050r120j46105m4383K63944J7445M8749
$$ plain form
16127 1598235 1482799 1301819 1418945 1419889 1566224 1626689 1476043 1616039 1456193 1416193
16117 1416193 1525586 1471794 1396649 1355636 1567922 1596535 1752834 1674647 1647782 1537744
16107 1537744 1564592 1459013 1304313 1431000 1635584 1839975 1816717 1883091 1826834 1836779
16097 1836779 1749305 1661797 1611631 1531075 1365548 1422970 1555063 1747680 1713637 1689748 1751814
16086 1751814 1783899 1662721 1661916 1659774 1644890 1751923 1714076 1571215 1654677 1676187 1376978
16075 1376978 1538575 1655857 1713022 1734581 1835929 1740930 1575754 1583796 1530241 1351601
16065 1351601 1429256 1502099 1676072 1713549 1868626 1789455 1785375 1645399 1565366 1569917 1612640
16054 1612640 1717935 1802574 1748895 1674902 1763952 1754832 1608727 1564344 1828288 1845733 1894482
16043A894482j40606m9762r7404q8996K13971O5083j69078p6916K0824K03699
16033A775297N0127j70220Q4861J8220j57161P5174j96631P2133n1404R270L2593
16022A542259J72251o5994J22857J25443k19577N1122j4841K0577J46692o8220
16012A812569j34077n6706K4712J66925k47097K6252J43261q5566N064J27597
16002A782934j61784J8018J4285n0137J10810k14566n0973K407J03502K10803
15992A765299l8554n6292M7383r2303o2192K08064O4208j99089p0401K53744j3392
15981A806475R9550j08351l9955m0409j60294M7153J77320M5102K02407q5301
15971A943697J40194j17276k47395Q2707j05414P7107O6322L4283j36285k0936
$$ plain form
16043 1894482 1753876 1704114 1606710 1517714 1731685 1796768 1627690 1550774 1571598 1775297
16033 1775297 1825424 1655204 1740065 1758285 1601124 1676298 1479667 1551800 1500396 1509666 1542259
16022 1542259 1714510 1648516 1771373 1896816 1677239 1728361 1713520 1734097 1880789 1812569
16012 1812569 1678492 1621786 1646498 1813423 1566326 1592578 1735839 1650273 1655337 1782934
16002 1782934 1621150 1639168 1653453 1603316 1714126 1499560 1448587 1450994 1554496 1765299
15992 1765299 1726745 1670453 1717836 1625533 1563341 1771405 1835613 1636524 1566123 1819867 1806475
15981 1806475 1906025 1797674 1757719 1717310 1557016 1604169 1781489 1826591 2028998 1943697
15971 1943697 2083891 1966615 1719220 1801927 1696513 1773620 1839942 1874225 1737940 1717004
15961A717004r0473k0107J19963N6687k22324j81649P7924J73187K4570M7978
15951A702760q3482N4517l3636J30742j30945J29915O4092j23131J51516K0849
15941A883197O6709R104l29300j01641Q5551n1695J80547k7144J128J19135o1343
15930A774248m4676l0593j67342J49099J45443K9616l4741j19733o7236M0299
15920A674384K248J34712m7741j81388J93866M9803m2596Q5808m0395j46823J66532
15909A848410j69151R884Q1860k9771l0019L9801n5965k2832k097p0563J18869
15898A718426K6924P1742k0819J33211n7520j4875R0572k6763p5301j27984J4352
15887A731965J5758P9874k1023j00884J46460j48871N922J00409j40760j94999
$$ plain form
15961 1717004 1626531 1606424 1726387 1783074 1560750 1379101 1457025 1630212 1654782 1702760
15951 1702760 1619278 1673795 1640159 1770901 1639956 1769871 1833963 1710832 1862348 1883197
15941 1883197 1949906 1959010 1629710 1528069 1613620 1561925 1742472 1715328 1716456 1835591 1774248
15930 1774248 1729572 1698979 1531637 1680736 1826179 1855795 1821054 1701321 1634085 1674384
15920 1674384 1676632 1811344 1763603 1582215 1776081 1825884 1783288 1869096 1828701 1681878 1848410
15909 1848410 1679259 1689143 1771003 1741232 1711213 1751014 1695049 1672217 1670120 1599557 1718426
15898 1718426 1745350 1817092 1796273 1929484 1871964 1857089 1947661 1920898 1845597 1717613 1731965
15887 1731965 1747723 1827597 1806574 1705690 1852150 1703279 1709201 1809610 1668850 1473851
15877A473851K18788R7819J64353k9107O9336j25752k30037j48683J00905L1794
15867A623267j8896k2462q2992K64915o58J22492K7484n5523j62879m2045P1879
15856A724582q7877Q2633J30429r2484K933N517R4359O0J7084j82957Q6095M0766
15844A821140j55317O8347N8082Q897o8397L195p5232J12750K3849J26575o3569
15833A860320j89008J18987K40090j42009k30753n3356q2659J82655J01871j30354
15823A675784k33654j33885J97809Q2612K4358J87143R4237j9848j06983Q5979
$$ plain form
15877 1473851 1692639 1790458 1954811 1925704 1995040 1869288 1639251 1490568 1591473 1623267
15867 1623267 1604371 1581909 1498917 1763832 1763174 1885666 1913150 1857627 1694748 1652703 1724582
15856 1724582 1636705 1719338 1849767 1757283 1760216 1765733 1860092 1860152 1877236 1694279 1780374 1821140
15844 1821140 1665823 1734170 1792252 1801149 1732752 1735947 1660715 1773465 1797314 1923889 1860320
15833 1860320 1671312 1790299 2030389 1888380 1657627 1604271 1521612 1704267 1806138 1675784
15823 1675784 1442130 1308245 1506054 1588666 1613024 1800167 1894404 1874556 1767573 1853552
$$ [...]
##END NTUPLES=NMR SPECTRUM
##END=
