##TITLE=1H_CA-8835-4
 CDCl3, 8 sc, 
 6.07.2021
##JCAMPDX= 6.0         $$ Bruker NMR JCAMP-DX V2.0
##DATA TYPE= NMR SPECTRUM
##DATA CLASS= NTUPLES
##ORIGIN= UXNMR, Bruker Analytische Messtechnik GmbH
##OWNER= root
$$ XWIN-NMR		Version 3.5
$$ Tue Jul  6 09:52:16 2021 Russian Standard Time (UT+4h)  she@DPX200
##.OBSERVE FREQUENCY= 200.131506
##.OBSERVE NUCLEUS= ^1H
##.ACQUISITION MODE= SIMULTANEOUS
##.ACQUISITION SCHEME= undefined
##.AVERAGES= 8
##.DIGITISER RES= 18
##SPECTROMETER/DATA SYSTEM= spect
##.PULSE SEQUENCE= zg30
##.SOLVENT NAME= CDCl3
##.SHIFT REFERENCE= (INTERNAL, CDCl3, 0, 17.5044)
##AUDIT TRAIL= $$ (NUMBER, WHEN, WHO, WHERE, WHAT)
$$ ##TITLE= Audit trail, XWIN-NMR		Version 3.5
$$ ##JCAMPDX= 5.01
$$ ##ORIGIN= Bruker BioSpin GmbH
$$ ##OWNER= she
$$ F:/spectra/data/she/nmr/H-F/1/pdata/1/auditp.txt
$$ ##AUDIT TRAIL=  $$ (NUMBER, WHEN, WHO, WHERE, WHAT)
(   1,<2021-07-06 09:50:15.85 +0400>,<she>,<DPX200>,
      <created by zg, POWCHK disabled, PULCHK disabled
       configuration hash MD5:
       00 E9 B6 7A A2 85 ED C7 34 08 36 98 17 FE 4E 26
       data hash MD5: 16K
       88 1A D0 49 61 2C C2 A4 A5 BC 97 16 E4 20 16 28>)
(   2,<2021-07-06 09:50:22.46 +0400>,<she>,<DPX200>,
      <Start of raw data processing
       efp BC_mod = 2 LB = 0.24 FT_mod = 6 PKNL = 1 PHC0 = -11919.72 PHC1 = 16.00099 SI = 16K 
       data hash MD5: 16K
       ED B3 78 69 E1 ED EF D2 F9 62 E7 08 A7 82 85 E3>)
(   3,<2021-07-06 09:50:39.34 +0400>,<she>,<DPX200>,
      <pk PHC0 = 4.600431 PHC1 = -2.4 
       data hash MD5: 16K
       98 36 1B 20 05 92 E6 E7 CB 34 A5 97 7F 71 AC 66>)
(   4,<2021-07-06 09:50:42.40 +0400>,<she>,<DPX200>,
      <abs ABSG = 5 
       data hash MD5: 16K
       24 6A 79 32 86 EB EC 99 09 89 AC 06 50 B0 8B CB>)
(   5,<2021-07-06 09:51:21.96 +0400>,<she>,<DPX200>,
      <pk PHC0 = 1.07116 PHC1 = -2.8 
       data hash MD5: 16K
       5D A6 1B C6 EA E8 80 3E 74 95 51 02 F1 DD F4 47>)
(   6,<2021-07-06 09:51:25.64 +0400>,<she>,<DPX200>,
      <abs ABSG = 5 
       data hash MD5: 16K
       73 AF 8E 99 A1 3F B3 AF 10 5C 20 B4 93 2D 76 DC>)
(   7,<2021-07-06 09:51:45.35 +0400>,<she>,<DPX200>,
      <abs ABSG = 5 
       data hash MD5: 16K
       79 BB 07 90 BE 2A 2B EC AF FA 6F 35 46 49 3E 71>)
$$ ##END=
$$ 
$$ hash MD5
$$ F3 46 81 B9 36 FE 59 83 14 2C F2 9A D4 00 4F 0E
##$RELAX= 
##$RELAX= 
##$RELAX= 
##$RELAX= 
##$RELAX= 
##$RELAX= 
$$ Bruker specific parameters
$$ --------------------------
##$DU= <F:/spectra>
##$EXPNO= 1
##$NAME= <H-F>
##$PROCNO= 1
##$TYPE= <nmr>
##$USER= <she>
##$AMP= (0..31)
100 100 100 100 100 100 100 100 100 100 100 100 100 100 100 100 100 100 
100 100 100 100 100 100 100 100 100 100 100 100 100 100 
##$AQSEQ= 0
##$AQ_mod= 1
##$AUNM= <au_zg>
##$AUTOPOS= <>
##$BF1= 200.13
##$BF2= 200.13
##$BF3= 200.13
##$BF4= 200.13
##$BF5= 200.13
##$BF6= 200.13
##$BF7= 200.13
##$BF8= 200.13
##$BYTORDA= 1
##$CFDGTYP= 0
##$CFRGTYP= 5
##$CHEMSTR= <none>
##$CNST= (0..31)
1 1 145 1 1 1 1 1 1 1 1 1 1 1 1 1 1 1 1 1 1 1 1 1 1 1 1 1 1 1 1 1 
$$ [...]
##$SUBNAM3= <"">
##$SUBNAM4= <"">
##$SUBNAM5= <"">
##$SUBNAM6= <"">
##$SUBNAM7= <"">
##$SUBNAM8= <"">
##$SUBNAM9= <"">
##$SW= 20.0188882624521
##$SWIBOX= (0..15)
0 0 2 0 0 0 0 0 0 0 0 0 0 0 0 0 
##$SW_h= 4006.41025641026
##$TD= 16384
##$TD0= 1
##$TE= 0
##$TE2= 300
##$TE3= 300
##$TEG= 300
##$TL= (0..7)
0 120 120 120 120 120 120 120 
##$TP= (0..7)
150 150 150 150 150 150 150 150 
##$TP07= 0
##$TPNAME0= <>
##$TPNAME1= <>
##$TPNAME2= <>
##$TPNAME3= <>
##$TPNAME4= <>
##$TPNAME5= <>
##$TPNAME6= <>
##$TPNAME7= <>
##$TPOAL= (0..7)
0.5 0.5 0.5 0.5 0.5 0.5 0.5 0.5 
##$TPOFFS= (0..7)
0 0 0 0 0 0 0 0 
##$TUNHIN= 0
##$TUNHOUT= 0
##$TUNXOUT= 0
##$USERA1= <user>
##$USERA2= <user>
##$USERA3= <user>
##$USERA4= <user>
##$USERA5= <user>
##$V9= 5
##$VALIST= <valist>
##$VCLIST= <CCCCCCCCCCCCCCC>
##$VD= 0
##$VDLIST= <DDDDDDDDDDDDDDD>
##$VPLIST= <PPPPPPPPPPPPPPP>
##$VTLIST= <TTTTTTTTTTTTTTT>
##$WBST= 1024
##$WBSW= 4
##$XGAIN= (0..3)
0 0 0 0 
##$XL= 0
##$YL= 0
##$YMAX_a= 83583
##$YMIN_a= -135288
##$ZGOPTNS= <>
##$ZL1= 120
##$ZL2= 120
##$ZL3= 120
##$ZL4= 120
##$ABSF1= 17.50444
##$ABSF2= -2.514599
##$ABSG= 5
##$ABSL= 3
##$ALPHA= 0
##$AQORDER= 0
##$ASSFAC= 0
##$ASSFACI= 0
##$ASSFACX= 0
##$ASSWID= 0
##$AUNMP= <proc_1d>
##$AZFE= 0.1
##$AZFW= 0.1
##$BCFW= 0
##$BC_mod= 2
##$BYTORDP= 0
##$COROFFS= 0
##$CY= -3
##$DATMOD= 1
##$DC= 0
##$DFILT= <>
##$DTYPP= 0
##$F1P= 0
##$F2P= 0
##$FCOR= 1
##$FTSIZE= 16384
##$FT_mod= 6
##$GAMMA= 0
##$GB= 0
##$INTBC= 1
##$INTSCL= 1.334414e-10
##$ISEN= 128
##$LB= 0.24
##$LEV0= 0
##$LPBIN= 0
##$MAXI= 10000
##$MC2= 0
##$MEAN= 0
##$ME_mod= 0
##$MI= 1.114404
##$NCOEF= 0
##$NC_proc= -9
##$NLEV= 6
##$NOISF1= 3.799351
##$NOISF2= 2.8
##$NSP= 0
##$NTH_PI= 0
##$NZP= 0
##$OFFSET= 17.50444
##$PC= 1
##$PHC0= -11914.05
##$PHC1= 10.80099
##$PH_mod= 1
##$PKNL= yes
##$PPARMOD= 0
##$PSCAL= 0
##$PSIGN= 0
##$REVERSE= no
##$SF= 200.130006041525
##$SI= 16384
##$SIGF1= 3
##$SIGF2= 2
##$SINO= 5.538805
##$SIOLD= 16384
##$SREGLST= <1H.CDCl3>
##$SSB= 0
##$STSI= 16384
##$STSR= 0
##$SW_p= 4006.41025641026
##$SYMM= 0
##$S_DEV= 0
##$TDeff= 16384
##$TDoff= 0
##$TI= <>
##$TILT= no
##$TM1= 0
##$TM2= 0
##$TOPLEV= 0
##$USERP1= <user>
##$USERP2= <user>
##$USERP3= <user>
##$USERP4= <user>
##$USERP5= <user>
##$WDW= 1
##$XDIM= 16384
##$YMAX_p= 283499226
##$YMIN_p= -2578013
$$ End of Bruker specific parameters
$$ ---------------------------------
##NTUPLES= NMR SPECTRUM
##VAR_NAME=  FREQUENCY,     SPECTRUM/REAL,   SPECTRUM/IMAG
##SYMBOL=    X,             R,               I
##VAR_TYPE=  INDEPENDENT,   DEPENDENT,       DEPENDENT
##VAR_FORM=  AFFN,          ASDF,            ASDF
##VAR_DIM=   16384,         16384,           16384
##UNITS=     HZ,            ARBITRARY UNITS, ARBITRARY UNITS
##FACTOR=    0.24454680195387, 1,            1
##FIRST=     3503.16374451694, 0,            0
##LAST=      -503.246511893318, 0,           0
##MIN=       -503.246511893318, -2578013,    0
##MAX=       3503.16374451694, 283499226,    0
$$ Real data points
##PAGE= N=1
##DATA TABLE= (X++(R..R)), XYDATA
$$ [...]
10789E72499l89589o26504j56343p76467r2037j7765R80667l94830M99148J33244
10779b67977J32884K19825k21454L20493j193102R69151j19318j321835k12105
10770a693438l89280R05152M31226Q05796l5413m50900J33142k8180j66348J6927
10760d71316l47608J345608j07671m43531J9870K81087J24094j69409k63872j49717
10750a82465l00421j27016R39575J067948q72406j570768Q6127L25436R49186
10741C15196r37171M77923L37194l55099K60756m81550l70759J36710M84396k93186
10731d25590l94404J27935J173544k74294O70115j536772J7529k07656j30912
10722i80505J95353P44685K00909j031129M59991m15226j129175L95009L79263
$$ y = [572499, 182910, -443594, -599937, -1376404, -1468441, -1486206, -505539, -900369, -401221, -267977, -135093, 84732, -136722, 183771, -1009331, -40180, -159498, -1481333, -1693438, -2082718, -1177566, -746340, 59456, 24043, -426857, -293715, -321895, -488243, -471316, -818924, 526684, 419013, -24518, -4648, 276439, 400533, 231124, -32748, -182465, -482886, -609902, 329673, 1397621, 525215, -1045553, -959426, -633990, 315196, -621975, -144052, 193142, -161957, 98799, -382751, -753510, -616800, -132404, -425590, -819994, -692059, 481485, 207191, 877306, -659466, -641937, -849593, -980505, -785152, -40467, 160442, -870687, -410696, -825922, -1955097, -1560088, -1180825]
10713a180825L73360n28983M77176J104372N00228N63051r48727l84904p83662
10704h08914L02858J92934n90464J90522k42358N78816j01994L31221m20597p29321
10694a297297M48861j03099R45637j115229J76476J680800P57096j327257j551630
10685a385642N40746M59876N1825K23611M79710j79347l47992q33367j34889L72966
10675g52503j4713J489908j133398N800J58640j50616n47511J00204J091329n50961
10665c03821k82287J10051l14420K73387Q9141M92405k18926J82676o1471l71686
10655d04951j39530l65743P984N57168l18253n7228R25900m42733j67280O94175
10645B89509R84687q1886r00071M3829l15745k43781P81660j81318m29270n23693
$$ y = [-1180825, -807465, -1336448, -859272, 245100, 745328, 1308379, 359652, -25252, -808914, -506056, -313122, -903586, -713064, -955422, -376606, -478600, -147379, -567976, -1297297, -848436, -951535, -5898, -1121127, -944651, 736149, 1493245, 165988, -1385642, -844896, -385020, -333195, -109584, 370126, 190779, -157213, -990580, -1125469, -752503, -767216, 722692, -410706, -404906, -246266, -396882, -944393, -844189, 247140, -303821, -586108, -476057, -790477, -517090, -427949, 64456, -154470, 28206, -33265, -404951, -544481, -910224, -902240, -345072, -663325, -720553, 205347, -237386, -404666, 289509, 1274196, 1192310, 292239, 336068, 20323, -223458, 558202, 376884, -52386, -576079]
10635e76079N40373o52015M99759O94077j4177p71134K82939k7165l2193p39471
10625g95086q95769Q30571M09371m930N31611k12967m16980m21692j000112J371009
10615f04974N83846q92094l59920O63243N16811K822J58565p99223j124170R42640
10605i12454O64409N98855q11507J31111k63445K01887P0561J24710k6440K23715
10595A402m51671P4205K99973k34515J89731J40222K00706l37952P50986J38284
10585G71371j198094M07399O0831r60169J83686M41257P55700m68590k5658r2530
10575a24797j318141K27427m98423P24526R14860j54763o7682J7243k3063m45705
10565g48518j18091o74636J151945O96978N36158j572246l0484J65269o73535
$$ y = [-576079, -35706, -687721, -187962, 506115, 491938, -279196, 3743, -23422, -55615, -795086, -1690855, -860284, -450913, -455843, 75768, -137199, -554179, -975871, -1975983, -604974, -21128, -913222, -1273142, -609899, -93088, -90266, 68299, -730924, -1855094, -912454, -248045, 350810, -460697, -329586, -593031, -391144, -320583, -195873, -222313, 1402, -450269, -376064, -76091, -310606, -120875, 19347, 220053, -117899, 633087, 771371, -426723, -19324, 41507, -918662, -734976, -293719, 461981, -6609, -32267, -124797, -1442938, -1215511, -1713934, -989408, -74548, -229311, -296993, -279750, -302813, -748518, -866609, -1541245, -389300, 307678, 843836, -728410, -758894, -593625, -1267160]
10556a267160k35267J065211Q1572l20029j7368o22578K91263K21631L03839r036
10546e07922j46826J84196j13997l57158M99971J19286n14511M77557j36617M19186
10536g6835M80732m21214K02350m76816q0215n7165k24333n72389l29224R04542
10526f50567J73428p43130l87564j70889l58405Q98680M57884J176463j8294o75414
10516b97808j84024J97844j013q05250k97006L56261Q78838R8932P08477k24990
10506D30261j49624m13227l16963m4050l43863J37166j52622O76517K07678j038789
10496a007516K87534Q71995o64772j195349K7003L32771O56323j10781k20231
10487a023023J70743N24964m81363M73520J265640m88200j25112q19026J97354
$$ y = [-1267160, -1502427, -437216, -355644, -675673, -693041, -1315619, -1024356, -802725, -498886, -507922, -654748, -470552, -584549, -941707, -441736, -322450, -836961, -359404, -496021, -76835, 403897, -17317, 185033, -291783, -371998, -429163, -653496, -1225885, -1555109, -650567, -477139, -1220269, -1607833, -1778722, -2137127, -1238447, -780563, 395900, 377606, -297808, -481832, -283988, -285001, -1090251, -1387257, -1030996, -152158, -53226, 655251, 430261, 280637, -132590, -449553, -493603, -837466, -700300, -852922, -176405, 31273, -1007516, -719982, 152013, -512759, -1708108, -1681105, -1348334, -692011, -802792, -1023023, -852280, -327316, -808679, -335159, 930481, 442281, 317169, -501857, -304503]
10478c04503O29774j29319j21244p21678J36740l82677O91894p0873k45744j161864
10468a679494M7185L78840P751J502382m75454L8854m77145M85882j00094J26241
10458a45052j17965O39871P39180p35374q74965j87272n95833O56963K68881j019369
10448a370935J358426l72009R28387O7345q58805P87760K6645Q9389r20373k03167
10438d67337l34833R0767j11277m31559K82134j6897N29694j09010l16802M4308
10428h40812K10081O70670M28971L5268j69401j171591J28102P83337J2542m43751
10418c56584M31446K64031k07511m38537n6042r2386N74121M53474q61634o89381
10408i79003k71212J321970J45205l41870K78865n9273l8374m19835O53243j286159
$$ y = [-304503, 325271, 195952, 74708, -646970, -510230, -892907, -201013, -271886, -517630, -1679494, -1632309, -1253469, -1245718, 256664, -218790, -179936, -657081, -171199, -271293, -145052, -263017, 376854, 1116034, 380660, -494305, -681577, -1277410, -620447, -351566, -1370935, -12509, -384518, 543869, 611214, -247591, 540169, 566814, 656203, -264170, -467337, -802170, -711403, -822680, -1254239, -972105, -989002, -459308, -568318, -885120, -840812, -630731, 39939, 468910, 504178, 334777, -836814, -708712, 74625, 87167, -356584, 74862, 338893, 131382, -307155, -363197, -455583, 118538, 572012, -289622, -979003, -1250215, 71755, 216960, -124910, 153955, 94682, 56308, -363527, 289716, -996443]
10398i96443n63261L86850Q52598J33870j03279J58247q56980L16130K38418j89025
10388f22875J088K90769j63031j01671K83697K54035P43666j441879k38710L77728
10378f17183J74053O99517m77706K9521j53456L66469J88705M8306P06010M19947
10368A384183j407452M64894R0723l41785r64591o61459J221191N6017q24975
10359i83254o76725K01747N94829r3314M61307j160k8238J20354P03444n86537
10349b87547j69949K27016L94199o22445j0135n4213O3897j25189l54581M70659
10339d68288j175699M24463J309063r74999J9551P94891j93925j27484n02902
10330h95329R05186n93622K71614k19058Q6835q12462N39477N88820P31736r42295
$$ y = [-996443, -1559704, -1172854, -320256, -186386, -289665, -131418, -988398, -672268, -433850, -622875, -621787, -331018, -494049, -595720, -312023, -57988, 685678, -756201, -994911, -617183, -443130, 256387, -221319, -191798, -345254, 21215, 209920, 258226, 964236, 1384183, -23269, 441625, 532348, 190563, -774028, -1435487, -214296, -158279, -983254, -1659979, -1458232, -863403, -956717, -495410, -496570, -524808, -404454, 298990, -287547, -457496, -230480, 163719, -458726, -468861, -523074, -459177, -584366, -938947, -468288, -1643987, -1219524, 89539, -885460, -865909, -71018, -264943, -392427, -895329, 9857, -583765, -312151, -531209, -444374, -1256836, -717359, -128539, 603197, -339098]
10320c39098k38345P73241n0868L00906K70416j87246r12901n9378j2571J20392
10310c35452L89059p54509m24244J71282O03629L05729r08168P86151j03700L9215
10300b31008r7463l60860q7533P33297P4429j44047K15724j90693p70843j42148
10290a001145J94504M47173m42604O24490q89259J31442J221309j078183L51951
10281d40322K40120m02486n68088m6367J047077o26143M38030J07532o27209M39242
10271d38614j90535M0899p1767j13372J427768K8785j52610n44505K23673o23986
10261d14264j140268R81860N21057K85419l01162p9816N78451L14624O0222n9250
10251G46873m78174n54954J80519P76163m96302J52899m31488n31074N81031L56118
$$ y = [-339098, -577443, 195798, 144930, 445836, 716252, 529006, -383895, -443273, -455844, -335452, 53607, -700902, -1125146, -953864, -350235, -44506, -952674, -166523, -270223, -231008, -328471, -689331, -776864, -43567, 30862, -113185, 102539, -88154, -858997, -1001145, -806641, -359468, -802072, -177582, -1066841, -935399, 285910, -792273, -440322, -200202, -602688, -1170776, -1217143, -170066, -796209, -358179, -250647, -877856, -438614, -629149, -588250, -660017, -773389, 654379, 683164, 530554, -13951, 209722, -414264, -1554532, -572672, -51615, 233804, -67358, -147174, 431277, 745901, 806123, 746873, 268699, -286255, -105736, 670427, 174125, 327024, -104464, -635538, -54507, 301611]
10241C01611o38737K26277M77628m78910K18688N58231o33661L32050J58343j13730
10231D07790p20588p73392J11728j86249K51037p12066R48275L87700Q07492n53881
10221c2154K95609Q62479m33351J4399j106989K05563n91170k76107p2373N27194
10211f06900R71748k03018j416239J355187k87050o25278J041651L22018o86032
10202a33913l2616N32940M74527q66510r2088N86412L68588j219835j20858N72018
10192F8665r2684q2830R6682K46564k56692K42105q4563Q34646m32888r51574
10182d12569o29833O7931P14203j38521o55573O66663L34302N86813L84407r56090
10172c8267O20250R5681n20170m4959m55220J90479J16987M9196o30210m43193
$$ y = [301611, -337126, -110849, 366779, -112131, 106557, 664788, 31127, 363177, 521520, 407790, -312798, -1086190, -974462, -1160711, -909674, -1621740, -673465, -285765, 521727, -32154, 263455, 1125934, 692583, 706982, -400007, -194444, -785614, -1061721, -1134094, -606900, 364848, 161830, -1254409, 100778, -186272, -811550, 230101, 552119, -133913, -166529, 366411, 840938, -25572, -117660, 468752, 837340, -382495, -503353, 68665, -24019, -106849, -10167, 236397, -20295, 221810, 137247, 971893, 539005, -412569, -1042402, -974471, -260268, -398789, -1054362, -387699, -53397, 533416, 917823, -38267, 581983, 677664, 157494, 112535, -342685, -152206, -35219, 13977, -616233, -1059426]
10162a059426n10203P26920R72991k44250j435070N79114J589079j20304j155212
10153f56361o82782o94013l99999J351082l13911L99855O35672k06284o24433
10144a191174K15500N40773m78003K84394l59110J277800r11890l77954N85530
10135d14134M73237k8582p96827l89523J73924J135869k43194k68521o38786O10026
10125c86511l32983k42196R88301l47544P76399P0791j8269o28732j279809m9057
10115a449610j92758J007844o71980j13910K93435l00997j18170O74984P90247
10106h0915o26152r13019N28431M49413q23890J080395J36679j54739M8272J11873
10096b43652m52797l7455J220711l48632r48822m54445K24303K45322P02842k96936
$$ y = [-1059426, -1569629, -842709, 130282, -113968, -1549038, -969924, 619155, 498851, -656361, -1339143, -2033156, -2433155, -1082073, -1395984, -996129, -360457, -566741, -1191174, -975674, -434901, -912904, -628510, -987620, 290180, -621710, -999664, -414134, 59103, 30521, -766306, -1155829, -981905, 153964, -89230, -357751, -996537, -386511, -719494, -961690, 26611, -320933, 455466, 526257, 507988, -120744, -1400553, -1449610, -1642368, -634524, -1306504, -1420414, -1126979, -1427976, -1546146, -871162, -80915, -707067, -1620086, -1091655, -642242, -1466132, -385737, -249058, -403797, -355525, -243652, -696449, -733904, 486807, 138175, -810647, -1265092, -1040789, -795467, -92625, -389561]
10086c89561L57070P6319m27722M53029p12836k97284r42311N19158J69987J97452
10076i96699N73116M33521o97346L21106R34619l79615n96655p74186L27857K4428
10066h29854J89483l02824K70018O51497j37665l32961P25474l07139j514082
10057a588053J258952J44690l76934q17397J83840L33780K78221k83016J54204
10048g11713L16060j87775l57070m82653L59696M14474J84303m93362L98889m84867
10038a044018P27621Q30830m44576M28911m50294K0865R50113j97376O24436q44502
10028F02010Q0914q64962O89838N14005l53219k36895k00566n40825p78737J27431
10018i61006K79173O05693l14336N3424n96352l51701J324385k82916k25798Q7874
$$ y = [-389561, -32491, 43828, -383894, 69135, -643701, -940985, -1883296, -1364138, -1194151, -996699, -423583, 9938, -687408, -366302, 568317, 188702, -407953, -1182139, -854282, -829854, -640371, -943195, -673177, -21680, -159345, -492306, 233168, -73971, -1588053, -329101, -184411, -561345, -1378742, -1194902, -861122, -582901, -865917, -711713, -395653, -583428, -940498, -1423151, -1063455, -648981, -464678, -958040, -559151, -1044018, -316397, 514433, 69857, 498768, 48474, 69339, 1019452, 822076, 1446512, 602010, 682924, -182038, 507800, 1021805, 668586, 431691, 231125, -309700, -1088437, -961006, -681833, -76140, -390476, -337052, -933404, -1285105, 39280, -243636, -469434, -381560]
10008c81560l47582m05785P53317K8188Q6829l47630M2348j00845L47933M22391
9998I7604k90428j09354L90731J31770m60144M23477P92037m44282p32989j016643
9988a218221K99445L42303r9463j36571l08230k4159J077270J57224j001575j38800
9978a050777k96115P45089j59600l62378L66353M22196p71299l56249K97578N33154
9968f32048j38468L46878M41136n83442q1976j87920r50426J108192O07107j23677
9958a94644m21418O92711l30334j18225l09666L31349N55275J02967r24493J20320
9948d96158R15387N34523j810054m91574k81206R5399P47914L77833k58595J56828
9938e09703N99807m05018p5443N8479L34005m01895p76093O41367K88217K24726
$$ y = [-381560, -729142, -1134927, -381610, -353422, -266593, -614223, -571875, -672720, -324787, 97604, -192824, -302178, 88553, 220323, -239821, 183656, 975693, 531411, -201578, -1218221, -918776, -576473, -675936, -812507, -1120737, -1144896, -67626, 89598, -911977, -1050777, -1346892, -601803, -761403, -1123781, -757428, -335232, -1106531, -1462780, -1165202, -632048, -770516, -423638, 17498, -565944, -647920, -835840, -1786266, -678074, -70967, -194644, -616062, 76649, -253685, -371910, -681576, -350227, 205048, 308015, -616478, -496158, 419229, 953752, -856302, -1347876, -1629082, -1533683, -785769, -407936, -666531, -509703, 90104, -314914, -390357, -331878, 2127, -399768, -1175861, -534494, -246277, -21551]
9928b1551L15729q3499j93162k42419m73300l40740M73580O35279o60758Q7252
9918e03589Q4460L1359o753r46663K22809K53713n42089p539N74211L73315m9727
9907e16493N58068K40748j074019M36891M78614P6554l57897K2496j88319n16760
9897h40117M88384r42564M18019J497988P1010O283q60880Q78578l84949P28687
9887A060439j461184J14998J224119l49582j208570K20526L68951j049986L53622
9878g26667J223599M7143M43587q12212N56084m39373r8425j101214M56022O63006
9868B11550K2746R64673K15932M1277j058482p9902N3844Q8314m22373n04037
9858d66458K49213k81345m68662K29630J56434l25083J5740R31848j75511j25522
$$ y = [-21551, 294178, 210679, 17517, -224902, -698202, -1038942, -565362, 69917, -590841, -503589, -419129, -387770, -394523, -1341186, -1118377, -864664, -1406753, -1414292, -840081, -466766, -516493, 41575, 282323, -791696, -354805, 123809, 200363, -157534, -135038, -323357, -840117, -351733, -1294297, -876278, 621710, 692720, 699003, -161877, 716701, 331752, 1060439, -400745, -285747, 938372, 588790, -619780, -399254, -30303, -1080289, -726667, 496932, 544075, 987662, 175450, 731534, 292161, 193736, -907478, -451456, 211550, 234296, 1198969, 1414901, 1456178, 397696, 317794, 371638, 459952, 37579, -466458, -217245, -498590, -967252, -737622, -581188, -906271, -890531, 41317, -134194, -259716]
9848b59716J063405J39433l61655o30928L70733l60017M2021k64351k87050p9756
9838f27881r2727J72178o51819N65513K0326N54095L11217N36584o12073n20391
9828c44978j23599k78022J4018Q14314J69685l98562O39436l09024m86505j9605
9818c22842l73716L92454n26641J08273O48181q3685L64703L81201n43267K07145
9808B51806k70367q8610J9900K70419j04930J85547j237584J073962j87099L70669
9798B83713q04654p21530K82780L37863N09136K73922l8008K31728m31240O05243
9788E28953o22512j209566J572045j37416n80742o60085m94099J071341N96029
9779F3948K0184K27975J54704K53836l04954l06403K63271r13761L28582K90287
$$ y = [-259716, 803689, 943122, 581467, -49461, 321272, -38745, 3276, -261075, -548125, -627881, -720608, -548430, -1200249, -634736, -614410, -60315, 250902, 787486, 175413, -344978, -468577, -746599, -732581, 81733, 251418, -147144, 492292, 183268, -303237, -322842, -696558, -304104, -830745, -722472, -74291, -157976, 206727, 587928, 44661, 251806, -18561, -107171, -87271, 183148, 78218, 263765, -973819, 100143, -86956, 283713, -520941, -1242471, -959691, -621828, -112692, 161230, 123222, 354950, -76290, 528953, -93559, -1303125, 268920, 131504, -449238, -1109323, -1603422, -532081, 63948, 84132, 312107, 466811, 720647, 415693, 109290, 372561, -541200, -212618, 77669]
9769G7669j14974K20429o42566k20716k46945j45544L707O80756n35728K34624
9759f89288j07131K10354M59096M03596k2580k9145n0598o98834N40498N19362
9749E35330M54296m84222m94470O22969j80800J43911p94579j71645J67861Q20881
9739F19532q95521k11566K1485r7619j89277O94650R1771M37458p67184L03231
9729F960M66441q45668M73370L87881L28737l82580O20473j056838r7455M9605
9719d9074J55955m59281J86247P58722j192660l3305m95525R15987M64873K99542
9709E51481o25106P36623k71338j79072N0817P58282K51535j071215k50186J10752
9699F2573k45862j66936K03812k96096n87197M12694p2821J16198J16754K05340
$$ y = [77669, -37305, 183124, -459442, -680158, -927103, -1072647, -1068940, -388184, -923912, -689288, -796419, -586065, -126969, 276627, 254047, 224902, 174304, -524530, 15968, 535330, 989626, 505404, 10934, 633903, 453103, 597014, -197565, -369210, -201349, 619532, -275989, -487555, -466070, -563689, -752966, -58316, 33455, 470913, -296271, 6960, 473401, -372267, 101103, 488984, 817721, 435141, 1055614, -1224, -98679, -49074, 106881, -352400, -166153, 592569, -600091, -633396, -1128921, -212934, 251939, 551481, -73625, 662998, 391660, 212588, 263405, 1021687, 1273222, 202007, -48179, 62573, -183289, -350225, -146413, -442509, -1029706, -617012, -689833, -573635, -456881, -251541]
9689b51541K34789n02060N53012J56409K64228p07311k27855M57433J13932o52208
9679e61172P70935K92171J42225o22075J9829L12499j113144m24698Q32778Q0995
9669b69657M23928o58179J0100M53518j73862q83744Q74666L84024n58008m34173
9659h31387L17144L87040k90500l57883j78813N52206O29552j89039j08062Q30909
9649G61167j695420q61908Q20015j04953N91352P12395j233915L52541J078662
9640D19936m70977P78176M96324J39727m42321l74874J96044m93649J02139q87544
9630e37019N39080M65265q96701k38201M34888n3880J88296n3189J13526n37697
9620e75632J494267k59757n76728N41748o50737m13818K796K61749j21595j40042
$$ y = [-251541, -16752, -518812, 34200, 190609, 454837, -252474, -480329, -22896, 91036, -561172, 209763, 501934, 644159, 22084, 41913, 354412, -758732, -1183430, -350652, -269657, 154271, -503908, -493808, -40290, -214152, -1097896, -223230, 160794, -397214, -831387, -514243, -127203, -417703, -775586, -954399, -402193, 227359, 38320, -69742, 761167, -934253, -1796161, -976146, -1081099, -489747, 222648, -1011267, -658726, 419936, -51041, 727135, 1223459, 1363186, 920865, 545991, 742035, 248386, 350525, -537019, 2061, 467326, -429375, -667576, -232688, -286568, -98272, -151461, -37935, -575632, 918635, 658878, 82150, 623898, -26839, -440657, -437861, -176112, -297707, -437749]
9610d37749J77592J012617L20291J82222m19389n38994q29430O38794J8791l62508
9600b37763J37652l29517K40075K996j030555J228962O12883p43793L27950P33139
9590I42029o54995k6421n05276J330224m64719q23793K25646N652J64725q48385
9580f55313m48912O90524p6025L35168l68692j70838k27437K87734P39879J04102
9570B10190O25836j136394q3958R44364k41897j059635K83543L30850P58575m92160
9560A39314P55132l08350K69934p41207n13988M71084J79032k69717N55138k83439
9550B52933L43728P03994J26069j57685k62886l91432j419878K12769M01314j39914
9540c30988l54249J133752j18408l49939n11211J70883K93697n8297j39850P51076
$$ y = [-437749, -260157, 752460, 1072751, 1254973, 835584, 296590, -532840, 105954, 124745, -237763, -100111, -429628, -189553, -186557, -1217112, 11850, 624733, -119060, 208890, 942029, 287034, 260613, -244663, 1085561, 620842, -202951, 22695, 28347, 193072, -655313, -1104225, -413701, -489726, -154558, -523250, -694088, -921525, -633791, 106088, 210190, 836026, -300368, -384326, 560038, 318141, -741494, -457951, -127101, 631474, 139314, 894446, 586096, 856030, 114823, -399165, 71919, 250951, -18766, 536372, 252933, 596661, 1300655, 1426724, 1269039, 1006153, 614721, -805157, -592388, -191074, -330988, -685237, 448515, 330107, -19832, -531043, -360160, -66463, -124760, -264610, 486466]
9530D86466K07461o04976l87727K17074O44305l57817k73456O83891o65904j6700
9520f7383P79858m07156r36458k92650P44720P28812L29016K4466k61532l74958
9510B66735r21761P31741M49178o97885l30542m25002l67131L83059J227591Q36273
9500A152256o11849r97827P28746n62538J91303N2600K70462m79165l03284L52881
9490b06415K38916J340868L98977k50860m1257k75160J32068J74282M00299L8198
9480A949916M85256n93456m34751J74418k11231n49418J26428M07840P07855p0396
9470A992461L26099R5828K44884M60493o59988M0516P82311o39071N18459j119695
9460B042297j20440K3465L9339K88638l85239J04656J66867L14298m88367j46742
$$ y = [486466, 693927, 88951, -298776, -81702, 562603, 204786, -68670, 615221, -50683, -67383, 712475, 305319, -631139, -923789, -179069, 549743, 878759, 903225, 641693, 266735, -655026, 76715, 525893, -171992, -502534, -927536, -1294667, -911608, 315983, 1152256, 540407, -457420, 271326, -291212, -99909, -47309, 223153, -256012, -559296, -206415, 32501, 1373369, 1772346, 1521486, 1480229, 1205069, 1337137, 1511419, 1911718, 1949916, 2435172, 1841716, 1406965, 1581383, 1370152, 820734, 947162, 1355002, 2062857, 1992461, 2318560, 2414388, 2659272, 3119765, 2459777, 2500293, 3282604, 2643533, 3161992, 2042297, 1921857, 1945322, 1984661, 2273299, 1888060, 1992716, 2159583, 2473881, 1985514, 1838772]
9450A838772k9312K60602n44077o02458m3052L31482q63018O66903K3250j23876
9440I15216L56235J68855m13866L2157L52365p63215k62870o60914K45998L50499
9430C20460m53179L38637N48389m5421m60652L82908J45896M4394n84693P94038
9420A030777J009403p59770m19338O01125m08098q53364o96989L46036K04795
9411E4577L20555N73583l87562m01881P76948k62640l18653N25938J79312m53810
9401F06367l03757J89872j24386j38254J102573J28869n41618q96767j1715M77509
9391D88693M1607r40968O96593k31235l11745j51823j06082P55910L24148P22405
9381A287503m62982J86142j313581M44875Q30633l89870Q72827j034966J47262
$$ y = [1838772, 1809460, 2070062, 1525985, 923527, 880475, 1211957, 348939, 1015842, 1039092, 915216, 1271451, 1440306, 1026440, 1058597, 1410962, 647747, 384877, -276037, -30039, 320460, -132719, 205918, 754307, 708886, 248234, 631142, 777038, 821432, 236739, 1030777, 2040180, 1280410, 861072, 1462197, 1054099, 200735, -496254, -150218, 54577, 375132, 948715, 561153, 159272, 936220, 673580, 354927, 880865, 1060177, 606367, 302610, 492482, 368096, 229842, 1332415, 1461284, 919666, 22899, 11184, 488693, 530300, -410668, 285925, 54690, -257055, -408878, -514960, 240950, 565098, 1287503, 824521, 1010663, -302918, 141957, 972590, 582720, 1455547, 420581, 567843]
9372E67843n43760L50826j65765n06076O44456l73611O06115J33397k30557l04034
9362A78834J24617L50021p3635r17244L99496l5636j44527k793O65559k09808
9352C34884j71057Q83016o92804Q2207J52192r1708L99923m73961j79980K02208
9342D44920Q9902r6599m1170L5170N26309k23730m67178L36109M30641o48846
9332C85528P2913m3307l01994R00389O76123j576263m92107P33545J078644L74693
9322A808164K6382j36836m33774j270866o6302J620019r02064L04656K69854l61161
9312H58072k36506M33872j82645q21578K63526K67135q30197O71996K28750o22549
9302B9876Q21634o38204j011809J014064L83228K906n9133N27655R2272l03428
$$ y = [567843, 24083, 374909, 209144, -296932, 347524, -26087, 580028, 713425, 482868, 178834, 303451, 653472, 579837, -337407, 62089, 26453, -118074, -120867, 544692, 334884, 163827, 1046843, 354039, 436246, 588438, 496730, 896653, 422692, 242712, 444920, 534822, 438223, 397053, 432223, 958532, 734802, 267624, 603733, 1034374, 385528, 458441, 415134, 113140, 1013529, 1689652, 113389, -378718, 354827, 1433471, 1808164, 1834546, 1697710, 1263936, -6930, -73232, 1546787, 644723, 949379, 1219233, 858072, 621566, 1055438, 872793, 51215, 314741, 581876, -248321, 423675, 652425, 29876, 851510, 213306, -798503, 215561, 598789, 601695, 542562, 1070217, 1162489, 859061]
9292H59061n88115R2184P3171m44320M60171j91003r4369M4153K26525p6010M81947
9281H43395M9761J37201R4633k57381o21666L55453J61602j78069m08825N13423
9271F89527O16831j79105k73245M86579r05534N9509L14673m64040J00134K1491
9261D66820l64743K52997N89735j83361j62348M8040m76278L07576k65969P66208
9251I78677m3709n0063J90142k91945k51884M18704L20988r03022n05193P93429
9241F56124J94552N36981K46841n02335l98291J63912J60090j036726L12703L51421
9231F85272J79418J29817o88534L33861J230071L15289J074358r51683j97338
9222B110531M86811q56093M6986k08708l42497M76251K34707l6148q23629O57286
$$ y = [859061, 270946, 363130, 436301, -8019, 452152, 261149, 166780, 210933, 437458, 361448, 843395, 893156, 1030357, 1124990, 867609, 245943, 601396, 762998, 584929, 176104, 689527, 1306358, 1127253, 854008, 1340587, 435053, 494562, 809235, 345195, 445329, 466820, 102077, 355074, 944809, 761448, 599100, 647140, 170862, 478438, 212469, 978677, 934968, 884905, 1075047, 783102, 531218, 949922, 1270910, 367888, -137305, 656124, 850676, 1387657, 1634498, 1132163, 733872, 897784, 1057874, 21148, 333851, 685272, 864690, 994507, 305973, 639834, 1869905, 2185194, 3259552, 2307869, 2110531, 2597342, 1741249, 1788235, 1579527, 1237030, 1713281, 1947988, 1911840, 1088211, 1745497]
9212A745497j06723r4151k30047Q13141l49605K14843N93821P13132j19550p74170
9202B406188M24055L20683j076650J28008q0076n0034o15374k60926R1463J97594
9192A484931L13734l92701o9063K5029o90078J189831n51210p09351M09346n74478
9182D35990L41555P2495j09177J92285P68442o26978p9127L31697P31386q78542
9172A180026j435504M72495J519006j519990P69346O31924k51740K55449j78755
9163A442257K90962j16874k33197lr19408J02972O45937n82667L14454m73531
9153D70902M17006j41999m71178K82662K75354n08165J09620l4218N93750J135528
9143B129262k84604p54370L30273n55507j62117J06170M24218M4648m86645J1476
$$ y = [1745497, 1638774, 1544623, 1314576, 2127717, 1778112, 1992955, 2586776, 3299908, 3180358, 2406188, 2830243, 3150926, 2074276, 2202284, 2122208, 2072174, 1456800, 1195874, 1287337, 1484931, 1798665, 1405964, 1336901, 1361930, 671852, 1861683, 1310473, 601122, 1010468, 435990, 777545, 850040, 740863, 933148, 1701590, 1074612, 995485, 1327182, 2058568, 1180026, -255478, 217017, 1736023, 216033, 985379, 1617303, 1365563, 1621012, 1442257, 1733219, 1616345, 1383148, 1383145, 463737, 566709, 1212646, 629979, 944433, 470902, 887908, 745909, 274731, 557393, 832747, 324582, 434202, 399984, 993734, 2129262, 1844658, 1090288, 1420561, 865054, 702937, 809107, 1233325, 1277973, 791328, 802804]
9133H02804j91367j2961L4637o11874K74506R37853r09127O6231p14552l05693
9123f29543K28590Q83932k9911r3936N92122k81551j9387P34389o27358o93578
9113F3769M9158k40074J84553J215846r82060N80897P61959k58436K32352Q635
9103A616599j80527O03601p89580n31519O17377k82541m67250m78083N11740m35423
9093A84394J75379O36572Q26493L23371r58975k05460N89229k90945o78225k61008
9083C40825o11382L70468L51033L875L13485o49457L93100R01241l71896k90641
9073G50651K15120J38936M97332k72477k9313M27665K60940j207652m01843K28593
9063F07952M08662J02295j484116O6895J248917k05662J06047j20892K35510Q88809
$$ y = [802804, 611437, 598476, 633113, 21239, 295745, 1233598, 324471, 390702, -323850, -629543, -400953, 482979, 453068, 359132, 951254, 669703, 650316, 1384705, 757347, 63769, 112927, -127147, 57406, 1273252, 291192, 872089, 1634048, 1375612, 1607964, 1616599, 1436072, 2039673, 1250093, 718574, 1335951, 1053410, 586160, 108077, 619817, 184394, 359773, 996345, 1822838, 2146209, 1187234, 981774, 1571003, 1280058, 601833, 340825, -270557, 99911, 450944, 454819, 768304, 118847, 511947, 1413188, 1041292, 750651, 965771, 1104707, 1602039, 1329562, 1300249, 1727914, 1988854, 781202, 379359, 607952, 1016614, 1118909, -365207, -298312, 950605, 744943, 850990, 730098, 965608, 1854417]
9053A854417J48792j93496n45986m49135N51688L90486n59645K79711l9892R06851
9043B343791q71158n00088M28391l37036J28238M1638J90725j105225O96220L30647
9033A346143q87095K99086J00203M73946l44518k99205j311674J10955J026547
9024E14388K77101j23324m07732J429043J19994o72407p13383j95849L49301j2333
9014E64799L18291K01384j169424k66257O45590j1017Q68427K18307J531951j42138
9004B759913r48280K63366n53225R80127k68170j178890r15195O93171n79255
8995B53562l11011N64942L94005l65082J26517k3039K29293j16295L48175J65022
8985A266089N6807o21369n53K89302K57484R9985m63705l7481n38999M28334n17568
$$ y = [1854417, 2003209, 1809713, 1263727, 814592, 1366280, 1756766, 1197121, 1476832, 1436940, 2343791, 1472633, 972545, 1400936, 1063900, 1192138, 1233776, 1424501, 319276, 1015496, 1346143, 459048, 758134, 858337, 1332283, 987765, 688560, -623114, -512159, 514388, 791489, 668165, 260433, 1689476, 1809470, 1137063, 423680, 227831, 577132, 564799, 883090, 1084474, -84950, -351207, 294383, 283366, 1151793, 1370100, 2902051, 2759913, 1811633, 2074999, 1521774, 2501901, 2233731, 1054841, 139646, 832817, 253562, -57449, 507493, 901498, 536416, 662933, 639894, 869187, 752892, 1101067, 1266089, 1322896, 701527, 700974, 990276, 1247760, 1347745, 884040, 846559, 307560, 735894, 218326]
8974B18326J386314l94735j48664L07677O43223m36674j55792j22267r4933J25140
8964A327615j14275j110772K68259J748605l31254q1090k92710L06778n32475
8955A188681k4912J37430M5273j70906k12132L1739J62739N71039J56137p00380
8945A184708k73002k77004L98602K70709l76131K92494o18341K26237Q61419N5112
8935A744803j93327m52759k51847O25140r10602O01974J59126j18110J71814L39492
8925A715704M80768l43988l55398n67869J18632N93841k73425n21087j65171O77958
8915A359965P8895k39497m89759J5485Q00034J41766R78698j110908J83127l99723
8905A318083n63817m60334O79571J012970N52164K05523j567726N8336N54670
$$ y = [218326, 1604640, 1209905, 1061241, 1368918, 2012141, 1575467, 1419675, 1297408, 1202475, 1327615, 1213340, 102568, 370827, 2119432, 1788178, 1707088, 1414378, 1721156, 1188681, 1163769, 1301199, 1346472, 1175566, 963434, 995173, 1157912, 1728951, 1885088, 1184708, 911706, 634702, 1033304, 1304013, 927882, 1220376, 602035, 828272, 1689691, 1744803, 1551476, 1098717, 846870, 1472010, 561408, 1163382, 1322508, 1204398, 1376212, 1715704, 2196472, 1852484, 1497086, 929217, 1047849, 1641690, 1368265, 847178, 682007, 1359965, 1438860, 1199363, 709604, 725089, 1525123, 1666889, 2645587, 1534679, 1717806, 1318083, 754266, 293932, 973503, 1986473, 2538637, 2744160, 1176434, 1234770, 1789440]
8896A789440n67347K56047j62817k29139m60737j61111Q23486R16980J35183q97583
8886A442402n75387K67961K45413j26261M1838J38329j49249l26339L10618o8874
8876A200451k06825L61205M55584j126142l51613J493879K09470Q4893m44987
8867A675915P98489k43223o82492L13769l23953j3594P09859l08124j281104r9811
8857E45731L86807Q56763J02696m7814P74009o05261O3016M71689J04265r61257
8847A690644l73070O08770p06315p76490P2372N69330N67052J22549j010406l8356
8837G26080L76088Q62987l755m43909K48159q80518K94655R67741r8373o00960
8827A448195j57413N32083L39112l08272o90611N40882j24626O16239M17422l84230
$$ y = [1789440, 1222093, 1478140, 1315323, 1086184, 625447, 464336, 1287822, 2204802, 2339985, 1442402, 867015, 1134976, 1380389, 1254128, 1295966, 1434295, 1285046, 958707, 1269325, 1200451, 993626, 1354831, 1810415, 684273, 332660, 1826539, 2036009, 2120902, 1675915, 2474404, 2231181, 1548689, 1862458, 1538505, 1524911, 2234770, 1926646, 645542, 545731, 932538, 1789301, 1891997, 1844183, 2618192, 2012931, 2075947, 2547636, 2651901, 1690644, 1317574, 1926344, 1220029, 443539, 515911, 1085241, 1652293, 1774842, 764436, 726080, 1102168, 1965155, 1961400, 1517491, 1765650, 885132, 1179787, 2147528, 2049155, 1448195, 1290782, 1822865, 2161977, 1853705, 1163094, 1703976, 1579350, 2195589, 2613011, 2228781]
8817B228781p79364j5749J10373j04264L89951N94901n16245K87281N86913n11211
8807B271367k04807k35269L39969N15890n88214O42658m95065n3220o77544K69092
8797A784857k69243k20796M51579l37672n54225P34128L39846Q110K17661K85078
8787B439323n72500O97543O08277o53228K6516j44462l91279k78908K28941K61637
8777B221860L25045K79509m35491O90901L90969j739081K73893o37428K99836
8768A670013p1219Q7554J28007N64644O91055m58491o64873q21388l74851J180336
8758A930787K20911J45255r8964R5081p5138K98184r42537k94139k1463K89530
8748A547507O10081n01568J003011o10559m10131N69376k164r5791Q1238j76078
$$ y = [2228781, 1449417, 1433668, 1544041, 1439777, 1829728, 2424629, 1908384, 2195665, 2782578, 2271367, 2066560, 1831291, 2171260, 2687150, 2098936, 2741594, 2246529, 2193309, 1515765, 1784857, 1515614, 1294818, 1746397, 1408725, 854500, 1588628, 1928474, 1936584, 2154245, 2439323, 1866823, 2564366, 3172643, 2519415, 2545931, 2401469, 2010190, 1731282, 1960223, 2221860, 2546905, 2826414, 2390923, 3081824, 3472793, 1733712, 2007605, 1370177, 1670013, 1598794, 1686348, 1814355, 2378999, 3070054, 2611563, 1946690, 1125302, 750451, 1930787, 2151698, 2296953, 2197989, 2293070, 2217932, 2516116, 1573579, 1279440, 1257977, 1547507, 2157588, 1656020, 2659031, 2048472, 1638341, 2207717, 2205553, 2109762, 2191000, 2014922]
8738B014922j80392j33376l47738J277427p18128m11411M03953P16430K3922M2176
8728B687785P07996r69896m51981J316223J018662K1882j494252K40823M25285
8719C502527o41473l80561l83437N73912K01658k04885L73928j87460o7005m35205
8709B351999j18777M61550l92926R5907l86135L83640j06737m88497o0658M74258
8699B213624Q38118n45254l2232j31672L02827K49999m47368l51214N38134K73229
8689B908191m13128K44570N33274m2805J7441M29943k05287j094647l50351O72770
8679B699971J44748M33648j71889L0544K13548K02758m9354j026599n08021R97562
8669B966916l48740j42769J40574L4369o45582J026035K93327m85435M56575k20070
$$ y = [2014922, 1834530, 1701154, 1353416, 2630843, 1912715, 1501304, 1905257, 2621687, 2645609, 2687785, 3395781, 2425885, 1973904, 3290127, 4308789, 4330671, 2836419, 3077242, 3502527, 2861054, 2480493, 2097056, 2670968, 2872626, 2667741, 3041669, 2854209, 2787204, 2351999, 2233222, 2694772, 2301846, 2397753, 2011618, 2395258, 2288521, 1800024, 1739366, 2213624, 3051742, 2506488, 2474256, 2342584, 2645411, 2895410, 2448042, 2096828, 2634962, 2908191, 2495063, 2739633, 3272907, 3230102, 3247543, 3677486, 3472199, 2377552, 2027201, 2699971, 2844719, 3278367, 3106478, 3137022, 3350570, 3553328, 3503974, 2477375, 1969354, 2966916, 2618176, 2475407, 2615981, 2650350, 2004768, 3030803, 3324130, 2838695, 3295270, 3075200]
8659C075200j29124K19698r14877L31988Q0727L45917K85399j91662K50087P41601
8649D094954N62147n67853m65075l98747K40223L17880Q8456P92752n61075q27499
8639C276163m59659r01320J300117M31156P75325o66809q93911N99920O2540j06078
8629C417444J120763K65480l95131O33001o37444m60346o4300M10542K80980m75123
8619D095866N71442p95270J9159n7551n59088P1553Q21160N06773l63689r98835
8609C311520q95103O28407M56222m0250L19100k61682j59779K62276L66149J01772
8599D088632k80584P98174l11238j029911R34981J12787J03385J80371J32020
8590D728617O2532n27350m83194q28613P43611K86444J032924o27099n69032k05828
$$ y = [3075200, 2946076, 3165774, 2250897, 2582885, 2663612, 3009529, 3294928, 3103266, 3353353, 4094954, 4657101, 4089248, 3624173, 3225426, 3465649, 3783529, 3871985, 4664737, 4103662, 3276163, 2816504, 1915184, 3215301, 3646457, 4421782, 3754973, 2861062, 3460982, 3523522, 3417444, 4538207, 4803687, 4408556, 5041557, 4404113, 3943767, 3879467, 4290009, 4570989, 4095866, 4667308, 3872038, 3891197, 3833646, 3274558, 3346111, 4167271, 4674044, 4310355, 3311520, 2416417, 3044824, 3501046, 3460796, 3779896, 3518214, 3358435, 3620711, 3986860, 4088632, 3808048, 4606222, 4294984, 3265073, 4200054, 4312841, 4416226, 4596597, 4728617, 4791149, 4263799, 3780605, 2951992, 3695603, 3982047, 5014971, 4387872, 3818840, 3613012]
8580C613012J77515L38663M82141j377862N91284Q88440l76769J61984J90842
8571D689250J03610J10161k87948n99926L90124L62433k78081l8245q9781l19941
8561D041656N07910J28637l90512k66637O25707J11652K80357K33150L13640j007429
8551D578131k96468R75228m83611M8232n31497k8052k8380J08347N34656l05393
8541D571193Q98114L308j72140M45093p40615m97218J113508J39581n17726l45000
8531D898098Q59496r5559l63600N47853n96544m15186Q45230l85078L6799M81118
8521E812627q6408R2705o42497N85426p4564M56747K62104k22279n98876P3227
8511E658212N79018k77694R82276J05562r61933l26733O22086n32490R29555K5558
$$ y = [3613012, 3790527, 4129190, 4611331, 3233469, 3824753, 4713193, 4336424, 4498408, 4689250, 4792860, 4903021, 4615073, 4015147, 4405271, 4767704, 4489623, 4451378, 4361597, 4041656, 4549566, 4678203, 4287691, 4021054, 4646761, 4758413, 5038770, 5271920, 5585560, 4578131, 4281663, 5256891, 4773280, 4821512, 4290015, 4261963, 4233583, 4341930, 4876586, 4571193, 5469307, 5472615, 5300475, 5745568, 5004953, 4507735, 5621243, 5760824, 5243098, 4898098, 5757594, 5662035, 5298435, 5846288, 5249744, 4834558, 5679788, 5294710, 5331509, 5812627, 5726219, 5818924, 5176427, 5761853, 5687289, 6144036, 6406140, 6183861, 5584985, 5658212, 6237230, 5959536, 6941812, 7047374, 6085441, 5758708, 6380794, 5848304, 6777859, 6803417]
8501F803417j10272K21443P1943M4824p69657J06825J506482N64619p17058l5711
8491G686855k73837L06300n76661J78950N62397r36825M99864N51352q66058K18962
8481G351299M93102k99680o9516K36804J102190p97301m9750l72573N58318L56799
8471H509692m8915n34678O3044M29162O7932m16081N88582M54616n83293r2519
8461H437542J20829J316664j98537j80497j75943K20915q53365j79008P02978
8452I211578O62818K98922J24840k61319l57193Q32929r5087l74795N31700K56062
8442A0830455J85630O91557k84510l82952N95079O45026K78578K29688j6951K72382
8432A3043982P45621k5252q7746J77679N39843K60916M32815Q79296j362012l89157
$$ y = [6803417, 6693145, 6914588, 6986531, 7031355, 6261698, 6368523, 7875005, 8439624, 7722566, 7686855, 7413018, 7719318, 7142657, 7321607, 7884004, 6947179, 7447043, 7998395, 7132337, 7351299, 7844401, 7544721, 7475205, 7712009, 8814199, 8016898, 7967148, 7594575, 8152893, 8509692, 8460777, 7926099, 7989143, 8418305, 8486237, 8070156, 8658738, 9113354, 8530061, 8437542, 8558371, 9875035, 9676498, 9496001, 9320058, 9540973, 8687608, 8508600, 9211578, 9874396, 10173318, 10298158, 10036839, 9679646, 10512575, 10417488, 10042693, 10574393, 10830455, 11016085, 11707642, 11423132, 11040180, 11635259, 12280285, 12558863, 12788551, 12771600, 13043982, 13789603, 13764351, 13676605, 13854284, 14394127, 14655043, 15087858, 15967154, 14605142, 14215985]
8422A4215985M9j86782N4127L47148Q89122m81051M39163N17972j09132p77349
8412A4909252J142077j49714J136823p4358l75983R8982J49954O73304k84547
8403A7225790L45807J008451J04302j37852J65147N7074J660172R77210K81025
8394B1687126J734563Q9452M87190J656676K80947N96041J56592J68092K95836
8385B7152515o65915j242221j034411L91422M30242p00453k74956k83391o34072
8376B3138760K26149J76574P0845O81180L15980N74499k48134J88744n9963R24711
8366B5989345l856O8435J436507k65846P74172N6390J370080R70768P99736P50998
8356C1946729J701620J371620J093400K436842P77085P15877M24047j205246l24725
$$ y = [14215985, 14216034, 14029252, 14083379, 14430527, 15319649, 14838598, 15277761, 15795733, 15686601, 14909252, 16051329, 15901615, 17038438, 16964080, 16588097, 16687079, 16837033, 17510337, 17225790, 17571597, 18580048, 18684350, 18546498, 18711645, 18768719, 20428891, 21406101, 21687126, 23421689, 23511141, 23998331, 25655007, 25935954, 26531995, 26688587, 26856679, 27152515, 26486600, 25244379, 24209968, 24601390, 25031632, 24331179, 24056223, 23772832, 23138760, 23364909, 23541483, 23612328, 24293508, 24609488, 25183987, 24935853, 25124597, 25064634, 25989345, 25985489, 26053924, 27490431, 27224585, 27998757, 28055147, 29425227, 30395995, 31195731, 31946729, 33648349, 35019969, 36113369, 38550211, 39327296, 40043173, 40467220, 39261974, 38937249]
8347C8937249N78319R36127k99416Q26408K209122J358909J99299M72421J227089
8338D6445527N83638K035468J739345J453513J124198J074745J412170J159547
8330E7028151P77249J640079J15491n8714L64273J016044Q17625Q40829Q93178
8321F3434205J434222K967694Q26358J889952K823913K021202K720604J556233
8313G9674383K625077Q25482J715993K011353J570725J145058J053566J858952
8305I2480589R19442j91949j17380J44706P4343J64829P16671J541072K059632
8296I7791955J009518M58065j28296j86234j201633j293659k91664j61376l18573
8287I5678103p55589J34664J076261J62975O77505N17230J323769J205115J038229
$$ y = [38937249, 39515568, 40451695, 40152279, 40978687, 43187809, 44546718, 44746017, 45218438, 46445527, 47029165, 49064633, 50803978, 52257491, 53381689, 54456434, 55868604, 57028151, 57805400, 59445479, 59560970, 59502256, 59866529, 60882573, 61700198, 62541027, 63434205, 64868427, 67836121, 68662479, 70552431, 73376344, 75397546, 78118150, 79674383, 82299460, 83124942, 84840935, 86852288, 88423013, 89568071, 90621637, 92480589, 93400031, 93208082, 93090702, 93235408, 93309751, 93474580, 94191251, 95732323, 97791955, 98801473, 99259538, 99131242, 98945008, 97743375, 96449716, 96158052, 95996676, 95678103, 94922514, 95057178, 96133439, 96296414, 96973919, 97491149, 98814918, 100020033, 101058262]
8278A01058262K210489J476800J167766O53987J585304R30383J115012j269687
8270A08928316m18217j609282j371726j654729j611716o84537r73311k65335j000934
8261I9338529k73226m66465j175253j486292j727575j376469P4950q62392j766128
8252I0279679k77521j234439q47446r48005p47918j465210j360651n46396L55682
8243H3207775k95119j62860K75299J60224O63406m80451J564062P11040n01432
8234H5141944M95269J267594J258991Q15894J198290J480723M90694P13671O87802
8225I3550872M49757O77019Q96210K28472K09514R11736J114013m46392n20627
8216I7070574J190379j26096r95449p50786k85506j240863k098798l07746l2033
$$ y = [101058262, 103268751, 104745551, 105913317, 106567304, 108152608, 109082991, 110198003, 108928316, 108510099, 106900817, 105529091, 103874362, 102262646, 101578109, 100604798, 100339463, 99338529, 99065303, 98598838, 97423585, 95937293, 94209718, 92833249, 92908199, 92045807, 90279679, 90002158, 88767719, 87920273, 86972268, 86224350, 84759140, 83398489, 82852093, 83207775, 82912656, 82749796, 83025095, 83185319, 83848725, 83368274, 84932336, 85643376, 85141944, 85637213, 86904807, 88163798, 88979692, 90177982, 91658705, 92149399, 92863070, 93550872, 94000629, 94677648, 95573858, 95802330, 96011844, 96923580, 98037593, 97591201, 97070574, 98260953, 98134857, 97139408, 96388622, 96103116, 94862253, 92763455, 92455709, 92423676]
8207I2423676j64033L07599N30777j082663o37982o35856P24692J400498J741872
8198I4608580k12840J124145j995J569200R55886L776284m742780p021847L408225
8189I3462858O08267K178835K00964K29678o9662L11355J308583Q03208L5153
8180I9069239J637044R61866K399274J295373K427599J660322K802344K327026
8172A14580087M121449M248897N472983O181317O863463P980362P028824O894352
8164A63371734O371597O208708L877734M347979L441728K232699J488793K261739
8156A93602711K680939K700553Q86373J068731K25345j222089l057959k449145
8148A94435459k133260l211273j033038O73998J015011J948860j88558k892549
$$ y = [92423676, 92259643, 92567242, 93098019, 92015356, 91377374, 90741518, 91466210, 92866708, 94608580, 94395740, 95519885, 95517890, 97087090, 98042976, 101819260, 97076480, 90054633, 93462858, 94071125, 96249960, 96450924, 96680602, 96610940, 96922295, 98230878, 99034086, 99069239, 100706283, 101668149, 104067423, 105362796, 107790395, 109450717, 112253061, 114580087, 118701536, 122950433, 128423416, 134604733, 141468196, 149448558, 156477382, 163371734, 169743331, 175952039, 179829773, 184177752, 187619480, 189852179, 191340972, 193602711, 196283650, 198984203, 199870576, 200939307, 201164652, 199942563, 196884604, 194435459, 192302199, 189090926, 188057888, 188731886, 189746897, 191695757, 191507199, 188614650]
8140A88614650n540627o168226o866122n463345m092727k036804L73984K118041
8132A60938824J762402K864964M571452L682823K478327K150372J804136J197389
8124A81450689J069005o60635L19304O64601O55437O1253J653808J446841R57644
8115A87617947O83472l70084r63884j670446r81016Q82670J989694L091018J133963
8106A91413334j580738o665771j0252022j1037961j1758920j0097311q664006
8099A31356605o647989m844271m194723l882918l691152k659665k348872k923793
8091A00163222j545138q91150j829159j598728j63538q36288n72547L48835L280
8082I3078789J080144O8967L36844J523774J429295K580791J366583K101336K437115
$$ y = [188614650, 183074023, 176905797, 170039675, 164576330, 160483603, 158446799, 158820783, 160938824, 162701226, 165566190, 170137642, 173820465, 176298792, 178449164, 180253300, 181450689, 182519694, 181859059, 182178363, 182842964, 183498401, 183559654, 185213462, 186660303, 187617947, 188301419, 187931335, 186967451, 185297005, 184315989, 185198659, 187188353, 190279371, 191413334, 189832596, 183166825, 172914803, 161876842, 150117922, 140020611, 131356605, 124708616, 119864345, 115669622, 111786704, 108095552, 105435887, 103087015, 100163222, 98618084, 97726934, 95897775, 94299047, 94135509, 93299221, 92726674, 93075509, 93078789, 94158933, 94227900, 94564744, 96088518, 97517813, 100098604, 101465187, 103566523, 106003638]
8073A06003638L520912L572097L658979L514301J972678J753220J456207J168275
8065A26620307R06258Q10835p30631r44197j356115M70176p61891j513102j764266
8056A21737374j675799j894888k602724j547614p11418k42054j007775R1813r07585
8047A11239330J063425O55844K126344K814971K916081K220234M491393M679217
8039A32206839L388068N140822M683746M187082M370962O211506M417475M263549
8031A68870049L943456M912964K097058K246209J204529N65579K505486J976245
8023A88321575J524838J371124R55391P34542J308715J949337J429427J718191
8015A99313140K608168M888391Q500853J2112067J6565526J3012273k811084k2241102
$$ y = [106003638, 109524550, 113096647, 116755626, 120269927, 122242605, 123995825, 125452032, 126620307, 127526565, 128337400, 127606769, 126662572, 125306457, 125776633, 125014742, 123501640, 121737374, 120061575, 118166687, 115563963, 114016349, 113304931, 113062877, 112055102, 112146915, 111239330, 112302755, 112958599, 115084943, 117899914, 120815995, 123036229, 127527622, 132206839, 135594907, 140735729, 145419475, 149606557, 153977519, 160189025, 164606500, 168870049, 172813505, 177726469, 179823527, 182069736, 183274265, 183839844, 186345330, 188321575, 189846413, 191217537, 192172928, 192907470, 194216185, 196165522, 197594949, 199313140, 201921308, 206809699, 215310552, 227422619, 243988145, 257000418, 254189334, 231948232]
8007B31948232j9211181j7395316j6021566j3033217j1058643p486020n700806
8000A42041483l604440k704459k137706k047250j426967o46460l79110o47888
7992A28447203L41061L32809J224006J450400K335891R78683K043081R79757J089510
7983A39222401P52333p000J966616J88099N9090Q8191j76039k00157K3564k011168
7973A39905930l038972j682647j140105k954883k212172k125226j848829j933454
7965A22969642j82327p78254j595995P40354j185886j202157N45575m53835j34608
7956A18722509L78381j332435Q5204o95919n34310o38935j162951P9684J106797
7947A16008025j293112l17286l79691O14452J380560k06255O13633J99829J273149
$$ y = [231948232, 212737051, 195341735, 179320169, 166286952, 155228309, 147742289, 142041483, 138437043, 135732584, 133594878, 131547628, 130120661, 129474201, 129095091, 128447203, 128788264, 129121073, 130345079, 131795479, 134131370, 135110053, 137153134, 138132891, 139222401, 139974734, 139967734, 141934350, 142122449, 142181539, 142269730, 142093691, 141893534, 141917098, 139905930, 136866958, 135184311, 134044206, 131089323, 128877151, 126751925, 124903096, 122969642, 122787315, 122009061, 120413066, 121153420, 119967534, 118765377, 119310952, 118857117, 118722509, 119100890, 117768455, 117853659, 117157740, 116623430, 115984495, 114821544, 114901228, 116008025, 114714913, 114397627, 114017936, 114632388, 116012948, 115806693, 116420326, 116620155, 117893304]
7938A17893304m35825N02620R57140j358061J342630P20882p2799Q44702n0589
7929A20344004M75099J800132J508889J413121K375415L792598L430711M805398
7921A39945367L947256P152221O496320O716832Q087047J0095957J1840491J3853692
7913B08135183J5168307J2103244Q144522P03027o494566r810748j0648800j0166235
7905B07133934q532636q921669o581542m913317m967811m456738m155087m273811
7897A60331323l932449m289556m118174n270079n054681k802783l972185l046612
7889A27844804k580839j513528j083314j29558J492020J382435J799542L003958
7881A30215520M070437M610851O250287O842207Q694437P953614O107757K168856
$$ y = [117893304, 117457479, 117960099, 118917239, 117559178, 118901808, 119622690, 119549891, 120394593, 120344004, 120819103, 122619235, 124128124, 125541245, 127916660, 131709258, 135139969, 139945367, 143892623, 151044844, 157541164, 164257996, 172345043, 182441000, 194281491, 208135183, 223303490, 235406734, 243551256, 244254283, 237759717, 227948969, 217300169, 207133934, 198601298, 189679629, 183098087, 178184770, 173216959, 168760221, 164605134, 160331323, 156398874, 152109318, 147991144, 142721065, 137666384, 134863601, 130891416, 127844804, 125263965, 123750437, 122667123, 122537565, 124029585, 125412020, 127211562, 130215520, 134285957, 138896808, 145147095, 151989302, 160683739, 168637353, 174745110, 176913966]
7873A76913966k294795o362936o947859o186411m517940n994458m481138k924029
7865A37204400l227026l127228k634868l087758l575182k742534l775202m658756
7857A10375846l039623l824846m474356l476976m135083k288474k744187k239963
7849H4152338q68229j139852j801422j287679l62650j583978n46609j181164K22062
7840G5602817k416393j467107J462997M9133K04649j689021o18513p94933j532752
7831F8800877j672912q51342j756142j192947l76020m95093M8287n66731k36995
7822F1700982o36624j459724j869736j004565k16909p57329q73967O67357K275
7813E5551760j251665J163710k2777M03454R55071J327286L1599l02163J246660
$$ y = [176913966, 174619171, 168256235, 161308376, 155121965, 150604025, 144609567, 140128429, 137204400, 133977374, 130850146, 128215278, 125127520, 121552338, 118809804, 115034602, 110375846, 107336223, 103511377, 99037021, 95560045, 91424962, 89136488, 86392301, 84152338, 83284109, 82144257, 80342835, 79055156, 78692506, 77108528, 76561919, 75380755, 75602817, 73186424, 71719317, 73182314, 73231447, 73436096, 71747075, 71128562, 70333629, 68800877, 67127965, 66276623, 64520481, 63327534, 62951514, 62456421, 62504708, 61937977, 61700982, 61064358, 59604634, 57734898, 56730333, 56513424, 55756095, 54882128, 55549485, 55551760, 54300095, 55463805, 55441028, 55844482, 56799553, 58126839, 58158438, 57856275, 59102935]
7804E9102935J428333J466720J721877J669726Q65713J420607j26981q36583j868831
7795F4843516k071436k179508k916787k224141j713561R3361r36360j479786j348207
7786E0067091k100914j233020j359359j403769j408750j068031p0161M56709n60708
7777D1319088o90444j724329J73615M40360j470899N38463m0633M22639j53680
7768C8814180o47476K84847o38485l44394Q4774J513658o59020j357370o30072
7759C6420642p88464q60363q03687j020132n97945q56337r33960M06517r14366
7750C0051905p45041p96872j188699j83126j361664r23747j9597k17702l69275
7741B4246182o79296j347082O4725r70599o27866K31641m87999m39517j14234
$$ y = [59102935, 60531268, 61997988, 63719865, 65389591, 66255304, 67675911, 67548930, 66712347, 64843516, 62772080, 60592572, 57675785, 55451644, 53738083, 53831444, 52895084, 51415298, 50067091, 47966177, 46733157, 45373798, 43970029, 42561279, 41493248, 41423087, 41879796, 41319088, 40628644, 38904315, 39077930, 39518290, 38047391, 38585854, 38545221, 38967860, 38814180, 38166704, 38451551, 37813066, 37468672, 37553446, 39067104, 38408084, 37050714, 36420642, 35632178, 34771815, 33968128, 32947996, 32350051, 31493714, 30559754, 30966271, 30051905, 29306864, 28509992, 27321293, 27138167, 25776503, 24852756, 24833159, 24615457, 24246182, 23566886, 22219804, 22284529, 21313930, 20686064, 20917705, 20429706, 19990189, 19875955]
7732A9875955o07080K65129L41149r8969k15535n7204n33759m36669M60272q9811
7722A8903478l79542k51402L20417j85747K87740j258047L88920j25121j113868
7713A6586828p93720L9176J2618L46061J36536m64671m95082l34527k32628N08748
7703A5309339o50272m9806L71994M05128l97358j14778q316p23867L89165l77040
7693A4154189k47620O870L41776L43830L197n31839q5466o4764l66953K73614
7683A3826834p9201J18560n26600k20251j34148l44403m94728j63673J580572
7674A3562962m36194j389360R13248q08971Q64680l37940m60877J149030o87721
7665A2368857m80965L33717m86637k35004L30454P8001q33445M73817N23916q58146
$$ y = [19875955, 19268875, 19534004, 19875153, 19776184, 19560649, 19503445, 18969686, 18533017, 18993289, 18903478, 18523936, 18272534, 18592951, 18407204, 18694944, 17436897, 17825817, 17700696, 16586828, 15793108, 15832284, 15844902, 16190963, 16327499, 15862828, 15367746, 15033219, 14800591, 15309339, 14659067, 14609261, 14981255, 15386383, 14989025, 14874247, 14865931, 14142064, 14531229, 14154189, 13906569, 13913439, 14255215, 14599045, 14602242, 14070403, 13984937, 13920173, 13553220, 13826834, 13747633, 13866193, 13339593, 13119342, 12985194, 12640791, 12146063, 11982390, 13562962, 13126768, 11737408, 12650656, 11841685, 12706365, 12368425, 11907548, 13056578, 12368857, 11887892, 12221609, 11734972, 11499968, 11830422, 11908423, 11074978, 11548795, 12072711, 11214565]
7655A1214565p57185J44991Q19595J4065j20287l86543L22692n64434q84451l00487
7645I502521P12383n45902M84858K55106L72538p17763L03467R07141j013208
7636A0261141O50567l0207n84652R21842m1639l92584N4943r94319j42297O98572
7626A0401367l03294M85229N66256k68923P0544L11656j9702k4538j321072K8290
7616I925813Q14876K22449N6451q04851L18196j53770m2119l14527J88701M96761
7606A0707980j15464j16086L70087m46934p62895M85666p7104J69897K66593r0080
7596A0391660L25468K73200k41122l83522j111305l32127O53839P29691q2213
7587A0223569K19043l91077Q94742O73518m30231o09791J21410J28735l27404
$$ y = [11214565, 10457380, 10602371, 11421966, 11436031, 11315744, 10929201, 11251893, 10687459, 9803008, 9502521, 10214904, 9669002, 10153860, 10408966, 10781504, 10063741, 10367208, 11274349, 10261141, 10911708, 10881501, 10296849, 11218691, 11177052, 10784468, 10839411, 9845092, 9702795, 10401367, 10098073, 10583302, 11149558, 10880635, 10951179, 11262835, 11243133, 11218595, 9897523, 9925813, 10740689, 10963138, 11019589, 10214738, 10532934, 10379164, 10337045, 10022518, 10211219, 10707980, 10592516, 10476430, 10846517, 10399583, 9636688, 10122354, 10045250, 10215147, 10481740, 10391660, 10717128, 10990328, 10749206, 10365684, 9254379, 8922252, 9576091, 10305782, 10223569, 10442612, 10051535, 10946277, 11619795, 11189564, 10579773, 10701183, 10829918, 10502514]
7578A0502514N96823n87558j93537O81023j203243m3210K70672R47441l07205
7569A0663720J59458J90857p21237K95582o11796M21022l40597O6227O64525K51913
7559A1039674n71177j01165n77877N1607j14294l24880P94446L57590q70097l95725
7549I288102R36574K06643o493K93138j264411m42495k21271Q12108M08487j14315
7539I896067P02906l1199L94070J8304k20858j170364N77082J305261J37909j352405
7529A0256773j30809L89989n8958j20936k03129Q7638J030605K58629l46927M59907
7519A1622782p9021N2534q42841p06137J349124l82487n89592k58328L23818L55010
7509A0844862J013878r63962n75965J327548r09931k8568M15594j217040L60137
$$ y = [10502514, 11099337, 10511779, 10318242, 10999265, 9796022, 9752812, 10023484, 10970925, 10663720, 10823178, 11014035, 10292798, 10588380, 9976584, 10397606, 10057009, 10123236, 10787761, 11039674, 10468497, 10367332, 9789455, 9841062, 9726768, 9401888, 10196334, 10553924, 9683827, 9288102, 10224676, 10431319, 10424826, 10717964, 9453553, 9011058, 8789787, 9601895, 10010382, 9896067, 10598973, 10567774, 10961844, 10980148, 10759290, 9588926, 10166008, 11471269, 11609178, 10256773, 10125964, 10515953, 10456995, 10336059, 10132930, 10220568, 11251173, 11509802, 11162875, 11622782, 11543761, 11596295, 10753454, 10047317, 11396441, 11013954, 10424362, 10166034, 10489852, 10844862, 11858740, 10894778, 10318813, 11646361, 10736430, 10707862, 11123456, 9906416, 10266553]
7500A0266553J035519m65927M79608k49302l16978m56696j14108j94344Q90165
7491A0874490K33841n15387j46164P36842N91240m23079O52376M1997j260437
7482A0785719n66175J608480N66528j713264O50351k42403k53183M31178l11670
7473A0955561J252809M31165j917294N77866j058292J065125P07439J12663m55152
7464A1671890Q6212m66893N19746k87863m95004J21435j02249O81825N41895m14106
7454A1856888L93154J177754n35977m9131k63171R3053N7117j11915p98632M93908
7444A2313048J73498J99312o08910k53341K98691J51435J64760J88325J64828
7435A2791646q3802n67566J65719K36509k80783L30278M03291l95302n2271m04863
$$ y = [10266553, 11302072, 10836145, 11315753, 11066451, 10749473, 10292777, 10178669, 9984325, 10874490, 11108331, 10592944, 10446780, 11183622, 11774862, 11351783, 12004159, 12046156, 10785719, 10219544, 11828024, 12394552, 10681288, 11331639, 11089236, 10836053, 11267231, 10955561, 12208370, 12639535, 10722241, 11300107, 10241815, 11306940, 12014379, 12127042, 11671890, 11758102, 11291209, 11810955, 11523092, 11028088, 11149523, 11047274, 11729099, 12270994, 11856888, 12250042, 13427796, 12891819, 12842688, 12579517, 12672570, 12729687, 12617772, 11819140, 12313048, 12486546, 12685858, 12076948, 11823607, 12122298, 12273733, 12438493, 12626818, 12791646, 12707844, 12140278, 12305997, 12542506, 12261723, 12592001, 12995292, 12599990, 12547719, 12142856]
7425A2142856K69314P83578K21619Q02069O76341L70369j365380l57864R72783
7416A4515685N89039J26430J611253k26241p60817M39512j131760k04036K25142
7407A5184207J88888L32582J14211O01146m50234J08920M44037O52027O26556
7398A7802340p48156k89416J49776J267123j466052O30709J15326m8906K9383
7389A7442127K49853j279110p01825k83225O38312L58791o34864m0225P96678
7380A6546512k33846Q54880n48293Q07118j96214p1126P02340j87044J021650
7371A8695977M78118J788545j95627l38165l96453M01958j02359p21991L05838
7362A9915841o45185K59679n43280k88415M44753N37867R734p79726M64360m24154
$$ y = [12142856, 12412170, 13195748, 13417367, 14219436, 14895777, 15266146, 13900766, 13542902, 14515685, 15104724, 15231154, 16842407, 16616166, 15855349, 16294861, 15163101, 14959065, 15184207, 15373095, 15705677, 15819888, 16421034, 15970800, 16079720, 16523757, 17175784, 17802340, 17054184, 16764768, 16914544, 18181667, 16715615, 17346324, 17461650, 17412744, 17442127, 17691980, 16412870, 15711045, 15427820, 16066132, 16424923, 15790059, 15749834, 16546512, 16312666, 17167546, 16619253, 17426371, 17230157, 17159031, 17861371, 17674327, 18695977, 19174095, 20962640, 20767013, 20428848, 20032395, 20434353, 20331994, 19610003, 19915841, 19270656, 19530335, 18987055, 18698640, 19143393, 19681260, 19690994, 18911268, 19375628, 18951474]
7352A8951474O29063m68931K43486j239573p68914p8122Q6282l66289L7555Q59802
7342A7885833k51096J11682K8166K60488p66408M42817Q17835j34708r8091J062526
7332A9359044Q08925r68628j024677m22659J68058L41603j45414o65028o62804
7323A6788420N29247l08910k26421P45279M905r43379M41139P15787j96470N12833
7313A8062430j42938M35114k92291m33890q70859L93752M65696R96507j23488
7304A8490033n42288p56114J0198m94625O20788k78472k93253M50724k42788L68944
7294A7333147j26776M12178l78457k63853K40811O70715q88512n85983p73581
7285A5639689l21287O41284R57877N39899o59589n26305n39716P99267P08836
$$ y = [18951474, 19580537, 19111606, 19355092, 18115519, 17346605, 17268483, 17354765, 16988476, 17026031, 17885833, 17634737, 17746419, 17774585, 18035073, 17268665, 17711482, 18529317, 18394609, 18296518, 19359044, 20167969, 19199341, 18174664, 17752005, 17920063, 18261666, 18116252, 17451224, 16788420, 17317667, 17008757, 16782336, 17527615, 17532520, 16589141, 17030280, 17746067, 17549597, 18062430, 17919492, 18354606, 18062315, 17628425, 16757566, 17151318, 17617014, 18613521, 18490033, 17947745, 17191631, 17201829, 16707204, 17327992, 17049520, 16756267, 17206991, 16964203, 17333147, 17206371, 17618549, 17240092, 16976239, 17217050, 17887765, 16999253, 16413270, 15639689, 15318402, 15959686, 16917563, 17457462, 16797873, 16271568, 15731852, 16531119, 17239955]
7276A7239955j038559P584R03478L34277M8176q6000l32836j53659J221435m62921
7266A7680930K27709m88158m78457L1611J64732P6668o4306m72841k84547m72767
7256A5920574J04463M92604K96657r4044k09554N84741k62541O83373o79060k46808
7246A6590405N42554L23390j090209m98184L0050O97491P03283r40815J2821L06619
7236A6677405L52506k61246j335057M96256J19446P45718Q93498K05295m13901
7227A7479920q3683N86476j083693n43346m0705O7574o40979p27521J267923J163687
7217A7445653J82926R3501j846552M33207O73116L75899p6023o60240N21183l62313
7207A6780357R5717l19358O12126L68735o05766m39332K20372M39449K4500K54579
$$ y = [17239955, 16201396, 16208980, 17112458, 17446735, 17494911, 17408911, 17076075, 16922416, 18143851, 17680930, 17908639, 17420481, 16942024, 16973635, 17138367, 17215035, 17150729, 16677888, 16393341, 15920574, 16025037, 16517641, 16814298, 16720254, 16510700, 17095441, 16832900, 17516273, 16837213, 16590405, 17132959, 17456349, 16366140, 15867956, 15898006, 16595497, 17298780, 16357965, 16370786, 16677405, 17029911, 16768665, 15433608, 15929864, 16049310, 16795028, 17688526, 17893821, 17479920, 17396237, 17982713, 16899020, 16355674, 16314969, 16382543, 15741564, 15014043, 16281966, 17445653, 17628579, 17722080, 15875528, 16308735, 16981851, 17357750, 17281727, 16621487, 17142670, 16780357, 16876074, 16556716, 17168842, 17537577, 16931811, 16492479, 16712851, 17152300, 17176800, 17431379]
7197A7431379r02351r9591O33387o90305K74363N846Q4481J35776k44589r41041
7187A5687355R56250M82480J67006J0515l50425M60601M22063j005474l22762
7178A6507609M77381O43377n89781q51050M76706j9688K07788L17835o07658L42354
7168A6904873o14089J68740M95423k36645n26192l50028N91037r4205R0346L09523
7158A6738783P27091K88759k10467J38034n26884r66214J097786L94189M99578
7149A8180655r58811K23602J007468o2142q76667K24726n87097l02555P84068
7140A7633247N27524J57481j73382M27011n75249p13656m21308J3802J55180j14437
7130A6916213k24381n58439q2187l69376O62177O24270o36775K12592N8155n31485
$$ y = [17431379, 16529028, 16429437, 17062824, 16372519, 16646882, 16652728, 16737209, 16872985, 16628396, 15687355, 16643605, 17126085, 17293091, 17303606, 16953181, 17413782, 17835845, 16830371, 16507609, 16984990, 17628367, 17038586, 16187536, 16664242, 16644554, 16852342, 17170177, 16562519, 16904873, 16290784, 16459524, 16954947, 16718302, 16192110, 15842082, 16433119, 16338914, 16429260, 16738783, 17465874, 17754633, 17544166, 17682200, 17155316, 16189102, 17286888, 17681077, 18180655, 17221844, 17445446, 18452914, 18390772, 17514105, 17738831, 17151734, 16849179, 17633247, 18160771, 18318252, 18144870, 18571881, 17996632, 17282976, 16861668, 16875470, 17030650, 16916213, 16691832, 16133393, 16051206, 15681830, 16344007, 16968277, 16331502, 16544094, 16602249, 16070764]
7120A6070764N31871r5908K46035K61908k11095l1775L61757m88144p92047J20564
7110A5973930P20039p8255m1112P30347m35591o5834K4503M6254j3422j81416
7100A6679443l71650P79593p7739o1783K59294p38159M6377L19258j373846k48886
7090A5211902L9036k59860N69277M55560J78839K15073l1720r21879N4218O11197
7080A6121643j94251j456442R85704R29962j756676J72922p64137K282J018548
7071A5059555J017672l05119L28574Q01155n23525p76481k19580P3427n36436
7062A4919242n99825K0259Q47002M59560j63844J28161m71104o32563M91359k80287
7052A4717960n96671j21141M2727m81606J93492O52443o45934p4646J39915n51866
$$ y = [16070764, 16602635, 16506727, 16752762, 17014670, 16803575, 16771800, 17133557, 16645413, 15853366, 15973930, 16693969, 16615714, 16574602, 17304949, 16869358, 16803524, 16828027, 16874281, 16860859, 16679443, 16307793, 17087386, 17009647, 16947864, 17207158, 16468999, 16515376, 16834634, 15460788, 15211902, 15250938, 14991078, 15560355, 16015915, 16194754, 16409827, 16378107, 15456228, 15510446, 16121643, 15927392, 14470950, 15456654, 16386616, 14629940, 14802862, 14038725, 14041007, 15059555, 16077227, 15772108, 16100682, 16901837, 16378312, 15601831, 15382251, 15455678, 14919242, 14319417, 14339676, 15186678, 15646238, 15482394, 15610555, 15139451, 14506888, 14998247, 14717960, 14121289, 14000148, 14042875, 13561269, 13754761, 14407204, 13761270, 13686624, 13826539, 13274673]
7042A3274673q30529J008468M90936M577J47968P2477j40876r34261k89507L54317
7032A3158243J02681l11375K45239J9315K97026p63172k82508M16199M93416n3190
7022A3321874J84220j071827q06392O79126m52739o86522P06854o9026j27082
7013A1678486J01381j25892K96984p4829J78276K6484o24910m74286m3986P99840
7003A1737548M3174k36290j7586m11482K19698J95897l30695q74074k43824L90358
6993A0472724O68512R4744Q7051j69801j46457m48431p2185O40597j080953m35815
6983I609986O88956K3176k60902o08275M92623O51345j85420M24082o27075k62364
6973I946132n41525O97797J48071J46730n62085M0139R22819M95089r69377j089865
$$ y = [13274673, 12444144, 13452612, 13943548, 13948125, 14096093, 14168570, 14027694, 13093433, 12803926, 13158243, 13260924, 12949549, 13194788, 13214103, 13511129, 12747957, 12465449, 12881648, 13375064, 13321874, 13506094, 12434267, 11627875, 12307001, 11854262, 11167740, 11874594, 11805568, 11678486, 11779867, 11653975, 11950959, 11876130, 12054406, 12080890, 11455980, 10981694, 10937708, 11737548, 11780722, 11544432, 11526846, 11115364, 11335062, 11530959, 11200264, 10326190, 10082366, 10472724, 11141236, 11235980, 11323031, 11153230, 11006773, 10558342, 10486157, 11126754, 10045801, 9609986, 10298942, 10322118, 10061216, 9452941, 9945564, 10596909, 10411489, 10835571, 10208496, 9946132, 9404607, 10102404, 10250475, 10397205, 9835120, 9875259, 10798078, 11293167, 10323790, 9233925]
6963I233925J57582J24341J178258r08187j795280J111364Q40440j23085J0531
6954I829889R7077q75269J78903J62814J02992L9635j494332M30610M55151N04621
6944I432091l64720l75070J64154m18874Q46108Q0671K24681J84266p91123M93739
6934I475923O61781l95095p92079j7423M73167Q41361J39040K02305j79577j134666
6924I274737J48431o9036o95667J84939l02431R9029Q41337j08450p93028n0530
6914H529331O64853J04610K19401l14817K77073j93884r59679k13259L91859N40268
6904I045756Q2796J301611r45294K15606N74809k80712O02751j84272r46545o06096
6894H860410M32250Q89066K98471o23132j42209L84211j346704Q39950j167620
$$ y = [9233925, 9391507, 9515848, 10694106, 9785919, 7990639, 9102003, 9942443, 9819358, 9829889, 9926966, 9051697, 9230600, 9393414, 9496406, 9536041, 8041709, 8472319, 8927470, 9432091, 9067371, 8692301, 8856455, 8437581, 9283689, 9364360, 9589041, 9773307, 8982184, 9475923, 10137704, 9742609, 8950530, 8933107, 9406274, 10247635, 10386675, 10588980, 10409403, 9274737, 9423168, 9354132, 8658465, 8843404, 8540973, 8640002, 9481339, 9372889, 8579861, 8529331, 9194184, 9298794, 9518195, 9203378, 9480451, 9286567, 8326888, 8113629, 8505488, 9045756, 9128552, 10430163, 9484869, 9700475, 10275284, 9994572, 10597323, 10413051, 9466506, 8860410, 9292660, 10181726, 10480197, 9857065, 9714856, 10099067, 8752363, 9592313, 8424693]
6885H424693k56429j89570Q18053k62664K57646j42747l63560j96998J70680K2232
6875H281336q4419L52352j52636l75243J8609j49788m78243Q34847p49383O2660
6865G560092R12678L5282m15401O2231k33863j31283J70744P06574j45755j626043
6855F895256k0514J016599N41950k9714j2750k74839j198740O5963J26507K94724
6845G404442Q316l99106o39677O39673j87275J68343O97367j7696l23942R10859
6835H261304N83756j433142p04183M11070L78395m25693R17066n56222j494642
6826E937709J839711J57208K78232J17210j21273p21949j17826Q3738N29811q64410
6816G118161L87645L32624m3004M98626M16720q9745O15178R5386q51118k14556
$$ y = [8424693, 8168264, 7978694, 8796747, 8534083, 8791729, 8648982, 8285422, 8088424, 8259104, 8281336, 8196917, 8549269, 8396633, 8021390, 8039999, 7890211, 7411968, 8246815, 7497432, 7560092, 8472770, 8508052, 8092651, 8154882, 7921019, 7789736, 7960480, 8667054, 8521299, 6895256, 6874742, 7891341, 8433291, 8403577, 8390827, 8115988, 6917248, 6983211, 7109718, 7404442, 7412758, 7013652, 6373975, 7013648, 6826373, 6994716, 7692083, 7674387, 7350445, 8261304, 8845060, 7411918, 6707735, 7118805, 7497200, 7071507, 7988573, 7432351, 5937709, 7777420, 7934628, 8212860, 8330070, 8208797, 7486848, 7369022, 7452760, 7982571, 7118161, 7505806, 7838430, 7795426, 8294052, 8710772, 8621027, 9236205, 9331591, 8480473, 8265917]
6806H265917P75977k86005p88669L41307n5326k83060L8613K29334L08468L09845
6796H856401m38874l6671q35864L49067N29192l65604q71515j28218L71870l46201
6786G083583K92346o2222k72318J3018l17756j21460J022046J108586k68253o50684
6776G826886Q66850p31077L87432J60611n53181k94362P94996l71887n75474J582562
6766I093356K92176r01332p15439Q03051k03700p18726k13066l55837o89797K86265
6756F676951L13536m89539M21433l6003m32600K11050K36663N27777k48508k86234
6746F894526n52461p87487R9031q76260M83506K17720p8857J353724l50560q61103
6736E541779l19643R93558J4855M77909J008274o97731j195306q22902N03499
$$ y = [8265917, 9041894, 8755889, 7967220, 8308527, 8253201, 7970141, 8008754, 8238088, 8546556, 8856401, 8417527, 8380856, 7544992, 7894059, 8423251, 8057647, 7186132, 7057914, 7429784, 7083583, 7375929, 7313707, 7041389, 7054407, 6736651, 6615191, 7637237, 8745823, 8477570, 7826886, 8693736, 7962659, 8350091, 8510702, 7957521, 7663159, 8458155, 8086268, 7510794, 9093356, 9385532, 8484200, 7768761, 8571812, 8368112, 7649386, 7436320, 7080483, 6390686, 6676951, 6990487, 6500948, 6922381, 6886378, 6453778, 6664828, 6901491, 7429268, 7180760, 6894526, 6342065, 5554578, 5653609, 4777349, 5260855, 5478575, 5399718, 6753442, 6402882, 5541779, 5222136, 6215694, 6230549, 6708458, 7716732, 7019001, 5823695, 5000793, 5504292]
6727E504292N63378n06858j000970K15639J416859j083530P19263J07014l29851
6718E605236j31457O36137j24755j040253j351407P39598j61828P42271n32871
6709D380671r80837Q75270k31061l93260R9888L94347l37494M2734j75229L69084
6699D044113j29036K54023l17564n0590k52299q91507j89532P31685N79760p09849
6689C069204L23047L9937K79505m33709N50242k0116r28776j057865L45251R64689
6679C131409n01903l38712O28852j038519P55255J413336q21484J44024K92109
6670C664367K81053n63050O48578m22544R7448j42776J6217L49525L0352R81131
6660D940301m86643n14222M79023r58006Q61360p6617n35364Q46034j186692r60299
$$ y = [5504292, 6067670, 5560812, 4559842, 4775481, 6192340, 5108810, 5828073, 5935087, 5605236, 5473779, 6109916, 5985161, 4944908, 3593501, 4333099, 4171271, 4913542, 4380671, 3399834, 4275104, 4044043, 3650783, 3750671, 4145018, 3807524, 3850258, 3675029, 4044113, 3915077, 4169100, 3851536, 3800946, 3548647, 2657140, 2467608, 3199293, 3779053, 3069204, 3392251, 3432188, 3711693, 3277984, 3828226, 3808110, 2879334, 1821469, 2166720, 3131409, 2629506, 2290794, 2919646, 1881127, 2636382, 4049718, 3228234, 3372258, 3664367, 3945420, 3382370, 4030948, 3608404, 3705852, 3563076, 3579293, 3928818, 3959170, 4940301, 4453658, 3939436, 4418459, 3460453, 4321813, 4245196, 3709832, 4555866, 3369174, 2408875]
6650B408875J391309j59477o9064j04427J111923j189793m82733K57230J76596
6641C340439p58077k74034J488943p46136R04328k10175j160040K08400l48187
6632B445461j97864O84703K04765L62L12160R4059q02132p67237J55953R9741
6622B229971l64806M67721o55033N98767N95739k776L55219l29206k30233M67948
6612C133311j58766o44676m13016M38377o37316J081576M9110m46854R11015J2830
6602C325591o41947J99143O62880J27528j047781l05653R77153o09441L63154
6593C050627m95905m5162J86086J91164N4482R9962q14102J40695P91903j088496
6583B071254P26936L07974n34722n89458j16937R96332J63649M94376j092926
$$ y = [2408875, 3800184, 3640707, 3571643, 3467216, 4579139, 3389346, 2906613, 3163843, 3340439, 2582362, 2308328, 3797271, 3051135, 3955463, 3745288, 2585248, 2793648, 2445461, 2247597, 2932300, 3137065, 3137427, 3449587, 3543646, 2741514, 1974277, 2130230, 2229971, 1865165, 2332886, 1677853, 2276620, 2872359, 2869583, 3224802, 2895596, 2665363, 3133311, 2974545, 2329869, 1916853, 2355230, 1717914, 2799490, 2848600, 2401746, 3312761, 3325591, 2683644, 2882787, 3545667, 3673195, 2625414, 2319761, 3296914, 2687473, 3050627, 2554722, 2509560, 2695646, 2886810, 2941292, 3041254, 2227152, 2367847, 3159750, 2071254, 2798190, 3106164, 2571442, 1981984, 1865047, 2861379, 3025028, 3519404, 2426478]
6574B426478p13192m32881Q21895o8961l71592L33157M79065j8937M51470j64972
6564B741530m25128J008163J6417r16647n35608L45972O94386l33056p10247J44550
6554B030332J82983L26540m24743L32210p31085q37151J022311j91343L30000
6545B040054J84128m04559q19355M67939l1062L8116R31130l19863R2042k72646
6535A905924m22834P35386j39952n02949p13310L09512M59142l5484N77507J78305
6525B351247m08173l8368j09949L76444K94595J27772r45871j031474Q24841O46479
6515B087543M7875j191702L14931q8572K37388M94285j91823l53356m932O61046
6505B012683n80298l91733l45384m02510O8387Q4431O547k03302L80162k44792
$$ y = [2426478, 1713286, 1280405, 2102300, 2033339, 1661747, 1994904, 2473969, 2455032, 2906502, 2741530, 2316402, 3324565, 3340982, 2424335, 1888727, 2234699, 2929085, 2596029, 1885782, 2030332, 2213315, 2539855, 2115112, 2447322, 1716237, 879086, 1901397, 1710054, 2040054, 2224182, 1819623, 1000268, 1468207, 1437145, 1475261, 2406391, 2086528, 2178570, 1905924, 1483090, 2218476, 2078524, 1575575, 862265, 1171777, 1630919, 1595435, 2172942, 2351247, 1943074, 1904706, 1794757, 2171201, 2465796, 2593568, 1647697, 616223, 1441064, 2087543, 2135418, 943716, 1258647, 1170075, 1407463, 1901748, 1709925, 1356569, 1351637, 2012683, 1432385, 1040652, 695268, 292758, 361145, 445576, 452123, 248821, 628983, 384191]
6495C84191J67984N28685M96110j10556k35221J69142L12847K08555M91200q05459
6485A607478m32398K59764M54715l61820q2533O57796P87494j012831l77060k73516
6475A227089m50585K11976M8345R45996N74772n64947p77308j25091K65814m99719
6465H56342L9949n01758R1356K27262j00888j19118N09878R51573o82893L78517
6455A650220O61560r46564j65923Q31830J44719j766579j94494P53180M74318
6446A442267j59888Q7170L66376m3861m01525K30306m14908p77321Q83547K14462
6436A426625n91781J115416N02096j058942l51484m25573P69040J220439p43958
6427A861878n17201J006489l11444j75782R82587q96409q78362k71817j53169
$$ y = [384191, 552175, 1080860, 1576970, 1466414, 1231193, 1400335, 1713182, 1921737, 2412937, 1607478, 1175080, 1434844, 1889559, 1527739, 1445206, 2103002, 2890496, 1877665, 1500605, 1227089, 776504, 988480, 1036825, 1982821, 2557593, 1992646, 1215338, 1090247, 1356061, 856342, 896291, 394533, 485889, 713151, 612263, 493145, 1003023, 1954596, 1271703, 1650220, 2311780, 1365216, 1199293, 2031123, 2175842, 409263, 214769, 967949, 1442267, 1282379, 1369549, 1735925, 1692064, 1290539, 1520845, 1105937, 328616, 1212163, 1426625, 834844, 1950260, 2452356, 1393414, 1041930, 616357, 1385397, 2605836, 1861878, 1344677, 2351166, 2039722, 1863940, 2846527, 1950118, 1071756, 799939, 646770]
6418F46770J51930m33299l34241l22004M96425P76016k37529k02097M84984P23655
6408A750610n43313j06970o7660k82489Q26990j95756J54216j221886P43352R0555
6398A147649j1898q9714m84406O80995N55679m6473k85161j183060j53721J31514
6388B61404J704421K14673m04942l63502M20483o14066k32595n98991L53152M66431
6378A206468O61306M29799j359132L80286L30894m51141N4685o4668n80806P29457
6368A337148j62578M73743k36015j380797R6265J350009o1997n01200l16488O18220
6358A216310K99336j158505l3642O79542N22115M04303R1749j027289j23269K32649
6348A103299R19488m62368M6371j30619J6212N29348m68419k3026p4899j26100
$$ y = [646770, 798700, 365401, 31160, -290844, 205581, 981597, 744068, 541971, 1026955, 1750610, 1207297, 1100327, 1032667, 750178, 1577168, 1381412, 1535628, 313742, 1057094, 1147649, 1135751, 1046037, 561631, 1242626, 1798305, 1751832, 1466671, 283611, 129890, 261404, 1965825, 2180498, 1775556, 1412054, 1832537, 1218471, 985876, 386885, 740037, 1206468, 1867774, 2297573, 938441, 1318727, 1649621, 1198480, 1253165, 1188497, 607691, 1337148, 1174570, 1648313, 1412298, 31501, 127766, 1477775, 1415778, 914578, 598090, 1216310, 1515646, 357141, 323499, 1003041, 1525156, 1929459, 2021208, 993919, 870650, 1103299, 2022787, 1560419, 1606790, 1476171, 1492383, 2021731, 1553312, 1530286, 1455387, 1329287]
6338A329287o44416o20719J10414j59268n56901N85247M55767M01574j83771j42096
6328E75118k16939l08197N00119N58355N19994o15372o907P03709j42265K02498
6318A770113J91539k66372n33257N40524M76878m79436n74388p91636l45039J394605
6308A383531K81672j314722L8374J392254K95944k02867p50607M29318P907K05343
6298A766147M57215J68928n68104o42435q39K59876n52638O87140J04612j63632
6288A516270k49080M24759j01744n67670O3518M54740J25572l49734n36929N71269
6278A350971R1687m57119k00044J421933J13747p36345m93309n69535L58722P62293
6268A643001o42769k27187R55814j10679k35097o20544L11752p94269Q60083Q6224
$$ y = [1329287, 684871, 64152, 174566, 15298, -541603, 43644, 499411, 900985, 717214, 575118, 358179, 49982, 550101, 1108456, 1628450, 1013078, 1006171, 1709880, 1567615, 1770113, 1961652, 1695280, 1162023, 1702547, 2179425, 1699989, 1125601, 333965, -11074, 1383531, 1665203, 350481, 388855, 1781109, 2077053, 1874186, 1123579, 1552897, 1560804, 1766147, 2223362, 2392290, 1824186, 1181751, 1180912, 1440788, 888150, 1575290, 1679902, 1516270, 1267190, 1691949, 1590205, 1022535, 1086053, 1540793, 1666365, 1316631, 779702, 1350971, 1442658, 985539, 785495, 2207428, 2321175, 1584830, 1091521, 521986, 880708, 1643001, 1000232, 773045, 1728859, 1618180, 1383083, 762539, 1074291, 280022, 1140105, 1226329]
6258A226329r24838Q48989q96266K54661R28265j104406R547k9355Q70620p06380
6248D77166k66020J255329L37613j084323l21321N01045M56856P554o9826L59011
6238A653084n02927p96726K74487R10925q37371O54141k56620p7357L63132J202308
6228B587076o2598k8296n72712r30211O76526L48440R2855n74240q36475J34100
6218H34465Q94627j30570k9533M36302j97125J09797r8904j679022Q54769n01939
6208D92867M22654l84446J157944O69521k17039P50036k91149j004480j475549
6199A20359M45215J188277J99087l01770j6403K76772N8391L74316l34014K70049
6189B280279l89877m69758n69988j84198K65683J74603l66021L66919m52465M97095
$$ y = [1226329, 301491, 1150480, 254214, 508875, 1437140, 332734, 342281, 312926, 1183546, 477166, 211146, 1466475, 1804088, 719765, 398444, 899489, 1356345, 1363899, 1294073, 1653084, 1150157, 353431, 627918, 1538843, 701472, 1355613, 1098993, 1021636, 1384768, 2587076, 2524478, 2496182, 1923470, 993259, 1669785, 2018225, 2111080, 1536840, 700365, 834465, 1729092, 1598522, 1568989, 2005291, 1808166, 1917963, 1819059, 140037, 994806, 492867, 915521, 531075, 1689019, 2358540, 2141501, 2891537, 2600388, 1595908, 120359, 565574, 1753851, 1952938, 1651168, 1634765, 1911537, 1969928, 2344244, 2010230, 2280279, 1890402, 1420644, 850656, 666458, 932141, 1106744, 740723, 1107642, 655177, 1152272]
6179A152272J18081Q0959L42179m56580j42985O12656j86683o33678l40652M60407
6169A005976Q62662M68206K70204n16097P3550l92535J177498o80075m57423o7563
6159A744403j02294m02138k17548N38653o6918K75351L52650m11426R22961O1594
6149B695288l87029M99752k12320o1692k01299J90995L47186K47390n68054j48310
6139B401907k01838o79464N91246J58331O51547r5785O66773p78484N3628K434
6129B770295p06072K29378m92447m98347Q09364K85304L56494L33280L2611k95723
6119B824137l006r8846N71948r4648p2376r59001l0789N87710L48778M73100n37113
6108C009894j029334M86108O53133k82939J27797n07285J182942q40500n7764
$$ y = [1152272, 1270353, 1351312, 1693491, 1236911, 1093926, 1706582, 1519899, 886221, 545569, 1005976, 1868638, 2336844, 2607048, 2090951, 2164501, 1771966, 2949464, 2269389, 1811966, 1744403, 1642109, 1239971, 1022423, 1561076, 1494158, 1769509, 2122159, 1710733, 2633694, 2695288, 2308259, 2808011, 2595691, 2533999, 2332700, 2523695, 2870881, 3118271, 2550217, 2401907, 2200069, 1520605, 2111851, 2270182, 2921729, 2825944, 3492717, 2714233, 2767861, 2770295, 2064223, 2293601, 1801154, 1302807, 2112171, 2397475, 2753969, 3087249, 3119860, 2824137, 2821131, 2722285, 3294233, 3199585, 3127209, 2168208, 2137419, 2725129, 3073907, 3547007, 3009894, 1980560, 2466668, 3119801, 2836862, 2964659, 2457374, 3640316, 2799816, 2742052]
6099B742052K00914p82329K74547J358424J21888L1320N8992k13925L44211m45296
6089C690798M27446j72346L4359o5865j42271K14778m05544K48683M59N63530
6079D394027J57103Q90713l34776m03413n63013l69332P20257O26162N3705k78720
6069D892713m44030N45391M33102k48940L07989K90994p1393P56588p5323o2657
6059F324434k04297m18763l17282R78562L0780k7699n3793l32398Q80858P32220
6049G592622n45059M23209l03383J86811J193984p60168k57166N0726j01024J178948
6039H659500K07148M4735R46003r58794J065516N84566j57098N00868O22862M34858
6029A1950164N67158L39341M35226q16921J21169O75408K36439J88603l32332
$$ y = [2742052, 2942966, 2160637, 2435184, 3793608, 3915496, 3946816, 4005808, 3791883, 4136094, 3690798, 4118244, 3945898, 3980257, 3914392, 3772121, 3986899, 3581355, 3830038, 3830497, 4394027, 4551130, 5441843, 5107067, 4703654, 4140641, 3771309, 4491566, 5117728, 5171433, 4892713, 4448683, 4994074, 5427176, 5178236, 5486225, 5777219, 5705826, 6462414, 6387091, 6324434, 6120137, 5701374, 5384092, 6362654, 6393434, 6365735, 6311942, 5979544, 6860402, 7592622, 7047563, 7470772, 7167389, 7354200, 8548184, 7788016, 7530850, 7581576, 7480552, 8659500, 8866648, 8911383, 9857386, 8898592, 9964108, 10548674, 10391576, 10892444, 11515306, 11950164, 12517322, 12856663, 13291889, 12474968, 12596137, 13271545, 13507984, 13696587, 13364255]
6020A3364255M85162P94333L28501l85261k25281N83753l5334l32641P52736R08210
6010A6238433J002944M42450J113695O70559l23647M7340L69117P41716J665377
6001B1967984J302602K76099Q32135J74755O43235K23945J440351l4479O41769
5992B7468396m61817J15062k90566P01424j6012p01614k12468J080196L48428
5983B8031029l38927L78771M94964k59621Q98272J509580p56605P25188J788191
5974C2470842J919149L36657O12397m45821m37216J577706J493562j125844P1825
5965C6473257N13762K24041l95206L22134M24224j16909N32234K02801j46290
5956C8034048m35548p53675m41198L07631j70062j50752J05974K17553M0261J096215
$$ y = [13364255, 13849417, 14643750, 14972251, 14586990, 14361709, 14945462, 14910128, 14577487, 15330223, 16238433, 17241377, 17683827, 18797522, 19468081, 19144434, 19191774, 19560891, 20302607, 21967984, 23270586, 23546685, 24378820, 24553575, 25196810, 25420755, 26861106, 26826627, 27468396, 27006579, 27121641, 26831075, 27532499, 27516487, 26814873, 26602405, 27682601, 28031029, 27692102, 28070873, 28565837, 28306216, 29204488, 30714068, 29957463, 30682651, 32470842, 34389991, 34726648, 35339045, 34893224, 34456008, 36033714, 37527276, 36401432, 36473257, 36987019, 37211060, 36815854, 37137988, 37562212, 37445303, 37977537, 38180338, 38034048, 37598500, 36844825, 36403627, 36711258, 36541196, 36390444, 36496418, 36713971, 36754232, 37850447]
5946C7850447L79830j15442J080134o22756m08216k78164j23343l80983K09434
5937C7590941j60113k33075r8607j02141R20627J08322n22858n51895l59911P67914
5927C7359204j30028J74369l72526M45349n86365q47940l6785J3491O10026j073866
5917C5554929J25135J363062l70225q11134n60541N07498P1466n11217p62493
5908C4606480K46715j096993n19692P6041k23599L59332r51257Q45486k11850
5899C3130663J66669L98773r24247L74631l89882p35902o85298M32167j86287
5890C1581287o0092l76157M19798l99687J06977N98415j179005l86238m90685
5881B9814613n69200Q52600m38083k11825O79864j35358k8385m95763N61512r44902
$$ y = [37850447, 38230277, 38114835, 39194969, 38572213, 38163997, 37885833, 37762490, 37381507, 37590941, 37430828, 37197753, 37099146, 36997005, 37917632, 38025954, 37503096, 36951201, 36591290, 37359204, 37229176, 37403545, 37031019, 37476368, 36890003, 36042063, 36005278, 36018769, 36628795, 35554929, 35680064, 37043126, 36672901, 35861767, 35301226, 35808724, 35880190, 35368973, 34606480, 34853195, 33756202, 33236510, 33312551, 33088952, 33448284, 32497027, 33342513, 33130663, 33297332, 33696105, 32771858, 33146489, 32756607, 32020705, 31335407, 31767574, 31581287, 31521195, 31145038, 31564836, 31165149, 31272126, 31870541, 30691536, 30305298, 29814613, 29245413, 30098013, 29659930, 29448105, 30127969, 29992611, 29964226, 29468463, 30029975, 29085073]
5871B9085073p12029p9320M43644o05718n46438J79451k81564n58939J47971m63453
5861B6608678j21386O02484l03348l78091J113062m6551n67583M84322r12663
5852B6478924J97761L11281J1350L19474o56824k01022J7765m5599K6935P44606
5842B7204651R5861O06944n11043n34095k85278J41819l91542l77695j23989q44263
5832B4981370N58628L29307j303323L28730n65399J118843m32878q04931J457692
5823B5668039o78463R7393J04417m28719j47519K42130K28806L8520K75736M59979
5813B5860319n66510p91953P26907l22535J63770j24926o1947m31855p0500l56979
5803B4023791p20454j18991M76444K3804l98415N50503L9839j0535N56324q09103
$$ y = [29085073, 28373044, 28293724, 28737368, 28131650, 27585212, 27764663, 27483099, 26924160, 27072131, 26608678, 26487292, 27089776, 26786428, 26408337, 27521399, 27474848, 26907265, 27391587, 26478924, 26676685, 26987966, 26999316, 27318790, 26661966, 26460944, 26478709, 26433110, 26460045, 27204651, 27300512, 27907456, 27396413, 26862318, 26577040, 26718859, 26327317, 25949622, 25825633, 24981370, 25539998, 25869305, 24565982, 24894712, 24329313, 25448156, 25015278, 24210347, 25668039, 24989576, 25086969, 25191386, 24762667, 24615148, 24857278, 25086084, 25124604, 25400340, 25860319, 25293809, 24501856, 25228763, 24906228, 25069998, 24945072, 24883125, 24451270, 24380770, 24023791, 23303337, 23184346, 23660790, 23684594, 23286179, 23836682, 23876521, 23865986, 24422310, 23613207]
5793B3613207j150483m82723l556R72744m56114k90976N5367K36592l65271L8177
5783B2166964k6661N47453Q385l28612j040698J429604m96104n89860l41137j23925
5773B1205409L38743n8103j11511k79336l87042j88310L93700j547526J024497
5764B0390521J299566J09247j88098r64261o3159L4437m47984J211551k528n16444
5754B0862848L76368k65189O27345N27311L30804j23089R0039l28668o50951o76627
5744B0770191J049201Q21312o33701j120865M91993R56529j636367J35037P03349
5735B1536679k52000K5977K5317P38310o21898J49941q17142J46674O51956O50844
5725B2234658L80265q8579J084637n483n6430K88270M0509N25080M46131M92861
$$ y = [23613207, 22462724, 21980001, 21976445, 22949189, 22493075, 22202099, 22257466, 22494058, 22128787, 22166964, 22140303, 22687756, 22696141, 22367529, 21326831, 22756435, 22260331, 21670471, 21329334, 21205409, 21544152, 21486049, 21374538, 21095202, 20708160, 20519850, 20913550, 19366024, 20390521, 21690087, 21799334, 21611236, 20646975, 20583816, 20618253, 20170269, 21381820, 21379292, 20862848, 21239216, 20974027, 21601372, 22128683, 22459487, 22336398, 22426437, 22097769, 21446818, 20770191, 21819392, 22640704, 22007003, 20886138, 21378131, 22334660, 20698293, 20833330, 21536679, 21284679, 21310656, 21335973, 22074283, 21452385, 21602326, 20785184, 20931858, 21583814, 22234658, 22614923, 22526344, 23610981, 23605498, 23549068, 23837338, 23877847, 24402927, 24849058, 25341919]
5715B5341919m73928o22958Q39852N74450k36428j471529l533M60400o1754K70879
5705B4617370O1237p30148J91779j81190j135784p5113l75911Q38664K82493P29949
5695B4223346K04392m91770O43275o08351Q33297R66070k31824k95080M75511
5686B5718866P75229O58248K2942L17868k95923j49456j9952o0250r57344k1534
5676B5988694n97522n87064K03588J46420q5977k45996j400128o2106N25339r0595
5666B3794653J049263l77845M7717Q69364Q30746J034166l81129l34291P76392
5657B7309036J30328J62422P06254L61155J310845J46249l10786n81955L09298
5648B9542846N69158q78686m03615O343j121704K83843k52884N42847Q99371r13173
$$ y = [25341919, 24867991, 24245033, 25084885, 25659335, 25422907, 23951378, 23947845, 24408245, 24346491, 24617370, 24678607, 23948459, 24140238, 23959048, 22823264, 22748151, 22372240, 23210904, 23493397, 24223346, 24427738, 23935968, 24579243, 23970892, 24804189, 25770259, 25538435, 25243355, 25718866, 26494095, 27152343, 27175285, 27493153, 27197230, 27047774, 27027822, 26967572, 26010228, 25988694, 25391172, 24804108, 25007696, 25154116, 25068139, 24822143, 23422015, 23359909, 23885248, 23794653, 24843916, 24466071, 24513788, 25383152, 26213898, 27248064, 26866935, 26532644, 27309036, 27439364, 27601786, 28308040, 28669195, 29980040, 30126289, 29815503, 29233548, 29542846, 30112004, 29233318, 28829703, 28836046, 27714342, 27998185, 27745301, 28288148, 29187519, 28274346]
5638B8274346J130033L33409K0175J27883O21565J305731K01434k76450k29109
5629C1509017q24586Q89361n24445J182033J88695m14021L43759o86068q83164
5620C0780581M75093R60405J056602m05020j71361K61481l2625m0195O14859L87957
5610C3887777m34006Q82318Q53050J186236M50704P66276K24324N55001j43715
5601C8227965R36170m16184p2972k92666l65465n44956m4711j423650p28964j12830
5591C5161737l44403J684802r20887k99855K34786J30743J500719Q01581o88521
5582C7260702N23755O03196P47218J255900O16558l81234o2608L40223O65070
5573D1568780N45860N17384J755736Q01643L16210J297615Q72089J763043j59187
$$ y = [28274346, 29404379, 29737788, 29757963, 29885846, 30507411, 31813142, 32014576, 31738126, 31509017, 30684431, 31573792, 31049347, 32231380, 32420075, 32006054, 32349813, 31663745, 30780581, 31255674, 32216079, 33272681, 32867661, 32696300, 32957781, 32925156, 32884961, 33499820, 33887777, 33453771, 34336089, 35189139, 36375375, 36826079, 37592355, 37816679, 38371680, 38227965, 39164135, 38747951, 38674979, 38382313, 38016848, 37471892, 37427181, 36003531, 35274567, 35161737, 34817334, 36502136, 35581249, 35281394, 35516180, 35646923, 37147642, 37949223, 37260702, 37784457, 38387653, 39134871, 40390771, 41007329, 40626095, 40563487, 40903710, 41568780, 42114640, 42632024, 44387760, 45189403, 45505613, 46803228, 47675317, 49438360, 49279173]
5564D9279173n37000J130066J834365J794837K258831K147002K189877K157331
5556F2254482K864751M197335L795887M231123M629064N127856P527410P933208
5548A02561116N914387L046880o17110k481053n739729n596454m679581k918642
5540H9489814k436750k297004j871781j560332J68419P20314Q79132N46923J141777
5531H4780512J475808K808974K802403L858246L906329M037013M925245N639952
5523A14234482M916493P934062Q450261J0258275J1225579J3676277J3926062
5516A84621491J0705717L722933o791404j4065512j5648813j5076853j2217459
5509A35250100r224139p885153n159536n607935m218239j914954j170616j461906
$$ y = [49279173, 48742173, 49872239, 51706604, 53501441, 55760272, 57907274, 60097151, 62254482, 65119233, 69316568, 73112455, 77343578, 81972642, 87100498, 94627908, 102561116, 108475503, 111522383, 110905273, 108424220, 102684491, 97088037, 92408456, 89489814, 87053064, 84756060, 82884279, 81323947, 81492366, 82212680, 83091812, 83638735, 84780512, 86256320, 89065294, 91867697, 95725943, 99632272, 103669285, 108594530, 114234482, 119150975, 127085037, 135535298, 145793573, 157019152, 170695429, 184621491, 195327208, 199050141, 192258737, 178193225, 162544412, 147467559, 135250100, 126025961, 118140808, 112981272, 107373337, 103155098, 101240144, 100069528, 98607622]
5501I8607622N74351j454376J07818J833697J114173J709014J407482j017674
5493A02882107M20540M66401R04941J330932L817929K957191N759594O696787
5485A25236422M966462J363296k822298n664577o472189o685177p117276m818206
5477I7986457n852706l902698l164723k083208j322447q1614P1402o42166O4079
5468H1072376M95217J87954k171355m325178m123081l984533l460951k625924
5460F1064525k038383k062768j155620o84319j727084k28782l26779j398087p896
5451E1434807n02020K90245R87432J788483N29157r15976k3341P44638L19457
5442E4652882Q49092J089568Q14088L302280j3725n45433j868941l973585k441059
$$ y = [98607622, 99181973, 97727597, 97835415, 99669112, 100783285, 102492299, 103899781, 102882107, 103302647, 103769048, 104673989, 106004921, 109822850, 112780041, 118539635, 125236422, 130202884, 131566180, 128743882, 123079305, 116607116, 109921939, 102804663, 97986457, 92133751, 88231053, 85066330, 82983122, 81660675, 81579061, 81650463, 81008297, 81072376, 81567593, 81755547, 79584192, 75259014, 71135933, 67151400, 63690449, 61064525, 59026142, 56963374, 55807754, 55123435, 53396351, 53167569, 52840790, 51442703, 51434807, 50932787, 51223032, 52210464, 53998947, 54528104, 53612128, 53588787, 54333425, 54652882, 55501974, 56591542, 57405630, 60707910, 60694185, 60148752, 58279811, 54306226, 51865167]
5433E1865167j990714j749457j488623l47106j3991J87872o6728l60393k337071
5424D3698956j367806j136705Q286j257090k33970j7449j55219P23408k7672p56802
5414C9477937J88602R75606o63725q2849l80286L63959K23873q19111q24410n58531
5404C7901065j457017P7385J193904K86297j92908J649668J449085l55494j944101
5395C8607884q95420j753726j254545j562507k008563q96714m96577p58228m9767
5386B8931837L27927l26863q18348j336578l99769j51669K56186O5005K68101
5377B6815829k08992k05148M4005k31315L88940P81755p14259l35461J199143
5368B7534497K52477K6614J53751j219778k06966j224589r7112j633456q48662
$$ y = [51865167, 49874453, 48124996, 46636373, 46289267, 46275276, 46463148, 46396420, 46036027, 43698956, 42331150, 41194445, 41202731, 39945641, 39711671, 39694222, 39539003, 40262411, 40234739, 39477937, 39666539, 40642145, 39978420, 39895571, 39515285, 39879244, 40103117, 39284006, 38459596, 37901065, 36444048, 36521433, 37715337, 38001634, 37808726, 39458394, 40907479, 40551985, 38607884, 37712464, 35958738, 34704193, 33141686, 31133123, 30236409, 29739832, 28981604, 28931837, 29259764, 28932901, 28114553, 26777975, 26378206, 26226537, 26482723, 26547728, 26815829, 26606837, 26401689, 26445694, 26214379, 26603319, 27385074, 26670815, 26335354, 27534497, 27786974, 27813588, 27967339, 26747561, 26540595, 25316006, 25218894, 23585438, 22736776]
5359B2736776j158485j19056o97738K57780l47721j18159K64982j330668m85942
5350A9001769m64297K28144k95666o33807p10833k15500M30299o75823R37335
5341A7601621k46644M93351j96008K3347L63802r34277K303j220818M02396j97701
5331A6091372p98443p2517j19421o86433k94441m45637O0701K96641k17289j131022
5321A2683511J129785O79931j610719q91631J7547o14959O29423P39383k27085
5312A2535186j194059N89375N1338L8950L5367J42524j046978M42768m14180k38755
5302A0941536L26213M8589J52873o40197m29878Q20465j19051J35220J41555k75368
5292A1101957m69773N7095j19312q77502k27503K06570J41906p2734M03399K64704
$$ y = [22736776, 21578291, 21459235, 20761497, 21019277, 20671556, 20553397, 20818379, 19487711, 19001769, 18537472, 18765616, 18469950, 17836143, 17125310, 16909810, 17340109, 16664286, 17601621, 17354977, 17848328, 17652320, 17675667, 18039469, 17105192, 17107495, 15886677, 16289073, 16091372, 15292929, 15220412, 15100991, 14414558, 14120117, 13674480, 13735181, 14031822, 13814533, 12683511, 13813296, 14493227, 12882508, 11990877, 12008424, 11393465, 12022888, 12762271, 12535186, 11341127, 11930502, 11981840, 12020790, 12056157, 12198681, 11151703, 11594471, 11180291, 10941536, 11267749, 11316338, 11469211, 10829014, 10399136, 11219601, 11100550, 11235770, 11377325, 11101957, 10632184, 10689279, 10569967, 9692465, 9464962, 9671532, 9813438, 9740704, 10144103, 10408807]
5282A0408807K87854K31548K9047j265306M86483J337270k84136j23288M0957
5273A1149236n22506m96476L11207j94633j12719j034618J069469J051169K62144
$$ y = [10408807, 10696661, 10928209, 10957256, 9691950, 10178433, 11515703, 11231567, 11108279, 11149236, 10626730, 10130254, 10441461, 10246828, 10134109, 9099491, 10168960, 11220129, 11482273]
$$ [...]
##END NTUPLES=NMR SPECTRUM
##END=
