##TITLE=1H_CA-8834-3
 CDCl3,8 sc, 
 11.03.2021
##JCAMPDX= 6.0         $$ Bruker NMR JCAMP-DX V2.0
##DATA TYPE= NMR SPECTRUM
##DATA CLASS= NTUPLES
##ORIGIN= UXNMR, Bruker Analytische Messtechnik GmbH
##OWNER= root
$$ XWIN-NMR		Version 3.5
$$ Thu Mar 11 09:57:39 2021 Russian Standard Time (UT+4h)  she@DPX200
##.OBSERVE FREQUENCY= 200.131506
##.OBSERVE NUCLEUS= ^1H
##.ACQUISITION MODE= SIMULTANEOUS
##.ACQUISITION SCHEME= undefined
##.AVERAGES= 8
##.DIGITISER RES= 18
##SPECTROMETER/DATA SYSTEM= spect
##.PULSE SEQUENCE= zg30
##.SOLVENT NAME= CDCl3
##.SHIFT REFERENCE= (INTERNAL, CDCl3, 0, 15.9543)
##AUDIT TRAIL= $$ (NUMBER, WHEN, WHO, WHERE, WHAT)
$$ ##TITLE= Audit trail, XWIN-NMR		Version 3.5
$$ ##JCAMPDX= 5.01
$$ ##ORIGIN= Bruker BioSpin GmbH
$$ ##OWNER= she
$$ F:/spectra/data/she/nmr/H-F/1/pdata/1/auditp.txt
$$ ##AUDIT TRAIL=  $$ (NUMBER, WHEN, WHO, WHERE, WHAT)
(   1,<2021-03-11 09:56:19.81 +0400>,<she>,<DPX200>,
      <created by zg, POWCHK disabled, PULCHK disabled
       configuration hash MD5:
       00 E9 B6 7A A2 85 ED C7 34 08 36 98 17 FE 4E 26
       data hash MD5: 16K
       24 F0 C7 DB EB CB A8 22 F9 7B 10 22 AD 1B 17 85>)
(   2,<2021-03-11 09:56:29.53 +0400>,<she>,<DPX200>,
      <Start of raw data processing
       efp BC_mod = 2 LB = 0.24 FT_mod = 6 PKNL = 1 PHC0 = -11114.26 PHC1 = 2.800942 SI = 16K 
       data hash MD5: 16K
       E7 73 80 58 B9 97 13 A7 00 E4 85 3E 32 AA 1A 66>)
(   3,<2021-03-11 09:56:53.03 +0400>,<she>,<DPX200>,
      <pk PHC0 = 0.7147916 PHC1 = 4.6 
       data hash MD5: 16K
       86 09 5C 74 6D 3B 21 3A 9F C0 C7 42 81 2F D4 92>)
(   4,<2021-03-11 09:56:56.18 +0400>,<she>,<DPX200>,
      <abs ABSG = 5 
       data hash MD5: 16K
       D4 E3 3B 73 70 E8 BE 3C 43 C7 0D FC 07 E2 71 BD>)
$$ ##END=
$$ 
$$ hash MD5
$$ E6 90 09 E2 B1 52 8A D2 43 58 90 42 87 49 1B 21
##$RELAX= 
##$RELAX= 
##$RELAX= 
##$RELAX= 
##$RELAX= 
##$RELAX= 
$$ Bruker specific parameters
$$ --------------------------
##$DU= <F:/spectra>
##$EXPNO= 1
##$NAME= <H-F>
##$PROCNO= 1
##$TYPE= <nmr>
##$USER= <she>
##$AMP= (0..31)
100 100 100 100 100 100 100 100 100 100 100 100 100 100 100 100 100 100 
100 100 100 100 100 100 100 100 100 100 100 100 100 100 
##$AQSEQ= 0
##$AQ_mod= 1
##$AUNM= <au_zg>
##$AUTOPOS= <>
##$BF1= 200.13
##$BF2= 200.13
##$BF3= 200.13
##$BF4= 200.13
##$BF5= 200.13
##$BF6= 200.13
##$BF7= 200.13
##$BF8= 200.13
##$BYTORDA= 1
##$CFDGTYP= 0
##$CFRGTYP= 5
##$CHEMSTR= <none>
##$CNST= (0..31)
1 1 145 1 1 1 1 1 1 1 1 1 1 1 1 1 1 1 1 1 1 1 1 1 1 1 1 1 1 1 1 1 
##$CPDPRG= <>
##$CPDPRG1= <>
##$CPDPRG2= <>
##$CPDPRG3= <>
##$CPDPRG4= <mlev>
##$CPDPRG5= <mlev>
##$CPDPRG6= <mlev>
##$CPDPRG7= <mlev>
##$CPDPRG8= <mlev>
##$CPDPRGB= <>
##$CPDPRGT= <>
##$D= (0..31)
0 1.2 0 0 0 0 0 0 0 0.06 0 0.03 0 0 0 0 0.0002 0 0 0 0 0 0 0 0 0 0 0 0 
0 0 0 
##$DATE= 1615442179
##$DBL= (0..7)
120 120 120 120 120 120 120 120 
##$DBP= (0..7)
150 150 150 150 150 150 150 150 
##$DBP07= 0
##$DBPNAM0= <>
##$DBPNAM1= <>
##$DBPNAM2= <>
##$DBPNAM3= <>
##$DBPNAM4= <>
$$ [...]
##$SUBNAM3= <"">
##$SUBNAM4= <"">
##$SUBNAM5= <"">
##$SUBNAM6= <"">
##$SUBNAM7= <"">
##$SUBNAM8= <"">
##$SUBNAM9= <"">
##$SW= 16.9725357007746
##$SWIBOX= (0..15)
0 0 2 0 0 0 0 0 0 0 0 0 0 0 0 0 
##$SW_h= 3396.73913043478
##$TD= 16384
##$TD0= 1
##$TE= 0
##$TE2= 300
##$TE3= 300
##$TEG= 300
##$TL= (0..7)
0 120 120 120 120 120 120 120 
##$TP= (0..7)
150 150 150 150 150 150 150 150 
##$TP07= 0
##$TPNAME0= <>
##$TPNAME1= <>
##$TPNAME2= <>
##$TPNAME3= <>
##$TPNAME4= <>
##$TPNAME5= <>
##$TPNAME6= <>
##$TPNAME7= <>
##$TPOAL= (0..7)
0.5 0.5 0.5 0.5 0.5 0.5 0.5 0.5 
##$TPOFFS= (0..7)
0 0 0 0 0 0 0 0 
##$TUNHIN= 0
##$TUNHOUT= 0
##$TUNXOUT= 0
##$USERA1= <user>
##$USERA2= <user>
##$USERA3= <user>
##$USERA4= <user>
##$USERA5= <user>
##$V9= 5
##$VALIST= <valist>
##$VCLIST= <CCCCCCCCCCCCCCC>
##$VD= 0
##$VDLIST= <DDDDDDDDDDDDDDD>
##$VPLIST= <PPPPPPPPPPPPPPP>
##$VTLIST= <TTTTTTTTTTTTTTT>
##$WBST= 1024
##$WBSW= 4
##$XGAIN= (0..3)
0 0 0 0 
##$XL= 0
##$YL= 0
##$YMAX_a= 255237
##$YMIN_a= -192027
##$ZGOPTNS= <>
##$ZL1= 120
##$ZL2= 120
##$ZL3= 120
##$ZL4= 120
##$ABSF1= 15.97403
##$ABSF2= -0.9986324
##$ABSG= 5
##$ABSL= 3
##$ALPHA= 0
##$AQORDER= 0
##$ASSFAC= 0
##$ASSFACI= 0
##$ASSFACX= 0
##$ASSWID= 0
##$AUNMP= <proc_1d>
##$AZFE= 0.1
##$AZFW= 0.1
##$BCFW= 0
##$BC_mod= 2
##$BYTORDP= 0
##$COROFFS= 0
##$CY= -3
##$DATMOD= 1
##$DC= 0
##$DFILT= <>
##$DTYPP= 0
##$F1P= 0
##$F2P= 0
##$FCOR= 1
##$FTSIZE= 16384
##$FT_mod= 6
##$GAMMA= 0
##$GB= 0
##$INTBC= 1
##$INTSCL= 2.992141e-10
##$ISEN= 128
##$LB= 0.24
##$LEV0= 0
##$LPBIN= 0
##$MAXI= 10000
##$MC2= 0
##$MEAN= 0
##$ME_mod= 0
##$MI= 1.114404
##$NCOEF= 0
##$NC_proc= -8
##$NLEV= 6
##$NOISF1= 3.799351
##$NOISF2= 2.8
##$NSP= 0
##$NTH_PI= 0
##$NZP= 0
##$OFFSET= 15.95434
##$PC= 1
##$PHC0= -11113.54
##$PHC1= 7.400942
##$PH_mod= 1
##$PKNL= yes
##$PPARMOD= 0
##$PSCAL= 0
##$PSIGN= 0
##$REVERSE= no
##$SF= 200.130011426308
##$SI= 16384
##$SIGF1= 3
##$SIGF2= 2
##$SINO= 5.538805
##$SIOLD= 16384
##$SREGLST= <1H.CDCl3>
##$SSB= 0
##$STSI= 16384
##$STSR= 0
##$SW_p= 3396.73913043479
##$SYMM= 0
##$S_DEV= 0
##$TDeff= 16384
##$TDoff= 0
##$TI= <>
##$TILT= no
##$TM1= 0
##$TM2= 0
##$TOPLEV= 0
##$USERP1= <user>
##$USERP2= <user>
##$USERP3= <user>
##$USERP4= <user>
##$USERP5= <user>
##$WDW= 1
##$XDIM= 16384
##$YMAX_p= 427758817
##$YMIN_p= -1159495
$$ End of Bruker specific parameters
$$ ---------------------------------
##NTUPLES= NMR SPECTRUM
##VAR_NAME=  FREQUENCY,     SPECTRUM/REAL,   SPECTRUM/IMAG
##SYMBOL=    X,             R,               I
##VAR_TYPE=  INDEPENDENT,   DEPENDENT,       DEPENDENT
##VAR_FORM=  AFFN,          ASDF,            ASDF
##VAR_DIM=   16384,         16384,           16384
##UNITS=     HZ,            ARBITRARY UNITS, ARBITRARY UNITS
##FACTOR=    0.207333158178282, 1,           1
##FIRST=     3192.94224271256, 0,            0
##LAST=      -203.796887722227, 0,           0
##MIN=       -203.796887722227, -1159495,    0
##MAX=       3192.94224271256, 427758817,    0
$$ Real data points
##PAGE= N=1
##DATA TABLE= (X++(R..R)), XYDATA
$$ [...]
5617D82198L4924L0286J38043k25117P4212N04543m76739j90168J66405M44163
5607I82750k96032o57162R9698j0733r3446J98091L61945l855k65258K11605K94
5596E27897l41134K56990K28209k62909K35223J3801k8290m4313l39634J01400
5586C47240K43748L02079L8136k8403Q8541L4187O8758j08161J24864J93209J080
5575A305278j2868n01268j51192L80599M1497m17040M18765K98622q3658K75123
5565A553858J87549l38953M68154p5631j47346J08021k2426J68107j89429M98833
5555B210737j39297J00755j99726K55618M51505j10668J52252J80596p5095N55012
5545C381689L48004l74225Q4871q5705M74340M54120k76463K74605K00573J80010
$$ plain form
5617 482198 517122 547408 685451 460334 534546 1039089 562350 372182 538587 982750
5607 982750 686718 29556 129254 118521 25075 223166 585111 581256 315998 527603 527897
5596 527897 186763 443753 671962 409053 644276 658077 629787 585474 245840 347240
5586 347240 590988 893067 931203 902800 991341 1025528 1094286 986125 1110989 1304198 1305278
5575 1305278 1292410 791142 639950 1020549 1062046 645006 1063771 1362393 1278735 1553858
5565 1553858 1741407 1402454 1870608 1794977 1647631 1755652 1733226 1901333 1711904 2210737
5555 2210737 2071440 2172195 1972469 2228087 2679592 2568924 2721176 2901772 2826677 3381689
5545 3381689 3729693 3355468 3440339 3354634 3828974 4283094 4006631 4281236 4481809 4661819
5535D661819J32617K13384M45651J55749Q617l1525l80728P93075j34329K48258
5525F112588K7941o8120J84697J37800K12181L02844K76225J09858K16297M86772
5515G999083K79981N37535K35203M38826N13415P93309Q38668J91714J91894N86466
5505A2606094L52802J68375q3019J47960O11356L5875n25814j16133L1167k59839
5495A2968824M7681k45408L29910k59514m77306J75168M94741N48354K41185O63337
5485A4486972L64883K04425K72747j0851J277603O25800M67971N05186K48385
5476A8443121O47014M35468L86422N89074j52800q45022k90707m49377n61889
5467A8201304m10235m28579p27002p10882m13832m57822k1545l07626m76372n71408
$$ plain form
5535 4661819 4794436 5007820 5453471 5609220 5617837 5586312 5205584 5998659 5864330 6112588
5525 6112588 6140529 6072409 6257106 6394906 6607087 6909931 7186156 7296014 7512311 7999083
5515 7999083 8279064 8816599 9051802 9490628 10004043 10797352 11636020 11827734 12019628 12606094
5505 12606094 12958896 13127271 13044252 13192212 13803568 13839443 13313629 13197496 13228663 12968824
5495 12968824 13016505 12771097 13101007 12841493 12364187 12539355 13034096 13582450 13823635 14486972
5485 14486972 14851855 15056280 15329027 15318176 16595779 17221579 17689550 18194736 18443121
5476 18443121 19090135 19525603 19912025 20501099 20348299 19503277 19212570 18763193 18201304
5467 18201304 17791069 17362490 16635488 15924606 15510774 15052952 15031407 14723781 14247409 13676001
5457A3676001J08689j27243l6089o1684K78515K4411j69313n0824P08604K93076
5447A4644143K09559L71718O3482k32168K9632R8340l21324q73418m63338K39801
5437A3766427q33669j069611n17261r8002m64681l82645l92258j008418o04383
5428H395499l18623j89985k46689j05493m35511p6678j46403M95540l7143q1646
5418G252868k80569J90444m71939q43531N6403L80993L73172l99951m59402o0344
5408E738144l76761j3343k98030n51304K02406p98205m64392k45964M4303O2684
5398C299538J13895m22279k41393J2517Q8045l37155n32645L1078M31678j3351
5388B429928m44913j29392J60702j49888K84115j00345L26018N070m09112J10313
$$ plain form
5457 13676001 13784690 13657447 13621358 13559674 13838189 13862600 13693287 13642463 14351067 14644143
5447 14644143 14853702 15225420 15288902 15056734 15086366 15184706 14863382 13989964 13526626 13766427
5437 13766427 12932758 11863147 11345886 11247884 10783203 10400558 10008300 8999882 8395499
5428 8395499 8076876 7886891 7640202 7534709 7099198 7022520 6876117 7371657 7334514 7252868
5418 7252868 6972299 7162743 6690804 5847273 5903676 6284669 6657841 6257890 5798488 5738144
5408 5738144 5361383 5348040 5050010 4498706 4701112 3902907 3438515 3192551 3236854 3299538
5398 3299538 3413433 2991154 2749761 2762278 2850323 2513168 1980523 2011601 2443279 2429928
5388 2429928 1985015 1855623 2016325 1866437 2150552 2050207 2376225 2381295 1972183 2082496
5378B082496l11536k14816J37109l24011j0179L08909l3064m72621L14582K07687
5368A684556o34157O6230N02874o42297j18560j35988k01667J22069J22690K71677
5358A037427n164k81494P2167O8670k37805l018r6312j70178K4260l85448L91281
5347D14386L84227l809l9368l16288j68339R2001k11288j77518l25064L11931
5337c9129J59062k33296O95194M39508k76178l97866l2854k09764J42928k85686
5327c8081R2408M6491j96427l7127K31563J59968m2964o4257K46218L0999J54501
5316E83292Q4329m2438j89095j25971l15620L73606M28474l50457k14604k98177
5306f6661l95354P8985r9805L97401L7420p0201L11377n9533K85789j40391k17603
$$ plain form
5378 2082496 1770960 1556144 1693253 1369242 1359063 1667972 1634908 1162287 1476869 1684556
5368 1684556 1050399 1116629 1619503 977206 858646 722658 520991 643060 765750 1037427
5358 1037427 1032263 750769 822936 891606 653801 650783 554471 384293 408553 23105 414386
5347 414386 798613 794804 755436 439148 270809 362810 151522 -25996 -351060 -39129
5337 -39129 119933 -113363 581831 1021339 745161 347295 314441 104677 247605 -38081
5327 -38081 54327 100818 -95609 -132736 98827 258795 215831 151574 397792 428791 583292
5316 583292 667621 625183 436088 310117 -5503 368103 796577 446120 231516 -66661
5306 -66661 -462015 -383030 -482835 -85434 -48014 -118215 193162 133629 419418 279027 61424
5295F1424m43418P13479K30051n6888m2405n42780j98606R2617K21402o7857k96859
5284c29840J84121L38830k708k15277j95558J77807P2732K53754O1474n94414
5274b49079N3201K91187M7685J99833k01872P7272k94004m70278r3570M06723
5264b32902P8461j83162M27050K34323k88163n57103L48882k36902k60680J18938
5254e51258K50208J27136J22933l69524m61923K10987M4452O13098M9234J9432
5244E4775l21902k35694J92618O1060J672m46304K26577L18316l57979J85982
5234c20879j51704K9316P6689L25214K18813p2509j45275l06478J84056j33321
5224b96078l67635M84018l41865K21790L72992j43644j88556J81717j40592k84343
$$ plain form
5295 61424 -381994 331485 561536 504648 462243 -80537 -279143 -186526 34876 -32981 -329840
5284 -329840 -145719 193111 190403 -24874 -220432 -42625 30107 283861 345335 -249079
5274 -249079 -195878 95309 142994 342827 140955 218227 -75777 -546055 -639625 -232902
5264 -232902 -154441 -337603 89447 323770 35607 -521496 -172614 -409516 -670196 -551258
5254 -551258 -301050 -173914 -50981 -420505 -882428 -671441 -626989 -13891 35343 54775
5244 54775 -267127 -502821 -310203 -249143 -247471 -693775 -467198 -148882 -506861 -320879
5234 -320879 -472583 -443267 -366578 -41364 177449 104940 -40335 -346813 -162757 -296078
5224 -296078 -663713 -179695 -521560 -299770 73222 -70422 -258978 -77261 -217853 -502196
5214e02196M2536l79112n1443N42249K78401l11626N2926j04728N43725K15493
5204C26225m71348k76285j76165j77435Q4364O44722K89219m53983k03072j39367
5194e53125J87416o602L62287J44151k82357k78418j48290N39908K31346k34488
5184c8172j19680k15171K57038K98593K10619o1771p17165j58321J76018L26400
5174d1612j99890P8632J66851j25169j94989j19282J52667j4003j10027M92718
5164H5896j97934o79669O7465L61550L14763j8658M9401j51669k45075r7083J27015
5153c83998k79558L82321K09265P6165k10052j03978J01410M2120J61687j96987
5143b01605k43005K40700N0599r24705Q75201J56959l22705n6907Q3157L03912
$$ plain form
5214 -502196 -459660 -838772 -890215 -347966 -69565 -381191 -328265 -432993 110732 326225
5204 326225 -145123 -421408 -597573 -775008 -690644 -45922 243297 -210686 -413758 -553125
5194 -553125 -365709 -372311 -10024 134127 -148230 -426648 -574938 -35030 196316 -38172
5184 -38172 -157852 -373023 -115985 182608 393227 331456 -385709 -544030 -368012 -41612
5174 -41612 -241502 -162870 3981 -121188 -316177 -435459 -282792 -296795 -406822 85896
5164 85896 -112038 -791707 -724242 -362692 -47929 -66587 -17186 -168855 -413930 -511013 -383998
5153 -383998 -663556 -281235 -71970 4195 -205857 -309835 -208425 -166305 -4618 -201605
5143 -201605 -444610 -203910 -153311 -1078016 -202815 -45856 -368561 -425468 -342311 -38399
5133c8399l06473K57878J91141K7387P3810J41054J2532k4593J30184q6495k6196
5122C51830J94069k05728p0406J32462O0392j49087K99718j63692j37728L95608
5112G07438L4670k64461l87481K66098j73671Q5159M09916K80796L39582k08877
5102A089169k80893j2256L0865l00286k32496R3006L63292K95344k80612P3974
5092H39107K64863p2999L76377l43795l06528q7822J77677P3983l6321n53765
5082C30777q175j61329L44640O5750o9349j32104j5850N25691K43504j07072k55153
5071G61330n2085K30797L73213K50092k67393M6913j24720m28306K6488n10809
5061C05520O63937l22194j98185L06450L35864m6166l41513L78406m57216j79674
$$ plain form
5133 -38399 -344872 -86994 104147 131534 205344 346398 358930 334337 464521 378026 351830
5122 351830 545899 340171 269765 402227 462619 313532 613250 449558 311830 707438
5112 707438 742108 477647 90166 356264 182593 267752 677668 958464 1298046 1089169
5102 1089169 808276 796020 826885 526599 294103 387109 750401 1045745 765133 839107
5092 839107 1103970 1030971 1407348 1063553 757025 669203 846880 920863 884542 330777
5082 330777 322602 161273 505913 571663 502314 370210 354360 880051 1123555 1016483 761330
5071 761330 709245 940042 1313255 1563347 1295954 1342867 1218147 789841 816329 305520
5061 305520 969457 647263 449078 755528 1091392 1045226 703713 1082119 624903 445229
5051D45229J85019l5213J6920l7252J33950r5990p6608j36152K45832N11870j17419
5040A040186k30721l34632K11164K78418J16103K64070r825R6224n24110r3133
5030H13744J45944K32626j61413j39273N8744J46833L71670m02439l7653j18734
5020I10049l51538L7949K23463J10595j17382m6254m9495M42241k96797K6355
5010H89186l21174J42073j14585J76548O1070l09447q744o1770k7535J96546J32526
4999G54694m11592L81075j86222j23636J85298J69066o1405N5775K00550l79605
4989E83998j24663Q711j00033k70772N78769K00714j40745J39805j80713L7913
4979G32984k6068n10017m4285M67447L92744m47279j11386j67905J66579L34192
$$ plain form
5051 445229 630248 595035 611955 574703 708653 612663 536055 399903 645735 1157605 1040186
5040 1040186 809465 474833 685997 964415 1080518 1344588 1334763 1430987 906877 813744
5030 813744 959688 1192314 1030901 891628 950372 1097205 1468875 1066436 1028783 910049
5020 910049 558511 596460 819923 930518 813136 766882 717387 1159628 862831 889186
5010 889186 568012 710085 595500 772048 833118 523671 514927 453157 425622 622168 754694
4999 754694 343102 724177 537955 414319 599617 768683 707278 763053 963603 583998
4989 583998 459335 468046 368013 97241 676010 876724 735979 875784 695071 732984
4979 732984 706916 196899 152614 620061 1012805 565526 454140 286235 452814 787006
4969G87006l54656j05381j83942M6160m68688M33646k62401K91646J92183n8160
4959C17413L461J25882j2641J01203L71355n2854j17371k44303k60512N9925L78320
4948F69878j84082j6016J07210J21983J24024j52332K6244J95439p3767n6965
4938G61616J60915L80919k29640l32495n0536j73683j63406J48581J60972J73187
4928H36430k19165L90057j25704m45065K33270j72084N1145Q0826J62300j15768
4918F76242N08289m35691j2213p0414L15300K97695l44861K67253M0013j17066
4908A124547j62846O9287K11261O48586m6265k55233m42203j66242j54563n4117
4898G72212J44998M70137j44057M6368L14119j20624L90099k03364o9705M25731
$$ plain form
4969 787006 432350 326969 143027 189187 -279501 154145 -108256 183390 375573 317413
4959 317413 320874 446756 434115 535318 906673 853819 736448 492145 231633 291558 669878
4948 669878 485796 469780 576990 698973 822997 670665 696909 892348 818581 761616
4938 761616 922531 1303450 1073810 741315 690779 517096 353690 502271 663243 836430
4928 836430 617265 1007322 881618 436553 669823 497739 548884 629710 792010 676242
4918 676242 1184531 748840 736627 666213 981513 1279208 934347 1201600 1241613 1124547
4908 1124547 961701 1030988 1242249 1890835 1844570 1589337 1147134 980892 826329 772212
4898 772212 917210 1387347 1243290 1289658 1603777 1483153 1873252 1669888 1600183 2025914
4888B025914j55269j0648R2756n27637L41027j38365L04631J53600j05936q7721
4878A892352j24579J50440q6685J69587n0789J74087m34356m0912L56262j76940
4868A828467k28003k75155O48929K35784k75681j03714m65697l5567J17968O7209
4858A514540L21862K21264k11331J21623M54271R9446l71505o405j20256j80114
4848A843395l9726L74644L66079j99117K52222K50166K84856k35959k02763L78545
4838C072342j28004J678k27037o3140L37812j67376o2038M30119K39163k48914
4828C184605O7268J2953r924j20547J83596M42328K62509k04062L57945k82442
4818C894229l91847J49912L03007J1348J5541L18784k6643l20341J29306L08843
$$ plain form
4888 2025914 1870645 1859997 1952753 1425116 1766143 1627778 1932409 2086009 1980073 1892352
4878 1892352 1767773 1918213 1831528 2001115 1950326 2124413 1690057 1649145 2005407 1828467
4868 1828467 1600464 1325309 1974238 2210022 1934341 1830627 1364930 1329363 1447331 1514540
4858 1514540 1836402 2057666 1846335 1967958 2422229 2521675 2150170 2143765 2023509 1843395
4848 1843395 1803669 2178313 2544392 2345275 2597497 2847663 3132519 2896560 2693797 3072342
4838 3072342 2944338 2946016 2718979 2655839 2993651 2826275 2764237 3194356 3433519 3184605
4828 3184605 3251873 3264826 3254902 3134355 3317951 3760279 4022788 3818726 4176671 3894229
4818 3894229 3502382 3652294 3955301 3966649 3982190 4300974 4274331 3953990 4083296 4392139
4808D392139K3924n8865L61572M05138m9997N43447K82800K96924J31809J71654
4798F500545J31270L73457l8397N93245J48566k8755O92923K19065l94384O64872
4788H862407N14821K59119L11359Q78028P46844L79060P61481P78167Q94409R03887
4778A5289582R87141J024489J301154R84795J203024J131376Q92288Q54630R39035
4769B4607514P52815M25828J2720o39887J18497m50702m84365J93745J13493o44641
4759B4005017k87140k58962l38206l90696r6076K49486j19046l51710Q2616O26073
4749B3121356L15632N82129Q75206P98698Q51469J380095J162546J207071Q24940
4740C1119142J042654J832192R14925J118966Q56494M36811P47800N86515Q62445
$$ plain form
4808 4392139 4416063 4357198 4718770 5123908 5073911 5617358 5900158 6197082 6328891 6500545
4798 6500545 6631815 7005272 6966875 7560120 7708686 7679931 8372854 8591919 8197535 8862407
4788 8862407 9377228 9636347 9947706 10825734 11572578 11951638 12713119 13491286 14385695 15289582
4778 15289582 16276723 17301212 18602366 19587161 20790185 21921561 22813849 23668479 24607514
4769 24607514 25360329 25786157 25798877 25158990 25277487 24826785 24342420 24536165 24649658 24005017
4759 24005017 23717877 23458915 23120709 22730013 22633937 22883423 22764377 22412667 22495283 23121356
4749 23121356 23436988 24019117 24894323 25693021 26544490 27924585 29087131 30294202 31119142
4740 31119142 32161796 33993988 34908913 36027879 36884373 37321184 38068984 38655499 39517944
4731C9517944M48469N27416L48874M91548L43277M562k39429J44340n2371P7720
4721D1612350o44503k7450l97758j247814j016227j378391j624550j640890j270406
4712C2364361j201098j227096n83207o14450k72828k60869l71880q4322L6925
4703B7785536M96829m4222N0267Q89600O27675P10400K83555l9117L69737P25213
4693C1855473K33512L08113L07983r3993l64725l85425q10458m79293j129337
4684B9441850j710088j474567j906443j726027j727467j182320j547709o56364
4676A7510865q02489q62299k6304o02546p76670r25395n94004j33381J20520j01230
4666A2807067m71534k44977k56286k87620n06200J95300L48788m36502j59021
$$ plain form
4731 39517944 39966413 40493829 40842703 41334251 41677528 41682090 41442661 41587001 41534630 41612350
4721 41612350 40967847 40940397 40542639 39294825 38278598 36900207 35275657 33634767 32364361
4712 32364361 31163263 29936167 29352960 28738510 28465682 28204813 27832933 27748611 27785536
4703 27785536 28282365 28238143 28288410 29178010 29805685 30516085 30799640 30760523 31130260 31855473
4693 31855473 32088985 32397098 32705081 32611088 32246363 31860938 31050480 30571187 29441850
4684 29441850 27731762 26257195 24350752 22624725 20897258 19714938 18167229 17510865
4676 17510865 16708376 15846077 15819773 15217227 14440557 13515162 12921158 12787777 12908297 12807067
4666 12807067 12335533 12090556 11834270 11546650 11040450 11235750 11584538 11148036 10989015
4657A0989015j47568n03446J96389l29590m42544o7020m9712k92349k09912J77618
4647I320881Q9573o38574n33060N4912j31346j51450k62067m42673j3791P6155
4637G368560k95131j62842j98701n350L0387j79846j30201j68644K39692j20228
4627F377696M858r5338L9594L7906L14870Q2257o5379k78158j35014j58744l47852
4616E776696Q41302N7313J96000N38669q6741M41090K11533J22148O062l03820
4606G800252K728N81056K87582P2311l8204q2113j1064J96088J01693j50078q7418
4595H672833M19549Q9232r604m88300l21764N86971n2461j4111l57544j46823
4585H377978O835K85172o59679k91709j69201N3847K90159K9177m57631K26383
$$ plain form
4657 10989015 10841447 10338001 10534390 10204800 9762256 9695236 9645524 9353175 9143263 9320881
4647 9320881 9410454 8771880 8238820 8293732 8162386 8010936 7748869 7306196 7292405 7368560
4637 7368560 7073429 6910587 6711886 6706536 6736923 6557077 6426876 6258232 6497924 6377696
4627 6377696 6382554 6287216 6326810 6364716 6679586 6761843 6696464 6418306 6283292 6124548 5776696
4616 5776696 6617998 6675311 6871311 7409980 7323239 7764329 7975862 8098010 8104072 7800252
4606 7800252 7802980 8384036 8671618 8743929 8705725 8623612 8612548 8808636 8910329 8760251 8672833
4595 8672833 9092382 9181614 9172010 8683710 8361946 8948917 8896456 8882345 8524801 8377978
4585 8377978 8384813 8669985 8010306 7718597 7549396 7603243 7893402 7922579 7464948 7691331
4575G691331L81090K78066j78004J80102P30350L45254k39825L53397K76758m29842
4565I388677r8378K10031M05618K21428J52174J38290J96005n4839L7119K78421
4555A0874546M59822J55860L7266R620O52678M67189M00023j61243O004Q01625
4545A3703390N73893N22143O53484N60729N77381P10779R41515Q97776J190261
4536B0331351Q59529J261375J305100J368732J383908J724593J860758J621199
4528C1716545J713654J176311J461312J180558O41472K12046N73320j61597j036
4519C8512585m90110j59228R4468q63441k95034l91767l23976K94609k53998l57616
4509C5766492r6122L20507o8856L19209O34838N66672Q61858P13087R09997R51544
$$ plain form
4575 7691331 8072421 8350487 8172483 8352585 9082935 9428189 9188364 9541761 9818519 9388677
4565 9388677 9290299 9500330 9905948 10127376 10279550 10417840 10613845 10559006 10596125 10874546
4555 10874546 11334368 11490228 11527494 11537114 12189792 12656981 13057004 12895761 12901765 13703390
4545 13703390 14277283 14799426 15452910 16013639 16591020 17301799 18243314 19141090 20331351
4536 20331351 21190880 22452255 23757355 25126087 26509995 28234588 30095346 31716545
4528 31716545 33430199 34606510 36067822 37248380 37889852 38101898 38675218 38513621 38512585
4519 38512585 38022475 37863247 37957715 37094274 36799240 36407473 36083497 36378106 36124108 35766492
4509 35766492 35670370 35990877 35922021 36241230 36876068 37442740 38304598 39017685 39927682 40879226
4499D0879226J268423P85965J305534M77750J93624q48250k13412l05461l44172
4490D3199227k86804o19293j93242p1219m67658k10911k12717m47897k95352l21797
4480D0072337j65633r5112k17215q42359l50085k80292o97644q18326j234760
4471C5370911n48448j201742j280345j029489j028284m48738p41639l58649k81179
4462B8452398k15899J77066M07724K35549p3189j50525J32556K70022N57186K00973
4452B9993861K11508l53574p5133m0097m64514k86295q33080n59522p00711j509978
4442B5382465j478827j562383j584506j082573p78126q74861q25505o88511p07037
4433A5800136r94556j38499q02717j48230n22866r32242l86710p0299R7712k40659
$$ plain form
4499 40879226 42147649 42933614 44239148 44716898 44910522 44062272 43848860 43543399 43199227
4490 43199227 42912423 42293130 42099888 42028669 41561011 41350100 41137383 40689486 40394134 40072337
4480 40072337 39906704 39811592 39594377 38752018 38401933 38121641 37423997 36605671 35370911
4471 35370911 34822463 33620721 32340376 31310887 30282603 29833865 29092226 28733577 28452398
4462 28452398 28236499 28413565 28821289 29056838 28983649 28833124 28965680 29235702 29792888 29993861
4452 29993861 30205369 29851795 29776662 29736565 29272051 28985756 28152676 27593154 26892443 25382465
4442 25382465 23903638 22341255 20756749 19674176 18896050 18021189 17195684 16507173 15800136
4433 15800136 14805580 14667081 13864364 13716134 13193268 12261026 11874316 11804017 11901729 11661070
4423A1661070m58321l2777j01402m16565o26815J11191k23667m56664j80821l40023
4413H935206k15045m83513J01708k68667O0222q8496n16525j00068k19145R731
4403G215408n18044n48914l1657k27471L81097j22359j81459k58972l2238k96384
4393E379007l62991M3922k02818j00150j20032m83971J14743L99971k78506L0331
4383D419506k0428k7211j12051l82441m2095j55856j28363J16527j12745l56819
4373C198024N4393L29847L11817Q4831n47322K3212j90838J00554P7806M2811
4363C485135J65025R7021q4397l10005k04642k24320j56973M29251m6893K10343
4353C359545K29418m68171j671k27112L9184J22188m61228m45111J68015J54425
$$ plain form
4423 11661070 11202749 11169972 11068570 10652005 10025190 10136381 9912714 9456050 9275229 8935206
4413 8935206 8720161 8236648 8338356 8069689 8129911 8041415 7524890 7424822 7205677 7215408
4403 7215408 6697364 6148450 6116793 5889322 6270419 6148060 5966601 5707629 5675391 5379007
4393 5379007 5016016 5059938 4857120 4756970 4636938 4152967 4267710 4667681 4389175 4419506
4383 4419506 4399078 4371867 4259816 3877375 3835280 3679424 3551061 3667588 3554843 3198024
4373 3198024 3252417 3582264 3894081 3978912 3431590 3454802 3263964 3364518 3442324 3485135
4363 3485135 3650160 3747181 3662784 3352779 3148137 2923817 2766844 3196095 3149202 3359545
4353 3359545 3588963 3120792 3119121 2892009 2931193 3053381 2592153 2147042 2315057 2469482
4343B469482R3592k8880K26100K36702k95755k25396k92170k0205M47850r1092
4333B520228K36841k17637J69117q7050k68588J3495K96155j86169k72029j63294
4323B041069J29578K46132L03501l44842k59990J77729L29689K2730k54390j98485
4313B192721l03447L43306n3581K24710r3874k3109L49825k04745L74108o8816
4303B737098j84116k66266l61863k21768q591K59648m36905L50777M615j80432
4293A692197J64451L31400K81892j00795J77082n1955N118L8634M63599j97854
4283B803769l66914K62768j37488N29813K25070J04437M03972L65852J18290J28621
4273D438190l06723j52637m7646m06911k80277M1219q58969n81460K07934J55000
$$ plain form
4343 2469482 2563074 2534194 2760294 2996996 2701241 2475845 2183675 2163470 2611320 2520228
4333 2520228 2757069 2539432 2708549 2621499 2352911 2366406 2662561 2476392 2204363 2041069
4323 2041069 2170647 2416779 2720280 2375438 2115448 2293177 2622866 2645596 2391206 2192721
4313 2192721 1889274 2232580 2178999 2403709 2309835 2286726 2636551 2431806 2805914 2737098
4303 2737098 2552982 2286716 1924853 1703085 1694494 1954142 1517237 1868014 1872629 1692197
4293 1692197 1856648 2188048 2469940 2369145 2546227 2494272 2499390 2538024 3001623 2803769
4283 2803769 2436855 2699623 2562135 3091948 3317018 3421455 3825427 4191279 4309569 4438190
4273 4438190 4131467 3978830 3931184 3524273 3243996 3285215 2426246 1844786 2052720 2207720
4263B207720j599j26140M1139k01576J62996l04204L586K42124K6117k59234k87285
4252A503644L62555j25765j03009R590M8809K4494m52769K29345K20835j06790
4242A610939M61423j63423j49886J91365m8488J53113q1785J21948l7080K15289
4232B273415j72934L40715J54709l11159P1198O75833J13778N30630J91303K35737
4222D103225M38962k3795j08206P4053n918n47132l29238k23177j59662l55433
4212B863679k11753n83149k20457j60242J67955O9585L68908J35607q4884n29871
4202A815378l7593k97230M9154K67358M6791n11081J43992O3230R9599j29526
4192A510072l96494l12701k00916J97100K2724J14126L9145N44698M3782l0924
$$ plain form
4263 2207720 2206121 2079981 2121120 1919544 2082540 1778336 1781922 2024046 2050163 1790929 1503644
4252 1503644 1866199 1740434 1637425 1647015 1695824 1720318 1267549 1496894 1717729 1610939
4242 1610939 2072362 1908939 1759053 1950418 1901930 2055043 1973258 2095206 2058126 2273415
4232 2273415 2100481 2441196 2595905 2284746 2355944 3031777 3145555 3676185 3867488 4103225
4222 4103225 4542187 4518392 4410186 4484239 4478321 3931189 3601951 3378774 3219112 2863679
4212 2863679 2651926 2068777 1848320 1688078 1856033 1925618 2294526 2430133 2345249 1815378
4202 1815378 1777785 1480555 1529709 1797067 1843858 1332777 1476769 1539999 1639598 1510072
4192 1510072 1113578 800877 599961 797061 819785 933911 973056 1517754 1561536 1530612
4182A530612L39813l22498j90143n661J96K73106J87396J33214L25557J69080
4172B440672P4266L73716k09769m77507J88030l14211J65902o1433P4551k14243
4162B039974j58262n2799l13880J83552Q9357r0484l78739l8908j16016j82640
4152I81155j68582L70201K35610o246l33941m9635J54943K00226L07951k63954
4142A427728p17793j6404K40755k90430j05141J123957l38204p24957K35189j06936
4132G27764l09269K88893L18083k60215l70412l55105J99522l5493J02984O86366
4122I93118K02581r1260l44498J39813J62336J38801k13790j77110N5871k52871
4112F12991J1655o25304J72102K34551J90424J3291J07180M56956n3703k66911
$$ plain form
4182 1530612 1870425 1547927 1357784 1352123 1352319 1625425 1812821 1946035 2271592 2440672
4172 2440672 2514938 2888654 2678885 2201378 2389408 2075197 2241099 2179666 2254217 2039974
4162 2039974 1881712 1828913 1515033 1698585 1787942 1697458 1318719 1279811 1163795 981155
4152 981155 812573 1182774 1418384 1412138 1078197 1028562 1183505 1383731 1691682 1427728
4142 1427728 709935 693531 934286 643856 538715 1662672 1324468 599511 834700 727764
4132 727764 418495 707388 1025471 765256 394844 39739 239261 203768 306752 993118
4122 993118 1195699 1104439 759941 899754 1062090 1200891 987101 809991 865862 612991
4112 612991 624646 -658 171444 405995 596419 609710 716890 1173846 1120143 853232
4102H53232n6163L60753r2234j46227l16576m9634j9058j47721j16940M59463
4092G28895k04317r1215m75015p8576K88853m1909o6823M11440J76449K35655
4082H83437o7550j56373L2790l5879L30902O2336n17807J57515K19778k72222
4072F36927o2613l11997l24814N6501N25461l13220k46575K79494L50185P4048
4062F63397O8464j94613J39976K09051m51142L46935J55683j45444p3709j59632
4052E58966l97837N2599K40545M50555J18682q8656m26701J52935L47413O6163
4042A074664j92708l07830J88999j65934j42544j22912L58531k01013J28102Q406
4032F25761r1784j48912K46121j7307L10024J25367l33841k39504R4001K0172
$$ plain form
4102 853232 797069 1157822 1065588 919361 602785 553151 534093 386372 269432 728895
4092 728895 524578 433363 -41652 -120228 168625 126716 59893 471333 647782 883437
4082 883437 815887 659514 692304 656425 987327 1049663 531856 689371 909149 636927
4072 636927 574314 262317 -62497 -5996 519465 206245 -40330 239164 589349 663397
4062 663397 731861 537248 677224 886275 435133 782068 937751 792307 718598 558966
4052 558966 161129 213728 454273 904828 1023510 934854 508153 661088 1008501 1074664
4042 1074664 881956 574126 763125 597191 454647 331735 690266 489253 617355 625761
4032 625761 533977 385065 631186 613879 923903 1049270 715429 475925 569926 590098
4022E90098M63958P7186J15823m58027m4376J46068k67l3575j64616L26869k76655
4011G42486Q1494j18111k60776O95571K50934j56122k78123r8240j41032J62029
4001H80110j48934j51086N20819L27477k36725j93910l56503p3614K60956L84207
3991A212797J43881l81419o8953j57380L19996K49482k39313l67417Q7327K11237
3981A010238K21726j43248p0575M46042k20606l78297J9488J16201O14982K74959
3971A890910j3685l3066l23107m5584j90021K9241M12321r8970J13772k21689
3961A520122o1640J69811M3872O7592l30330L5367K65903l2739K54123P8958Q8819
3950B099858L76868l2257m6986P0558N33361L5633K0230l99135k18875M58683
$$ plain form
4022 590098 1054056 1131242 1247065 789038 744662 890730 890463 856888 692272 1019141 742486
4011 742486 823980 705869 445093 1140664 1391598 1235476 957353 859113 718081 880110
4001 880110 731176 580090 1100909 1428386 1191661 997751 641248 567634 828590 1212797
3991 1212797 1356678 975259 906306 748926 1068922 1318404 1079091 711674 799001 1010238
3981 1010238 1231964 1088716 1018141 1464183 1243577 865280 884768 1000969 1615951 1890910
3971 1890910 1877225 1844159 1521052 1475468 1285447 1314688 1727009 1628039 1741811 1520122
3961 1520122 1458482 1628293 1672165 1739757 1409427 1444794 1710697 1677958 1932081 2011039 2099858
3950 2099858 2476726 2444469 2397483 2468041 3001402 3037035 3057265 2658130 2439255 2897938
3940B897938n20922r0056M06583K8614K73796N8483k30407q3486l37281q592J21809
3929B516479J03354j89375j05483j62479R67J59622p3410J43529P0474l6777K7901
3918B454802K22161M04096L77470k58382k29092L40673O87974o60689M5145N95382
3908C979540l29867L92349L3914j30533j34656J31496r5135L22356J31726M60342
3898D761532j10625O0891l47186L3209J86255o9577L51506k52465n78963P44265
3888D778842J90976j94018j8216J59289j99995m93587J94939N2905k161q2259
3878D386715J3508k05247L76349j72060j39172J73195m14362L6640l2876K05577
3868D228267M2086K7625J13940n6532j45614O906J925p8731L94813m58826P8822
$$ plain form
3940 2897938 2377016 2286960 2693543 2722157 2995953 3054436 2824029 2740543 2403262 2394670 2516479
3929 2516479 2619833 2430458 2324975 2162496 2163463 2323085 2249675 2393204 2463678 2426901 2454802
3918 2454802 2676963 3081059 3458529 3200147 2971055 3311728 3999702 3339013 3384158 3979540
3908 3979540 3649673 4042022 4075936 3945403 3810747 3942243 3847108 4169464 4301190 4761532
3898 4761532 4650907 4711798 4364612 4397821 4584076 4514499 4866005 4613540 4034577 4778842
3888 4778842 4969818 4775800 4757584 4916873 4716878 4223291 4418230 4471135 4468974 4386715
3878 4386715 4400223 4194976 4571325 4399265 4260093 4433288 4018926 4055566 4022690 4228267
3868 4228267 4270353 4297978 4411918 4355386 4209772 4216678 4218603 4139872 4534685 4075859 4154681
3857D154681M53669k15498K15250K47492p8498K97137J27833m1088r862m1149
3847E109967J44200N2821J63355L26022R7540j9161P4395L5503j04000M7345o5859
3836E862128J9633l52706k13674k32680M31232J0593k8823l18814J04445K92953
3826E574287J54760k91793L8656J31237j04529J25485k04570J45493K7234n34080
3816E062180J76293K37806K35246K46813k23597n1078L1792l26750k56565K53958
3806E386098O55746j79712k84622N19516L0105k53580m2542L64473L5913k95679
3796E935716K79250M42105l76805j89595Q8394L1689K68343j83950j57240M73996
3786F611903L48479M2515m84565k59695P9602k51129K78224L21938M03655K50605
$$ plain form
3857 4154681 4608350 4392852 4608102 4855594 4777096 5074233 5202066 5160978 5151116 5109967
3847 5109967 5254167 5306988 5470343 5796365 5893905 5874744 5949139 5984642 5880642 5927987 5862128
3836 5862128 5881761 5529055 5315381 5082701 5513933 5524526 5495703 5176889 5281334 5574287
3826 5574287 5729047 5437254 5475910 5607147 5502618 5628103 5423533 5569026 5596260 5062180
3816 5062180 5238473 5476279 5711525 5958338 5734741 5683663 5715455 5388705 5132140 5386098
3806 5386098 6041844 5862132 5577510 6097026 6127131 5873551 5831009 6195482 6231395 5935716
3796 5935716 6214966 6657071 6280266 6090671 6179065 6210754 6479097 6295147 6137907 6611903
3786 6611903 6960382 7002897 6518332 6258637 6338239 6087110 6365334 6687272 7090927 7341532
3776G341532K61346M03594m43523l12250J50090M60867J7705m96782J38334N99608
3766H120521l19469l16648r1803N69007K11453J41165J29895n65859K34413M41665
3756H554340M03707J19816j98604L51400L38677K91894j3189J49540j85406J40382
3746I952557N21613M06966n457j09640L22351J67055K88815J88064J61105L58524
3736A2251953M95115J39817L25763j0890j11925k86917M31013L74421j42775m0822
3726A3424753m91428L44993L31004O0167K02306L38442L05692L37938L71579N56886
3716A5782332J94362J5707K59749K01646O6278j96478K0269L02494K93883K38065
3706A7178307k13634R0747L43506J38031M54798K29447O06839N40016L51557M67574
$$ plain form
3776 7341532 7602878 8006472 7562949 7250699 7400789 7861656 7879361 7382579 7520913 8120521
3766 8120521 7801052 7484404 7392601 7961608 8173061 8314226 8444121 7878262 8112675 8554340
3756 8554340 8958047 9077863 8879259 9230659 9569336 9861230 9848041 9997581 9812175 9952557
3746 9952557 10474170 10881136 10875679 10766039 11088390 11255445 11544260 11732324 11893429 12251953
3736 12251953 12747068 12886885 13212648 13201758 13089833 12802916 13233929 13608350 13465575 13424753
3726 13424753 12933325 13278318 13609322 13669489 13871795 14210237 14515929 14853867 15225446 15782332
3716 15782332 15976694 15992401 16252150 16453796 16520074 16323596 16343865 16646359 16940242 17178307
3706 17178307 16964673 17055420 17398926 17536957 17991755 18221202 18828041 19368057 19719614 20187188
3696B0187188O27118K50883q5097K25107R98852P5769J20598M63144J88665J202345
3686B4254572L41647L00892N75810L12804K03262M69886O27771P03043M29790
3677B8219477P0469L32509J173890M26030R7346M44493R68028M1853L26132P91656
3667C2891883M27641R55473O62746R43369N79906O39183J026261J453599O59954
3658D0240015Q97692P74646Q84980Q29870P36938J179551J090555R27829J021954
3649D8584030J699157Q98714J163323J342224J538985K058806K491167J836505
3641F1612911J650689K328089J880198K293164K792751K789430L366440L777329
3633H2491001L931423M458107M726539M876977N542516N585005N941841O693925
$$ plain form
3696 20187188 20814306 21065189 20980092 21205199 22204051 22279820 22400418 22863562 23052227 24254572
3686 24254572 24596219 24897111 25472921 25785725 25988987 26458873 27086644 27789687 28219477
3677 28219477 28289946 28622455 29796345 30222375 30319721 30764214 31732242 31774095 32100227 32891883
3667 32891883 33319524 34274997 34937743 35881112 36461018 37100201 38126462 39580061 40240015
3658 40240015 41137707 41912353 42797333 43627203 44364141 45543692 46634247 47562076 48584030
3649 48584030 50283187 51181901 52345224 53687448 55226433 57285239 59776406 61612911
3641 61612911 63263600 65591689 67471887 69765051 72557802 75347232 78713672 82491001
3633 82491001 86422424 90880531 95607070 100484047 106026563 111611568 117553409 124247334
3625A24247334O436198O919094P187590P670864O864922O151417N700241O124565
3617A77302225N732373M917888M486609M477242L251777K313517P75066m06046
3609B02850651q15523J0677J576165K839774M818561N821091O527361P642041
3601B31270798P787471P185939O912051O637182N587363N643747O343225O108169
3593B83475945O706609M942698L528489J570471m74710k399965k907453k788721
3585B91653363l754523n559477p365295q588926q574871r089353p499600n214828
3577B36006490k898780p52932J452906L921599N629767O727575P511535Q292344
3569B65890504P988176P507942O966102N546688M345286L034658K072826m70400
$$ plain form
3625 124247334 130683532 137602626 144790216 152461080 159326002 165477419 171177660 177302225
3617 177302225 183034598 187952486 192439095 196916337 200168114 202481631 203256697 202850651
3609 202850651 202035128 202045805 203621970 206461744 211280305 217101396 223628757 231270798
3601 231270798 239058269 246244208 253156259 259793441 265380804 271024551 277367776 283475945
3593 283475945 290182554 295125252 298653741 300224212 299749502 297349537 294442084 291653363
3585 291653363 287898840 282339363 274974068 266385142 257810271 248720918 241221318 236006490
3577 236006490 233107710 232354778 233807684 237729283 243359050 250086625 257598160 265890504
3569 265890504 273878680 281386622 288352724 293899412 298244698 301279356 303352182 302881782
3561C02881782k346900l471373n335911o975269p956803p912150q011858p757123
3553B53114395o715721m925104l345375j600299K55097K788643M628699P022580
3545B51222915Q585023R635258Q995570Q064113P171771M686255K487241J008254
3537C01856400j134181j330329j833735j622963k009925n189351p452151r156299
3529B72127466p977457o478787o223918n788116n316130o134866o777657o015555
3521B21414980n775590n176219l161605j523631k06648J100199J288673N57320
3513B08517479j060570k534236m309570o288291o923440o959444o929541p529201
3505A65983186p278418q053410r002065q108892q982458p923687p112707n836311
$$ plain form
3561 302881782 300534882 297063509 291727598 284752329 276795526 268883376 260871518 253114395
3553 253114395 246398674 241473570 238128195 236527896 236782993 239571636 244200335 251222915
3545 251222915 259807938 269443196 278438766 286502879 293674650 298360905 300848146 301856400
3537 301856400 300722219 299391890 297558155 295935192 293925267 288735916 281283765 272127466
3529 272127466 264150009 257671222 251447304 245659188 240343058 234208192 227430535 221414980
3521 221414980 215639390 210463171 207301566 205777935 205571287 206671486 207960159 208517479
3513 208517479 207456909 204922673 200613103 194324812 187401372 180441928 173512387 165983186
3505 165983186 158704768 150651358 141649293 133540401 124557943 116634256 109521549 103685238
3497A03685238m900893m809833m235719m035552m595493l507972l166009l005132
3489G1428635l054392k517413k232116j998364k055748j916304j828094k120584
3481E3705620j626413j530736j518348j310448p14520q65927p66794j167304q31248
3472D3373882j379935j543218j005016m94107k42544j157027j351641m61941p16423
3463C5022030m15844J31131k60950o36466k12166p60226l22464M649p51111j47125
3453C1651458k95397q87701l79265p86060o98401k62886m00840q19660n31020
3444B6590228j61138n27268o3169Q6479n54313o44238o14422o02045j41501k28011
3434B3140602o83878J27427k88937J19183m09841r16935q44866l84094j73270
$$ plain form
3497 103685238 98784345 93974512 89738793 85703241 81107748 77599776 74433767 71428635
3489 71428635 68374243 65856830 63624714 61626350 59570602 57654298 55826204 53705620
3481 53705620 52079207 50548471 49030123 47719675 47005155 46139228 45372434 44205130 43373882
3472 43373882 41993947 40450729 39445713 38951606 38709062 37552035 36200394 35738453 35022030
3463 35022030 34606186 34737317 34476367 33839901 33627735 32867509 32545045 32549694 31798583 31651458
3453 31651458 31356061 30468360 30089095 29303035 28604634 28341748 27940908 27121248 26590228
3444 26590228 26429090 25901822 25838653 25925132 25370819 24726581 24112159 23510114 23368613 23140602
3434 23140602 22456724 22584151 22295214 22414397 22004556 21087621 20242755 19858661 19685391
3425A9685391q2842m11048m38678L6201j89893j48026J05855o48798q41022k17946
3415A6849194k41385l86162k45321l57513l11256j22170l39948M1404o85206J70275
3405A4371912L48344k77338l40769l85956j56039l03377k54883J95881K16883
3396A3414658j91333J15123K57102k75058j58157r0515m34163p8182P7501k6908
3386A2610068k69695L6451M3742J00132r4962N5502j88230j38512j90378l53239
3376A1610879m82746m81207N87741r5761l42069k3980O3911k54850o50271L393
3366I935040K5403j06953K57110r6251m34998l7457o09559r20919J17438K38840
3356H367694J19347l06786m8038n65636l65290O2131j03103m09448M2862M2368
$$ plain form
3425 19685391 19602549 19191501 18752823 18789024 18599131 18451105 18556960 17908162 17067140 16849194
3415 16849194 16607809 16221647 15976326 15618813 15307557 15185387 14845439 14886843 14201637 14371912
3405 14371912 14720256 14442918 14102149 13716193 13560154 13256777 13001894 13197775 13414658
3396 13414658 13223325 13338448 13595550 13320492 13162335 13071820 12637657 12559475 12636976 12610068
3386 12610068 12340373 12376824 12420566 12520698 12425736 12481238 12293008 12154496 11964118 11610879
3376 11610879 11128133 10646926 11234667 11138906 10796837 10772857 10836768 10581918 9931647 9935040
3366 9935040 9960443 9853490 10110600 10014349 9579351 9541894 8932335 8011416 8128854 8367694
3356 8367694 8487041 8180255 8132217 7566581 7201291 7263422 7160319 6750871 6793733 6836101
3346F836101J79143R994k63744P9438j66010m59538o4830j76064J23591n01032
3336E597049K43588r5254K47953J06863n99426Q3010L30337L2188l63021r1606
3326E491681R0543J0741K77783L69832k97207j94600k8061K05285K25439J80021
3316F331457l84844j09936J24610j72200j25053j18704J6295k99953L34436M70736
3306F066844j85149M80598l18158j60381j25990o626m4447p624J54238O33304
3296F486609j87727j44898l41597J52220M2355r5345K44092J9615N73964M03179
3286G152467M8634k15458M81696M78371l21096n58164r8221n9836L62479L23715
3276G594587O0262o48710J41124k61791j43012R7934M0970K27800l48651K26451
$$ plain form
3346 6836101 7015244 7025238 6761494 6840932 6674922 6215384 6150554 5974490 6098081 5597049
3336 5597049 5840637 5745383 5993336 6100199 5500773 5583783 5914120 5946308 5583287 5491681
3326 5491681 5582224 5592965 5870748 6240580 5943373 5748773 5720712 5925997 6151436 6331457
3316 6331457 5946613 5836677 5961287 5789087 5664034 5545330 5561625 5261672 5596108 6066844
3306 6066844 5881695 6362293 6044135 5883754 5757764 5751138 5706691 5699067 5853305 6486609
3296 6486609 6298882 6153984 5812387 5964607 6006962 5911617 6155709 6175324 6749288 7152467
3286 7152467 7201101 6985643 7467339 7945710 7624614 7066450 6968229 6908393 7270872 7594587
3276 7594587 7654849 7006139 7147263 6885472 6742460 6840394 6881364 7109164 6760513 6986964
3266F986964P6299Q5767l09200M49956m0827j075935J90863J89493k66385j00933
3256F186062J71853O5977L13993J30897j29734J58984J99710k43007K87274J05340
3246G247349j07956R7070j30411J22094J24791J87737J43093j42438j90619K71457
3236G622167J13359J62265k89693r4549n21980N05170k54689j83889R0299J65179
3226G313639N7493j43414J31862m9244L3919M0091p3737K15856k87753j06595
3216G132117J64350j32290N4437J56089L38187L7835J55414m4734J29522j44445
3206G846482l42569l44325P38611j36881m14207J79337J86312m54192M01089J75374
3196G835031m06149j34352m03174k34150M09287J52429P1436m2626M4086m9655
$$ plain form
3266 6986964 7063263 7149030 6839830 7289786 7248959 6173024 6363887 6553380 6286995 6186062
3256 6186062 6357915 6423892 6737885 6868782 6739048 6898032 7097742 6854735 7142009 7247349
3246 7247349 7139393 7236463 7106052 7228146 7352937 7540674 7683767 7541329 7350710 7622167
3236 7622167 7735526 7897791 7608098 7513549 6991569 7496739 7242050 7058161 7148460 7313639
3226 7313639 7371132 7227718 7359580 7310336 7344255 7384346 7310609 7526465 7238712 7132117
3216 7132117 7296467 7164177 7218614 7374703 7712890 7750725 7906139 7861405 7990927 7846482
3206 7846482 7503913 7159588 7898199 7761318 7347111 7526448 7712760 7258568 7659657 7835031
3196 7835031 7428882 7294530 6891356 6657206 7066493 7218922 7290358 7247732 7291818 7242163
3186G242163k144k59757m3244K08291L33934j59974L8915M30085R7540M33231
3176H319040l92247J49941J28269r5959K51567J07505M09030j17080j36094L19969
3166H943941L78911n742o07257O79796L30027K30048k90195N9893J68849n547
3156I882724R01011K43807n84094L10202N79868J69233L68239K9502l95378N04646
3146A2009760M28523L39968L03824K16140k83017L80643M15286M94798n4542j52708
3136A4098675L01206L74687N71899P91459L37533K03673R6765Q3698N43488J24673
3126A7527756N45463K46408O735K51201P60944O94098M86146j79147N60068L17282
3116B1216954K49832M98090O29478P68533N91426N07261J131902J074052N79930
$$ plain form
3186 7242163 7240019 6980262 6937018 7145309 7479243 7319269 7358184 7788269 7885809 8319040
3176 8319040 7926793 8076734 8205003 8109044 8360611 8468116 8877146 8760066 8623972 8943941
3166 8943941 9322852 9317110 8709853 9389649 9719676 9949724 9659529 9719422 9888271 9882724
3156 9882724 10783735 11027542 10443448 10753650 11333518 11502751 11870990 11900492 11505114 12009760
3146 12009760 12438283 12778251 13082075 13298215 13015198 13395841 13811127 14305925 14251383 14098675
3136 14098675 14399881 14774568 15346467 16137926 16475459 16679132 16775897 16859595 17403083 17527756
3126 17527756 18073219 18319627 18326362 18577563 19338507 20032605 20518751 20339604 20899672 21216954
3116 21216954 21466786 21964876 22594354 23362887 23954313 24461574 25593476 26667528 27247458
3107B7247458M64276J150891J121289R95342N69084P96440J058062J558519J114138
3098C6075499J436102J392506J305768J582409J779421J337159J179705J510591
3090D7599160K029426J764306J504692J659896J575765J278915J559543K201692
3082F1173395K356726J551733J841831J872099J609760K008653J823304K030474
3074G6267975J465585J677779J841629J242516J035573J174204M79779J199783
3066H6384823J405583J093687Q93695Q04620O84015K35619j09722P712j04108
3057I1295924m36836l61118n85509j350782p37934n58962o80119o76415j134009
3048H4774240j394508j291992j011552j280112k238563j634967j491987j627157
$$ plain form
3107 27247458 27711734 28862625 29983914 30979256 31548340 32344780 33402842 34961361 36075499
3098 36075499 37511601 38904107 40209875 41792284 43571705 44908864 46088569 47599160
3090 47599160 49628586 51392892 52897584 54557480 56133245 57412160 58971703 61173395
3082 61173395 63530121 65081854 66923685 68795784 70405544 72414197 74237501 76267975
3074 76267975 77733560 79411339 81252968 82495484 83531057 84705261 85185040 86384823
3066 86384823 87790406 88884093 89777788 90582408 91266423 91502042 91392320 91400032 91295924
3057 91295924 90859088 90497970 89912461 88561679 87823745 87264783 86584664 85908249 84774240
3048 84774240 83379732 82087740 81076188 79796076 77557513 75922546 74430559 72803402
3040G2803402j839854j971359j741222j525481j601913j520255j314345j704332
3032E9584641j494522j226951j405421j041928j816378j630202j147312r97356
3024D8824571j184316j238752q16066j171747q44952m85449n63116k63622o75215
3015D1581336o53362m83431p68231j011628k25661J58168J87148j33771o24141
3006C8026427j88906n01349P2526K99064j10596M06511L11352n9597J04673L04624
2996C8664729J06882K17223J524L14729L19399m40196J69075L51706j64492N38709
2986D0079288L71293j15579J62593K91550M14682J88257J52644K2356M1258j3681
2976D1594661p016K51430r3784j76498p7743J17556j1163l20833k5109P3556J216
$$ plain form
3040 72803402 70963548 68992189 67250967 65725486 64123573 62603318 61288973 59584641
3032 59584641 58090119 56863168 55457747 54415819 52599441 50969239 49821927 48824571
3024 48824571 47640255 46401503 45585437 44413690 43568738 43083289 42520173 42256551 41581336
3015 41581336 40927974 40444543 39676312 38664684 38439023 38597191 38784339 38650568 38026427
3006 38026427 37837521 37336172 37408698 37707762 37597166 38003677 38315029 38255432 38360105 38664729
2996 38664729 38771611 38988834 38990358 39305087 39624486 39184290 39353365 39705071 39540579 40079288
2986 40079288 40450581 40335002 40497595 40789145 41203827 41392084 41544728 41567084 41608342 41594661
2976 41594661 41587645 41839075 41745291 41568793 41491050 41608606 41597443 41276610 41251501 41325057 41326273
2965D1326273j87713m69029l93318k61910m44969o201k2047K25793p66181k17159
2955C8783539m62278N1870p4197k55929k04350m66971k63790k59300m66521j010721
2945C5371352l75302j46308L32058l05560n56026l13384q27190k68545J29646
2936C3040741k52586m46088l79802p4150o5522j30012L74613N08372l91771q7919
2926C2095876m4329K61422m16057l45288r2727l10423K69447J45125P4006J72310
2916C1809362k17743J21606P188k7339O21296M10253L48493K24272M61946J77916
2906C3937250K35530j19008N02181M46583Q4160K03189N30934N28024O13938N37234
2896C7500015O46765Q67107R97700R19580R69530R83875J275471R64338J375937
$$ plain form
2965 41326273 41138560 40669531 40276213 40014303 39569334 39563133 39541086 39766879 39000698 38783539
2955 38783539 38321261 38373131 38298934 38043005 37838655 37371684 37107894 36848594 36382073 35371352
2945 35371352 34996050 34849742 35181800 34876240 34320214 34006830 33179640 32911095 33040741
2936 33040741 32788155 32342067 31962265 31888115 31822593 31692581 32067194 32575566 32183795 32095876
2926 32095876 32051547 32312969 31896912 31551624 31458897 31148474 31417921 31563046 31637052 31809362
2916 31809362 31591619 31713225 31720413 31693074 32314370 32724623 33073116 33297388 33759334 33937250
2906 33937250 34172780 34053772 34555953 35002536 35086696 35289885 35820819 36348843 36962781 37500015
2896 37500015 38146780 39013887 40011587 40931167 41900697 42884572 44160043 45124381 46500318
2887D6500318J439632J178206J537848J728902J609640J788729J876442J619647
2879E9279364K050365J468831J290571J149297J159251R09841J818159K213766
2871G1339445J899901J515953J473272J259843J995207J667901K308298K819382
2863H6279202K248948L121811K901102J905430J861116J277989K99268P48432
2855A00643298J073259J450843J702615J723556J821577K296401K181917L228409
2847A16121875L033476L453593M270881M480378M423863M363860L850782L345014
2839A47343722K851830L125238M491043N282065O164426P207438Q399692Q858678
2831A93724132Q388760O209186N491601M315968K996520K678807L731177L939758
$$ plain form
2887 46500318 47939950 49118156 50656004 52384906 53994546 55783275 57659717 59279364
2879 59279364 61329729 62798560 64089131 65238428 66397679 67307520 69125679 71339445
2871 71339445 73239346 74755299 76228571 77488414 79483621 81151522 83459820 86279202
2863 86279202 88528150 91649961 94551063 96456493 98317609 99595598 99894866 100643298
2855 100643298 101716557 103167400 104870015 106593571 108415148 110711549 112893466 116121875
2847 116121875 119155351 122608944 126879825 131360203 135784066 140147926 143998708 147343722
2839 147343722 150195552 153320790 157811833 163093898 169258324 176465762 184865454 193724132
2831 193724132 202112892 208322078 213813679 218129647 221126167 223804974 227536151 231475909
2823B31475909L919190L715157L660440M910798O591394P202966Q430646Q373949
2815B78280449P738313Q467724R523208J1285188J2763906J4893769J6184746
2808C59137303J6967789J6606810J4110908R100629M236487m932k786150l129520
2800D14239324k424283j533861J26185K240408L533841M639347M114889K822967
2792D27758817n02319k482457k205518n57668Q75656J73052k779012n715182o726919
2783D07838450n690101l955225k001705j760032j508856j393136j629731k799984
2775C87099680o107668j1162546j7077739j9130698j7504930j5154906j2752405
2768B88208788j1079181q651413o686809n611311m659933n277279n772138n556736
$$ plain form
2823 231475909 235395099 239110256 242770696 247681494 254272888 261475854 269906500 278280449
2815 278280449 286018762 294486486 304009694 315294882 328058788 342952557 359137303
2808 359137303 376105092 392711902 406822810 415923439 420159926 420154994 417368844 414239324
2800 414239324 411815041 410281180 410407365 412647773 416181614 420820961 424935850 427758817
2792 427758817 427256498 424774041 422568523 422010855 422886511 423059563 420280551 414565369 407838450
2783 407838450 402148349 398193124 396191419 394431387 392922531 391529395 389899664 387099680
2775 387099680 380992012 369829466 352751727 333621029 316116099 300961193 288208788
2768 288208788 277129607 268478194 261791385 256180074 251520141 246242862 240470724 234913988
2760B34913988n405570n256677m505893l934995l637457m302283l931534l621888
2752B00317691l769679m198816n237287o703107q060108p768909o884817n796322
2744A51898646m767016l690437k211838k380524k286394k798400l781279n047937
2736A24934821m343580l824539l972925k661205k113135j890141q72985j119413
2728A04136898j281704j271651q15537r45210l36178o24585o28858p18337j718361
2719I5796477k642541k929417k945896k320902j668493j853160j575417r84062
2711G8876589r61876j621392j489106j141827j263081o12270p67238q98316k04359
2702F9917124p26165j331249q96249m10432j299940q76873o88445j015832r58704
$$ plain form
2760 234913988 229508418 224251741 219745848 215810853 212173396 207871113 203939579 200317691
2752 200317691 196548012 192349196 187111909 180408802 172348694 164579785 157694968 151898646
2744 151898646 147131630 143441193 141229355 138848831 136562437 133764037 129982758 124934821
2736 124934821 120591241 116766702 112793777 110132572 108019437 106129296 105256311 104136898
2728 104136898 102855194 101583543 100768006 99822796 99486618 98862033 98233175 97514838 95796477
2719 95796477 93153936 90224519 87278623 84957721 83289228 81436068 79860651 78876589
2711 78876589 77914713 76293321 74804215 73662388 72399307 71787037 71019799 70121483 69917124
2702 69917124 69190959 67859710 66963461 66553029 65253089 64376216 63687771 62671939 61713235
2693F1713235n57226p51845l42803j39758m32165p8685k35952m46207Q1716M38534
2683E9248844N11906O4719J307K76365K61648M08597M04973Q48908M54315Q27579
2673F3309161O00458J010784R47537P65558R59695R12389J026098J367291J535371
2664G2434342J658240J009353J238871K010694J416204K044218J254037J313576
2656H4379535J548466K107182J522135K304335K368201K369854K319797K411071
2648A01330576K549845K313018K295690K496360K746129L296876L410846L110083
2640A23549423L582427L968447L889952M541941N051865M959985N835364O978358
2632A62357762P437356Q217516Q369442R131901J0772704J0402621J0213706J0188271
$$ plain form
2693 61713235 61156009 60404164 60061361 59921603 59489438 59410753 59174801 58728594 58810310 59248844
2683 59248844 59760750 59825469 59826776 60103141 60364789 60773386 61178359 62027267 62481582 63309161
2673 63309161 63909619 64920403 65867940 66633498 67593193 68505582 69531680 70898971 72434342
2664 72434342 74092582 75101935 76340806 78351500 79767704 81811922 83065959 84379535
2656 84379535 85928001 88035183 89557318 91861653 94229854 96599708 98919505 101330576
2648 101330576 103880421 106193439 108489129 110985489 113731618 117028494 120439340 123549423
2640 123549423 127131850 131100297 134990249 139532190 144584055 149544040 155379404 162357762
2632 162357762 169795118 178012634 186382076 195513977 206286681 216689302 226903008 237091279
2624B37091279J0247820R255705Q334124Q224598O060482M654679L690259K396958
2616B89955904J522010J276413Q17760R65503R58795J019638O33359M58496L09850
2607B97917728n15462j030924k443544l876587n152664o068053o729426p301853
2599B64799215p793581p791642o950390o256238n936417n398971m217994l474565
2591B16979417l095237k750663k823609k345018k109537j830154k067376j727236
2583A98230587j881163j803230k453860k306831j969535j624293j887975k041625
2575A82262075j542964j415755j793598j262237j086026j544863j378369q14933
2567A71423330j344727j158722k64898k46875k11293l64576k8050M01906N95429
$$ plain form
2624 237091279 247339099 256594804 264928928 273153526 279214008 283868687 287558946 289955904
2616 289955904 291477914 292754327 293572087 294537590 295496385 296516023 297149382 297607878 297917728
2607 297917728 297402266 296371342 293927798 290051211 284898547 278830494 272101068 264799215
2599 264799215 257005634 249213992 242263602 236007364 230070947 224671976 220453982 216979417
2591 216979417 213884180 211133517 208309908 205964890 203855353 202025199 199957823 198230587
2583 198230587 196349424 194546194 192092334 189785503 187815968 186191675 184303700 182262075
2575 182262075 180719111 179303356 177509758 176247521 175161495 173616632 172238263 171423330
2567 171423330 170078603 168919881 168654983 168408108 168196815 167832239 167804189 168206095 168801524
2558A68801524Q84724J189938Q57244J109722J508116K149749J720516R79818
2550A79201351J633150J672798J844392J117888Q82213J049900O33476P57482
2542A88792650J024877L3364m34184j10508K5244k55787j047147j553124j824662
2533A84650723j871052k593764k745636k814223l317992l202512m004104l999240
2525A60102200l866020m092226m048783m275953l893104l774356m472332m372246
2517A27307180l995289l894817l397675l862012l903025m230524l803514l289757
2509I6930567k979895k994559k829345k563865k551362k832927k400435k021786
2501G5756393k068014j214461j320035j607151j296897r63333j024422q96179
$$ plain form
2558 168801524 169686248 170876186 171733430 172843152 174351268 176501017 178221533 179201351
2550 179201351 180834501 182507299 184351691 185469579 186351792 187401692 188035168 188792650
2542 188792650 189817527 189850891 189416707 189306199 189331443 189075656 188028509 186475385 184650723
2533 184650723 182779671 180185907 177440271 174626048 171308056 168105544 164101440 160102200
2525 160102200 156236180 152143954 148095171 143819218 139926114 136151758 131679426 127307180
2517 127307180 123311891 119417074 116019399 112157387 108254362 104023838 100220324 96930567
2509 96930567 93950672 90956113 88126768 85562903 83011541 80178614 77778179 75756393
2501 75756393 73688379 72473918 71153883 69546732 68249835 67286502 66262080 65365901
2493F5365901m74236p17358o13301j93984j49589o02198j04857o61364o50683
2484F1198331m36809l70077k15674j26985r7597n14250n69120J17402j5014p36042
2474E8234165m17934m76172m45231m81777r83593j477906j067818o27418j197219
2465E1059097j038048j008871n60813j450195j452766o00222j286436p48197p65403
2456D2148146j254552j329941o87625j714372j166431j237662j338966r63277
2448C2455320j266258p69444o86817p85337j117563p55245j186543p20715m74234
2439B4693164o57822o58042n24408j94430o57235l02504n83957J07123n36572
2430B0685317m35824q16336r69790m0340n05101K7984j24004n11580j00413l74802
$$ plain form
2493 65365901 64891665 64174307 63561006 63367022 63217433 62615235 62510378 61849014 61198331
2484 61198331 60761522 60391445 60175771 60048786 59951189 59436939 58867819 58985221 58970207 58234165
2474 58234165 57816231 57340059 56894828 56413051 55429458 53951552 52883734 52256316 51059097
2465 51059097 50021049 49012178 48451365 47001170 45548404 44948182 43661746 42913549 42148146
2456 42148146 40893594 39563653 38876028 37161656 35995225 34757563 33418597 32455320
2448 32455320 31189062 30419618 29732801 28947464 27829901 27074656 25888113 25167398 24693164
2439 24693164 24035342 23377300 22852892 22658462 22001227 21698723 21114766 21221889 20685317
2430 20685317 20249493 19433157 18463367 18423027 17917926 17945910 17821906 17310326 17209913 16835111
2420A6835111l96980K79540k81933p93334K59073K42134m93840n23945n29832
2411A4595994k85663K10843K71676n70163p4517N393l29241m58247O13512Q8731
2401A4068318j48058m42859k16186n4223p28566k71086K56876l85554K27384K34831
2391A2540877k77028m8737m42993m99477j78707j33376R6312J61998k29792N2463
2381A1041540N549L4345J22726N6380J36007L94711m82207n84792r5633K62322
2371A0890948K6268j2769L0310P0564L3316o21044m22797J82561n73503L68792
2361I972646J80241L35068M38131n6362n205R9754o39622r9482r0396Q827K04160
2350A0347760J07515k6697k91998p89034K17763L87114k07633L02594j69344j44530
$$ plain form
2420 16835111 16438131 16717671 16435738 15642404 15901477 16143611 15649771 15125826 14595994
2411 14595994 14310331 14521174 14792850 14222687 14148170 14153563 13824322 13366075 13979587 14068318
2401 14068318 13920260 13477401 13261215 13206992 12478426 12207340 12464216 12078662 12306046 12540877
2391 12540877 12263849 12215112 11772119 11272642 11093935 10960559 11056871 11218869 10989077 11041540
2381 11041540 11047089 11081434 11204160 11260540 11396547 11791258 11309051 10724259 10628626 10890948
2371 10890948 10917216 10904447 10934757 11005321 11038637 10417593 9994796 10177357 9603854 9972646
2361 9972646 10152887 10487955 10926086 10869724 10864519 10964273 10324651 10225169 10134773 10143600 10347760
2350 10347760 10455275 10428578 10136580 9347546 9565309 9952423 9744790 10047384 9878040 9733510
2340I733510o16020K97763L84565K1430l85869J10805O3673j24864M5735m2549
2330I488179M33114j04103l96005R1120j1145M04384P4159K35868j22570k0524
2320A0072477K94543L68195N3044L97293m396K738K02572J54482k00956K6053
2310A1366045L24160o6353P0984p7075J12368M8326m63376L38129J4287o139k2618
2299A1638738j54031M09893L69839k950R9376r3319Q7286M03263k06348k70007
2289A2281740j48824M66934P7246M25889j07240l73334j13232O6114L15117J57623
2279A3048033j54727M722K90260J22497k30851Q73055j04115o11796q8482L36272
2269A3484868k68169L46591J46583M12998M43733k64403k8024O09499K39906M348
$$ plain form
2340 9733510 9117490 9415253 9799818 9821248 9435379 9546184 9609857 9484993 9530728 9488179
2330 9488179 9921293 9817190 9421185 9512305 9501160 9905544 9979703 10215571 10093001 10072477
2320 10072477 10367020 10735215 10788259 11185552 11181156 11183894 11386466 11540948 11339992 11366045
2310 11366045 11690205 11623852 11694836 11617761 11730129 11778455 11315079 11653208 11667495 11661356 11638738
2299 11638738 11484707 11894600 12264439 12261489 12360865 12267546 12354832 12758095 12551747 12281740
2289 12281740 12132916 12599850 12677096 13102985 12995745 12622411 12509179 12575293 12890410 13048033
2279 13048033 12893306 12898028 13188288 13310785 13079934 13952989 13848874 13237078 13148596 13484868
2269 13484868 13216699 13563290 13709873 14122871 14566604 14302201 14274177 14883676 15123582 15127930
2259A5127930K68583K82870K097K55793O59588K45908Q32711J13455K20300O59174
2249A8668409L53670K79868N33858M66133N64570m7810N40424M38261J3343L69556
2239B2180282Q08178L332M17766J89754J56989K94352L54528q8370N63825R10840
2229B5791476N53300O53459O58922O00335J156232J040004K19068P37785R28588
2220C2339169J008409P89681P94691R92520Q90637Q30662K019275K327337J446323
2211D3438704J374560K305597K080774K735209K116129K106054K643259K441636
2203F1241922K070874J410104J607382R00936L53200K02763l45776m20373n89665
2194F6431367p23909j236370j017963j034980j196281k164260k571953k739212
$$ plain form
2259 15127930 15396513 15679383 15681480 15937273 16596861 16842769 17675480 17788935 18009235 18668409
2249 18668409 19022079 19301947 19835805 20301938 20866508 20818698 21359122 21797383 21810726 22180282
2239 22180282 22988460 22991792 23409558 23599312 23756301 24050653 24405181 24316811 24880636 25791476
2229 25791476 26344776 26998235 27657157 28257492 29413724 30453728 30672796 31410581 32339169
2220 32339169 33347578 34137259 34931950 35924470 36815107 37645769 39665044 41992381 43438704
2211 43438704 44813264 47118861 49199635 51934844 54050973 56157027 58800286 61241922
2203 61241922 63312796 64722900 66330282 67231218 67584418 67787181 67441405 67021032 66431367
2194 66431367 65707458 64471088 63453125 62418145 61221864 59057604 56485651 53746439
2186E3746439l102239k307041k296313k106731k486184k477884j680732j631150
2178C5658165j692215j450565j298013j634026j418633r25798r69188j485115
2170B4784612j053246r22213q13673n98760q62052l53584n49848l86369l76878
2161A8867989n7626m95089q36043o08495n7000k69414o0542l07988l65108o27333
2151A5183351l79530j99536o58786o32442n89646o21171p24564o3666O6023p38935
2141A0641098n60429J01670k46330j92665m48968J552k6499O1034m48529n05723
2131H376211Q1158k12857k29553m00234M0547J45435k44483o3598m92582k83766
2121F716278Q372K68882j68511o80949k64724K99413K59213j97822j96513K19351
$$ plain form
2186 53746439 50644200 48337159 46040846 43934115 41447931 38970047 37289315 35658165
2178 35658165 33965950 32515385 31217372 29583346 28164713 27238915 26269727 24784612
2170 24784612 23731366 22809153 21995480 21396720 20534668 20181084 19631236 19244867 18867989
2161 18867989 18810363 18315274 17479231 16870736 16813736 16544322 16483780 16175792 15810684 15183351
2151 15183351 14803821 14604285 13945499 13313057 12723411 12102240 11377676 11314010 11380033 10641098
2141 10641098 10080669 10182339 9936009 9743344 9294376 9295928 9269429 9330463 8881934 8376211
2131 8376211 8457369 8244512 8014959 7614725 7655272 7800707 7556224 7492626 7000044 6716278
2121 6716278 6724650 6993532 6825021 6144072 5879348 6178761 6437974 6240152 6043639 6262990
2111F262990L82536l01961n2139l42350J09260m3263k92492j32061j63826J33464
2101E560158n11258l09997M46458k85754l62228M08595n9532k05722k44138l04376
2091D132206L94260J23854q7667k79966m5458J43316m20008k21616K42943j63499
2081C818365L990L11979p10241m7138L57221k9632l06573l76337M46116N09371
2071C977121l96678J3220l1680n84996j59879M87095L24799o12755p7289L7387
2061B976345n72282m129R6016L6732K85661k53160q5968j74345K37758K40380
2051B783008K4230k00355j59366M44434l12098N1918k91934r1660K48744k64086
2041B232835J62335o655J04415o1940r2948K55073J24796j48803l35664q6816
$$ plain form
2111 6262990 6645526 6343565 6291426 5949076 6058336 6015073 5722581 5590520 5426694 5560158
2101 5560158 5048900 4738903 5185361 4899607 4537379 4945974 4886442 4680720 4436582 4132206
2091 4132206 4526466 4650320 4562653 4282687 4237229 4380545 3960537 3738921 3981864 3818365
2081 3818365 3822355 4134334 3424093 3376955 3734176 3704544 3397971 3021634 3467750 3977121
2071 3977121 3580443 3593663 3561983 2976987 2817108 3304203 3629002 3016247 2938958 2976345
2061 2976345 2404063 2399934 2495950 2532682 2818343 2565183 2479215 2304870 2542628 2783008
2051 2783008 2807238 2606883 2447517 2891951 2579853 2631771 2339837 2248177 2496921 2232835
2041 2232835 2395170 2388515 2492930 2430990 2338042 2593115 2717911 2569108 2233444 2146628
2031B146628k26352K42634k21660j16384K80504j9233l35125M22969L66966l70604
2021B170343j71195J78715l286L54455j55272j41088j40651k32153K81J00948
2011A961097l0988k52699k8556R7452j67185o3079J04121m4286M40323R1940j07397
2000B000743k77460K737J36362l63620L09434J95483k73745k85445k13242j04740
1990A126507L27463P53210l43816J28305J64064k71936J36499K80652j34077l60014
1980A806857K36582N9151j22742k12441M6923r2169M1059J69375o65872K67075
1970A533798L10929J08056l91765k84798j31763O18770J43377l2794j81186J96879
1960A889503k0734K69048K55952j9488n03812j54679j7395J79084K020l12515
$$ plain form
2031 2146628 1920276 2162910 1941250 1824866 2105370 2086137 1751012 2173981 2540947 2170343
2021 2170343 1999148 2177863 2174577 2529032 2373760 2232672 2092021 1859868 1860149 1961097
2011 1961097 1930109 1677410 1648854 1746306 1579121 1516042 1620163 1575877 2016200 2108140 2000743
2000 2000743 1723283 1726020 1862382 1498762 1808196 2003679 1729934 1444489 1231247 1126507
1990 1126507 1453970 2207180 1863364 1991669 2155733 1883797 2020296 2300948 2166871 1806857
1980 1806857 2043439 2102590 1979848 1767407 1814330 1722161 1763220 1932595 1266723 1533798
1970 1533798 1844727 1952783 1561018 1276220 1144457 1763227 1906604 1873810 1692624 1889503
1960 1889503 1868769 2137817 2393769 2374281 1870469 1715790 1698395 1877479 1879499 1566984
1950A566984L34375j18301O0729m1636j02680K23156r1229k52485M09916L09990
1940B298819n17692O5429K63681l07645k2399J6138J0332k76964J98633L64860
1930B093192L22576j21095j75216J48185M71421K4549Q625k32136J48786L96406
1920C085293k64865j23804K12145k70112m22208k35859O90568K99063J24699J87853
1910C282773J43909n45196L09771L52053j9297K05650l13201O24047J91598l07363
1900C924744k67828R4896M8229P7636J74511k82301M10902O6268j01267P35951
1890D881741L0459j96435N32203j25323L77183J70746l04620P07544N23105J61990
1880F758593P5182M87314K620K96088J016794l93452N42526P15131K02343L99178
$$ plain form
1950 1566984 1901359 1783058 1843787 1802151 1699471 1922627 1831398 1578913 1988829 2298819
1940 2298819 1781127 1846556 2110237 1802592 1780193 1796331 1806663 1529699 1728332 2093192
1930 2093192 2415768 2294673 2119457 2267642 2739063 2763612 2772237 2540101 2688887 3085293
1920 3085293 2820428 2696624 2908769 2638657 2216449 1980590 2671158 2970221 3094920 3282773
1910 3282773 3426682 2881486 3191257 3543310 3524013 3729663 3416462 4040509 4232107 3924744
1900 3924744 3656916 3751812 3800041 3877677 4052188 3769887 4180789 4247057 4145790 4881741
1890 4881741 4912200 4715765 5247968 5122645 5499828 5670574 5365954 6073498 6596603 6758593
1880 6758593 6833775 7321089 7323709 7619797 8636591 8243139 8785665 9500796 9703139 10102317
1870A0102317P67046L94286M11521P87494P16671Q4493P15450J051986L44534
1861A5375798O19629Q5044J02812m26394J9976P2442L248j0728l84031m44199
1851A5013597L21615K43437L07642k23434J63109N45621N62163N57703J90702
1842A7682155J48519O00209Q58580R69541P27683R15489J102579J306774J269660
1833B5581189J704125J344760Q18269k84434j680999k665659k167693j527744
1825B1121814j604074j264469p73497q75682p43395p51461n78992m70454k28254
1816A3831536r2731q2510j84721J86373K25386l80178L1515O901M82223j67657
1806A3856137k58904K46004N25760J16808J33974j06037K36302L48364j09535
$$ plain form
1870 10102317 10869363 11263649 11675170 12462664 13179335 13263828 13979278 15031264 15375798
1861 15375798 15995427 16080471 16183283 15756889 15776865 15849307 15852555 15841827 15457796 15013597
1851 15013597 15335212 15578649 15886291 15662857 15825966 16371587 16933750 17491453 17682155
1842 17682155 17830674 18430883 19289463 20259004 20986687 21902176 23004755 24311529 25581189
1833 25581189 27285314 28630074 29448343 29163909 27482910 24817251 22649558 21121814
1825 21121814 19517740 18253271 17479774 16604092 15860697 15109236 14530244 14059790 13831536
1816 13831536 13738805 13656295 13471574 13657947 13883333 13503155 13534670 13541571 14023794 13856137
1806 13856137 13597233 13843237 14368997 14485805 14619779 14513742 14750044 15098408 14988873
1797A4988873n26104m87897j237086q59063m43568o36777p45602k31088q15464
1788I006224l68319l23593j70200q63248m88816N3292j19426n98187L25963j10093
1778F343597n70916j21460o99664m228J67975j22203n21794j95231k9126k85177
1768C961773k53112J41639J97088k20034m05758l01371j34480k271l09019l92058
1758B282397L48649M75051l21219j33477j10965K17415o4089n1971o71765M491
1748A974517J83778j69608k60059k3799k57300k35525K51321m3457p3360k50789
1738A095719j41460m4385j3496J44668R9588L52018L14737j51761K38381R5587
1728A989596l15062j9024l34926k29741m17130M70710K23440k71711p4230L43307
$$ plain form
1797 14988873 14462769 13974872 12737786 11878723 11435155 10798378 10052776 9821688 9006224
1788 9006224 8637905 8314312 8144112 7280864 6792048 6845340 6725914 6127727 6453690 6343597
1778 6343597 5772681 5651221 4951557 4947329 5115304 4993101 4471307 4276076 4246950 3961773
1768 3961773 3708661 3850300 4047388 3827354 3421596 3120225 2985745 2983474 2674455 2282397
1758 2282397 2631046 3106097 2784878 2651401 2540436 2757851 2693762 2641791 1970026 1974517
1748 1974517 2158295 1988687 1728628 1704829 1447529 1212004 1463325 1419868 1346508 1095719
1738 1095719 954259 909874 896378 1041046 1140634 1492652 1807389 1655628 1894009 1989596
1728 1989596 1674534 1655510 1320584 1090843 673713 1144423 1367863 1096152 1021922 1365229
1718A365229l00803J79727l44877k66752j44010j17818Q0639L47650R3022L83355
1708A275362O3040l42596l29521O644q0862m38697J91346K90334O04133j58293
1698A080890m39350j99378J32078j82547N1841l06880j87407P8836N26136M2573
1688E96792o88221R2166J76894k97078L47859J08110O9184M11645j44324j54448
1678E18579j2915j726o5971k91541R1631J59644L3160m8817J26368j95285O5722
1667C78849k52424O8838Q7099k63381L0721K44221l50167l19106j55543q1252
1657f12145J51864K51447L87278k94476j3578L29717J21531n90217j02504l18338
1647f89421l34580M83240J31049O77742j36589L7620L04660K95475l86717l11947
$$ plain form
1718 1365229 1064426 1244153 899276 632524 488514 370696 451335 798985 892007 1275362
1708 1275362 1338402 995806 666285 672929 592067 153370 344716 635050 1239183 1080890
1698 1080890 641540 442162 574240 391693 443534 136654 -50753 28083 554219 596792
1688 596792 -91429 737 177631 -119447 228412 336522 405706 817351 673027 518579
1678 518579 505664 503938 437967 146426 238057 397701 430861 382044 508412 313127 378849
1667 378849 126425 195263 282362 18981 49702 293923 -56244 -375350 -530893 -612145
1657 -612145 -460281 -208834 178444 -116032 -129610 200107 321638 -268579 -371083 -689421
1647 -689421 -1024001 -540761 -409712 268030 131441 169061 473721 769196 382479 70532
1637G0532j20781J80264k88036m14202N08705j75160M47895L12551n10700p7401
1627f6333J08581K86866l66434m191K12450m10403r0861J56921K45073n2102K58005
1616B77572m00308L2978J27418N3468k06921p4448L6702k3478Q742k40951L80341
1605b8885L54926l37505n7807L35425o4240K96884l31174q1696l11686j5135k24770
1594d65663K86051O0702n58530L13126k66386M09210J96458k18390r6671K96000
1584d4093L4938k18351p1314k213K36713o3256L02285j08589n3078P2953p6931
1573I064j01611j29123n9183J69199J36153K89991J86509j45230p8815k83086
1563f132l7009j73009L2760j12051M0287k89778K17131L67074J20876k46293j78696
$$ plain form
1637 70532 -50249 130015 -158021 -572223 -63518 -238678 209217 521768 11068 -66333
1627 -66333 42248 329114 -37320 -41511 170939 -239464 -330325 -173404 71669 19567 277572
1616 277572 -122736 -89758 37660 91128 -115793 -190241 -153539 -177017 -168275 -409226 -28885
1605 -28885 326041 -11464 -69271 266154 201914 498798 167624 85928 -225758 -240893 -465663
1594 -465663 -179612 -118910 -677440 -364314 -630700 -221490 -25032 -243422 -340093 -44093
1584 -44093 -9155 -227506 -298820 -301033 -64320 -127576 174709 66120 13042 85995 9064
1573 9064 -92547 -221670 -280853 -111654 24499 314490 500999 355769 276954 -6132
1563 -6132 -43141 -216150 -183390 -295441 -255154 -544932 -327801 39273 160149 -86144 -264840
1552b64840k93924l6991K60664K65811J97571J98176j93658l75372N44901J04194
1542D06532l27020j66351L18388k79981o9525Q325l14174J3784j28373P1786J26753
1531c39856L43433l83208j8315K74212m1017k3654K52691N8803m5203N2385K4172
1520A54443k90221l65878L80435K38583n24680j8629k17538j443M45293k48483
1510d48118J00200L79268p8832K38382j33483m1698l41739J4333K78463K70480
1500B37256l17644J20362k81038l4821J6141L15292K74695k25447K11700k86687
1490B9809j05644l9566M40370m48346l01112J63222P5607R8553J07928l43773
1480c22952L3006l38024N18741l52715m07327K94889M25044j28162k41715J62836
$$ plain form
1552 -264840 -558764 -595755 -335091 -69280 128291 326467 132809 -242563 302338 406532
1542 406532 79512 -86839 231549 -48432 -117957 -109632 -423806 -410022 -538395 -466609 -339856
1531 -339856 3577 -379631 -397946 -123734 -164751 -188405 64286 123089 77886 130271 154443
1520 154443 -135778 -501656 -121221 117362 -407318 -425947 -643485 -644928 -199635 -448118
1510 -448118 -347918 31350 -47482 190900 57417 15719 -326020 -311687 -33224 237256
1500 237256 -80388 39974 -241064 -275885 -259744 55548 330243 104796 316496 29809
1490 29809 -75835 -115401 324969 -123377 -424489 -261267 -185660 -87107 20821 -322952
1480 -322952 -289946 -627970 -109229 -461944 -869271 -574382 -149338 -277500 -519215 -356379
1470c56379k86013M34300M96191J12410r7193j46298j32333K09497L3632l42784
1460g4970k93967L0246L07974j14305k31868l05093R9103o1292K60161L05453
1450g8558q5225K10689O5782l74533M9913j43416k61390M4900N60837K06596j51408
1439D4187J9373l81183n26726L25484L91982O426M9473J83194q6665k81132L04147
1428D8560j18763j92626J31387k22634L2523J26964Q3295N84765q9865o77831
1418b94225k56450k63102M23617L78032K99722r65767M04200m3010l10439J48417
1408d79005m76679o2914m7021L91835K52772l8052R8184o8817K28272j95204o70210
1397a066839J88689K11907j71503K42219k22673l41295N14699K299K87308p9457
$$ plain form
1470 -356379 -642392 -208092 288099 400509 303316 157018 24685 234182 267814 -74970
1460 -74970 -368937 -338691 -30717 -145022 -376890 -681983 -582880 -644172 -384011 -78558
1450 -78558 -163783 46906 112688 -261845 -211932 -355348 -616738 -571838 -11001 195595 44187
1439 44187 63560 -317623 -844349 -518865 -126883 -120457 -70984 112210 25545 -255587 48560
1428 48560 -70203 -262829 -131442 -354076 -321553 -194589 -111294 473471 383606 -294225
1418 -294225 -550675 -813777 -390160 -12128 287594 -678173 -273973 -316983 -627422 -479005
1408 -479005 -955684 -1018598 -1065619 -673784 -421012 -459064 -360880 -429697 -201425 -396629 -1066839
1397 -1066839 -878150 -666243 -837746 -595527 -818200 -1159495 -644796 -642497 -355189 -434646
1387d34646o2051Q9954J41572j78505k00629j54021N12717J60438l0062J54266
1377i67l44497o9866P92153n25421j01001J8296P8822l90609Q8904K94607N7691
1366a01888l84103l66666r9701L65647K62635K44773J22829j01260J43321j47569
1356f1982k88099J56268L34611R210l55872j29707j40366K20297L4238j37496
1346c58898l09052J00208J11549L83708o2848k34112O7952M4178J26176M47238
1336C16099j28448l26132K63829n23174j07653N968K38772Q3917j02749J23688
1326a55883M99984j30027j08192p29855J40270J75904j33719K42489n1029j34433
1316c84491o5661j2520k8470n2458K79126m9803l6531n4544J82632J43375n3715
$$ plain form
1387 -434646 -496697 -406743 -265171 -443676 -644305 -798326 -285609 -125171 -155233 -967
1377 -967 -345464 -415330 376823 -148598 -249599 -231303 -152481 -543090 -454186 -159579 -101888
1366 -101888 -485991 -852657 -952358 -586711 -324076 -79303 43526 -57734 85587 -61982
1356 -61982 -350081 -193813 140798 150008 -205864 -335571 -475937 -255640 -221402 -358898
1346 -358898 -667950 -567742 -456193 -72485 -135333 -369445 -301493 -257315 -131139 316099
1336 316099 187651 -138481 125348 -397826 -505479 -499511 -260739 -176822 -279571 -155883
1326 -155883 344101 214074 105882 -623973 -483703 -307799 -441518 -199029 -250058 -384491
1316 -384491 -450152 -462672 -491142 -543600 -264474 -314277 -350808 -405352 -222720 -79345 -133060
1305a33060l7445L81407m01285n6803j73168k7036L6390L09844K71455J00721
1295B71020k60780j10861O9537l29316k87394O4292N16265l79186J39287L31749
1285B4613l39704J21606J33706k05712R0464J46446O1365L2372J21189k59007
1275g2662M10074M17722k22817k96335j95433J8096p3832K34069J48204K62259
1265F29345R324l08379o9787Q5642j65492R1669n43468o10499J54653N06058K86115
1254F5181J26711k48190j73448j59259k05515k30799J23356K82614j47968K05432
1244c61885M4901J12602K75810L64366n49289l96069q2762o7176L21921K26609
1234a10972r747J86194q7450K37837j92939k72299K61814N4243L67836J51873
$$ plain form
1305 -133060 -170505 210902 -190383 -247186 -420354 -447390 -411000 -101156 170299 271020
1295 271020 10240 -100621 -31084 -360400 -647794 -583502 -67237 -446423 -307136 24613
1285 24613 -315091 -193485 -59779 -265491 -175027 -28581 32784 65156 186345 -72662
1275 -72662 337412 755134 532317 235982 40549 58645 -15187 218882 367086 629345
1265 629345 638669 330290 260503 346145 180653 272322 -271146 -881645 -726992 -220934 65181
1254 65181 191892 -56298 -229746 -389005 -594520 -825319 -701963 -419349 -567317 -361885
1244 -361885 -316984 -204382 71428 435794 -113495 -509564 -592326 -659502 -337581 -110972
1234 -110972 -120719 65475 -21975 215862 22923 -249376 12438 66681 434517 586390
1224E86390l57136k34435o4217M21895O7126q1455n5118l4470r281j52329j06082
1213a9112L53059j00364n8535k27126k91861K61104q8114n23598J98728L55963
1203a39856l0167J6814N88261q6983q2887k21666L79741K10778m56784n09638
1193c32387r1064L87250L45148R4900j99187L02706o669n04578L01175K22463
1183E19757N0040k59252k66480K88746k16784j25982P6062J7384J41810M65964
1173F91265k73310j55145l5466K61897J18341Q837n10011m02404l7007N36622
1163B03619j19955K18770m5881k2543P4912N3139P7862k89893j77912K14206L02657
1152D88981q8634O0560k03750m98499K80596l3139L2924M10769J44357j30912
$$ plain form
1224 586390 229254 -5181 -69398 352497 419623 338168 283050 248580 239299 86970 -19112
1213 -19112 333947 233583 175048 -52078 -343939 -82835 -170949 -694547 -495819 -139856
1203 -139856 -170023 -153209 435052 348069 265182 43516 423257 634035 177251 -332387
1193 -332387 -423451 -36201 308947 403847 204660 507366 500697 -3881 297294 519757
1183 519757 569797 310545 44065 332811 116027 -9955 66107 83491 225301 691265
1173 691265 417955 262810 227344 489241 607582 616419 106408 -295996 -333003 203619
1163 203619 83664 302434 256553 234010 308922 362061 439923 150030 -27882 186324 488981
1152 488981 400347 460907 257157 -241342 39254 6115 39039 449808 594165 463253
1142D63253K61529j24707k75121J24636j28589K41272o4565N4484k97147K47003
1132E02048L38940l56536J26229M46595k55239m98228L16647M89668k08814n5089
1122H46221j74162Q6968L02118L91179L29877l32592J30357m65395o7605j46861
1112I00105j28663l1201q1086j4562j80203K45729k76424L93443M7873J76264
1102A051275L36498l52812l24665N99024L99940q24202L6950Q9305J39658k28621
1092I22350k46485m0579L99541L76795r911J1440k70782J47201J95728K3487k70516
1081A238269J0451Q1005M43600k000J36929J09150O9440n94034J05929Q42429
1071B441168J65844k21622l806k0794l01489k55330J14729K43990m81551N05959
$$ plain form
1142 463253 724782 600075 324954 449590 321001 562273 497708 552192 255045 502048
1132 502048 840988 484452 610681 1057276 802037 303809 620456 1110124 901310 846221
1122 846221 672059 759027 1061145 1452324 1782201 1449609 1579966 1114571 1046966 900105
1112 900105 771442 740241 659155 644593 464390 710119 433695 827138 875011 1051275
1102 1051275 1387773 1034961 710296 1309320 1709260 885058 922008 1011313 1150971 922350
1092 922350 675865 635286 1034827 1411622 1401711 1413151 1142369 1289570 1485298 1508785 1238269
1081 1238269 1248720 1329725 1773325 1771325 1908254 2017404 2086844 1492810 1598739 2441168
1071 2441168 2607012 2385390 2381584 2360790 2059301 1803971 1918700 2162690 1681139 2187098
1061B187098K52786L14147J0094m68363o1985L04718K21687l49448J31332J30134
1051B672200j54457k27316J28151L26181L68985k69491K44930K6414N85384j21675
1041C579306q7096M6340k43817K47817K13838L64111J78687K4343J55078P9604
1031D558211l8518N39710P0478l6178N93801Q2193p2878R2850L3424P0572J82772
1020F076437J97291p9663L44112O72896N17083K62084K7164K1495Q73739N86067
1010I498705O52155N77327N84449P76432J002993P66281L59846Q61243R72584
1001A6052015J369240J095682J640004K045670K018888J726473J376377J631787
993B8956136K315706K722458L186372M804153N243778O542174P043387R154948
$$ plain form
1061 2187098 2439884 2754031 2764125 2295762 2233777 2538495 2760182 2410734 2542066 2672200
1051 2672200 2517743 2290427 2418578 2744759 3113744 2844253 3089183 3115597 3700981 3579306
1041 3579306 3492210 3538550 3294733 3542550 3756388 4120499 4299186 4323529 4478607 4558211
1031 4558211 4519693 5059403 5129881 5093703 5687504 5769697 5696819 5789669 5823093 5893665 6076437
1020 6076437 6273728 6194065 6538177 7211073 7728156 7990240 8017404 8038899 8912638 9498705
1010 9498705 10150860 10728187 11312636 12089068 13092061 13858342 14218188 15079431 16052015
1001 16052015 17421255 18516937 20156941 22202611 24221499 25947972 27324349 28956136
993 28956136 31271842 33994300 37180672 41984825 47228603 53770777 60814164 69969112
985F9969112J0297928J1151146J2843591J3408737M538521m858366j6068361k2965647
977G8316661j6832457j1537501q077967n913650m065380l099779k384128k385552
969B4020247j608812j424073j354802q75062j045199p88649j441265j510962j036263
960A2935160o85382o08845q90140l73994j89972m58757m84877l68868m33065m14403
950H026857n74317M26566j69139p17003o55050j09950K6591j42612j5707K2599
940F118835n3989j004103k91642o1242m7080j01061m40087l36816K4440j58503
930C648752j3786K73286k44425J66249m72963n26194J16453M7057J8955j08835
920B904549N07536L0328n91475P5423k49958L1734m4547j06679m88899J46145
$$ plain form
985 69969112 80267040 91418186 104261777 117670514 122209035 117350669 101282308 78316661
977 78316661 61484204 49946703 41868736 35955086 31889706 28789927 26405799 24020247
969 24020247 22411435 20987362 19632560 18757498 17712299 16923650 15482385 13971423 12935160
960 12935160 12249778 11640933 10750793 10376799 10186827 9728070 9243193 8874325 8441260 8026857
950 8026857 7452540 7879106 7709967 6992964 6337914 6227964 6254555 6111943 6096236 6118835
940 6118835 6064846 5060743 4769101 4707859 4660779 4559718 4119631 3782815 3807255 3648752
930 3648752 3634966 3908252 3663827 3830076 3357113 2830919 2947372 2994429 3013384 2904549
920 2904549 3412085 3442413 2850938 2926361 2676403 2708137 2663590 2556911 2068012 2214157
910B214157R7223p8023n0504j68217L03419l6252O0250n32852J30668P7812k29567
899A788114P8318o0578n50631k42069N52128J38566r5756j31764k59937k12469
889A003922K07529O64310l16832o47792J73638K21644l00948k83985K51928P5370
879A048784j1431m62056K69231j01926K10336L41981j49328p30045o8680j04458
869B42408J27116K49976m9219M95587l725q0950m08902j81476P6102N00196l81763
858E85350n81836K75683j32512Q9157O50409j28143J68989j90072k43895M69442
848I62572L03982l35705j15824l50025l1625K74336l29098K0031m55952l30505
838c87813M22547k9932K66852K09893k4624L8135j00798j84829l73232K40480
$$ plain form
910 2214157 2311380 2233357 2182853 2014636 2318055 2281803 2342053 1809201 1939869 2017681 1788114
899 1788114 1866432 1805854 1255223 1013154 1565282 1703848 1608092 1476328 1216391 1003922
889 1003922 1211451 1875761 1558929 911137 1084775 1306419 1005471 721486 973414 1048784
879 1048784 1037353 575297 844528 742602 952938 1294919 1145591 415546 346866 242408
869 242408 369524 619500 570281 1065868 1062143 981193 572291 390815 466917 967113 585350
858 585350 3514 279197 146685 235842 886251 758108 927097 737025 493130 962572
848 962572 1266554 930849 815025 465000 433375 707711 378613 398644 -57308 -387813
838 -387813 34734 4802 271654 481547 456923 495058 394260 209431 -163801 76679
828G6679M00074m7315J97644J96946n42030l39851K99884M23950p7791k32754
818C55436R8820L48486l80846k45870r4025K18490L0771K38666L38168q3287k58470
807E66339l48183L12473q0221L53972l6585n3358j06852l44706l88745J91593
797F5727r4435K26915R3920P9401P1722K60244q2200k47707m8985J27842l9897
786D12547l44142O5548l10019j51018N73058J86170l48050J62956m68243J71978
776d9215m79911J36732L8023L04022L82228j08468O4475J04318K12724J78303
766G83231k5043K00180m86107K3448M17124l39138n20087l497l00871M3165N13110
755C05515p1469Q1107k29197j612m90105j8796j11707K66954k3453J5821j13685
$$ plain form
828 76679 476753 429438 627082 824028 281998 -57853 242031 665981 588190 355436
818 355436 454256 802742 421896 176026 82001 300491 331262 569928 908096 824809 566339
807 566339 218156 530629 450408 804380 767795 714437 607585 262879 -125866 65727
797 65727 -28708 198207 292127 371528 443250 703494 621294 373587 324602 452444 412547
786 412547 68405 133953 -176066 -327084 245974 432144 84094 247050 -221193 -49215
776 -49215 -529126 -392394 -354371 -50349 331879 223411 287886 392204 604928 783231
766 783231 758188 958368 472261 495709 912833 573695 53608 50111 -250760 -207595 305515
755 305515 234046 315153 85956 84344 -405761 -424557 -536264 -269310 -292763 -276942 -390627
744c90627J51720M33160J77422J80734k57406J1119K9697q2602l65654j02116
734b14553K89009K63644p3745n8917k38479k95362j01449J87883N93463m1613
724C09881l41684J21385K82839j09147O32611l28943k19538l08233K56486K61881
714E57538j34899L46926j53856l87995j62094j57128j60913M58603L9620k06648
704C9154l7607l03611R1255M65648O54354L6620m33891l01601k155N86985k61734
693E33417j08185k51567k19290O6061K44587L56156n2632o92753j90897L7367
683b77736L7466M35430j02995k48108L96831Q4510k15722P2964l59214p8657Q5129
672a70102k32398O9494J91746k21023l4038L61094k94642M21588J87002L29737
$$ plain form
744 -390627 -238907 194253 371675 552409 295003 306122 335819 253217 -112437 -214553
734 -214553 74456 338100 264355 205438 -33041 -328403 -429852 -241969 351494 309881
724 309881 -31803 89582 372421 263274 895885 566942 347404 39171 295657 557538
714 557538 422639 769565 615709 227714 65620 -91508 -252421 206182 245802 39154
704 39154 1547 -302064 -210809 254839 909193 945813 511922 210321 208166 795151 533417
693 533417 425232 173665 -45625 20436 265023 621179 568547 -124206 -315103 -277736
683 -277736 -240270 195160 92165 -155943 240888 325398 109676 182640 -176574 -255231 -170102
672 -170102 -402500 -333006 -141260 -362283 -396321 -35227 -329869 91719 278721 608458
662F08458o04208k25052N38111l63306k23316p370K18857K69151j61475m00982
652c51132p9196K17649K01376o2519k13309l21066j3250k9800O9899K32425o8047
641d16970J91769M60634j66719j95325J51848K87874j39371m76689P2187J54641
631g6121n4627k35143r2932j25355p4399P51343R1325k52230L38473j00602O005
620A75737n57016J41130M0983j30702J44777K8648n3944M18011M8379o68603J81558
609b31042K77115l22258O4635M68058q0296j92777j07764J87157j14305j1953
599f3430o3639K37945o38076r5942j9586J89799J14592J34443p6461P86619M07800
588I14064m55868J80871k2409K4378m20399m40176J66034R1908o497J61631Q6435
$$ plain form
662 608458 4250 -220802 317309 -45997 -269313 -276683 -57826 211325 49850 -351132
652 -351132 -430328 -212679 -11303 -73822 -287131 -608197 -621447 -651247 -581348 -348923 -416970
641 -416970 -225201 235433 68714 -126611 25237 313111 173740 -302949 -230762 -76121
631 -76121 -130748 -365891 -458823 -584178 -658577 92766 184091 -68139 270334 169732 175737
620 175737 -381279 -240149 -199166 -329868 -185091 -156443 -210387 207624 256003 -412600 -231042
609 -231042 46073 -276185 -211550 256508 176212 -16565 -124329 62828 -51477 -63430
599 -63430 -127069 110876 -527200 -623142 -642728 -452929 -338337 -203894 -280355 506264 914064
588 914064 458196 639067 616658 641036 220637 -219539 -53505 38403 31906 193537 279972
577B79972l5560M7054k17820L30573O172n17297r8622J86239m29201K29984N06065
566B87559k28929M6256k04384j09292l7594M31169J67245j35366k37998k11327
556b32661K92293J61916l11224J40197j09545o0050l87615K92910P7921J4992
546a20866J49654J85795L35490l18455p63356L5810L87044J61005P6578j19525
536I174l8238N3274l51424L36681j04499J36266k52435J46525J5908j93307M30637
525A88562k11604Q1804j72294K32814l49356k85667k4712N89526O6613l31120
515b15434K68265N0462o2162q0059J74267k97386o9108K4423J36364M28605m59747
504a01510j43845L7235K72238j37019M85486k61723l7692m52483K5442M07032
$$ plain form
577 279972 244412 291466 73646 404219 410391 -106906 -205528 -19289 -448490 -218506 287559
566 287559 58630 104886 -99498 -208790 -246384 184785 352030 216664 -21334 -232661
556 -232661 59632 221548 -89676 50521 -59024 -119074 -506689 -213779 -135858 -120866
546 -120866 28788 214583 550073 231618 -531738 -495928 -108884 52121 128699 9174
536 9174 -29064 24210 -327214 9467 -95032 41234 -211201 -64676 -48768 -242075 188562
525 188562 -23042 58762 -113532 119282 -230074 -515741 -540453 49073 115686 -215434
515 -215434 52831 103293 41131 -38928 135339 -162047 -231155 -206732 -70368 358237 -101510
504 -101510 -245355 -208120 64118 -72901 412585 150862 113170 -339313 -313871 93161
494I3161K56694n2099k37360j40548J50352m1745L19269l15424o05830L06184
484b67346L08958J52511k9461Q8350l4446j17553n9773K81106K3080j00110l26039
473h0723K13723K18387p2741j04674K28514k34240K59423q1657p2268j03651k25940
462e5847k69160M00689K3297p5453J37845j75598j82141o3836r8818l7011Q58627
451D62594K48734l70877k46771n25299K04975L84173N831n26375j94386L99621
441a57780J62589M2742L17470r7068l89008N0405J62498J43590L4231m38616J39714
430b9233N32430l23376k03103p8505k20158N8375j49580K21754j4927L68704J95526
419C57907k62067r6303J28893q6047L16194L21358P79k73304Q3570k96379q6448
$$ plain form
494 93161 349855 297756 60396 -80152 70200 28455 347724 32300 -573530 -267346
484 -267346 41612 194123 164662 253012 218566 101013 41240 322346 345426 245316 -80723
473 -80723 133000 351387 278646 173972 402486 168246 427669 346012 273744 170093 -55847
462 -55847 -325007 75682 98979 23526 161371 -14227 -196368 -260204 -359022 -396033 462594
451 462594 711328 340451 93680 -431619 -226644 157529 163360 -363015 -557401 -157780
441 -157780 4809 47551 365021 267953 -121055 -70650 91848 235438 269669 -168947 -29233
430 -29233 503197 179821 -23282 -101787 -321945 -263570 -413150 -191396 -206323 162381 357907
419 357907 95840 -463 128430 42383 358577 679935 680714 407410 490980 194601 108153
408A08153j92857Q8850j23203j67124j24529J39013K24449J790L38088l19479
398b6849K51479N7046J41024l53505L0670K16002j99947o54386K35037j08387
388d11816Q6662K8392J23961J79420k49091n11240O00246R2048l81398K52737
378a90079R3258J03014M44799p40042k633k38047n6259K85167L54995j20789j26764
367a93380K49890n13231K36388p9583L38587J36382n70935m34665K64131R7459
357d68957Q3704N89520J87295m05776l52601L79072Q8375p4444j60704k91493
347d26009N4708J13327L23267j45927J86253j44429l90173k57797M12956K00438
337g3386P6023j76959M30051l2214k89376n7040K669J66841m7115o5854k71478
$$ plain form
408 108153 -84704 4146 -119057 -286181 -410710 -271697 -47248 -45458 292630 -26849
398 -26849 224630 281676 422700 69195 99865 315867 115920 -538466 -303429 -411816
388 -411816 -325154 -296762 -172801 6619 -242472 -753712 -153466 -61418 -442816 -190079
378 -190079 -96821 6193 450992 -289050 -291683 -529730 -585989 -300822 54173 -66616 -193380
367 -193380 56510 -456721 -220333 -299916 38671 175053 -395882 -830547 -566416 -468957
357 -468957 -385253 204267 391562 -14214 -366815 12257 100632 26188 -134516 -426009
347 -426009 -371301 -257974 65293 -80634 105619 -38810 -428983 -686780 -273824 -73386
337 -73386 2637 -174322 255729 223515 -65861 -122901 -120232 46609 -506 -66360 -337838
326c37838K68716J80434r5751k38652K00647J57484M8083j20374k12105r1908
316b41264K79278l52820J27961j19253j59405J79685J47313l70918l48544O2931
306g95036O63719J04423m18383k23l2885J17973L0440J18686p6644K17293J81821
295A11184L62799L5172j67604p85903p9314K26681N13225K91409Q4594j33471
285D58772K82031o77259n97685L45876L01093J14010k90420n9576k67124J0313
275c79969M16615j37808K10022k92114J6259J92163J68003K23496m95038K37677
265A59306P2987o8569K48545k53901m22761n2358j93892r7964L00995K28306M30479
254C51173k9054q8680k93847j67425J04938m34177L44945K21096l51421k5104
$$ plain form
326 -337838 -69122 111312 15561 -223091 -22444 135040 183123 62749 -149356 -241264
316 -241264 38014 -314806 -186845 -306098 -465503 -285818 -138505 -509423 -857967 -795036
306 -795036 -131317 -26894 -445277 -445500 -478385 -360412 -329972 -211286 -287930 -70637 111184
295 111184 473983 509155 341551 -444352 -523666 -296985 216240 507649 592243 458772
285 458772 740803 63544 -534141 -188265 112828 226838 -63582 -123158 -390282 -379969
275 -379969 36646 -101162 108860 -183254 -166995 25168 193171 416667 -78371 159306
265 159306 232293 163724 412269 158368 -264393 -316751 -510643 -608607 -307612 -79306 351173
254 351173 322119 233439 -60408 -227833 -122895 -557072 -212127 8969 -342452 -367556
244c67556K69748j71131K34303j26371J18570o5744l82943l3306K37804K6402
234b60224J36930j60913L22716K98032l82685k19776L7804J35275k46310j13915
224d53066n2094J5824L63899L0430l9472p6959J48495K21681k683j57377k07505
213b08827k79644O56704K68248n60180m4905r8155L20597k0410k02944R1698j96286
202b74104K03677j32693l7318L30784J954m99721n23715O43108J66315M580k53671
191c70804k72396J89549r1045l25065L1275N15076l05774J13838N85418l27554
181b57482j18308k33131J96218J6729J28360J96774L8525j65723k61926l7119
171d97083J91475j60988O5237K73029J4716j48652o0362j63812K00497J83672
$$ plain form
244 -367556 -97808 -268939 -34636 -161007 -42437 -108181 -491124 -524430 -286626 -260224
234 -260224 -123294 -284207 38509 336541 -46144 -265920 -228116 -92841 -339151 -453066
224 -453066 -505160 -489336 -125437 -95007 -134479 -211438 -62943 158738 156055 -1322 -208827
213 -208827 -488471 168233 436481 -123699 -168604 -266759 53838 33428 -169516 -77818 -274104
202 -274104 -70427 -203120 -240438 90346 92300 -407421 -931136 -288028 -121713 -117133 -370804
191 -370804 -643200 -453651 -544696 -869761 -838486 -323410 -629184 -515346 70072 -257482
181 -257482 -375790 -608921 -412703 -395974 -267614 -70840 -32315 -198038 -459964 -497083
171 -497083 -305608 -466596 -401359 -128330 -113614 -262266 -322628 -486440 -285943 -102271
161a02271j52686k24494K07990m98238J16247O98631q1765P5747J6348J28640
151A84149k39727O8687n32321L87076J27477k12984P9861L6873j9897n5791J7554
140a59043K23158r4521R221j02242J30049L723j72377m85539P258j64326L10331
129d94308M21685o0996j39481r1755L18713K32918j4597J967K14011M9206j10836
118C26527Q645r8774k96486K68876l11016k51489J57044L75293m1252N4535J48050
107C39953k25395o82854J61801K48958l8295k4009Q7699j52575J63195j37391
97b58913l2793M706K15927M70047O3811j82285j54594k12973O0084J07590P7272
86A57879R4911J9500j03584p8907K8880j55311k06433L62470j88228j12650j76216
$$ plain form
161 -102271 -254957 -479451 -271461 -769699 -653452 45179 -36586 39161 55509 184149
151 184149 -55578 13109 -519212 -132136 -4659 -217643 -137782 -100909 -120806 -176597 -159043
140 -159043 64115 -30406 -21185 -123427 6622 10345 -162032 -647571 -640313 -804639 -494308
129 -494308 -72623 -133619 -273100 -364855 -46142 186776 172179 174146 388157 437363 326527
118 326527 335172 236398 -60088 208788 -102228 -353717 -196673 178620 137368 191903 339953
107 339953 114558 -568296 -406495 -157537 -195832 -219841 -132142 -284717 -121522 -258913
97 -258913 -291706 -287000 -71073 398974 462785 280500 125906 -87067 -26983 80607 157879
86 157879 252790 272290 168706 89799 118679 -36632 -243065 119405 -68823 -181473 -357689
75c57689n77387J35190J75897L24071M2158K28356q5172K6850n9018R8033j1421
64f0132m16803l05607J80082K66706j39040l46030K27758L41074j35728J43842
54b43878J70570m31285p9990K74544r1774l9168n9507r2393K30833J21854J5624
43b24570k62336K58871J42120r1688m9224n1594J46915l5936J18514J04817j11363
32e5474J2866k49239m851K53903j49622k67929J09572j97045j7M10610J43818
21F592L7212l6180j40802j57358j28792K02591j88872K85491J19889K92519p1783
10B20507m29217j61353j42836J05379r4139M4570M31662K28460p4060J35272
0B64245
$$ plain form
75 -357689 -935076 -799886 -623989 -299918 -257760 -29404 -114576 -87726 -146744 -48711 -60132
64 -60132 -476935 -782542 -602460 -335754 -474794 -820824 -593066 -251992 -387720 -243878
54 -243878 -73308 -504593 -584583 -310039 -401813 -440981 -500488 -592881 -362048 -240194 -224570
43 -224570 -486906 -228035 -85915 -177603 -226827 -278421 -131506 -167442 -48928 55889 -55474
32 -55474 -42608 -291847 -296698 -42795 -192417 -460346 -350774 -547819 -547836 -137226 6592
21 6592 43804 7624 -133178 -290536 -419328 -216737 -405609 -120118 -229 292290 220507
10 220507 -208710 -370063 -512899 -407520 -501659 -457089 -25427 203033 128973 264245
0 264245
$$ Imaginary data points
##PAGE= N=2
##DATA TABLE= (X++(I..I)), XYDATA
16383f452099k56726N46914K21749k76505r4894L54072p8922Q0889J43037r2645
16373e905130P3125j9351M52584J51832N6712J19807K8447M151k42245M24073
16363d855995J58714j34766K51991q3585k06140K56670K93782j50057N2431K00364
16353d216591K48132j55195J35015M9415M2456k8762K90321M18372K0991N7602
16343c138244K62793k57404j27109j26477K40117L24087J68250m70022K48261
16334b875748K12607m4511K17379o929N5883j9812j62336K33463J57367Q5546
$$ plain form
16383 -6452099 -6708825 -6161911 -5940162 -6216667 -6311561 -5957489 -6036411 -5955522 -5812485 -5905130
16373 -5905130 -5832005 -5851356 -5398772 -5246940 -5190228 -5070421 -5041974 -5037823 -5280068 -4855995
16363 -4855995 -4697281 -4832047 -4580056 -4663641 -4869781 -4613111 -4319329 -4469386 -4416955 -4216591
16353 -4216591 -3968459 -4123654 -3988639 -3939224 -3896768 -3925530 -3635209 -3216837 -3195846 -3138244
16343 -3138244 -2875451 -3132855 -3259964 -3386441 -3146324 -2822237 -2653987 -3124009 -2875748
16334 -2875748 -2663141 -2707652 -2490273 -2497202 -2441319 -2461131 -2623467 -2390004 -2232637 -2147091
$$ [...]
##END NTUPLES=NMR SPECTRUM
##END=
