##TITLE=1H_CA-8834-2
 CDCl3,8 sc, 
 10.03.2021
##JCAMPDX= 6.0         $$ Bruker NMR JCAMP-DX V2.0
##DATA TYPE= NMR SPECTRUM
##DATA CLASS= NTUPLES
##ORIGIN= UXNMR, Bruker Analytische Messtechnik GmbH
##OWNER= root
$$ XWIN-NMR		Version 3.5
$$ Wed Mar 10 10:13:24 2021 Russian Standard Time (UT+4h)  she@DPX200
##.OBSERVE FREQUENCY= 200.131506
##.OBSERVE NUCLEUS= ^1H
##.ACQUISITION MODE= SIMULTANEOUS
##.ACQUISITION SCHEME= undefined
##.AVERAGES= 8
##.DIGITISER RES= 18
##SPECTROMETER/DATA SYSTEM= spect
##.PULSE SEQUENCE= zg30
##.SOLVENT NAME= CDCl3
##.SHIFT REFERENCE= (INTERNAL, CDCl3, 0, 15.9699)
##AUDIT TRAIL= $$ (NUMBER, WHEN, WHO, WHERE, WHAT)
$$ ##TITLE= Audit trail, XWIN-NMR		Version 3.5
$$ ##JCAMPDX= 5.01
$$ ##ORIGIN= Bruker BioSpin GmbH
$$ ##OWNER= she
$$ F:/spectra/data/she/nmr/H-F/1/pdata/1/auditp.txt
$$ ##AUDIT TRAIL=  $$ (NUMBER, WHEN, WHO, WHERE, WHAT)
(   1,<2021-03-10 10:11:10.14 +0400>,<she>,<DPX200>,
      <created by zg, POWCHK disabled, PULCHK disabled
       configuration hash MD5:
       00 E9 B6 7A A2 85 ED C7 34 08 36 98 17 FE 4E 26
       data hash MD5: 16K
       BE B1 FE E9 62 D0 5C 43 69 8F 80 AF E6 97 B7 AE>)
(   2,<2021-03-10 10:11:13.18 +0400>,<she>,<DPX200>,
      <Start of raw data processing
       efp BC_mod = 2 LB = 0.24 FT_mod = 6 PKNL = 1 PHC0 = -11117.52 PHC1 = 13.80094 SI = 16K 
       data hash MD5: 16K
       01 97 DA C8 5C 7F 34 41 D9 DA 0D 13 59 E6 0A 56>)
(   3,<2021-03-10 10:11:41.10 +0400>,<she>,<DPX200>,
      <pk PHC0 = 0.9680334 PHC1 = -3 
       data hash MD5: 16K
       C4 5E 89 FD 94 63 A3 F0 B5 D1 02 6B BC E5 38 AB>)
(   4,<2021-03-10 10:11:44.53 +0400>,<she>,<DPX200>,
      <abs ABSG = 5 
       data hash MD5: 16K
       30 C7 85 76 58 CE 5C 52 29 37 FF 47 78 96 FD 6F>)
(   5,<2021-03-10 10:12:10.70 +0400>,<she>,<DPX200>,
      <pk PHC0 = 4.032704 PHC1 = -6 
       data hash MD5: 16K
       2C D4 17 FE 87 64 6C 44 F1 83 81 72 6E E0 74 E4>)
(   6,<2021-03-10 10:12:13.68 +0400>,<she>,<DPX200>,
      <abs ABSG = 5 
       data hash MD5: 16K
       99 19 45 F5 0C 50 D1 0F 47 7E E6 44 A7 F4 BD D7>)
(   7,<2021-03-10 10:12:34.10 +0400>,<she>,<DPX200>,
      <pk PHC0 = 2.610532 PHC1 = -3.6 
       data hash MD5: 16K
       6E 77 E5 AA 36 69 85 3E 41 51 67 72 30 A6 67 99>)
(   8,<2021-03-10 10:12:40.56 +0400>,<she>,<DPX200>,
      <abs ABSG = 5 
       data hash MD5: 16K
       9B DA 1D AE B8 91 40 EF F0 75 C2 7C B8 71 78 9B>)
$$ ##END=
$$ 
$$ hash MD5
$$ 67 F0 3D 3D FE C8 08 22 BF 74 0D 65 1E 74 BF 13
##$RELAX= 
##$RELAX= 
##$RELAX= 
##$RELAX= 
##$RELAX= 
##$RELAX= 
$$ Bruker specific parameters
$$ --------------------------
##$DU= <F:/spectra>
##$EXPNO= 1
##$NAME= <H-F>
##$PROCNO= 1
##$TYPE= <nmr>
##$USER= <she>
##$AMP= (0..31)
100 100 100 100 100 100 100 100 100 100 100 100 100 100 100 100 100 100 
100 100 100 100 100 100 100 100 100 100 100 100 100 100 
##$AQSEQ= 0
##$AQ_mod= 1
##$AUNM= <au_zg>
##$AUTOPOS= <>
##$BF1= 200.13
##$BF2= 200.13
##$BF3= 200.13
##$BF4= 200.13
##$BF5= 200.13
##$BF6= 200.13
$$ [...]
##$SUBNAM3= <"">
##$SUBNAM4= <"">
##$SUBNAM5= <"">
##$SUBNAM6= <"">
##$SUBNAM7= <"">
##$SUBNAM8= <"">
##$SUBNAM9= <"">
##$SW= 16.9725357007746
##$SWIBOX= (0..15)
0 0 2 0 0 0 0 0 0 0 0 0 0 0 0 0 
##$SW_h= 3396.73913043478
##$TD= 16384
##$TD0= 1
##$TE= 0
##$TE2= 300
##$TE3= 300
##$TEG= 300
##$TL= (0..7)
0 120 120 120 120 120 120 120 
##$TP= (0..7)
150 150 150 150 150 150 150 150 
##$TP07= 0
##$TPNAME0= <>
##$TPNAME1= <>
##$TPNAME2= <>
##$TPNAME3= <>
##$TPNAME4= <>
##$TPNAME5= <>
##$TPNAME6= <>
##$TPNAME7= <>
##$TPOAL= (0..7)
0.5 0.5 0.5 0.5 0.5 0.5 0.5 0.5 
##$TPOFFS= (0..7)
0 0 0 0 0 0 0 0 
##$TUNHIN= 0
##$TUNHOUT= 0
##$TUNXOUT= 0
##$USERA1= <user>
##$USERA2= <user>
##$USERA3= <user>
##$USERA4= <user>
##$USERA5= <user>
##$V9= 5
##$VALIST= <valist>
##$VCLIST= <CCCCCCCCCCCCCCC>
##$VD= 0
##$VDLIST= <DDDDDDDDDDDDDDD>
##$VPLIST= <PPPPPPPPPPPPPPP>
##$VTLIST= <TTTTTTTTTTTTTTT>
##$WBST= 1024
##$WBSW= 4
##$XGAIN= (0..3)
0 0 0 0 
##$XL= 0
##$YL= 0
##$YMAX_a= 487080
##$YMIN_a= -444227
##$ZGOPTNS= <>
##$ZL1= 120
##$ZL2= 120
##$ZL3= 120
##$ZL4= 120
##$ABSF1= 15.95331
##$ABSF2= -1.019352
##$ABSG= 5
##$ABSL= 3
##$ALPHA= 0
##$AQORDER= 0
##$ASSFAC= 0
##$ASSFACI= 0
##$ASSFACX= 0
##$ASSWID= 0
##$AUNMP= <proc_1d>
##$AZFE= 0.1
##$AZFW= 0.1
##$BCFW= 0
##$BC_mod= 2
##$BYTORDP= 0
##$COROFFS= 0
##$CY= -3
##$DATMOD= 1
##$DC= 0
##$DFILT= <>
##$DTYPP= 0
##$F1P= 0
##$F2P= 0
##$FCOR= 1
##$FTSIZE= 16384
##$FT_mod= 6
##$GAMMA= 0
##$GB= 0
##$INTBC= 1
##$INTSCL= 2.992141e-10
##$ISEN= 128
##$LB= 0.24
##$LEV0= 0
##$LPBIN= 0
##$MAXI= 10000
##$MC2= 0
##$MEAN= 0
##$ME_mod= 0
##$MI= 1.114404
##$NCOEF= 0
##$NC_proc= -7
##$NLEV= 6
##$NOISF1= 3.799351
##$NOISF2= 2.8
##$NSP= 0
##$NTH_PI= 0
##$NZP= 0
##$OFFSET= 15.96988
##$PC= 1
##$PHC0= -11109.91
##$PHC1= 1.20094
##$PH_mod= 1
##$PKNL= yes
##$PPARMOD= 0
##$PSCAL= 0
##$PSIGN= 0
##$REVERSE= no
##$SF= 200.130008316201
##$SI= 16384
##$SIGF1= 3
##$SIGF2= 2
##$SINO= 5.538805
##$SIOLD= 16384
##$SREGLST= <1H.CDCl3>
##$SSB= 0
##$STSI= 16384
##$STSR= 0
##$SW_p= 3396.73913043479
##$SYMM= 0
##$S_DEV= 0
##$TDeff= 16384
##$TDoff= 0
##$TI= <>
##$TILT= no
##$TM1= 0
##$TM2= 0
##$TOPLEV= 0
##$USERP1= <user>
##$USERP2= <user>
##$USERP3= <user>
##$USERP4= <user>
##$USERP5= <user>
##$WDW= 1
##$XDIM= 16384
##$YMAX_p= 317195843
##$YMIN_p= -1634411
$$ End of Bruker specific parameters
$$ ---------------------------------
##NTUPLES= NMR SPECTRUM
##VAR_NAME=  FREQUENCY,     SPECTRUM/REAL,   SPECTRUM/IMAG
##SYMBOL=    X,             R,               I
##VAR_TYPE=  INDEPENDENT,   DEPENDENT,       DEPENDENT
##VAR_FORM=  AFFN,          ASDF,            ASDF
##VAR_DIM=   16384,         16384,           16384
##UNITS=     HZ,            ARBITRARY UNITS, ARBITRARY UNITS
##FACTOR=    0.207333158178282, 1,           1
##FIRST=     3196.05223803525, 0,            0
##LAST=      -200.68689239954, 0,            0
##MIN=       -200.68689239954, -1634411,     0
##MAX=       3196.05223803525, 317195843,    0
$$ Real data points
##PAGE= N=1
##DATA TABLE= (X++(R..R)), XYDATA
$$ [...]
7556 47548828 50931898 54348048 57973251 61908310 65331713 67768970 68999763 69606519
7548 69606519 69306999 68360376 67036596 65642803 64696221 64499971 64762774 65051422 65241356
7539 65241356 65122330 64093504 62479721 59969871 56816246 53052685 49416565 45630485
7531 45630485 42534884 39802364 37383043 35399129 33784799 32483047 31167985 30168375
7523 30168375 29391231 29115266 28962697 28783617 28739463 28827732 28995613 29118873 29580146 30273608
7513 30273608 31438193 32756359 33960691 35656734 37076129 38205637 38951357 39085535
7505 39085535 38356826 37502937 35915296 34431356 33562073 33118085 32874316 32989336 33375837
7496 33375837 33725142 33534916 32922640 31569106 29490866 27158273 24763736 22638785 20788850
7487 20788850 19214341 17776362 16542151 15885785 15059153 14473831 13480521 12539812 12085500
7478 12085500 11651471 11347513 11068799 10737838 10515079 10369323 10253567 9982268 9668394
7469 9668394 9331651 8783573 8401841 8033080 7696382 7351860 7028169 6801023 6793790 6880228
7459 6880228 6568108 6255730 5960495 5923426 5808971 5520530 5437308 5292914 5219584 5048662
7449 5048662 5241496 4984904 4836931 4831362 4459516 4112432 4003754 4146087 3957068 3834945
7439 3834945 3681362 3599178 3596151 3738298 3749768 3561532 3728923 3779529 3931601 3627227
7429 3627227 3699532 3686544 3710490 3624456 3551053 3521816 3346959 3166868 3195831 3270793 3298632
7418 3298632 3000199 3000309 2970934 2807504 2772327 2698822 2550596 2469053 2375588 2278822 2296935
7407 2296935 2103681 2065408 2069515 2188733 2120253 2170658 2272713 2085344 1938691 1940785 2029775
7396 2029775 1964571 2066643 2071154 1830656 1718388 1809284 1835344 1830472 1809712 1850444 1917782
7385 1917782 1786483 1674541 1494873 1417905 1545580 1561177 1453940 1665322 1683350 1848787
7375 1848787 1594291 1556221 1601392 1521155 1433313 1349042 1433963 1440200 1257077 1312661 1338890
7364 1338890 1277509 1079036 1041215 1191581 1233619 948343 1039582 947674 1023148 987321 808581
7353 808581 878581 1101347 970376 879988 1038582 986887 895500 748149 742619 661670 928774
7342 928774 959153 830132 716939 729747 709702 561391 656147 671548 604284 674505 501897
7331 501897 454799 201769 325116 497921 404911 422397 560399 351158 113261 249960
7321 249960 318752 470498 438413 472408 253591 379548 682821 504013 305890 287310
7311 287310 308877 229228 398120 378613 490580 477810 329839 209380 310125 235444 270532
7300 270532 380173 446720 526800 576510 521217 222490 81099 106682 157707 97451 -52355
7289 -52355 38465 -73487 -110720 120849 -57512 25007 -103438 -200438 -77359 -191442 -84588
7278 -84588 -133261 -122656 -54568 -126450 -255581 -123817 -137799 -40008 -193459 -337402 -133920
7267 -133920 -847 -8298 -65467 -346314 -410446 -105688 -16168 -197653 -228141 -246808 -247546
7256 -247546 -365440 -375375 -226562 -364840 -474962 -552659 -608488 -702606 -577152 -478760 -406988
7245 -406988 -551154 -321648 -414201 -441193 -447049 -411777 -504382 -479499 -474117 -677515 -761388
7234 -761388 -510356 -384335 -464717 -612161 -637534 -452914 -513475 -595212 -704381 -672679 -740308
7223 -740308 -559088 -395393 -313623 -506129 -559638 -577114 -624577 -468550 -361342 -366812 -605431
7212 -605431 -724182 -816676 -671484 -469041 -520385 -639644 -812667 -677128 -556107 -621341
7202 -621341 -673156 -856039 -612238 -203624 -270585 -256033 -459778 -634397 -598397 -644380 -706942
7191 -706942 -565323 -385088 -629394 -742159 -640292 -561960 -567370 -543659 -604696 -521939 -512124
7180 -512124 -592883 -544456 -364815 -528699 -684772 -627573 -659673 -936032 -983833 -734413 -474018
7169 -474018 -428944 -363150 -318572 -487842 -446467 -561198 -404162 -184381 -240146 -336460 -460973
7158 -460973 -578602 -607607 -467709 -360738 -383788 -505731 -287577 -289219 -463732 -190008
7148 -190008 -350161 -391753 -392113 -372325 -395636 -452745 -509226 -534453 -621324 -632983 -682643 -642322
7136 -642322 -538591 -692212 -606566 -755121 -642822 -752695 -773940 -671159 -569574 -616986
7126 -616986 -698465 -649086 -623136 -477669 -645139 -807295 -773595 -803586 -709506 -456328 -648124
7115 -648124 -859292 -800099 -768587 -925108 -919169 -783351 -599911 -642320 -613988 -457789 -458185
7104 -458185 -389750 -551925 -662269 -578577 -608966 -766018 -687724 -860571 -840219 -833332 -791198
7093 -791198 -771393 -766674 -796859 -851608 -586788 -868977 -886287 -833394 -679282 -573857 -787290
7082 -787290 -906103 -954754 -1030557 -1006371 -1037406 -1125863 -1105628 -1104130 -1267945 -1237985 -1258542
7071 -1258542 -1140326 -980247 -893229 -944780 -839185 -902565 -1092324 -1146635 -1124758 -1087780 -885380
7060 -885380 -817093 -1174346 -1036570 -1116623 -1206320 -1316575 -1267767 -999774 -1301193 -1227088 -1336060
7049 -1336060 -1475921 -1375419 -1225643 -1248785 -1263749 -1336262 -1310283 -1108442 -1065418 -1084877 -1211445
7038 -1211445 -1387762 -1269463 -1136753 -1245839 -1168971 -1230146 -1357050 -1282209 -1379432 -1604750
7028 -1604750 -1482611 -1272691 -1346812 -1273714 -1126595 -1288635 -1098706 -1044338 -1021544 -981268
7018 -981268 -1022928 -942665 -853083 -916297 -863486 -1174157 -1031965 -753576 -676091 -627793 -946232
7007 -946232 -1263899 -1466657 -1634411 -1378419 -1198298 -1262990 -1045122 -1088718 -1190705 -1169875
6997 -1169875 -1285047 -1291248 -1195073 -1101940 -1275158 -1346788 -1215909 -1336251 -1210641 -981789
6987 -981789 -966398 -929044 -1149507 -1294312 -1233925 -1060127 -1082724 -953831 -859928 -1136435 -1313158
6976 -1313158 -1180060 -1417871 -1280523 -1133163 -954666 -1064955 -1177475 -1168268 -1340158 -1262684
6966 -1262684 -1224551 -1122359 -1228304 -1105506 -1101208 -1189268 -1184453 -1348580 -1349428 -1186696 -1137807
6955 -1137807 -1094776 -1287381 -1330871 -1454904 -1533119 -1363583 -1079928 -930873 -1246888 -1470760
6945 -1470760 -1418311 -1180128 -1023076 -1043300 -1152118 -1115691 -1151493 -1123806 -1176467 -1242455 -1065870
6934 -1065870 -1229494 -1056044 -1049736 -1125605 -1246610 -1310795 -1349070 -1221337 -1191780 -1381337 -1473653
6923 -1473653 -1103970 -1090863 -1029432 -1415279 -1305280 -972529 -1318978 -1197267 -1207588 -1149429
6913 -1149429 -1182793 -1138612 -1241566 -1202936 -1248987 -1378441 -1361888 -1335875 -999657 -1063687 -1313236
6902 -1313236 -1294976 -1070049 -1231514 -1259976 -1364180 -1296573 -1248330 -1176908 -1119196 -1285601 -1399858
6891 -1399858 -1429038 -1164326 -1282288 -1477351 -1317716 -1028143 -943964 -1039952 -1061663 -1121382
6881 -1121382 -1177102 -1277037 -1267966 -1155964 -1158834 -1195574 -1330427 -1193658 -1201956 -1372621 -1300531
6870 -1300531 -1208939 -1077993 -1020458 -1065587 -1128893 -945661 -1128391 -1118161 -984518 -1123865
6860 -1123865 -846033 -986002 -931613 -1052980 -1041006 -1033928 -1211590 -972919 -991971 -1175098
6850 -1175098 -1107077 -1224478 -1197313 -1232937 -1265277 -1250482 -1175202 -1089193 -1037642 -1283813 -1460055
6839 -1460055 -1576258 -1530641 -1367147 -1195318 -1026601 -1123759 -1301217 -1023647 -1093647 -1211767
6829 -1211767 -1145225 -1343500 -1369683 -1321887 -941934 -857960 -928228 -1135352 -1308959 -1149828
6819 -1149828 -1031140 -1140333 -1248838 -1333878 -1266761 -1156705 -1167857 -1152290 -1080120 -1118243 -1174882
6808 -1174882 -1250886 -1263095 -1153586 -987950 -1164247 -1265321 -1209685 -1330509 -1105519 -963870
6798 -963870 -1071657 -1245010 -1113500 -1204250 -1151246 -1296662 -1443511 -1284935 -1044859 -901126
6788 -901126 -1131391 -1217278 -1106215 -1102366 -1444968 -1536728 -1354905 -1336034 -1357509 -1252697 -1228900
6777 -1228900 -1129942 -1059348 -1142839 -1116194 -953654 -991815 -1008288 -1086022 -1218031 -1088542 -1257605
6766 -1257605 -1099349 -1017018 -1233536 -1010650 -1136775 -1203708 -1078834 -1255196 -1054539 -953556
6756 -953556 -1225143 -1136163 -1100258 -1111462 -1279900 -1279315 -1079789 -880959 -983342 -1101852 -907765
6745 -907765 -858569 -919911 -958113 -1023359 -1046187 -1068886 -1146096 -1112631 -1238942 -1392085 -1198462
6734 -1198462 -1171402 -968447 -896171 -874219 -1104505 -1168105 -1016561 -990649 -998286 -980340 -936478
6723 -936478 -967894 -951872 -1044562 -959295 -945870 -923858 -863453 -877189 -759783 -850175 -836080
6712 -836080 -1007155 -1191864 -970916 -1081013 -873966 -755600 -691580 -793882 -787862 -840004
6702 -840004 -1223953 -1276462 -1188272 -999667 -976533 -838820 -880570 -1041205 -1125296 -1273738 -1276717
6691 -1276717 -1098190 -1018534 -1038200 -1013006 -804164 -869427 -1013377 -1092580 -1105905 -981392 -767690
6680 -767690 -805344 -829064 -770871 -817571 -788907 -744908 -882408 -857810 -941240 -1004788 -1063581
6669 -1063581 -924046 -852697 -958474 -922510 -900259 -716548 -759373 -656514 -608470 -707604 -739125
6658 -739125 -728438 -718668 -612728 -570885 -611822 -712724 -665618 -688219 -777062 -729784 -613405
6647 -613405 -707273 -730839 -749146 -669945 -771963 -785903 -738068 -510765 -716022 -686408 -647420
6636 -647420 -655728 -549678 -461971 -385440 -558931 -560962 -687676 -623804 -601728 -633665 -749521
6625 -749521 -869786 -781942 -888626 -798507 -615824 -394818 -503976 -462138 -572397 -409694
6615 -409694 -379518 -729000 -650173 -316858 -181517 -242857 -281342 -457234 -640666 -802776
6605 -802776 -655648 -797131 -784614 -417848 -506444 -600014 -490248 -593249 -555766 -405248
6595 -405248 -485473 -620436 -456208 -499770 -486220 -388886 -339238 -279544 -287261 -330770 -281021
6584 -281021 -406904 -576304 -519120 -561500 -247696 28614 -226231 -253191 -287189 -338887 -235410
6573 -235410 -110475 -149884 -220713 -375590 -319260 -282643 -236600 -175513 -31707 -153119 -171561
6562 -171561 -225322 -119912 -256317 -250519 -229172 -182937 -6195 -81192 -2137 172192 185452
6551 185452 82459 31106 -65705 -128052 -99320 -193014 -376863 -155930 -89672 3120 172690
6540 172690 -228622 -244575 192939 96389 -7207 66649 288337 378479 339073 80880 254166
6529 254166 287759 247488 95801 125501 313612 455822 240327 -106810 -27306 81345
6519 81345 141630 -25546 41599 207430 291140 238631 351272 398268 238110 87207 482723
6508 482723 254573 201869 312338 516466 561608 374447 476242 556616 789266 665223
6498 665223 489775 431254 461608 537636 510946 528323 793710 803896 671102 647550 676182
6487 676182 594917 750132 812792 843008 850226 766410 720089 878432 1057767 1248697 977330
6476 977330 926652 1033596 1099674 919974 1032889 1149363 1099416 1079924 1204615 1399024
6466 1399024 1560842 1397934 1306927 1247054 1177454 1553215 1676904 1776262 1783268 1580427 1535297
6455 1535297 1564624 1481902 1811632 1724302 1724435 1654155 1760777 1707345 1754039 1857925 1767655
6444 1767655 1823268 1968070 2146390 2182610 2077308 2024265 2208399 2467875 2405355 2512997
6434 2512997 2644051 2549547 2490100 2717048 2753430 2799668 2885737 3057115 2933543 2853891 2987797
6423 2987797 3078088 3089236 3140951 3377137 3422693 3559988 3137807 3173691 3163649 3263903 3557373
6412 3557373 3864426 3874404 3832931 4011174 3965907 4140069 4266483 4208151 4312135 4286183 4690552
6401 4690552 4772769 4641736 4732889 4625681 4591088 4730361 4823840 4843799 4847561 5061766 5114624
6390 5114624 5015826 5059785 5333052 5659603 5735284 5634983 5684909 5796737 5995148 6301745
6380 6301745 6291205 6373801 6251815 6212996 6515958 6646459 6911554 6840578 6830781 6868360 6802612
6369 6802612 6918712 6868217 7001560 7073283 7305440 7384606 7641097 7772857 7421901 7656137
6359 7656137 7857194 7846114 7866362 8001289 8118648 8175783 8571601 8758816 8844640 8658016
6349 8658016 8724128 8755371 8865399 9037183 9188382 9136131 9277208 9140585 9438870 9790309
6339 9790309 9622752 9614059 9774580 9877996 9990993 9920202 10077765 10242930 10213473 10386961
6329 10386961 10555015 10879000 10683757 10913235 11060762 11021136 11099700 11270302 11146513 11139387
6319 11139387 11347483 11357474 11607864 11896122 11954268 12042704 12002944 12178330 12465882 12538931
6309 12538931 12937803 13100300 13050164 13139981 13135328 13379686 13526282 13587799 13622349 13689404 13836435
6298 13836435 14001289 14349786 14301174 14422076 14695016 15059298 15469984 15516266 15353536 15432888
6288 15432888 15800398 15894245 15978617 16243427 16407852 16519308 16679457 16771456 16847168 17075801
6278 17075801 17296046 17248397 17429011 17801591 17860036 17976916 17749166 18165015 18433335 18306420
6268 18306420 18432317 18630265 18609493 18488682 18695625 18683356 18757257 18854038 19081332 19063506
6258 19063506 19271365 19127264 19169615 19133800 18959735 18927696 18903805 18902066 18810340 18743324 18738592
6247 18738592 18732537 18519193 18650270 18615104 18502628 18540034 18477062 18115303 17991690 17913419
6237 17913419 17774393 17458251 17352407 17210588 17103580 16827546 16535021 16620078 16623944 16569552
6227 16569552 16306096 16416051 15927532 15666337 15754620 15597364 15332012 15242931 15225980 15096139
6217 15096139 14949889 14658441 14210488 14124607 13756758 13516082 13334171 13212452 13205565 13027294
6207 13027294 12911777 12867750 12430208 12322956 12391233 12210356 12097488 11968963 11815252 11585972
6197 11585972 11310975 11274354 11464838 11131339 11001412 10862307 10531046 10294945 10247351 9971351
6187 9971351 9971868 10046405 9812369 9659547 9925653 9720750 9673824 9701895 9388125 9137944 9061899
6176 9061899 9199140 9112403 8939154 8864095 8718963 8434301 8461854 8538205 8316511 8150830
6166 8150830 8089241 8033119 7840347 7724163 7445495 7325135 7246411 7254642 7209488 7100762 7126525
6155 7126525 7281806 6830189 6585602 6586631 6355989 6437648 6451703 6465322 6522852 6249376 6092943
6144 6092943 5787414 5632926 5535656 5500871 5480913 5394889 5411308 5283124 5243155 5229855 5173433
6133 5173433 4772496 4724811 4722284 4758576 4760944 4563359 4407238 4336441 4201543 4236340 4319362
6122 4319362 4242802 4170413 3920344 3786679 4054878 3904166 3846655 3943135 3924419 3917040 3907515
6111 3907515 3736058 3556987 3594614 3647256 3466032 3373334 3207291 2978923 2780097 2944571
6101 2944571 2904212 2749164 3025319 2942521 2894796 2892286 2815363 2643729 2521730 2507255 2452499
6090 2452499 2478358 2271114 2420213 2304678 2319688 2389589 2147193 1984637 1902503 2070263
6080 2070263 1927238 1807993 1987632 2057582 2009301 1976317 2012453 1967489 1846785 1965857
6070 1965857 1900574 1953002 1871913 1790776 1506877 1504295 1290640 1406346 1645776 1435153 1455201
6059 1455201 1379533 1452204 1409174 1546537 1378819 1373659 1324039 1335436 1245856 1262085 1334390
6048 1334390 1176231 940421 886051 1003673 1037778 1015560 1030022 1064469 1237699 1255948 1174231
6037 1174231 1266881 1155605 1215146 1091104 943335 941780 1078956 1032857 1152183 955168
6027 955168 868228 889636 756625 793024 1048659 1045693 787474 859521 775689 916030 954745
6016 954745 590176 473065 679537 816507 828056 780661 677349 893689 769768 579121
6006 579121 803400 658472 590961 657262 734441 729594 769775 679343 502399 663244 823745
5995 823745 722611 453004 503103 801207 1048241 1053643 968978 748021 667016 605797 570680
5984 570680 675853 669435 813800 562135 522874 759871 867153 792359 644628 579852 519952
5973 519952 810754 869680 729602 668550 896932 935909 912732 709064 716686 739159 723680
5962 723680 876935 936864 1021348 859366 909319 989693 947749 952384 1083553 1080044 878287
5951 878287 1007211 924476 797646 691234 673967 869470 972957 945363 983783 977071 816322
5940 816322 892595 1132155 1085523 964426 1155728 1181044 1036384 1228847 1338901 1327062
5930 1327062 1194642 1055936 1292750 1378707 1435836 1358022 1426323 1472761 1357213 1314129 1392332
5919 1392332 1240317 1260572 1367588 1471608 1488736 1449357 1377314 1556497 1775925 1846082
5909 1846082 1841815 1688101 1554718 1798440 1888562 1969207 2183180 2173852 2198561 2101777 2174374
5898 2174374 2151398 1983203 2050294 2493456 2401344 2375746 2664251 2698317 2525280 2535021 2570324
5887 2570324 2689503 3031669 3099772 3206814 3234834 3138235 3127530 3222371 3173816 3266497 3564358
5876 3564358 3915799 4019433 4078623 4103804 4213693 4451750 4449378 4544982 4909254 5250981
5866 5250981 5352504 5366193 5288383 5420660 5593767 5801044 5750414 6033013 6252590 6329351
5856 6329351 6560521 6758654 6985616 7237157 7609088 7525056 7495606 7615550 7850021 8232889
5846 8232889 8490687 8687904 8659670 8841780 9323031 9374446 9423680 9620383 10010697 10356241
5836 10356241 10692237 10832283 10977022 11043988 11373352 11649873 11794738 12085757 12138226 12465645
5826 12465645 12620004 12839223 13482487 13461981 13649462 14134090 14439800 14472365 14625638 14909688
5816 14909688 15185041 15191014 15496028 15979832 16085500 16263397 16243151 16476409 16732507 16926113
5806 16926113 17072326 17371291 17582773 17912098 17834091 17867064 18074980 18047352 18240534 18452334
5796 18452334 18629080 18909085 19025607 19032630 19120239 19241290 19150804 19324533 19300953 19301383 19304258
5785 19304258 19389118 19676212 19633434 19545206 19548797 19584113 19204848 19213449 19269784 19061440 19022871
5774 19022871 19344701 19153282 18957113 18969167 18761979 18732874 18487554 18443506 18185721 17910485
5764 17910485 18006809 17932483 17605805 17321312 17129423 16779849 16651273 16435752 16199831 16145845
5754 16145845 15921935 15619941 15320116 15402530 15031189 14919692 14779390 14629184 14141628 13759300
5744 13759300 13682490 13651231 13316715 13023733 12850793 12603040 12367839 12194801 11839828 11475523
5734 11475523 11408569 11224098 10902535 10720721 10594001 10340753 9798859 9524299 9566577 9457840
5724 9457840 9333087 9248175 8745455 8609756 8573437 8190485 8094268 7622713 7494107 7560650
5714 7560650 7370896 7314203 7095932 6930507 6806481 6346660 6284084 6160106 5893789 5634163
5704 5634163 5673892 5563355 5501156 5359358 5234112 4974200 5102654 4932427 4821929 4665225
5694 4665225 4637027 4652056 4406160 4151368 4008337 3927072 3877346 3814130 3647599 3648220 3735286
5683 3735286 3583276 3571463 3595971 3447598 3260150 3256494 3049310 2728394 2870776 3021091
5673 3021091 2841938 2832791 2726250 2681344 2468738 2298500 2382445 2317368 2375191 2330332 2303332
5662 2303332 2292689 2157780 2099766 2007944 1994982 1894460 1875718 1911380 1927335 2071037 1978951
5651 1978951 1832628 1869948 1995123 1782678 1689089 1595515 1758305 1798097 1628355 1720721
5641 1720721 1661878 1571126 1508796 1300839 1269896 1345670 1097011 1224258 1376651 1267519
5631 1267519 1170091 1158243 1353831 1096854 1108105 1322449 1206428 971750 1106803 1066970
5621 1066970 1040357 910327 918648 871059 960717 997862 1013784 971374 886607 1007326 1124813
5610 1124813 1265607 1184270 1093504 961571 632113 601641 751983 731574 928821 882281
5600 882281 681516 708523 897257 914988 658026 590740 806324 754847 840980 787447 569220
5589 569220 617858 772641 1079003 1032006 920448 907269 995153 1019958 820132 753854 872960
5578 872960 911713 931994 878136 879377 849422 1020285 957630 898340 809579 808112 929241 862451
5566 862451 990954 882258 677255 836041 1030381 1038868 991155 931496 885111 912194 788847
5555 788847 955063 1058980 1226218 1128147 1064428 1100407 1203368 1314852 1181079 1108173
5545 1108173 1187199 1271814 1185870 1363642 1224011 1220373 1345512 1256963 1132839 1349417 1513628
5534 1513628 1385544 1375943 1335980 1365498 1449902 1519380 1492052 1532331 1688700 1491905 1359978
5523 1359978 1415666 1278878 1353142 1550220 1684704 1909659 2080710 2190245 2202935 2308872
5513 2308872 2278925 2173739 2077925 2379486 2339274 2423276 2523959 2528587 2486651 2612268 2701694
5502 2701694 2816657 2873131 2872147 3012078 3155615 2923399 2810795 3097954 3386272 3593390
5492 3593390 3450010 3435306 3588013 3616073 3697806 3856266 3805604 3831437 3992514 3981356 3861202
5481 3861202 4124135 4055297 4290454 4644876 4775897 4768607 4954448 4996865 4991472 5136205 5214406
5470 5214406 5582218 5621487 5529176 5485695 5740741 5867136 5778855 5772421 5935835 5965799 5996189
5459 5996189 5952673 6136991 6309593 6350779 6235549 6377503 6374429 6503127 6860163 6661688
5449 6661688 6655226 6712150 6652727 6702921 6617545 6702871 6816470 6893211 7044727 7050719 7431509
5438 7431509 7352848 7274427 7279170 7256658 7219679 7347630 7416728 7465820 7566720 7729927 7534377
5427 7534377 7375117 7669455 7593377 7763710 8066372 7957079 7734341 7710700 7725484 7775555
5417 7775555 7804732 8151691 8114602 7949485 7940617 8020443 8014359 7961731 8047274 8230094 8231061 8090613
5405 8090613 8191740 8367669 8467735 8512940 8387508 8244647 8490579 8666194 8656578 8732138
5395 8732138 8474394 8348614 8346469 8585716 8791101 8689022 8778166 8555271 8538998 8565460
5385 8565460 8739750 8665750 8557221 8604914 8690468 8755595 8683226 8804777 9028682 8802773
5375 8802773 8938976 8989807 8824316 8724394 8816773 8917152 9021911 8824980 8876703 9108239
5365 9108239 9028303 8892764 8917424 8757031 8622521 8803234 8733434 8576023 8811441 8966306
5355 8966306 9018368 8802308 8811366 8685301 8563477 8561886 8359361 8500858 8489673 8316293 8289475
5344 8289475 8444998 8202067 8230370 8320959 8259360 8027184 8251824 8106964 8109954 7794856
5334 7794856 7686331 7740811 7674983 7661081 7576720 7255138 7294134 7232031 7167034 7129599 6853437
5323 6853437 6953685 7022921 6959428 6690659 6548727 6445780 6394613 6241289 6120251 6084769
5313 6084769 6092787 5999672 5983435 5967377 5986483 5709893 5405263 5209286 5510648 5400497 5350526
5302 5350526 5063483 4950938 4891520 4748733 4677938 4660082 4471810 4666503 4741326 4436911
5292 4436911 4420729 4439657 4523273 4339314 4129237 3877848 3922477 3988586 4103712 3872061
5282 3872061 3817504 3907209 3760823 3745491 3780138 3874157 4059865 3862779 3809130 3597609 3587838
5271 3587838 3432791 3468458 3488382 3412520 3497677 3506512 3460510 3593203 3622237 3517386 3381999
5260 3381999 3424392 3430394 3379308 3512825 3388144 3227288 3110359 3336236 3246588 3429348
5250 3429348 3478071 3345240 3408703 3452643 3454851 3428196 3287168 3210747 3211174 3271211 3561025
5239 3561025 3593591 3591137 3553442 3520667 3626330 3525196 3401998 3586656 3573954 3503103 3517069
5228 3517069 3356785 3513578 3764006 3694873 3750944 3826867 3841947 3798639 3894578 3955414 3864374
5217 3864374 3937912 3829307 3672407 4008045 4082739 4013298 4355012 4022798 3867137 3884709
5207 3884709 3855286 4021878 4003284 4205050 4541147 4396718 4352448 4448323 4550046 4575698
5197 4575698 4594507 4804383 4928513 4762536 4736778 4680365 4485310 4748095 4594607 4882621
5187 4882621 4898275 5000015 4980522 5071139 5310765 5361533 5411095 5338565 5461591 5638789 5752602
5176 5752602 6062399 6141343 6099685 5986855 6154064 6198077 6384439 6565856 6310921 6532656
5166 6532656 6721310 6839830 6854183 6968144 7096412 7254945 7346564 7373870 7576117 7849452
5156 7849452 7990098 7959191 7942258 8209992 8445832 8746380 8870778 8915164 8977849 9351795
5146 9351795 9625775 9732073 10017053 10115986 10234725 10389998 10503659 10783014 11062320 11125964
5136 11125964 11472470 11902998 12080952 12248885 12704243 13181407 13295127 13236202 13655585 14242397
5126 14242397 14470597 15044109 15164825 15496915 15842668 16258723 16778144 17191523 17627295
5117 17627295 18147361 18298196 18677541 19125176 19520001 20053881 20738967 21150865 21647363
5108 21647363 22093377 22524510 22846261 23177075 23741094 24314077 24890399 25259121 25690907
5099 25690907 26378566 26749404 27309818 28134546 28526130 29024605 29418416 29987279 30461479
5090 30461479 30924099 31474178 32178567 32671857 33159735 33787186 34172479 34644311 35122404
5081 35122404 35757869 36446420 36790839 37344433 37610887 37985808 38547325 39250420 39601172
5072 39601172 39839499 40181517 40482045 41214094 41580452 41919639 42545410 42756700 43148455
5063 43148455 43660891 43803255 44020420 44326173 44844163 45090811 45294879 45538301 45597537 45853317
5053 45853317 46240137 46523782 46604915 46526907 46543469 46635953 46803026 46703912 46801006 46858574 46589318
5042 46589318 46721934 46748348 46606893 46929779 47020771 46739215 46664934 46480171 46264088 46234516
5032 46234516 46067548 45726874 45455561 45261959 45125406 44973224 44615724 44336946 44117776
5023 44117776 43706858 43617295 43331794 42944951 42489435 42364997 41955101 41478707 40785169 40707542
5013 40707542 40523574 40278638 39797579 39539862 39313035 38799172 38438069 38435337 38200881 37589851
5003 37589851 37211289 36876650 36605173 36134747 35824266 35561913 35163211 34875561 34748456
4994 34748456 34423409 34267252 33937838 33637499 33419453 33200876 33248302 32855928 32476561 32330505
4984 32330505 32355672 32337704 32133222 32079874 32110624 32114886 32089409 32070903 32213481 32115709 32121194
4973 32121194 32086944 32110708 32318069 32387238 32405515 32628360 32867388 33078205 33420482 33535772
4963 33535772 33494909 33467818 33801987 33936340 34098217 34425058 34885634 34821265 34983572 35116908
4953 35116908 35431902 35551886 35777591 35862708 35937951 36206712 36175135 36200638 36402476 36666279
4943 36666279 36887968 37213065 37228825 36937813 37039217 37043302 37103009 37228641 37176941 37053075
4933 37053075 37155478 37001210 36760376 36675610 36696548 36623844 36298189 36049348 35699538 35375388
4923 35375388 35188466 34899468 34568139 34248649 34193788 33875479 33389650 33010964 32686993 32496005
4913 32496005 32063839 31566576 31056510 30912492 30646688 30015329 29556836 29235207 28701782
4904 28701782 28266318 27817459 27477201 27019617 26583184 26093815 25485274 25099044 24686039
4895 24686039 24259825 23781977 23354303 22807690 22427211 22017830 21905066 21692593 21170181
4886 21170181 20812527 20471888 20164227 19786098 19204025 18886865 18741215 18459016 17993521
4877 17993521 17799029 17480237 17156373 16868162 16591420 16258337 15949217 15775147 15464170
4868 15464170 15329527 15061308 14727997 14468050 14516174 14265647 14119749 14043425 13649092 13303084
4858 13303084 13202869 12973435 12949294 12732499 12362993 12457780 12229674 12105713 11834503 11542091
4848 11542091 11701932 11515013 11442151 11220581 11075294 11019713 10926623 10933952 10896010 10826152 10644972
4837 10644972 10674233 10557005 10368394 10504337 10617005 10505072 10173046 10176017 10196470 10072105
4827 10072105 9970400 9923931 9930546 9796511 9731935 9958451 10117299 9872021 9802399 10002739
4817 10002739 9994998 10055599 9932805 9753885 9777538 9982273 9847026 9710809 9967208 10080288
4807 10080288 9818910 9732156 9750870 9720104 9584483 9747493 10165171 10137812 10226625 10394298
4797 10394298 10184340 10369893 10360965 10274756 10307215 10366748 10644689 10668818 10528747 10428428
4787 10428428 10574389 10858273 11038020 10999656 10958452 11172476 11457047 11490160 11970716 12203688
4777 12203688 12164721 12507825 12514816 12461163 12444295 12645444 13037261 13368035 13382157 13674309
4767 13674309 13892751 14128932 14420210 14749389 14932737 14993267 15418817 15812576 16387075 16879623
4757 16879623 17175164 17420824 17838382 18251314 18375624 18618618 19229018 19580996 20113559
4748 20113559 20435307 20866523 21321387 21529492 22085777 22723922 23054237 23516956 24164022
4739 24164022 24753168 25241113 25834617 26280822 26902483 27367683 27853407 28392953 28757384
4730 28757384 29242847 29875429 30275176 30762896 31525183 32111342 32505282 32543493 33307943 34291704
4720 34291704 34806366 35091693 35648286 36000267 36406272 37046019 37602651 38153892 38377812
4711 38377812 38804979 39214584 39863944 40226406 40471095 40752006 41224827 41655310 42002130
4702 42002130 42272257 42608026 43094844 43371592 43684802 44009084 44115349 44119440 44345466 44404962
4692 44404962 44507619 44577610 44582883 44744311 44833248 44755488 44736118 44814655 44918650 45001287 45097093
4681 45097093 44842038 44603643 44534626 44450947 44409779 44271062 44301012 44178341 43929501 43805747
4671 43805747 43668979 43527046 43422873 43062190 42555453 42269237 42225031 41943776 41623086 41431903
4661 41431903 41032844 40625034 40480269 40221394 39713626 39227505 38731329 38360026 37971290
4652 37971290 37372807 37037478 36366940 35743102 35293696 34844996 34802054 34299697 33993735 33360397
4642 33360397 32666506 32382634 31762329 31431286 30817979 30254597 29967186 29511227 29096133
4633 29096133 28611853 28405056 28116624 27517935 26991857 26524245 26141044 25775049 25539429
4624 25539429 25141599 24756414 24177099 23827985 23437181 22876050 22330873 22100669 21865474
4615 21865474 21242873 20887249 20627655 20389753 20108548 19843093 19426284 18963799 18868381 18475828
4605 18475828 18028225 17900078 17434549 17285893 16794615 16547408 16477417 16176107 16141549 15997719
4595 15997719 15569862 15416545 15258375 15072614 14853956 14536239 14539667 14699141 14816108 14730155
4585 14730155 14685529 14638471 14365603 14539980 14499941 14576919 14547121 14608619 14699565 14744723 15005801
4574 15005801 15260585 15416243 15508364 15807519 16085517 16171223 16307684 16511988 16593013 16501870
4564 16501870 16831130 17124217 16966934 16932302 17054922 17182639 17318339 17415179 17348105 17335470
4554 17335470 17298208 17445277 17580960 17382484 17432740 17359670 17463706 17637293 17572950 17598693
4544 17598693 17816240 17626686 17478889 17572645 17533107 17418398 17314019 17460757 17406310 17029193
4534 17029193 16711730 16350665 16107046 15951395 15479411 15246970 15063054 14916423 14625450
4525 14625450 14515752 14493758 14196149 13870409 13888141 13778691 13674007 13482572 13431863 13284635
4515 13284635 13142319 12808454 12491470 12374420 12383092 12044115 12013415 11703285 11216622 11089941
4505 11089941 10832674 10595514 10197126 10069231 10045026 9782258 9511678 9117532 8856409 8761662
4495 8761662 8652545 8473030 8328344 8087725 7922625 8055999 7963452 8014253 7995807 7782806
4485 7782806 7632461 7641386 7469960 7478705 7390032 7242767 7127374 7090526 7026355 6875095 6803178
4474 6803178 6749474 6737007 6552575 6706658 6603847 6298609 6399863 6414885 6384534 6329721
4464 6329721 6297374 6302647 6299176 6158800 6091468 5887698 5662481 5848458 5702684 5561100 5402723
4453 5402723 5253968 5209787 5133463 5003532 5059800 4877570 4746256 4650595 4560634 4705028
4443 4705028 4577334 4569544 4492785 4320004 4329418 4035066 4047843 4135395 4035717 3991624 3978949
4432 3978949 4018498 3763360 3662103 3696758 3788149 3639903 3540771 3630190 3530786 3594358 3526250
4421 3526250 3334916 3376476 3229538 3217646 3523156 3315874 3232829 3179779 3160228 3265936
4411 3265936 3497165 3378834 3125450 3080240 2828001 2899776 3013673 3225291 3020585 2821886
4401 2821886 2835890 3046473 3096834 3142812 3102829 2870629 2663565 3053244 2992503 2818153
4391 2818153 2750686 2815573 3035373 2878583 2879188 3003928 2905138 2785599 2949577 2970541 2718902
4380 2718902 2611995 2511330 2527610 2635346 2584271 2515941 2363658 2445854 2541651 2581235 2520500
4369 2520500 2539529 2362193 2388137 2299868 2292910 2319416 2168074 2415487 2585083 2649356 2406373
4358 2406373 2281305 2255073 2337755 2286992 2200555 2291318 2222969 2323665 2248310 2373294 2419879
4347 2419879 2375190 2249434 2318551 2500557 2360724 2238366 2177965 2125203 2295248 2458829
4337 2458829 2284647 2178091 2272852 2315165 2201612 2234412 2338147 2392837 2311185 2210255
4327 2210255 2145355 2212330 2483118 2381388 2372370 2378432 2320722 2360382 2501519 2422328 2190664
4316 2190664 2159287 2173369 2209011 2135571 2161766 2249751 2196258 1948919 2079095 2276172 2008589
4305 2008589 1852373 1840057 1889849 2107773 2228109 2141067 2317121 2116139 2183184 2259273
4295 2259273 2077343 2087277 2027640 2219338 2045390 2042986 2041562 2256954 2292731 2242286 2007704
4284 2007704 2086254 2188744 2129675 1909391 1937240 1873853 1863069 1868174 1899518 1918787 2143288
4273 2143288 2038176 2125271 2235641 2093089 2082657 2148586 2015260 2081732 2207103 1991693
4263 1991693 2047487 1880407 2213329 2363662 2032521 2052063 2306897 2110401 2044431 2102337
4253 2102337 2080685 1914523 2031553 2080398 1998138 2191970 2450464 2316773 2287704 2188494
4243 2188494 2049188 1910590 2020610 1924637 1905402 2145806 2281884 2175489 2211184 2359992
4233 2359992 2393413 2399798 2410110 2280985 2395484 2348103 2329680 2435156 2606900 2572106 2633664
4222 2633664 2532335 2656026 2635430 2480352 2654128 2833225 2748355 2865660 2937027 2906079
4212 2906079 3026918 3072241 3127887 2968628 3082818 3263806 3260259 3206460 3299505 3360224 3417502
4201 3417502 3408064 3440747 3573923 3797768 3948558 3917965 3798094 4058255 4311898 4266584
4191 4266584 4248415 4381499 4436724 4309262 4343348 4407738 4534121 4540090 4422256 4547398 4776700
4180 4776700 5101073 5226603 5062211 5121508 4960461 4915108 5170438 5357458 5381186 5224762
4170 5224762 5241670 5444675 5626996 5362774 5467460 5538989 5564495 5666094 5853291 5760319
4160 5760319 5576162 5731754 6024100 5874176 5827196 5689362 5723846 5829468 5801103 5768553
4150 5768553 5873400 5932006 5986815 5598548 5755288 6051360 5905094 5887887 5860927 5805707
4140 5805707 5933457 6197508 6222870 6105775 6224934 6531651 6090566 5879771 5921730 5939151
4130 5939151 5953978 5977571 6147117 6209696 6162515 6316113 6383241 6480179 6301240 6344980 6358773
4119 6358773 6400303 6432103 6530123 6635093 6701926 6487279 6481910 6558873 6578789 6479736 6379882
4108 6379882 6588754 6501697 6402486 6381205 6392626 6603977 6404421 6273360 6439943 6332490
4098 6332490 6216832 6286047 6369594 6120001 6176522 6155952 6105834 6019722 6238494 6069341 5996542
4087 5996542 6168668 6297811 6311854 6156249 5629383 5545941 5612127 5664508 5737847 5865719
4077 5865719 5589823 5405022 5604809 5714199 5606674 5328607 5440556 5375317 5112199 4931970
4067 4931970 4899268 4808796 4735157 4742055 4730436 4956755 5005324 4711450 4539744 4423521 4304590
4056 4304590 4213591 4320881 4451105 4258243 4400282 4564195 4245855 4263257 4254932 4036688
4046 4036688 3912569 4094618 4138484 4074745 4119543 4206667 4122486 4091502 4001914 3951640 3677518
4035 3677518 3639379 3811435 4002397 3752004 3796934 3744520 3626869 3776367 3980790 4060624
4025 4060624 3968032 3614030 3673833 3771668 3814709 4015733 3973640 4228226 4156211 4070894 4263751
4014 4263751 4279402 4156323 4117905 4060454 3992228 4058838 4298379 4117654 4170466 4257966 4407522
4003 4407522 4336829 4370643 4549295 4401146 4443011 4456120 4445246 4569464 4773842 4683047 4540459
3992 4540459 4631257 4657295 4777883 4932952 5041363 4972731 5179169 5081673 5066430 5284820
3982 5284820 5396933 5474404 5391257 5480622 5316927 5554249 5720773 5714963 5803315 5758559 5895026
3971 5895026 5858830 5786082 5949028 6116307 6282122 5929764 6047585 6127569 6343614 6529762
3961 6529762 6647950 6746236 6679170 6648566 6901768 7009942 6806940 7045117 7141750 6996289
3951 6996289 7138365 7057488 7165387 7267995 7405178 7364544 7328024 7396597 7296270 7593494
3941 7593494 7702237 7593940 7656533 7828814 7992957 7870038 7754818 7884668 8137745 8043163
3931 8043163 7841960 8125392 8260573 8037542 8113327 8298682 8428528 8396009 8361855 8329876
3921 8329876 8326178 8438231 8388808 8643099 8518792 8678030 8665570 8924244 8982563 8694521
3911 8694521 8560512 8497540 8636047 8593941 8497952 8491390 8519631 8639552 8566865 8665934 8887381
3900 8887381 9123957 9247931 9119715 8952915 9046738 8933896 8790440 8637729 8742612 9013468
3890 9013468 9121825 8956187 8765136 8791936 8877262 8712028 9001647 9002989 8759364 8643511
3880 8643511 8537622 8521697 8492035 8441499 8473049 8361609 8385579 8431101 8416258 8244939 8106325
3869 8106325 8050058 8056220 7971061 7921270 8192153 8049042 8117669 8236627 8013042 7903135 7526761
3858 7526761 7700852 7914378 7938403 7887483 7883215 7954509 7888793 7904480 7700203 7557765 7427147
3847 7427147 7462539 7593504 7924277 7597393 7685655 7791897 7817974 7917408 7749197 7542278
3837 7542278 7660199 7660901 7770769 7898350 7525034 7619800 7606062 7516986 7608058 7648821 7752531
3826 7752531 7504858 7559337 7597759 7482285 7607430 7696657 7704829 7620688 7741503 7929403 7715289
3815 7715289 7774909 7946681 7935497 7819227 7762372 7956446 7825203 7699002 7783085 7794328
3805 7794328 7824712 7842829 7936279 7799117 7701023 7753176 7918524 7957526 7771182 7866246 7876521
3794 7876521 7844972 7892183 7789729 7991158 7871930 7662010 7745273 7812081 7858395 7905992 7947021
3783 7947021 8028777 7871378 8020339 8136193 8012157 7915943 8109691 8119547 8204401 8193855 8190725
3772 8190725 8319212 8349275 8272010 8095101 8259581 8480773 8275830 8476333 8809690 8835379
3762 8835379 9021047 8879741 8775144 8837387 8608956 8606016 8708794 8920885 9127232 9441262
3752 9441262 9379611 9076969 9093599 9171878 9440944 9472481 9404807 9390263 9656234 9919169 9956674
3741 9956674 9782895 9849545 10017852 9977106 10207385 10257178 10282570 10258672 10426609 10638795
3731 10638795 10569411 10553619 10598091 10682481 10796549 10966675 11206099 11416949 11426534 11549004
3721 11549004 11755419 11991864 11915128 12051439 12019104 12133814 12188573 12461759 12348419 12494408
3711 12494408 12681047 12697694 12629496 12971797 13280372 13531730 13555691 13518680 13885381 14117686
3701 14117686 14542734 14574013 14669456 14808292 14896507 15067791 15412618 15777739 15842706 15863110
3691 15863110 16232550 16680444 16852322 16890748 16905943 17264202 17773301 18005817 18013723 18533371
3681 18533371 18678897 18858533 19063831 19145477 19469476 19762051 20333205 20563857 20670485 21046284
3671 21046284 21433877 22042286 22229553 22442800 22958273 23309182 23862052 24275682 24501888
3662 24501888 24791056 25265908 25783578 26266330 26577276 27030508 27407479 27947584 28574766
3653 28574766 28972145 29575425 30170348 30653731 31408541 32109439 32960826 33841328 34772392
3644 34772392 35359468 35927365 36897141 37831084 38865483 39994514 41358682 42844255 44063532
3635 44063532 45217637 46571431 48093809 49739240 51860937 53614185 55608582 57975783
3627 57975783 60262203 62607300 65136005 67874991 70783682 73876974 77267382 80750059
3619 80750059 84124397 87554228 90866014 94274890 97631713 100933825 103849962 106992359
3611 106992359 109673114 111850806 113918019 116185479 117814478 119381944 120743184 122210617
3603 122210617 123752454 125320841 127385642 129707016 132355104 135033395 137970955 140945567
3595 140945567 144070158 146949079 149727373 152223489 154807950 157122809 159118195 160870798
3587 160870798 162043779 162564889 162516496 161772664 160726206 159311764 157276033 155006807 152009761
3578 152009761 148608156 145153068 141500900 137957852 134568053 131696778 129484515 127584553
3570 127584553 125983218 124969516 124456426 124085874 123769215 123783462 123945034 124231745 124238021
3561 124238021 124447481 124411431 124417568 124258471 124082242 123875622 123521918 123208580 122861230 122741114
3551 122741114 122760109 122685428 122834687 123099183 123365642 123378393 123902983 124299885 124550688 124810380
3541 124810380 124917955 125421401 125804325 126016413 126005253 125865308 125825936 125552259 125067596 124549453
3531 124549453 124184653 124274353 124582175 125124912 126002737 127623422 129809461 132692653 135866447
3522 135866447 139891553 144228751 148743979 153188318 157118579 160789180 164102841 166671653
3514 166671653 168494683 169647840 170279727 170545579 170280319 169096863 166934224 164206977
3506 164206977 160985745 157682845 154282068 150837972 147234264 143658467 140038066 136680583
3498 136680583 133654572 130798204 128389549 126721276 125169071 123846090 122823243 121618551
3490 121618551 120372417 118578299 116703041 114129722 111307264 107876719 104160039 100359930
3482 100359930 96241047 91845298 87698993 83469085 79050170 74814337 70876674 67181981
3474 67181981 63716483 60640742 57387343 55042727 52604326 49989000 47848019 46088891
3466 46088891 44314737 42365418 41117198 39677495 38347918 36957427 35687075 34623637
3458 34623637 33862808 33127130 32185753 31529247 30671814 29821924 29046040 28374447 27602518
3449 27602518 26591158 25903766 25663563 24872860 24030622 23379718 22861509 22677590 22086708
3440 22086708 21212614 20917736 20685312 19925715 19258914 18977440 18403474 17791360 17553090
3431 17553090 17323525 16789418 16353747 15962401 15547434 15185992 14785338 14395985 14109165
3422 14109165 14001147 13541845 13278845 13108383 12914629 12616308 12438360 12203824 11962587
3413 11962587 11948989 11769293 11292367 11161529 11013347 10860624 10697919 10546671 10441927 10451651
3403 10451651 10294172 10326568 10137124 9942260 9781434 9586210 9666529 9565484 9443439 9456384
3393 9456384 9383255 9289112 9430252 9441697 9559406 9162578 9177483 9249343 9169664 9002491 8924500
3382 8924500 9106262 8926113 8736596 8849215 8948268 8899815 8641430 8423646 8382397 8457747
3372 8457747 8502259 8309609 8301168 8586740 8748779 8617491 8144708 7927178 7959761 8072940
3362 8072940 7963498 7684949 7879225 7826909 7675970 7738595 7814948 7786735 7582180 7473832
3352 7473832 7231211 7396973 7232811 6863494 6999170 7087407 6856182 6818613 6871765 6784723
3342 6784723 6722144 6851944 7190495 6876522 6426918 6498420 6411026 6428359 6469072 6347588
3332 6347588 6412232 6198251 6114092 6482410 6578551 6542290 6400779 6241162 6083340 6219647
3322 6219647 6214013 6174279 6179540 6291253 6285238 6367450 6352328 6351521 6149062 6202960 6250079 6157125
3310 6157125 6123748 6174185 6317966 6173176 5972533 6023254 6166922 6220988 6121406 6134813 6466252
3299 6466252 6650025 6644495 6586347 6598973 6365539 6437496 6280598 6374437 6347335 6416794 6449824
3288 6449824 6585699 6587276 6683403 6639032 6642486 6682190 6579843 6664644 6487111 6633646 6919487
3277 6919487 7128969 7020520 6796736 6889858 7007210 7041662 7145202 6892931 7075399 7169549
3267 7169549 6817962 6758347 6936876 6985559 7105796 7261809 7407713 7608093 7581237 7371233
3257 7371233 7488015 7341100 7423927 7716672 7779784 8056744 8085161 8147716 8030816 8100273
3247 8100273 7997863 7872543 7816315 8110985 8366298 8360066 8335044 8659122 8602704 8714960
3237 8714960 8706786 8457906 8628464 8655135 8692973 8599184 8363561 8513959 8592445 8605070 8809743
3226 8809743 9016124 9229034 9141915 9220846 9240028 9029767 9038363 9319849 9630980 9861036
3216 9861036 9865286 9760821 9745801 9858382 9955943 9786208 9953152 10211806 10385557 10276033
3206 10276033 10255203 10242800 10406338 10483592 10511840 10622776 10863046 10978582 11015360 11052620
3196 11052620 11167583 11360751 11460467 11513615 11397739 11293465 11519526 11904858 12000440 12007287
3186 12007287 12047222 12239494 12401242 12421006 12581402 12943330 12724034 12897911 12928469 13184223
3176 13184223 13407118 13524330 13770702 13962092 14013235 14139630 14259331 14449218 14650549 14788060
3166 14788060 15258061 15449561 15578115 15664269 15858974 16118699 16284304 16612695 16770240 17009869
3156 17009869 17329554 17613626 18037151 18494255 18898605 18961422 19296825 19787680 19995786 20367121
3146 20367121 20492031 20864957 21245059 21443805 21948283 22407257 22668620 23062494 23499656
3137 23499656 23986675 24245179 24704184 25162546 25523503 26048387 26397858 26889592 27080637
3128 27080637 27303734 27973484 28732155 29267039 29776855 30306447 30959871 31541852 32007859
3119 32007859 32902132 33269825 33741480 34179323 34805852 35890954 36425002 37038460 37937269
3110 37937269 38837131 39606629 40436115 41401185 42182589 43204355 44236389 45263847 46500312
3101 46500312 47525072 48709084 50158890 51464899 52987371 54637775 55879152 57404583
3093 57404583 59256730 61254855 63157192 64956546 66878446 69228313 71359600 73814294
3085 73814294 76488228 78866270 81622721 84540840 87608960 90406324 93610823 97059995
3077 97059995 100374463 104068916 107941120 111738020 115348171 119024590 123205715 127470759
3069 127470759 131772009 136054115 140517256 144958927 149169025 153411359 157955093 162239374
3061 162239374 166467482 170973857 175007394 179059752 182826593 186400726 190068262 193258390
3053 193258390 196423816 199524206 202185569 204705735 207116853 209060194 210690768 212195795
3045 212195795 213285340 214178429 214648667 215186843 215256332 214948235 214350346 213495072 212139468
3036 212139468 210657657 209160181 207608634 205532054 203073858 200619655 197941775 195230668
3028 195230668 192341214 189298159 186406877 183022045 179381982 175813666 172338015 168739115
3020 168739115 164930671 160922123 157096480 153296264 149667495 146246435 142504195 138924336
3012 138924336 135479225 132039640 128479916 125325076 122036019 119168451 116314114 113222049
3004 113222049 110345172 107523404 105067839 102746600 100648237 98373977 96523091 94472617
2996 94472617 92599197 91152117 89497227 88118377 86661353 85427897 84625973 83803549
2988 83803549 82708174 81787693 81041747 80511990 80134969 79697914 79322752 79033342 78809652
2979 78809652 78555565 78143416 78087859 77910768 77783604 77810905 77859364 77888105 77861072 77724296
2969 77724296 77660806 77573352 77546254 77498917 77355030 77179822 77156995 77444680 77465975 77448656 77301571
2958 77301571 77158621 77091465 76850009 76683102 76861344 76976316 76654309 76729562 76723796 76620689
2948 76620689 76286341 76126654 75702110 75549612 75602707 75300765 74887325 74562656 74345304 74008022
2938 74008022 73612601 73165701 72776321 72357082 72053246 71475202 71115828 70710994 70111065
2929 70111065 69472247 68964908 68427721 67674960 66874246 65947910 65319472 64750688 64060896
2920 64060896 62996340 62160735 61407065 60597476 59762733 58962958 58237155 57282272 56564274
2911 56564274 55563074 54729022 53964863 53275905 52708361 52070123 51470584 50881465 50049795
2902 50049795 49447650 48652069 48275594 47762886 47354110 46952752 46773551 46586634 46380813
2893 46380813 46049204 45841682 45748185 45369358 45439066 45237540 45116356 45310224 45405638 45612570
2883 45612570 45634995 45725136 45781070 46149357 46255405 46239373 46288659 46502820 46713425 46581865
2873 46581865 46893456 47231884 47513109 47735117 47969223 48334486 48709356 48969498 49357321
2864 49357321 49750777 50180153 50887266 51393572 51744157 52345603 52898136 53548575 54006350
2855 54006350 54815314 55585012 56620436 57278225 57956236 58742660 59355394 60047909 61048395
2846 61048395 61863728 62896721 63681884 64427651 65440661 66476405 67370750 68395955 69440112
2837 69440112 70581805 72022944 73329565 74504600 75859597 77012932 77823890 78743888
2829 78743888 79903583 80746508 81766116 82882481 84154978 85706028 87333253 89155846
2821 89155846 90951678 92988603 95248262 97673873 100148918 102625667 104972197 107421222
2813 107421222 110106615 113197124 115870419 118928540 122719243 126350106 130465613 134676138
2805 134676138 138818618 143065893 147045397 150483447 153881694 157252258 160574710 163835483
2797 163835483 167267088 170964781 174561844 178686401 182967483 187588695 192299681 197431004
2789 197431004 203012702 209112423 215626629 222631156 230116954 237715092 245192027 252355334
2781 252355334 258594818 264002763 267974945 270562878 272102665 273339895 274758068 276505232
2773 276505232 278535734 280617903 282845244 285238933 287104013 288788811 290327294 291211557
2765 291211557 291570732 291399360 290803159 289877043 288455895 286322738 283928797 281757995 279549220
2756 279549220 277400086 275396584 273353815 270758527 267755980 264046565 259532325 254259341
2748 254259341 248044099 241283042 234204876 227356541 221259556 216040453 211341790 207514229
2740 207514229 204208616 201191470 198623275 196202166 193433506 190905209 188875009 187145499
2732 187145499 185164952 183338364 181852358 180466771 179162925 177355831 175452582 173554447
2724 173554447 171465463 169285278 167560442 166234118 165561251 165267611 165152383 165560048 166279188
2715 166279188 166790569 167350386 168386357 169442023 170680114 172433069 174555198 177380143
2707 177380143 180377985 184018413 187867452 192033083 196657787 201418568 206656633 212054133
2699 212054133 217768722 223956465 229953500 235989201 242264455 248468649 254653470 261092822
2691 261092822 267657319 273817830 279997224 285795023 291298112 296141896 300511499 304549929
2683 304549929 308010145 311020687 313368624 315175433 316423397 316917240 317195843 316763092
2675 316763092 316002820 314292251 311995683 309327288 306415534 302706922 298758937 294677126
2667 294677126 290130521 285218801 280112199 275159198 270227731 265137068 260225109 255705692
2659 255705692 251149566 246819984 242840944 238723003 234902951 231737201 228478003 225414429
2651 225414429 222864521 220040132 217591933 215179255 212316892 209665579 207477889 205569937
2643 205569937 203202749 200792676 198542347 196544125 194491146 192118849 189994884 188072623
2635 188072623 185930094 183815089 181609904 179264101 177378555 175653975 173614799 171665398
2627 171665398 169728598 167758383 166016835 164329306 162622747 161010903 159728868 158596282
2619 158596282 157396648 156148522 155014731 154188354 153302917 152322271 151560019 150697172 149888140
2610 149888140 149171834 148437597 147872363 147311537 146877587 146474592 146258442 145932088 145749515
2601 145749515 145645627 145862424 146246107 146519624 147139389 147831014 148217674 149156826 150442190
2592 150442190 151857883 153533933 155182584 156751377 159167573 161794536 164168748 166960817
2584 166960817 169915204 172995831 176323108 179701379 183212202 187092508 190949235 195002844
2576 195002844 199001513 203002558 207277144 211532118 215793019 220247418 224646778 229146358
2568 229146358 233739078 237861347 241886208 245711480 249437733 252866790 256217116 259272952
2560 259272952 261869496 264466437 266547280 268493334 270413941 271814090 272986978 273855268
2552 273855268 274370882 274575013 274404531 273855317 273045749 271812726 270534623 269065240 267406411
2543 267406411 265598716 263548391 261604779 259354392 257201097 254944877 252692448 250728733
2535 250728733 248727986 246783124 244682723 242613246 240848334 239070671 237328476 235761122
2527 235761122 233993905 232276415 230830070 229347285 227925960 226586039 224948998 223496211
2519 223496211 222042888 220267941 218701172 216883870 214686444 212334606 209902166 207273786
2511 207273786 204420509 201357967 198036973 194528885 190772101 186787707 182734595 178945029
2503 178945029 174881913 170372267 165897689 161439176 156926442 152508540 148029141 143696171
2495 143696171 139447559 134702574 130409348 126194142 121801403 117704861 113812396 110003084
2487 110003084 106340878 103171874 100000052 97060313 94094879 91589988 89096333 87095429
2479 87095429 85420405 83650161 82103723 80702539 79662071 78348225 77206266 76378004
2471 76378004 75798917 75182950 74687056 74209831 73770322 73164295 72683180 72338893 72114247
2462 72114247 71652503 70933234 70559143 70171563 69697362 69372155 68900960 68382748 67797678
2453 67797678 67097755 66224351 65453884 64479973 63659728 62708706 61597906 60161670 59032610
2444 59032610 57911321 56494415 55375462 53940153 52705702 51394215 50055416 48787279
2436 48787279 47475926 46209912 44708337 43449711 42160538 40771313 39383179 38311302
2428 38311302 37164849 35977841 34623814 33513332 32547523 31527827 30628480 29936090 29159708
2419 29159708 28201696 27574905 27041455 26292445 25604460 25095770 24507664 23897977 23204780
2410 23204780 22777760 22170895 21796104 21339511 21121345 20663753 20187095 19927048 19412577
2401 19412577 19176522 18915084 18423688 18018299 17791566 17715872 17314195 16918126 16756051 16495358
2391 16495358 16232220 16007761 15840058 15662334 15389124 14975425 14734965 14693459 14629051 14345672
2381 14345672 14144223 14141166 13840526 13649233 13572219 13517016 13142772 12798781 12890053 12671758
2371 12671758 12273337 12350558 11908070 11865821 11936327 11732047 11694349 11622957 11519526 11262954
2361 11262954 10972717 11092792 11014021 11001675 10780206 10705265 10806057 10550207 10426280 10377741
2351 10377741 10477996 10379126 10137234 10021226 9876401 9717150 9836870 9821220 9794969 9771284
2341 9771284 9828509 9626484 9517704 9328267 8962980 8812151 8669847 8773359 8868733 8720589
2331 8720589 8513191 8352111 8438725 8590844 8455424 8153390 8194175 8232455 8268369 8291380
2321 8291380 8329284 8131087 8119361 8101291 8088555 7845898 7805076 7787583 7563201 7558092 7492064
2310 7492064 7639322 7675931 7672958 7561443 7470341 7710837 7620554 7541380 7467591 7488463 7779322
2299 7779322 7852194 7810616 7605400 7760384 7844004 7956468 7967803 7922664 8032439 7963362 8044871
2288 8044871 8163501 8139203 7939680 8273812 8370141 8405465 8359229 8370756 8715002 8599508
2278 8599508 8540091 8629813 8744025 8982293 9233960 9318352 9569040 9819279 9792675 9912339
2268 9912339 9923331 10185490 10183659 10067494 9998134 9985795 10250848 10223235 10371433 10381374 10514632
2257 10514632 10590733 10647189 10830113 10952441 11219479 11545602 11652826 11915543 12169847 12259161
2247 12259161 12206539 12579742 12991838 13083877 13300797 13662322 14087862 14359898 14457043 14831302
2237 14831302 14772404 14869011 15518267 15697264 15949968 16360602 16697996 16844384 16951071 17053375
2227 17053375 17211007 17456800 17787933 18303723 18700175 18917230 19317830 19535845 19916148
2218 19916148 20687954 21220730 21760781 22369119 23286329 24180446 24935343 25435383 25944963
2209 25944963 26575667 27170660 27943488 28688895 29759863 30742689 31895571 33206665 34451609
2200 34451609 36173262 37993334 40040251 42175521 44368917 46670821 49069109 51423682
2192 51423682 53711463 56056177 58194565 59918013 61092998 61776266 61594324 60980073 59840506
2183 59840506 58027175 55744058 53401507 50852480 48644457 46819955 45124074 43007361
2175 43007361 40968109 39353890 37483993 35724308 34024625 32476646 31212618 29845289
2167 29845289 28542398 27335058 26133536 24917088 23614390 22858923 21841558 20894609
2159 20894609 20157078 19485587 18785828 18294206 17772725 17101792 16288819 15391180 14778753
2150 14778753 14382091 13953384 13283111 12972629 12659811 12231158 11969829 11797859 11284086
2141 11284086 10973805 10502259 10017795 9946184 9785614 9452506 9134743 9010445 8760099 8271388
2131 8271388 7924840 7496519 7698322 7656487 7469585 7333894 7311086 7274536 7037943 6861154
2121 6861154 6492204 6341564 6156097 5854937 5419970 5291057 5262490 5173583 5006597 4817252
2111 4817252 4470005 4323545 4325913 4267026 4191957 3896531 3734707 3852910 3761432 3546939
2101 3546939 3401698 3463992 3212616 3064933 2856454 2710586 2863588 2890818 2760608 2607818
2091 2607818 2734342 2784848 2751287 2674596 2416623 2054713 2129749 2333673 2234243 2183136 2003840
2080 2003840 1913248 2080542 2102606 2079416 2105208 1959470 2210563 2344484 1993493 1815548
2070 1815548 1938003 1995524 1749352 1699905 1808605 1819146 1767971 1488692 1505327 1468939 1520704
2059 1520704 1577087 1220560 1074471 1179260 1221669 1049839 1120497 1305797 1083625 1097054
2049 1097054 1103118 919603 1085547 960217 765076 878140 993770 975141 989791 1033385
2039 1033385 1142789 975973 984331 947739 1004445 980791 760030 578366 574310 550439 416738
2028 416738 635066 987611 957348 670931 707170 712318 422012 489567 443165 169473 308891
2017 308891 448640 381390 551790 598909 376484 502126 396894 331247 358647 517668
2007 517668 529335 539231 456131 478335 482941 489460 458505 554368 490546 348073 303465 242442
1995 242442 215595 205259 252547 231020 314308 315858 291910 211952 447587 434497 369356 228410
1983 228410 279075 338297 153827 331932 401779 319378 304333 475998 365723 145922 273061
1972 273061 410370 363977 261976 265634 348777 506862 495200 322194 151487 316211 371522
1961 371522 595020 662699 453264 519906 553114 351113 503871 529442 610783 589816 598356
1950 598356 542499 723191 856069 744230 528370 535124 522130 601927 766847 838584 841414
1939 841414 768356 816931 693271 859719 885912 847309 839505 935511 1009013 1051333 927672
1928 927672 1025238 1151749 1274116 1162689 1066544 1057099 1185396 1084865 1272919 1405356
1918 1405356 1439925 1245528 1494074 1571066 1426980 1585929 1580393 1664365 1826939 1705154
1908 1705154 1871557 1979539 2003401 2071035 1996365 2095482 2040072 2030924 2307505 2471301 2528012
1897 2528012 2632073 2609725 2428789 2502151 2514697 2585612 2656942 2577353 2759211 2592584 2657386
1886 2657386 2620072 2741423 2982691 3084328 3389960 3522867 3539764 3916181 4248185 4231326
1876 4231326 4288323 4300719 4477123 5026830 5322157 5392163 5480909 5811175 6209615 6375040
1866 6375040 6411574 6946802 6981151 7185639 7629548 8026204 8675748 9109972 9585716 10225368
1856 10225368 10781511 11403671 11998163 12997831 13603455 14222820 14913360 15695333 16290562
1847 16290562 16692053 16988508 17122109 16989227 17057913 16947640 16870983 16939947 16823183 16689953
1837 16689953 16747403 17154565 17218192 17285436 17335115 17431153 17771924 18101357 18331567 18786150
1827 18786150 19369505 19942676 20763516 21743321 23084409 24842792 26695447 28284782 29721928
1818 29721928 31069592 31549312 30868403 29156057 26866655 24113327 21793386 20114504
1810 20114504 18822698 17503806 16710800 15898760 15275619 14685728 14183355 13808470 13390331
1801 13390331 12813289 12574800 12532334 12418441 12219511 12203925 12108497 12173737 12238299 12363070
1791 12363070 12560204 12887530 13065381 13560816 13893910 13810538 13842401 13671607 13330749 12658430
1781 12658430 11773139 10978467 10138068 9416645 8674916 8109171 7559540 7020127 6697103
1772 6697103 6173625 5719732 5348162 5081734 4904709 4453089 4005881 3815905 3659858 3662354
1762 3662354 3270271 3147747 2988379 2857419 2810609 2593728 2406121 2245144 2143730 2135716
1752 2135716 2211486 2209084 1887424 1868269 1786953 1563999 1422537 1529487 1405050 1296063
1742 1296063 1371039 1341519 1147809 903706 693902 826466 773186 794941 794372 669096 824737
1731 824737 965538 820848 539446 511138 530559 508269 318924 278981 336362 397204 311935
1720 311935 188903 174028 247255 192664 245431 259247 267251 318361 393819 250660 338460
1709 338460 361935 158704 53017 -146407 -129043 -115320 -39844 -44751 -92273 11569 -106508
1698 -106508 -161869 26860 -93809 -139349 -193140 -343402 -144821 -136648 -255190 -257207 -241338
1687 -241338 -510328 -449031 -162174 -293768 -349298 -330244 -502462 -217281 -48881 -311957
1677 -311957 -110709 609 -182893 -236976 -269169 -178825 -291820 -568835 -558835 -612312 -577194
1666 -577194 -538127 -598366 -559944 -255689 -400860 -497120 -541363 -357106 -458385 -584739 -458693
1655 -458693 -541349 -674377 -649812 -457481 -421252 -537783 -804955 -769196 -561038 -684337
1645 -684337 -809044 -890322 -684685 -755928 -876981 -604605 -502885 -586953 -472960 -347084
1635 -347084 -519664 -620831 -526124 -628650 -765708 -632963 -766826 -640947 -647669 -847677
1625 -847677 -1001507 -942242 -635733 -622606 -722902 -563054 -517981 -734777 -852203 -982391
1615 -982391 -872005 -890307 -657595 -486653 -667294 -425702 -255996 -164381 -496569 -928961
1605 -928961 -754852 -761959 -665876 -577183 -578942 -692399 -875531 -615004 -602552 -779250 -866804
1594 -866804 -973943 -779936 -550294 -810071 -901501 -792396 -697006 -900304 -996078 -945034
1584 -945034 -920528 -940873 -839825 -595007 -688139 -761770 -611318 -752428 -560653 -626310 -874801
1573 -874801 -795751 -658990 -574414 -637256 -720167 -610214 -665623 -551233 -514504 -604778 -781855
1562 -781855 -759770 -716894 -761544 -599597 -566671 -581499 -628631 -774361 -687518 -668822 -901907
1551 -901907 -781555 -634948 -786841 -651451 -813003 -768782 -561114 -447101 -260111 -149318
1541 -149318 -119663 -397697 -615275 -661380 -729791 -516477 -315406 -413329 -349610 -402987 -540763
1530 -540763 -575621 -491368 -491340 -504212 -449629 -388435 -490132 -637202 -817951 -655538 -210578
1519 -210578 -388924 -374914 -251967 -533695 -562988 -547728 -439876 -641645 -670805 -639723 -587446
1508 -587446 -715850 -567784 -662557 -497469 -257006 -380815 -410021 -430597 -369385 -582125
1498 -582125 -677080 -623226 -443999 -571404 -619199 -783192 -929066 -769464 -654595 -658011 -799688
1487 -799688 -657863 -707234 -538568 -606952 -670880 -798940 -810293 -634803 -643044 -781925 -763114
1476 -763114 -795820 -762176 -820309 -725933 -708382 -757190 -521191 -326417 -366799 -571845 -683857
1465 -683857 -744486 -602249 -599814 -844392 -738866 -528412 -567213 -618757 -636669 -683673 -637740
1454 -637740 -526487 -418247 -538052 -661767 -419736 -529067 -512680 -543995 -545517 -392444
1444 -392444 -427288 -511813 -359469 -521646 -530761 -512206 -747558 -755327 -688661 -804534 -642991
1433 -642991 -688482 -743030 -949671 -939664 -828959 -649975 -700512 -686777 -737611 -750381 -543808
1422 -543808 -536084 -439399 -615134 -535542 -293238 -433946 -543204 -417251 -530785 -685081
1412 -685081 -820285 -702123 -637413 -568693 -593439 -651024 -754306 -782254 -641636 -407350 -549696
1401 -549696 -518397 -621544 -631212 -431155 -633409 -576678 -315465 -599385 -616670 -526518 -485866
1390 -485866 -802553 -701482 -530893 -512740 -452070 -584501 -459928 -630975 -538864 -556162
1380 -556162 -567705 -648011 -466587 -432563 -553366 -618368 -778986 -561741 -674868 -567187
1370 -567187 -422765 -767347 -731414 -667413 -508580 -409796 -491763 -345797 -495668 -869435
1360 -869435 -954453 -759888 -557542 -488147 -506678 -644853 -484509 -501781 -477011 -545042 -488424
1349 -488424 -481001 -617034 -722090 -763174 -676481 -815814 -998415 -818703 -621847 -660118 -583118
1338 -583118 -454300 -637502 -849044 -739882 -693717 -594076 -581237 -586825 -522707 -502059 -569784
1327 -569784 -496960 -521534 -617874 -579616 -853658 -736678 -822180 -673829 -373714 -485687 -591416
1316 -591416 -636036 -705075 -556739 -692446 -842408 -772318 -642284 -621954 -679566 -462990 -464973
1305 -464973 -435096 -550690 -692425 -800549 -634908 -497219 -431221 -461213 -614403 -467857
1295 -467857 -520634 -443170 -317524 -213058 -435856 -409570 -597314 -487925 -484354 -640152 -443484
1284 -443484 -669972 -708952 -422113 -349331 -330223 -465102 -657230 -653804 -596367 -408116 -644805
1273 -644805 -612791 -464102 -557990 -508064 -609809 -597362 -225080 -156926 -394677 -472255 -401375
1262 -401375 -534749 -563906 -518792 -463984 -582125 -329415 -75270 -98570 -39275 -153600 -442097
1251 -442097 -166043 -111579 -148173 -206854 -256549 -234835 -251245 -391623 -479702 -289528 -270148
1240 -270148 -365607 -203440 -139180 -345525 -460223 -473290 -233761 -310610 -498453 -414284 -359320
1229 -359320 -297203 -448127 -305248 -324593 -387405 -245051 -111388 -297143 -265289 -171697 -67530
1218 -67530 -399128 -356177 -267862 -327241 -270354 -31048 -375641 -266089 -404474 -585880 -367927
1207 -367927 -248279 -345676 -347577 -381262 -597785 -492017 -522401 -572551 -493411 -142294 -211518
1196 -211518 -346601 -556814 -449964 -331616 -308761 -467791 -510834 -585460 -317681 -185625
1186 -185625 -181700 -207683 -300452 -221014 -136772 -132602 -184580 -97165 -232732 -271685 -67426 -242769
1174 -242769 -270458 -444459 -433903 -326561 -276883 -465628 -302635 -449271 -332044 -246750
1164 -246750 -202243 -167410 -185108 -153013 -310718 -272598 -315636 -211065 -158173 -332360 -102210
1153 -102210 122845 51326 113928 15680 -187316 -321340 -419079 -630406 -615768 -296952 -322532
1142 -322532 -472143 -556348 -177472 -210432 -260445 -477792 -559412 -195321 45572 -82243
1132 -82243 -52030 -50033 -115615 -221527 -243318 -55274 -18083 54580 30711 -33101 -210987
1121 -210987 -200465 140391 150796 207687 246230 302220 242424 242511 208368 124750 123975 40319
1109 40319 -12629 46799 -70938 -165781 44692 31033 101055 195162 239354 85159 341789
1098 341789 218010 171066 125827 54009 124623 104880 215707 123778 208333 214138 44058
1087 44058 95720 267641 281237 147661 138808 101114 228572 186335 425390 460644 368022
1076 368022 302885 508302 479674 314889 429562 588670 607530 598907 487045 519703 493349
1065 493349 664316 571318 579473 535307 305081 382434 597385 692115 856578 906236 895146
1054 895146 971747 669646 551485 796930 935348 734962 745781 966799 1055632 1020352
1044 1020352 1072191 881310 899819 1048965 1066244 1198923 1160844 1284150 1117083 1127365
1034 1127365 1108553 1205931 1220707 1235652 1468805 1289274 1148882 1150710 1267435 1587285 1649498
1023 1649498 1387800 1419740 1781533 1841862 1846037 2008850 1951975 1837584 1982208 2194931
1013 2194931 2201996 2357334 2362698 2461216 2382121 2479564 2775865 2926305 3084816 3187999 3155179
1002 3155179 3334986 3375195 3621304 3989998 4308690 4623918 4909134 5260425 5713376 5836965
992 5836965 5890456 6355586 6741290 7202775 7690217 8245847 9103634 9675636 10164129 10726762
982 10726762 11265266 11726859 12586275 13585453 14985803 16408030 18135105 19958085 22653609
973 22653609 26718438 31561449 36754233 40956288 44901793 49163292 49092097 44299744 38094741
964 38094741 29975601 23703301 19889148 17199751 15134207 13633823 12354219 11184089
956 11184089 10150705 9383509 8817940 8282933 7978028 7334360 6619482 6446764 6132015
947 6132015 5488261 5114739 4829008 4523456 4180527 4110719 3846157 3724571 3637013 3617900
937 3617900 3677060 3125623 2821666 2839751 2622451 2561235 2445917 2230291 2049549 2123555
927 2123555 2005423 2175979 2205734 2045418 2166491 1977149 1603501 1657816 1472002 1398099
917 1398099 1458629 1407471 1276124 1160652 1137141 1055777 1368213 1241258 1036838 1002312 1165865
906 1165865 1064385 848369 717479 897932 918109 732934 707531 795292 693076 761609
896 761609 741086 722706 697739 558957 740852 627017 530629 642095 663465 332670 230873
885 230873 282214 328604 350314 296717 436147 458681 220749 313972 288337 367566 524848
874 524848 344469 214089 229049 259836 239576 113491 226757 290954 405975 181056 271309
863 271309 330988 153905 160629 151392 162087 230163 114284 -1800 112332 81175 245106
852 245106 286107 350745 318406 260606 162090 210273 237635 301544 172795 -59613 -5262
841 -5262 207625 310142 201958 -35622 -48322 -54149 171084 129359 196132 238380 76359
830 76359 -60412 42425 372429 207982 -64356 -38712 210106 112509 192878 197686 236194
819 236194 61400 -247133 -181586 -44412 57562 -5384 3742 67333 -34749 28495 -94291
808 -94291 18224 -64517 -156451 -124407 -14264 119449 72265 145750 117114 145236 80711
797 80711 67211 -67914 -134574 -178576 -84105 -20844 112700 280201 248595 5091 62816
786 62816 133299 218364 37504 -61350 -12299 45713 77912 87864 10903 11308 197602 141739
774 141739 203301 105659 60673 -68753 -44062 113637 -738 14494 -56335 -14559 141458
763 141458 144559 32400 266650 254297 -26248 182222 -80225 -258676 -159704 -51042 213129
752 213129 81956 196684 111227 14927 28873 127672 125131 268147 30276 -16114 105001
741 105001 -158952 -220493 5212 26170 116888 64632 26605 151752 -45464 154270 202374
730 202374 17304 105950 289052 185747 179160 -136096 199388 195303 44264 184824 154811
719 154811 335797 403180 25924 -11629 -15175 -41568 275825 240064 104012 -22504 -1171
708 -1171 -139209 -151505 59913 28599 -105442 -263654 -61091 54999 125002 152643 122447
697 122447 70859 170348 160972 337879 287566 302755 154078 12456 178170 70173 111509
686 111509 95510 145886 330264 277235 253562 328087 215625 214691 226740 219589 127718 273847
674 273847 332206 387855 336884 73005 10086 48651 114429 215839 21013 103920 -43655
663 -43655 -103494 182022 230298 424804 442736 171326 -23000 57158 154998 332003 253870
652 253870 277567 -63517 100303 158596 145235 240152 83501 -105635 -119566 -155081 -130025
641 -130025 -46482 159378 11587 24643 57855 46522 117187 38572 91506 98613 160482 518488
629 518488 631930 446208 389096 65633 -45605 48291 142338 25785 119571 349769 335466
618 335466 299871 369716 241286 305733 261004 348374 259761 216375 406809 414202 153443
607 153443 18542 102217 351358 326501 226747 137050 93575 87174 17899 -32595 152653
596 152653 193666 255656 296249 240957 147207 104204 329192 288526 35446 269630 314460
585 314460 292077 153124 37594 42879 220682 148230 107252 440327 374506 2361 69142
574 69142 71889 114076 253268 240123 339469 487874 281407 108467 131723 283968 396297
563 396297 437530 460611 201862 126875 264489 218511 206754 121850 177312 381130 217831
552 217831 301061 240078 430405 495270 494660 326470 274665 298189 281804 371413 353968 507836
540 507836 280289 298933 63011 -73947 79703 301546 333273 381619 354850 306651 479207
529 479207 310693 206102 269490 437646 447757 307000 548992 448899 238685 75120
519 75120 26967 89392 35198 13640 235625 491258 518127 462020 446239 618855 516087
508 516087 469904 383347 376662 317463 513591 584502 527558 359718 581159 676324 283559
497 283559 136340 214883 364866 648243 543131 369002 247116 375277 134371 218822
487 218822 475363 557347 588080 610656 367186 329612 179170 312940 347991 44572 104286
476 104286 401835 520021 319050 287299 358181 -37488 97444 200420 86210 194500
466 194500 132280 243992 242349 371956 465409 407336 341777 398313 505117 566289 521844
455 521844 314183 450185 109469 -15339 227226 142552 147958 238371 299346 274583 590209
444 590209 548506 491253 405449 292759 469425 526795 461995 437977 276653 217587 401548
433 401548 424979 300737 270847 185580 194832 266726 472707 452822 594219 632446 644608
422 644608 565310 456195 617641 403442 281142 221005 235536 300126 437554 371148 230091
411 230091 164928 26272 341689 294982 347342 509358 661789 602148 667483 644925 642164
400 642164 614910 789133 740633 791893 563277 352971 350816 476885 495786 570334 496039
389 496039 444058 447624 493917 338881 303559 319629 500055 418424 277731 299895 355778
378 355778 388406 344856 375049 616768 610543 431752 320431 241106 419272 359032 383251
367 383251 441041 564036 641652 468931 365689 305460 220167 364371 412822 622641 484770
356 484770 559764 529135 576966 580291 673131 591953 545840 439818 661645 922595 886639
345 886639 770848 841479 690810 559842 586499 550857 545371 667403 565461 573992 375292
334 375292 160205 407050 515763 603849 318266 291615 728119 845093 710519 530286
324 530286 731020 793669 567425 627555 633873 514641 542049 653784 665047 671293 635645
313 635645 559143 655698 683942 603308 384465 560921 549881 524750 710036 570480 468481
302 468481 577657 695417 619753 775206 768614 672256 624605 548094 658146 602411 553674
291 553674 581190 688672 840086 700697 640024 683037 682532 478384 569952 366372 450014
280 450014 521299 502463 670386 552351 617129 632082 644937 719679 836337 705029 669180
269 669180 624013 520518 718162 764366 515598 428617 235097 202502 512065 396629 489441
258 489441 456472 457229 566835 536814 621634 518447 435835 556887 437312 513400 567597
247 567597 512354 520541 550693 527550 530775 783042 617815 372849 271980 510953 587611
236 587611 705400 690948 614551 645554 721629 650306 574151 467325 565927 789511 938413
225 938413 865929 701029 881829 728256 609733 548240 735440 943225 794398 735005
215 735005 794076 822761 964244 682512 647085 688638 728147 787301 647016 586041 626438
204 626438 605736 608719 621266 583385 759473 705126 714635 755334 864530 602916 389953
193 389953 479207 570544 584215 787755 914520 780779 777353 761584 844089 814967 777750
182 777750 701917 725051 721737 722205 789130 798590 613134 812867 924980 720509 691296 624674
170 624674 764675 762079 636406 728514 850731 691269 597865 412892 662195 950971 666632
159 666632 553695 529173 594297 697851 814567 725499 527477 526029 685943 600717 676086
148 676086 773137 899799 919146 898296 651604 593899 589156 628135 598145 758839 813035
137 813035 782044 847934 553087 596922 687537 709688 799298 754475 729378 930840 775696
126 775696 691667 835711 834325 1090480 1090473 894752 956424 709867 685373 784899 787624 837203
114 837203 717677 640172 797835 883474 852874 810429 729603 620430 663498 639653 821748
103 821748 739287 729843 577116 579393 748539 773780 789130 800030 1032608 943395 920563 830767
91 830767 690055 742444 728180 906411 894219 575393 587470 724477 781210 826593 771704
80 771704 798074 681521 761532 833171 808818 925964 935710 884811 1021390 1004998 863320
69 863320 757257 758711 750195 699223 732514 856485 800902 764024 814779 780042 801361 802705
57 802705 685468 702244 779318 723202 933801 898046 834500 808099 751614 793753 795445 728653
45 728653 739580 810660 858039 790221 877768 834320 930663 988866 888569 831056 795731 785914
33 785914 766667 789010 933949 1035025 1148331 1123465 838187 806393 908436 962375 963287
22 963287 902105 898969 853741 797581 774688 826614 875884 784498 734525 728228 756134 600795
10 600795 744952 884063 789261 852286 952357 1101956 957988 918012 846563 915926
0 915926
$$ Imaginary data points
##PAGE= N=2
##DATA TABLE= (X++(I..I)), XYDATA
16383 -6701611 -6607185 -6458435 -6466054 -6411787 -6233046 -6138637 -5963292 -6084987 -5875329 -5807533
16373 -5807533 -5740416 -5599161 -5443959 -5451205 -5259927 -5101537 -5050361 -4968421 -5070833 -4984004
16363 -4984004 -4751099 -4867528 -4931847 -4881295 -4779995 -4564425 -4582114 -4645145 -4548044 -4483158
16353 -4483158 -4346293 -4159110 -4146127 -4167857 -3987735 -3780633 -3801714 -3715266 -3708838 -3660937 -3577014
16342 -3577014 -3484839 -3362100 -3162503 -2878311 -2849829 -2654489 -2751568 -2720898 -2614425 -2644537
16332 -2644537 -2616892 -2612476 -2533780 -2526667 -2510765 -2402739 -2196434 -2166376 -2103044 -2042172 -1682085
16321 -1682085 -1707755 -1552487 -1452479 -1427189 -1305069 -1326717 -1332560 -1206740 -1128806 -1067457 -1147572
16310 -1147572 -1057518 -937334 -985087 -871346 -711530 -602130 -685561 -703996 -677529 -544685
16300 -544685 -499014 -352825 -273390 -161643 -119345 -114325 -91952 -149507 86371 271167 293574
16289 293574 247892 255266 301810 392244 405184 377071 477174 676887 750053 846517 990848
16278 990848 870101 904218 1086543 1171581 1298911 1235750 1344293 1334825 1159881 1135146 1342841
16267 1342841 1451921 1641622 1703050 1651064 1840490 1775544 1736573 1706087 1738091 1796004 1937108
16256 1937108 2127195 2122523 2143114 2209562 2188409 2125073 2127386 2027119 2138782 2408529 2644570
16245 2644570 2528074 2482740 2814896 2941273 3063397 2904856 2789669 2793708 3140127 3132393
16235 3132393 3025547 3076647 3151627 3198692 3183370 2929218 3154511 3382810 3398862 3404431 3435008
16224 3435008 3476135 3481350 3502161 3609230 3568786 3660399 3801245 3672974 3827842 4074793
16214 4074793 3981053 3765770 3881468 3886954 3985338 3931462 3832364 3827931 3859971 3948479 4204528
16203 4204528 4186832 4049219 3994215 4142658 3944932 4006814 4105255 4253999 4378004 4316759
16193 4316759 4219403 4420561 4469932 4341297 4274770 4447094 4415394 4352617 4535843 4640728
16183 4640728 4655514 4456444 4790063 4891395 4785687 4676274 4633722 4748431 4723985 4646588
16173 4646588 4449362 4489386 4835284 4750257 4589215 4686329 5023072 5178534 5137281 4876621
16163 4876621 5127268 5076712 4892860 4888934 4925003 5135125 5256582 5408494 5525320 5421962
16153 5421962 5247035 5234202 5135291 4970965 4923989 5017054 5142846 5146928 5201798 5374246 5432306
16142 5432306 5384555 5442921 5300942 5491647 5599739 5526030 5342685 5320298 5604560 5682878
16132 5682878 5596413 5347361 5461691 5459391 5483508 5429197 5559907 5534090 5452417 5343095 5325835
16121 5325835 5261160 5517916 5641908 5600186 5627526 5520721 5685094 5608327 5567938 5523215
16111 5523215 5526158 5591822 5738749 5680632 5685422 5806171 5786565 5731669 5730740 5683979 5635907 5656791
16099 5656791 5890378 5789903 5744198 5804062 5798883 5893482 5664866 5673517 5757364 5935772 5971787
16088 5971787 5829160 5870921 5981154 5980757 5915859 5893135 5817648 5917588 5979342 5922638 6041204
16077 6041204 5980739 5882167 5933137 6034678 5905678 5980683 5851730 5952040 6070795 5770144
16067 5770144 5601506 5763578 5760703 5586409 5700315 6128572 6016179 5734626 5749167 5705325
16057 5705325 5936468 5953090 6125554 6006917 5917364 6135398 6038085 5970620 6011573 5909138
16047 5909138 5913429 6051655 5814632 5708173 5796142 5844545 5918852 5969723 5907714 5750197 6009799
16036 6009799 5980457 5824218 5933864 6031820 5941948 6050070 6193072 6102147 6030188 5627747
16026 5627747 5484475 5695731 5662307 5647940 5724461 5788042 5825206 5713044 5614106 5762586
16016 5762586 5912073 5689112 5845348 5897370 5579294 5627205 5844930 6137790 6222403 6194144
16006 6194144 5958519 6112517 6069354 6103953 5921660 5853683 5810536 6019317 5863757 5746175
15996 5746175 5961992 6014127 6100353 6026259 6127420 6087441 6284963 6304429 6429807 6089766
15986 6089766 6122336 5948619 6297028 6225103 6052242 6197167 6135061 6034825 5939414 6171307
15976 6171307 6180130 6090973 6142026 6002000 5927823 6022020 6334103 6262828 6013485 6318048 6345583
15965 6345583 6418543 6324327 6219021 6161900 6123450 6065272 5962975 5915846 5804858 6004971
15955 6004971 6073598 6299311 6464862 6301145 6328145 6197063 6292095 6316131 6374904 6387561
15945 6387561 6451210 6230017 6358048 6157298 6127804 6044002 5936775 5989144 6082032 5997212
15935 5997212 6045438 6140647 5964381 6003261 5880945 5883532 5936407 6223440 6162533 6002560 5975742
15924 5975742 5815170 5717194 5760351 6116916 6121481 6105780 6297083 6144878 6200759 6185002 6153663
15913 6153663 5950471 5952934 6094820 6236414 6071224 6070230 6170051 6161414 6022910 6278744 6296176
15902 6296176 5883417 5943362 6074556 6270043 6304860 6246287 6098482 6345771 6180299 6099563
15892 6099563 6485992 6376632 6121586 6497124 6399543 6148470 6063419 6408402 6518821 6447712
15882 6447712 6373540 6284084 6261210 6263073 6326643 6284081 6284139 5934586 5829598 5888178 6117706
15871 6117706 6295794 6220260 6181844 6172730 6123224 6298196 6374234 6207671 6093733 6033828 6180518
15860 6180518 6223500 6203276 6292005 5984164 5963044 6136253 6174025 6013741 6088896 6032535 6192129
15849 6192129 6240521 6153248 6023438 6164939 6221030 6132396 6219894 5999132 5841240 5895242
15839 5895242 6182392 6037696 5946273 5968085 5982408 6150276 6154638 6135852 6059762 6099920 6196251
15828 6196251 6303275 6009905 6011177 5983594 6003717 6107536 6219354 6187209 6068483 6144512
15818 6144512 6244822 6338639 6305297 6135765 6096125 6097879 6146607 6141647 6106826 6092872 6035737
15807 6035737 6322264 6340222 5993074 5874176 5963455 6109284 6150379 6062089 6182989 6186957
15797 6186957 6107219 6199806 6191128 6059219 6104403 6236473 6441331 6193921 6361661 6357765 6083295
15786 6083295 6327925 6511002 6375482 6255331 6179853 6227503 6253253 6429678 6389648 6129922
15776 6129922 6180177 6150524 6063364 6403252 6289054 5964844 6010598 6287278 6275110 6216752
15766 6216752 6275816 6032113 6114448 6045818 6172815 6291862 6149898 6179048 6287882 6192666
15756 6192666 6091828 6142861 6118457 6291261 6314570 6269318 6274833 6389798 6409380 6253508 6272847
15745 6272847 6315253 6203873 6171594 6434121 6550111 6524401 6129157 5823409 5895175 5963515
15735 5963515 6163199 6170220 5960189 6025431 6188140 6070327 6092019 6142638 6156638 6117309 6117915
15724 6117915 6121052 6044247 5971730 5738478 5893686 6166197 6053270 6045266 6085659 6033220 5943869
15713 5943869 5986261 6087889 6361723 6272070 6203246 6363336 6211707 6190396 6352672 6289879
15703 6289879 6308924 6300460 6209573 6165946 6153777 6109739 6042808 6132498 6331153 6330704 6483706
15692 6483706 6578134 6234808 6121012 6268839 6206705 6211483 6388513 6567380 6420185 6067597
15682 6067597 6037277 6235485 6300537 6158984 6291090 6153611 6037805 5870726 6023387 6223992
15672 6223992 6431992 6180667 6074973 6138362 6492286 6543941 6175785 6217680 6241333 6391509
15662 6391509 6373070 6372947 6348508 6359761 6423897 6315216 6299267 6248640 5928214 6155672 6181274
15651 6181274 6123903 5999970 5914296 6014656 5960767 6064979 6254170 6602557 6575724 6473635
15641 6473635 6212089 6270350 6445642 6209240 6200431 6110435 6103317 5969139 6161176 5956081
15631 5956081 6128969 6272485 6107083 6208999 6087654 6207441 6234306 6335274 6325727 6369585
15621 6369585 6315236 6309596 6338945 6331513 6254197 6352566 6255006 6336336 6332348 6337765 6274165 6199565
15609 6199565 6386389 6539192 6515600 6508777 6512561 6434793 6192980 6330938 6413915 6315745 6257075
15598 6257075 6167726 6391619 6211123 6153540 6179129 5994506 6080920 6357393 6370999 6012515
15588 6012515 6170060 6311259 6419597 6545379 6414987 6565085 6725072 6723419 6715657 6617606
15578 6617606 6533070 6698924 6542545 6299280 6202418 6461639 6418965 6487099 6561713 6408724
15568 6408724 6389727 6402891 6382750 6474799 6297515 6188931 6242025 6424368 6595598 6488588
15558 6488588 6617834 6712975 6388508 6438527 6525393 6592605 6546925 6389351 6451564 6511342 6394352
15547 6394352 6316206 6302382 6145936 6113521 6281124 6257101 6171596 6183126 6197202 6339256 6131042
15536 6131042 6160103 6265211 6572211 6510303 6366053 6366581 6286819 6446210 6298097 6353543 6348439
15525 6348439 6140648 6133018 6214454 6250561 6325974 6315371 6475350 6556021 6452072 6478149 6489862
15514 6489862 6572930 6381609 6280574 6417925 6604971 6562331 6591444 6519125 6596999 6607103
15504 6607103 6482438 6592745 6580228 6490751 6410677 6229294 6150026 6297127 6541846 6818160
15494 6818160 6650888 6473389 6255921 6275980 6343471 6319500 6427672 6437694 6299674 6364274
15484 6364274 6309721 6357929 6377087 6395345 6246648 6050673 6395459 6512348 6225588 6163945
15474 6163945 6426062 6610541 6563566 6524697 6524316 6526632 6574952 6264055 6165905 6296227 6218603
15463 6218603 6235384 6357633 6415874 6336517 6465503 6519634 6437222 6416342 6405721 6427006 6603241
15452 6603241 6485908 6294525 6432995 6552909 6340184 6326243 6340823 6265399 6275052 6547193
15442 6547193 6400476 6283964 6508019 6389647 6392985 6337974 6356832 6426425 6606736 6399850
15432 6399850 6348616 6409492 6409411 6331736 6538978 6504743 6482191 6338773 6348302 6306703 6317839 6176651
15420 6176651 6058960 6282740 6296367 6425863 6445613 6500338 6466235 6665229 6654114 6376179
15410 6376179 6477749 6632652 6635507 6533370 6418535 6399160 6491547 6467981 6682296 6323846
15400 6323846 6301683 6641102 6474781 6590256 6623059 6462461 6466254 6507983 6426488 6403874 6351193
15389 6351193 6261946 6384487 6420584 6415093 6676913 6679271 6466191 6320619 6490835 6512683 6447523
15378 6447523 6475392 6672287 6525338 6601675 6485981 6306258 6310713 6407744 6538657 6457897
15368 6457897 6321005 6307470 6301195 6199025 6445541 6328867 6242100 6309409 6354647 6246348
15358 6246348 6239953 6581731 6666819 6481544 6617370 6661243 6606920 6567230 6464356 6408135 6562238
15347 6562238 6568080 6453592 6390715 6505388 6647824 6415958 6475197 6562486 6588260 6650992 6403723
15336 6403723 6454798 6651708 6583032 6710182 6738221 6755973 6687302 6585981 6576284 6734220 7006391
15325 7006391 7117159 6932179 6753626 6740480 6819261 6691371 6573427 6158892 6278881 6484539
15315 6484539 6511062 6452843 6525494 6705673 6566826 6655781 6810810 6626362 6483229 6663920
15305 6663920 6663440 6597828 6411139 6446535 6509154 6593919 6607834 6596357 6407455 6496983 6704335
15294 6704335 6680168 6775671 6771403 6712362 6667025 6591060 6640650 6589778 6464300 6412188 6364943
15283 6364943 6639607 6759529 6684393 6657892 6435932 6501274 6542621 6617165 6390348 6234786
15273 6234786 6516742 6456998 6559216 6626222 6432236 6398687 6397791 6540575 6766179 6954728
15263 6954728 6706931 6597772 6564522 6559272 6555377 6402429 6379127 6333440 6279181 6493391 6658920
15252 6658920 6402648 6335877 6502165 6458369 6328564 6319432 6432925 6545183 6416513 6516868
15242 6516868 6432728 6426161 6480033 6440446 6423781 6548363 6486832 6515954 6674152 6809201 6563273
15231 6563273 6390394 6391546 6244422 6334374 6501288 6424221 6422597 6525649 6567114 6496676 6470002
15220 6470002 6557541 6683309 6652020 6664581 6639148 6668772 6617270 6609182 6758003 6846848 6694111
15209 6694111 6615241 6783419 6789607 6602498 6513456 6635867 6684855 6713230 6563260 6432392
15199 6432392 6404619 6562454 6730935 6695256 6669830 6663298 6854308 6971392 6655348 6555401
15189 6555401 6470457 6477886 6709427 6838698 6597547 6738573 6905086 6859344 6683254 6709354
15179 6709354 6565490 6502637 6285199 6450735 6512201 6389725 6404623 6536373 6632090 6538177
15169 6538177 6578544 6470951 6532986 6690725 6584004 6619369 6702083 6679424 6955964 6917220
15159 6917220 6702996 6604929 6473367 6437953 6429586 6452143 6470449 6517173 6642987 6961603 6754630
15148 6754630 6614510 6834256 6756773 6673467 6751583 6954313 6611578 6556786 6523814 6562442
15138 6562442 6551806 6652234 6650348 6442354 6538550 6389719 6611011 6735700 6624555 6452601
15128 6452601 6399897 6595158 6531503 6553199 6621908 6504652 6605938 6412684 6393206 6409128
15118 6409128 6470153 6596342 6635542 6706741 6627619 6544198 6537464 6568630 6475006 6526073 6627910
15107 6627910 6711759 6703989 6573398 6648141 6889085 7103033 7056850 6710636 6643663 6641646 6609455
15096 6609455 6617048 6634478 6579935 6694277 6532330 6693887 6779113 6561582 6407886 6793968
15086 6793968 6681415 6536239 6684788 6673896 6505415 6509742 6513383 6563207 6490296 6709209 6967030
15075 6967030 6674269 6615743 6640201 6554682 6468964 6529714 6666851 6813687 6687591 6687804 6659023
15064 6659023 6613801 6811697 6891182 6868837 6716717 6687061 6617010 6725061 6733212 6533171 6529073
15053 6529073 6580270 6493183 6659737 6764149 6645151 6667227 6505078 6653420 6509683 6544816
15043 6544816 6696851 6859618 6753477 6712992 6741125 6630861 6760429 6713852 6711443 6797559
15033 6797559 6848608 6852518 6844301 6913845 6852366 6737473 6560165 6668445 6708627 6613046 6763372
15022 6763372 6830680 6536553 6572664 6616636 6351931 6501342 6549802 6510987 6692979 6729613
15012 6729613 6666420 6842790 6987045 7013974 6877896 6988881 6935883 6745643 6804196 6661385
15002 6661385 6755534 6862262 6757124 6808520 6748748 6591569 6458350 6573596 6564298 6576547
14992 6576547 6619282 6514852 6685754 6429731 6493144 6569255 6505963 6460993 6712097 6874615
14982 6874615 6888260 6799990 6863621 6718908 7005919 6964694 6796694 6759097 6612534 6744739
14972 6744739 6938347 6941924 6775923 6886592 6699459 6718246 6599286 6692185 6604698 6603020 6579913
14961 6579913 6771352 6793405 6626989 6656088 6522328 6567076 6697930 6743402 6821002 6847823
14951 6847823 6845196 6714228 6618250 6709513 6810924 6812046 6666365 6907048 6863887 6477089 6429204
14940 6429204 6752081 6877793 6739632 6668904 6644121 6606562 6590061 6516758 6634934 6611658
14930 6611658 6601970 6696450 6646092 6765823 6902411 6938629 6710463 6586568 6731688 6715461
14920 6715461 6840101 6647914 6557181 6512865 6437206 6650242 6639264 6916186 7123084 6874015
14910 6874015 6951535 6979791 6886902 6880437 6892216 7086057 7044184 6910295 6912215 6939916 6713310
14899 6713310 6832187 6522182 6520204 6825915 6957607 7051351 7069229 7000000 6903587 6665218
14889 6665218 6664387 6696680 6641899 6754923 6843968 6760001 6901742 7044189 6807942 6737859 6689521
14878 6689521 6710234 6993860 7063374 6894148 6693167 6820191 6789527 6799957 6836559 6927450
14868 6927450 6988096 6764595 6709683 6844572 6991782 6914405 6802231 6805251 6736158 6814323 7032848
14857 7032848 7069532 7139487 6964677 6682006 6666712 6837887 7012167 7064171 7129168 6995830
14847 6995830 6937105 6819023 6697828 6702466 6555203 6547094 6497733 6823705 6912775 7053066 6851584
14836 6851584 6522544 6699389 6647582 6522042 6296041 6185970 6559929 6840981 6795825 6678676
14826 6678676 6698244 6906168 6880003 6749942 6485251 6441875 6759088 7056687 7064645 6874635
14816 6874635 6921797 6771314 6866084 6908556 6837055 6768506 6849651 6755162 6768197 6833260 6895647
14805 6895647 6828955 6944695 7337232 7373119 6915574 6760327 6784076 6631532 6925365 7127566
14795 7127566 7060916 6940591 6739368 6876900 6985639 6947680 7098492 6834388 6613669 6777356
14785 6777356 6788802 6586585 6758240 6833027 6816434 6945631 7141875 7151164 6931622 6930720 6779407
14774 6779407 6812560 6717018 6553069 6495161 6579782 6662076 6628253 6570077 6800881 6850759 7013607
14763 7013607 7006767 6997847 7093523 7104324 7015889 6834989 6931208 7027405 7149881 6898505 6844430
14752 6844430 6915603 6927355 6968220 7026024 7106149 7068198 6989746 6837261 6752606 6688072 6725713
14741 6725713 6939522 6981340 6985722 7148805 7101897 7080083 7100873 7049762 7078518 7056647 7355313
14730 7355313 7283150 6983266 6997242 6855378 6717551 6862128 6998528 7126118 6924355 6996299
14720 6996299 7062611 6953712 6802656 7033903 6738634 6837966 6959025 6946879 6843656 6692924
14710 6692924 6902014 7022215 6830104 6800662 7207293 7200740 6966991 6815697 6639271 6857177
14700 6857177 6907383 6796489 6973460 7071730 7182110 6878430 6712145 6923784 7006913 7156176
14690 7156176 6844084 6777501 6747839 6565621 6737146 6894152 6880261 6814536 6865405 6828675
14680 6828675 6964850 7070917 7010455 6858932 6851704 6959695 7089352 7052565 6969650 6906839
14670 6906839 6987160 6853973 6846139 6955980 7028093 6917550 6924855 6829877 6881096 7013752 7014635
14659 7014635 6998238 7053269 7027823 7036624 6972288 6877452 6989671 6789110 6842878 6968312 7042842
14648 7042842 7109922 7117793 7180205 7132341 7040959 7032146 7099874 7075468 7019322 7042205 7104996 7067969
14636 7067969 7035833 7009459 7032132 7075933 6932062 6827839 7012089 6904974 6926000 6930416 7087242
14625 7087242 6994617 6941065 7033261 7098694 7030252 6963393 7027234 6993950 6921974 6777905 6837511
14614 6837511 7041174 7059838 6972950 6904213 6993719 6925225 7245546 7156157 6877114 6693095
14604 6693095 6640414 6720530 6916896 7026515 6834905 6994475 7239475 7348289 7155403 7140040
14594 7140040 6972152 6943847 7109518 7180587 7029052 6843201 6896249 6928979 6888635 6937713
14584 6937713 7123871 7276039 7242301 7193608 7026604 6851807 6764447 6842607 6864072 7199088
14574 7199088 7167323 7125539 7082280 7052612 6873316 7107731 7327088 7109234 6967763 7280426
14564 7280426 7326362 7358256 7305554 7123034 7117581 7146003 7228548 7122269 7000195 7014381 7238781
14553 7238781 7254662 7124504 7026393 7112296 6932538 7065995 7141981 7181658 7288419 7179171
14543 7179171 7208250 7279930 7168047 7074150 6949234 7087910 7333264 7171017 7122310 7111315
14533 7111315 7163469 7275757 7151489 7097346 6903025 6812568 6992980 7119123 7067833 7075420
14523 7075420 7094899 7150614 7211424 7227456 7221038 7004498 6960253 7045938 7083545 7334022 7361884
14512 7361884 7438891 7356641 7181796 7367719 7409804 7206325 7122556 7367630 7247709 7227571
14502 7227571 7113638 6975956 6992854 7060590 7145704 7287363 7047864 7094606 7144216 7130132
14492 7130132 7165311 7134650 7238347 7345629 7027501 6781954 7162411 7221135 7231971 7358299
14482 7358299 7432258 7272216 7256334 7436039 7321772 7104802 7143035 7033162 6955399 7169014
14472 7169014 7140125 6911830 6998816 6968689 7249572 7546547 7228691 7092544 7207464 7158482
14462 7158482 7085612 7135906 7113280 7254697 7184852 7078026 7257705 7225902 7050997 7103416
14452 7103416 7234500 7274852 7289094 7298463 7233890 7381832 7283257 7235673 7320965 6891634 6902352
14441 6902352 7103176 7171487 7084495 7280300 7284272 7342218 7125811 7156768 7290949 7251500 7364029
14430 7364029 7221667 7260986 7383251 7431118 7449250 7071857 6833246 6878099 6861502 6815540
14420 6815540 6880241 7208216 7069507 7062158 7161493 7043930 7112949 7074502 7035340 7026549 7214188
14409 7214188 7139804 6944957 6892634 6964241 7061729 7028470 7112744 7261557 7268800 7374622 7242002
14398 7242002 7207207 7161622 7124605 7205123 7167093 7311764 7226748 7076070 7166383 7260903 7493747
14387 7493747 7395263 7358802 7375193 7198350 7222556 7290374 7428480 7081501 6971171 7043697
14377 7043697 6985980 6917972 6856572 7072836 7342087 7480192 7376239 7058720 7003447 7086059
14367 7086059 7070233 6922482 6929717 7059172 7364099 7272791 7278130 7328592 7373606 7217272 6966542
14356 6966542 6826570 6749697 6972773 7087656 7101506 7065327 7153368 7261959 7285459 7303536
14346 7303536 7230753 7203871 7223788 7197059 7278415 7175420 7417668 7493901 7397805 7616669 7563945
14335 7563945 7309514 7186888 7415366 7174191 7250244 7331062 7423793 7323375 7348630 7273842
14325 7273842 7128152 7188793 7100807 7202800 7370436 7311336 7313435 7330681 7414512 7661624 7597165
14314 7597165 7500539 7460399 7520788 7234166 7136511 7171346 7297778 7379997 7357328 7464381 7451376
14303 7451376 7469063 7392566 7334063 7300378 7451013 7673071 7805295 7642770 7566356 7438934
14293 7438934 7331674 7253787 7210527 7267083 7450742 7588117 7438225 7551195 7681264 7565732
14283 7565732 7644593 7684880 7607599 7459050 7182948 7387277 7530795 7509978 7340970 7336232
14273 7336232 7256414 6968715 7312380 7593479 7440243 7351134 7358167 7470108 7443494 7377221
14263 7377221 7538107 7387916 7067316 7149124 7238499 7329753 7212350 7306264 7098360 7188825
14253 7188825 7183942 7270997 7273253 7410758 7360402 7488878 7427904 7218612 7238260 7404536 7481501
14242 7481501 7334202 7358301 7283345 7276125 7584647 7689800 7512908 7587868 7486297 7220452
14232 7220452 7093580 7320829 7406760 7356518 7382341 7176102 7209257 7309272 7164905 7236880
14222 7236880 7137692 7088768 7067372 7342356 7335649 7214987 7295746 7366134 7338828 7279391 7353249
14211 7353249 7243969 7126304 7258163 7438549 7397425 7340211 7404011 7495066 7198740 7256783
14201 7256783 7318715 7186379 7298562 7495500 7490741 7479421 7411970 7378076 7336239 7387610 7505317
14190 7505317 7409811 7316902 7220708 7397802 7211695 7457829 7402621 7401081 7458939 7617626 7562977
14179 7562977 7352123 7285911 7438449 7315732 7179561 7224656 7266171 7206123 7330348 7343958
14169 7343958 7273537 7090071 7230828 7480189 7409919 7383569 7299110 7268375 7360217 7393338 7535167
14158 7535167 7505768 7134575 7159240 7080447 7197406 7258744 7338236 7471893 7511504 7462224 7581817
14147 7581817 7533941 7215777 7279201 7488995 7590960 7311601 7421503 7459912 7315258 7572559
14137 7572559 7298342 7208803 7262287 7301485 7398535 7564375 7577488 7648002 7649953 7621915 7443468
14126 7443468 7282580 7502089 7405202 7495397 7551086 7544056 7369392 7385349 7439063 7508387 7532568
14115 7532568 7721188 7686504 7514327 7454545 7419174 7543564 7356130 7432315 7437311 7527393 7429940
14104 7429940 7516848 7468013 7613155 7708187 7698172 7599886 7423427 7137348 7289578 7565373
14094 7565373 7430356 7529912 7498851 7454525 7491073 7470217 7510373 7436789 7549515 7581538 7849847
14083 7849847 7933383 7713289 7587623 7455927 7638650 7489777 7522721 7707686 7582244 7557400
14073 7557400 7515596 7389772 7410742 7441309 7398867 7329047 7264979 7395393 7538608 7443421 7605008
14062 7605008 7655058 7558613 7523130 7523264 7618518 7656925 7478591 7455602 7522899 7499353 7526318
14051 7526318 7500629 7694000 7705088 7435823 7379775 7479432 7496925 7549955 7535661 7386418 7392415
$$ [...]
##END NTUPLES=NMR SPECTRUM
##END=
