##TITLE=1H_CA-8834-1
 CDCl3,8 sc, 
 10.03.2021
##JCAMPDX= 6.0         $$ Bruker NMR JCAMP-DX V2.0
##DATA TYPE= NMR SPECTRUM
##DATA CLASS= NTUPLES
##ORIGIN= UXNMR, Bruker Analytische Messtechnik GmbH
##OWNER= root
$$ XWIN-NMR		Version 3.5
$$ Wed Mar 10 10:06:27 2021 Russian Standard Time (UT+4h)  she@DPX200
##.OBSERVE FREQUENCY= 200.131506
##.OBSERVE NUCLEUS= ^1H
##.ACQUISITION MODE= SIMULTANEOUS
##.ACQUISITION SCHEME= undefined
##.AVERAGES= 8
##.DIGITISER RES= 18
##SPECTROMETER/DATA SYSTEM= spect
##.PULSE SEQUENCE= zg30
##.SOLVENT NAME= CDCl3
##.SHIFT REFERENCE= (INTERNAL, CDCl3, 0, 15.9533)
##AUDIT TRAIL= $$ (NUMBER, WHEN, WHO, WHERE, WHAT)
$$ ##TITLE= Audit trail, XWIN-NMR		Version 3.5
$$ ##JCAMPDX= 5.01
$$ ##ORIGIN= Bruker BioSpin GmbH
$$ ##OWNER= she
$$ F:/spectra/data/she/nmr/H-F/1/pdata/1/auditp.txt
$$ ##AUDIT TRAIL=  $$ (NUMBER, WHEN, WHO, WHERE, WHAT)
(   1,<2021-03-10 10:05:03.90 +0400>,<she>,<DPX200>,
      <created by zg, POWCHK disabled, PULCHK disabled
       configuration hash MD5:
       00 E9 B6 7A A2 85 ED C7 34 08 36 98 17 FE 4E 26
       data hash MD5: 16K
       48 A2 DE A0 44 C1 46 70 34 4B 60 3F 55 A7 0F EC>)
(   2,<2021-03-10 10:05:06.51 +0400>,<she>,<DPX200>,
      <Start of raw data processing
       efp BC_mod = 2 LB = 0.24 FT_mod = 6 PKNL = 1 PHC0 = -11124.23 PHC1 = 17.00094 SI = 16K 
       data hash MD5: 16K
       BD 8C E7 F6 B7 28 3C 0E 2F 3A 29 A2 3F 08 93 92>)
(   3,<2021-03-10 10:05:27.85 +0400>,<she>,<DPX200>,
      <pk PHC0 = 6.712844 PHC1 = -3.2 
       data hash MD5: 16K
       38 41 D5 7F 3E 3F 5B 50 6C 6B A3 34 3F 57 B9 16>)
(   4,<2021-03-10 10:05:33.04 +0400>,<she>,<DPX200>,
      <abs ABSG = 5 
       data hash MD5: 16K
       39 74 63 10 27 D8 9A 3C 07 6D DC 5C B3 4F D8 54>)
$$ ##END=
$$ 
$$ hash MD5
$$ E4 6A 40 F5 E5 D4 5C F8 11 7A AF 99 3C 03 39 E9
##$RELAX= 
##$RELAX= 
##$RELAX= 
##$RELAX= 
##$RELAX= 
##$RELAX= 
$$ Bruker specific parameters
$$ --------------------------
##$DU= <F:/spectra>
##$EXPNO= 1
##$NAME= <H-F>
##$PROCNO= 1
##$TYPE= <nmr>
##$USER= <she>
##$AMP= (0..31)
100 100 100 100 100 100 100 100 100 100 100 100 100 100 100 100 100 100 
100 100 100 100 100 100 100 100 100 100 100 100 100 100 
##$AQSEQ= 0
##$AQ_mod= 1
##$AUNM= <au_zg>
##$AUTOPOS= <>
##$BF1= 200.13
##$BF2= 200.13
##$BF3= 200.13
##$BF4= 200.13
##$BF5= 200.13
##$BF6= 200.13
##$BF7= 200.13
##$BF8= 200.13
##$BYTORDA= 1
##$CFDGTYP= 0
##$CFRGTYP= 5
##$CHEMSTR= <none>
##$CNST= (0..31)
1 1 145 1 1 1 1 1 1 1 1 1 1 1 1 1 1 1 1 1 1 1 1 1 1 1 1 1 1 1 1 1 
##$CPDPRG= <>
##$CPDPRG1= <>
##$CPDPRG2= <>
##$CPDPRG3= <>
##$CPDPRG4= <mlev>
##$CPDPRG5= <mlev>
##$CPDPRG6= <mlev>
##$CPDPRG7= <mlev>
##$CPDPRG8= <mlev>
##$CPDPRGB= <>
##$CPDPRGT= <>
##$D= (0..31)
0 1.2 0 0 0 0 0 0 0 0.06 0 0.03 0 0 0 0 0.0002 0 0 0 0 0 0 0 0 0 0 0 0 
0 0 0 
##$DATE= 1615356303
##$DBL= (0..7)
120 120 120 120 120 120 120 120 
##$DBP= (0..7)
150 150 150 150 150 150 150 150 
##$DBP07= 0
##$DBPNAM0= <>
##$DBPNAM1= <>
##$DBPNAM2= <>
##$DBPNAM3= <>
##$DBPNAM4= <>
$$ [...]
##$SUBNAM3= <"">
##$SUBNAM4= <"">
##$SUBNAM5= <"">
##$SUBNAM6= <"">
##$SUBNAM7= <"">
##$SUBNAM8= <"">
##$SUBNAM9= <"">
##$SW= 16.9725357007746
##$SWIBOX= (0..15)
0 0 2 0 0 0 0 0 0 0 0 0 0 0 0 0 
##$SW_h= 3396.73913043478
##$TD= 16384
##$TD0= 1
##$TE= 0
##$TE2= 300
##$TE3= 300
##$TEG= 300
##$TL= (0..7)
0 120 120 120 120 120 120 120 
##$TP= (0..7)
150 150 150 150 150 150 150 150 
##$TP07= 0
##$TPNAME0= <>
##$TPNAME1= <>
##$TPNAME2= <>
##$TPNAME3= <>
##$TPNAME4= <>
##$TPNAME5= <>
##$TPNAME6= <>
##$TPNAME7= <>
##$TPOAL= (0..7)
0.5 0.5 0.5 0.5 0.5 0.5 0.5 0.5 
##$TPOFFS= (0..7)
0 0 0 0 0 0 0 0 
##$TUNHIN= 0
##$TUNHOUT= 0
##$TUNXOUT= 0
##$USERA1= <user>
##$USERA2= <user>
##$USERA3= <user>
##$USERA4= <user>
##$USERA5= <user>
##$V9= 5
##$VALIST= <valist>
##$VCLIST= <CCCCCCCCCCCCCCC>
##$VD= 0
##$VDLIST= <DDDDDDDDDDDDDDD>
##$VPLIST= <PPPPPPPPPPPPPPP>
##$VTLIST= <TTTTTTTTTTTTTTT>
##$WBST= 1024
##$WBSW= 4
##$XGAIN= (0..3)
0 0 0 0 
##$XL= 0
##$YL= 0
##$YMAX_a= 188656
##$YMIN_a= -126053
##$ZGOPTNS= <>
##$ZL1= 120
##$ZL2= 120
##$ZL3= 120
##$ZL4= 120
##$ABSF1= 16.03307
##$ABSF2= -0.9395943
##$ABSG= 5
##$ABSL= 3
##$ALPHA= 0
##$AQORDER= 0
##$ASSFAC= 0
##$ASSFACI= 0
##$ASSFACX= 0
##$ASSWID= 0
##$AUNMP= <proc_1d>
##$AZFE= 0.1
##$AZFW= 0.1
##$BCFW= 0
##$BC_mod= 2
##$BYTORDP= 0
##$COROFFS= 0
##$CY= -3
##$DATMOD= 1
##$DC= 0
##$DFILT= <>
##$DTYPP= 0
##$F1P= 0
##$F2P= 0
##$FCOR= 1
##$FTSIZE= 16384
##$FT_mod= 6
##$GAMMA= 0
##$GB= 0
##$INTBC= 1
##$INTSCL= 2.992141e-10
##$ISEN= 128
##$LB= 0.24
##$LEV0= 0
##$LPBIN= 0
##$MAXI= 10000
##$MC2= 0
##$MEAN= 0
##$ME_mod= 0
##$MI= 1.114404
##$NCOEF= 0
##$NC_proc= -8
##$NLEV= 6
##$NOISF1= 3.799351
##$NOISF2= 2.8
##$NSP= 0
##$NTH_PI= 0
##$NZP= 0
##$OFFSET= 15.95331
##$PC= 1
##$PHC0= -11117.52
##$PHC1= 13.80094
##$PH_mod= 1
##$PKNL= yes
##$PPARMOD= 0
##$PSCAL= 0
##$PSIGN= 0
##$REVERSE= no
##$SF= 200.130011632966
##$SI= 16384
##$SIGF1= 3
##$SIGF2= 2
##$SINO= 5.538805
##$SIOLD= 16384
##$SREGLST= <1H.CDCl3>
##$SSB= 0
##$STSI= 16384
##$STSR= 0
##$SW_p= 3396.73913043479
##$SYMM= 0
##$S_DEV= 0
##$TDeff= 16384
##$TDoff= 0
##$TI= <>
##$TILT= no
##$TM1= 0
##$TM2= 0
##$TOPLEV= 0
##$USERP1= <user>
##$USERP2= <user>
##$USERP3= <user>
##$USERP4= <user>
##$USERP5= <user>
##$WDW= 1
##$XDIM= 16384
##$YMAX_p= 355370384
##$YMIN_p= -1200894
$$ End of Bruker specific parameters
$$ ---------------------------------
##NTUPLES= NMR SPECTRUM
##VAR_NAME=  FREQUENCY,     SPECTRUM/REAL,   SPECTRUM/IMAG
##SYMBOL=    X,             R,               I
##VAR_TYPE=  INDEPENDENT,   DEPENDENT,       DEPENDENT
##VAR_FORM=  AFFN,          ASDF,            ASDF
##VAR_DIM=   16384,         16384,           16384
##UNITS=     HZ,            ARBITRARY UNITS, ARBITRARY UNITS
##FACTOR=    0.207333158178282, 1,           1
##FIRST=     3192.73611844946, 0,            0
##LAST=      -204.003011985334, 0,           0
##MIN=       -204.003011985334, -1200894,    0
##MAX=       3192.73611844946, 355370384,    0
$$ Real data points
##PAGE= N=1
##DATA TABLE= (X++(R..R)), XYDATA
$$ [...]
7860 114094717 123412831 134402182 147592962 161915057 176014943 188217201 195775194
7853 195775194 193388049 185471997 172025368 154480934 139794280 129913173 124695086 122234370
7845 122234370 122562873 123608209 122841510 120938837 116970858 110387671 101713339 92849896
7837 92849896 84494456 76932612 71255353 66344432 62332147 59650449 57763429 55901909
7829 55901909 54637250 52870594 51855358 51756433 51375628 51318969 51683652 52173280 52915942
7820 52915942 53535884 54561047 56462410 58005678 60160119 63127062 67353456 72366361
7812 72366361 78089809 84248702 90342653 95152176 97346755 98259256 96476594 92601560
7804 92601560 88241720 84768883 82064090 81652131 83739905 86376124 89466784 92406070
7796 92406070 93717906 92424551 88132272 80970491 72927646 64911401 56641370 49828011
7788 49828011 45416506 41493443 38458240 34931891 32842266 31572097 30516925 29229096
7780 29229096 27808009 26967507 25591352 24741108 24098478 23387600 22610539 21658620 20956429
7771 20956429 20370151 20215213 19900082 19659146 19263846 18586289 18215078 17893563 17618819
7762 17618819 17204027 16633787 15998670 15265780 14491128 14587845 14045961 13462495 12939207 13214021
7752 13214021 12533472 12443482 12433170 11974357 11960065 12159329 11810495 11504185 11451186 10991755
7742 10991755 10503535 10158271 10359674 10061838 10260295 10341480 10503718 10436042 9952776 9449913
7732 9449913 9586533 9807323 9402574 9090693 8774948 9130597 9284096 9381595 9489986 9354423
7722 9354423 9350509 9465199 9547880 9259282 8935968 8487756 8528785 8964087 8420033 8755058
7712 8755058 8715421 8642589 8372036 8080213 8686051 8541745 8142093 7862660 8063986 7980871
7702 7980871 7842555 7651975 7768397 7951291 8212752 8622229 8202395 8204215 8550171 8314070
7692 8314070 7835093 7610991 8401722 8354848 8420204 8155047 8384012 8706151 9035641 9036673
7682 9036673 9113142 9442022 9449278 9680689 9508741 9785997 9696860 10151971 9863098 9679459
7672 9679459 10186553 10270312 10939772 10891393 11009105 11075499 11815081 12135509 12377726 12872282
7662 12872282 12770808 12768023 13058206 13639886 14253116 14537580 14354699 15145357 16159249 16152595
7652 16152595 16670187 17042866 17642293 18284342 18356451 19321637 20706503 21605346 22393667
7643 22393667 23494958 24629430 26199593 27544849 28825973 30177922 32099748 34663602
7635 34663602 38196861 42252883 46905816 52290801 58423161 63382445 66691679 66693568 62197008
7626 62197008 55971541 51145887 48626786 48259146 49046620 50616666 53556881 57364409
7618 57364409 61012526 63643071 62979454 58714968 52166198 46266114 42028718 38918698
7610 38918698 37153616 36082334 34943735 34310811 34214141 34265783 35106692 35929037 36438471
7601 36438471 36833841 37605217 38813024 40198405 42196791 44477297 47065064 50048706
7593 50048706 53906851 58383788 63367532 69839210 76513597 83887343 90448695 94889886
7585 94889886 97092543 96965550 94499235 89739227 83136031 78192492 75836009 75997160
7577 75997160 78299878 81776619 85216399 87196435 86876932 84886113 80787729 73873153
7569 73873153 65214375 56875775 50004370 44626811 41032774 37882099 35482894 33673298
7561 33673298 32881144 31817996 30547303 29276756 29388314 30098932 30566597 30012396 30014107
7552 30014107 30618635 30642650 31605400 32491637 33956319 36353913 39193882 41751387 44915663
7543 44915663 48695717 52059422 52966887 50332761 45772154 41088860 37655786 35878337
7535 35878337 35802933 36502096 37798346 39858843 42106621 43804054 43948093 41770426 37049808
7526 37049808 31640864 27437613 24159310 21632634 19778386 18193144 17096283 16012834
7518 16012834 15119152 14123854 13364524 12772564 12169995 11336557 10686323 10570269 10254740
7509 10254740 9830888 9773098 9390633 9151689 9029955 8608069 8047615 7967002 7863620 7664621
7499 7664621 7685645 7739927 6689576 6446133 5948331 5685290 5517352 5125333 4958086 5095375
7489 5095375 5108347 5344266 5541314 4829892 4509434 4662445 5098851 4587191 4540811 4542334
7479 4542334 4461358 4511126 4147312 3702719 3793376 3859301 4248270 4298354 4017781 3660559
7469 3660559 3655503 3640621 3557698 3674555 3803705 3877013 4145773 3890428 3249586 3404409
7459 3404409 3767928 3221030 3128289 3461797 3368797 2729485 2837215 2705545 2456764 2503569
7449 2503569 2550045 2696795 2698368 2316944 1934979 2134083 2209831 2387766 2379132 1858575 1796222
7438 1796222 2077680 2328278 2247310 1806404 1728873 1783473 2143371 1963915 1586666 1310588
7428 1310588 1199283 1499161 1254331 1588831 1292991 1672288 2150511 1546866 861323 714224
7418 714224 1363179 1762807 1819348 1409725 1682601 1623290 1436671 1716005 1324452 892006
7408 892006 876381 1116752 1531850 1074832 749293 1177502 1155306 1175874 848422 855911 919251
7397 919251 1014008 951616 1028844 957325 819258 1074932 779460 715062 817666 1061058 1234887
7386 1234887 711426 508721 1067852 1018405 593563 601013 1055408 984280 768546 868419
7376 868419 551288 805470 706095 191262 91171 35924 300188 512186 563830 359217
7366 359217 636798 224192 189387 178588 193185 329769 402694 701869 767816 647842 566200
7355 566200 1016054 1137619 548908 624151 681757 445028 222790 543625 579994 312560
7345 312560 423190 464950 665596 457642 420363 942767 702890 1085321 652748 211644
7335 211644 665295 387933 116432 450254 538855 533947 262837 258516 446511 729174 648226
7324 648226 468429 740634 841342 548054 417631 105138 86543 232878 71483 -206176
7314 -206176 -51353 400545 322954 444101 257637 276 373459 473537 486510 387521
7304 387521 -15120 -131536 -184772 598061 718728 460881 132176 -346329 -79683 148954
7294 148954 -165498 110759 -131996 119146 355804 524608 521947 277287 74032 176728
7284 176728 -285331 -230969 13654 -85929 433207 470373 432486 258041 -26460 92514
7274 92514 32611 -65522 128869 -103014 40725 116072 299412 418327 94984 75786 312157
7263 312157 570037 241976 -21234 -187886 133203 206642 175492 384787 159992 -112527
7253 -112527 -46548 -39783 65555 294286 663633 135638 -28588 -242827 -479244 -775202
7243 -775202 -298034 115538 289146 380608 89650 265790 406500 1164211 800502 416925
7233 416925 301780 260037 503034 300643 510887 661383 869205 587908 561636 685773
7223 685773 437647 37946 -14459 11705 -84728 184169 687844 279047 -165528 -66896
7213 -66896 8098 65207 -237345 -317952 -121097 379802 133275 697069 715356 98192 -256469
7202 -256469 -216318 -403063 -85517 653766 814635 1006076 939408 436165 548715 551431
7192 551431 581340 172720 280810 475044 994601 1009551 757802 433013 578187 183260
7182 183260 382865 510336 103879 409590 407527 218602 104932 274544 452654 267329
7172 267329 230095 371742 546114 596099 476016 58733 -25043 -111269 -253640 119619
7162 119619 -26214 255430 -21733 -333594 -77981 -18443 -126269 -334715 -374361 -157956
7152 -157956 -166729 235623 312722 486747 348988 296850 208609 30232 -316201 -212676 -251544
7141 -251544 -233859 -306562 -83001 262906 278688 -183403 -264426 -346320 -754966 -172695 -360012
7130 -360012 -411828 108465 -213245 14619 124672 -5676 -145778 -282099 -401688 -88492
7120 -88492 -113045 -245612 -337332 -370770 -564665 -634758 -56084 -137029 -588999 -53603 20541
7109 20541 -589187 -352660 -265867 -299054 160939 498757 141508 -23441 174540 -42337
7099 -42337 -185541 -139672 -348499 -354501 -633667 -798263 -554656 -683949 -749535 -48571 22403
7088 22403 -142138 -280916 -56324 -97283 -71854 -99610 99624 10781 316734 -52385 -317926
7077 -317926 -343497 -236695 -49198 -441996 -232292 -513461 -523356 -479055 -132558 -29850
7067 -29850 -91668 769 105970 -266863 -300485 -209189 -29448 -26186 -403845 -685361 -490496
7056 -490496 194764 430 -418518 -123719 196669 89639 53445 -21111 72976 -240017
7046 -240017 -128838 -162481 -60087 -55432 179275 111576 33380 205465 108382 -118213 -77490
7035 -77490 -187090 -80089 -355844 -97621 -157658 -677326 -387884 -203547 8585 86393
7025 86393 -10191 -61149 256643 -4150 -293931 -917284 -1005167 -714116 -502379 -372853
7015 -372853 -327769 -365808 -122333 -270676 -464929 -564096 -224713 -183287 -149823 -221565 45593
7004 45593 -32302 -632859 -620809 -445911 -135806 -376341 -588987 -554775 -391801 -9819
6994 -9819 -183397 -336185 -276349 -102950 23120 -429107 -491367 -367796 -355237 47052 -265385
6983 -265385 -75951 318719 82038 -241727 -324936 -322550 36599 297060 82810 85562 -303828
6972 -303828 -282354 -375080 -143738 172146 1305 -210942 -404598 -385542 -449820 -682463
6962 -682463 -717404 -487391 167524 359059 234108 -146796 -468751 -241468 -75279 -43608
6952 -43608 4320 56728 -59151 29649 95292 -88040 -892956 -656334 -754195 -666272 -392553
6941 -392553 -447628 -660997 -738063 -77200 41159 -252275 -649305 -526637 -264505 193410
6931 193410 -18673 -21620 -72918 23912 288069 126284 219438 10193 79036 -59380 -80404
6920 -80404 -294937 -285362 -164289 -439044 -67039 -97249 -185095 156413 167056 -76685 -197239
6909 -197239 -263724 -119262 35335 -61629 18479 -98445 264086 126775 -13868 -68979
6899 -68979 -375654 -797728 -795764 -426821 -290980 -258734 -258029 -204412 -285715 -75324 -365081
6888 -365081 -262044 -84733 -284022 -58979 -242481 -111907 127048 -365356 -526976 -740204
6878 -740204 6834 97139 -93539 -12863 94914 155784 -202711 -498062 -105761 167767
6868 167767 54664 -99414 -158159 -422846 -303573 -424511 -440603 -158016 -2733 -289355
6858 -289355 -66129 -229196 -219253 -458377 -231801 -413774 -25297 336954 -97515 -75769
6848 -75769 -196810 -62537 -144176 -247190 37963 -174193 -240161 76061 -480189 -135433
6838 -135433 44751 -114504 -112185 -392765 -375538 -134889 -588994 -592373 -800449 -355656 -154701
6827 -154701 23785 112644 218764 -68259 -310309 -256325 -29015 -169745 -107107 543603
6817 543603 566473 424385 17665 -220339 -474562 -638927 -551279 -715367 -604687 -429552
6807 -429552 -221342 -68239 -47405 -268784 -418122 -420079 317369 -152241 -223000 77600
6797 77600 -194018 -400924 -391197 -233037 -86405 351819 -23523 158532 -202596 -503510
6787 -503510 -517034 -56652 -410846 -411395 -283133 -464431 117618 -270011 -29000 -293828
6777 -293828 -438130 -119870 -258463 -293898 -243828 -439178 -453812 -552066 -331799 -374167 -538587
6766 -538587 -154727 152854 -185227 -543264 -326742 -323319 -249677 102523 107802 226223 308995
6755 308995 181414 81529 91114 175836 158715 319102 334591 238886 259013 -205121 -158721
6744 -158721 22180 -39462 148755 418710 385086 155415 142513 -91219 130517 213713
6734 213713 -200706 -261910 52226 -7132 -620902 -1084585 -722944 -180052 -62125 93752
6724 93752 482688 -83931 -214321 236958 81978 -140426 -261096 -55344 474473 226944
6714 226944 35197 -304236 -259606 -473340 -203661 -27609 302152 730142 418952 277612
6704 277612 474786 398898 -47073 -365527 -419025 -174013 136133 443236 -176089 -269375
6694 -269375 128974 69245 -52077 -133268 -197048 24816 -76929 -303741 -147956 -229070
6684 -229070 -172174 -163597 -462496 -335420 -528403 -419968 -91285 130457 285371 24380
6674 24380 -104500 58716 284381 394593 151190 114444 -339928 -467292 -522032 -451897
6664 -451897 -112042 -444972 -315375 -234545 -560016 -559974 -212692 -149586 580437 106320 -471392
6653 -471392 -419050 -65494 -126243 -13855 -184590 -157822 40798 -49055 11855 13809 182024
6642 182024 -136948 -336460 -355156 -303498 -287962 -329383 -531063 -558319 -237145 -169387 -408898
6631 -408898 -37587 -48932 -80300 -97529 -164447 83335 -283525 -29733 523430 -156686
6621 -156686 -579553 -184921 -182927 -177421 -173836 -465247 -538317 -405363 -227091 36173 255008
6610 255008 -199119 -128323 -54728 18469 138394 241867 22850 -86194 91755 -106726
6600 -106726 -113340 187534 5585 -195780 -398021 -626712 -639469 -473659 -607401 -479897
6590 -479897 -82529 -69483 -418270 -410289 -303815 -305774 -31016 -116646 -200744 -150106 -49721
6579 -49721 60023 -336777 52061 20694 -288212 105818 76662 66809 -285992 -118923 -431035
6568 -431035 -558132 -501740 -594307 -287794 8221 -442209 -352929 -12934 -303898 -296992 -91753
6557 -91753 10407 -2369 -509981 -476641 -129442 530 368977 14245 59214 291653
6547 291653 143220 -162223 -22832 -302962 -483676 -121510 -212237 -584136 -341050 -30887
6537 -30887 52360 -297693 -500211 -438900 -194455 50130 -387962 -337047 -273286 -421299 -421812
6526 -421812 -65133 37733 -248763 -271662 -1025903 -702380 3116 -135127 9746 61451
6516 61451 -455074 -578461 -337791 -46364 -141431 -111135 55570 69847 -395196 -118328
6506 -118328 417674 360512 157429 -258753 -679233 -483952 -9550 300920 82206 -319276
6496 -319276 -245574 -96771 48525 92738 12884 -52529 208609 249477 -100558 111727 -104366
6485 -104366 -278882 383277 -69792 -66146 -276457 -303877 -168925 -205113 -372863 -597521
6475 -597521 -801259 -384901 -434853 -452657 -693222 -799077 -670582 -392937 -191710 125500
6465 125500 149034 152306 30195 209126 -184934 -85154 132021 -109822 -398669 -90897
6455 -90897 -24907 133452 193032 -37431 457538 34757 -232531 -245775 -51371 448399
6445 448399 460367 2901 8549 103754 32797 -263541 119802 48905 -241849 -105682 55035
6434 55035 -548606 -808414 -592184 -322364 -356352 -408584 -438240 -389287 -426105 -507383 -328034
6423 -328034 -432587 -369960 16524 -95185 -659742 -676695 -50460 171061 85514 -279559
6413 -279559 -316888 -247959 160711 -122664 -86119 252572 -44277 -73222 -199253 -443987
6403 -443987 -398505 -257094 412502 220385 320759 302507 -99784 393161 222124 -22731
6393 -22731 -252658 -395130 -363459 -178607 234252 25443 -998695 -1046805 -478757 -30323
6383 -30323 28752 -28433 -757494 -511895 -272551 -24725 -230948 169785 466139 136033
6373 136033 66445 -335607 -14833 -65258 983 78152 -105605 -166106 -75667 -120807 -270745
6362 -270745 -125528 -216706 -191815 150783 -74510 -78511 85975 33605 118243 204311 275095
6351 275095 -85356 -493405 -92675 -139844 -334577 294643 410170 -58765 82090 186493
6341 186493 -28199 -362661 -324859 -337214 -290107 30915 -527702 -711854 -428698 -110713
6331 -110713 -6979 -176313 146963 280339 111626 -702861 -554481 -155434 -266349 -596465
6321 -596465 -409980 -153233 -233217 -450397 -480779 -305037 -147150 -5457 -207539 -378826
6311 -378826 -149931 -56809 -3892 100979 312510 341683 62303 -198809 -200609 224442 47346
6300 47346 -429281 -56551 199602 -206045 -251369 49172 197008 243817 98067 41281
6290 41281 -46363 -41059 47471 48170 -375790 -473617 169098 -188131 -210887 -48525 -239544
6279 -239544 -597285 -521029 -430703 -428526 -442171 -144913 13031 40199 -76523 -258822 -200206
6268 -200206 6177 -63741 -538471 -443460 -601889 -414516 -325617 -59840 -331290 -371712
6258 -371712 -53931 -272941 -165483 -438238 -483795 -283008 -117249 -259245 -530621 -389096
6248 -389096 -225869 -239541 -92664 -245346 82838 -216268 -428024 -549905 -632705 -104381
6238 -104381 -348380 -536847 -411679 -68195 -227632 -409534 -527408 -682912 -404546 -84160
6228 -84160 -177689 -513722 -494876 -423146 -392623 -463616 -8487 317075 406225 61665 -224352
6217 -224352 -169968 168237 88410 63505 92012 245221 421434 -101306 -246255 -167072 -708124
6206 -708124 -543397 -727891 -510304 -60568 -28702 -90993 -141028 19148 -63535 -386835
6196 -386835 -248901 249103 281823 -87649 -175394 -137265 -564233 -410140 -86547 -498451
6186 -498451 -467909 -140439 -186553 -161678 -317255 54655 27797 -140182 197389 944876
6176 944876 344322 368703 54097 -42098 230028 50666 -270164 -1436 -233049 -153409
6166 -153409 119713 234967 -221407 -254062 194163 199458 -105798 -429658 -162402 -158799 -67980
6155 -67980 -83656 303631 -61184 -178578 106544 425787 -323656 -202732 43042 -69410
6145 -69410 -194474 -24948 198193 275222 345405 90001 -187352 -505519 -211783 347177
6135 347177 -95729 149164 149681 18314 231944 -346757 -95796 -44508 157767 186881 -226018
6124 -226018 -474795 -623396 -640235 -478065 -277179 -160681 222845 226318 -357428 -8032
6114 -8032 467816 566224 520704 338031 128418 223038 78258 145897 145588 68656 205128
6103 205128 -34131 -566519 -435169 -44233 216989 585915 699434 283149 -274776 16252
6093 16252 459152 -128693 97274 256062 -35611 -38770 190334 75232 -148448 -258007
6083 -258007 -191978 -375812 -180660 60972 254715 164351 191197 491610 117091 3950
6073 3950 -62541 12785 -887172 -725559 -465938 -279531 -142343 -10763 38577 -318847 -148748
6062 -148748 -41548 -273211 -100536 -464026 -739653 -199324 -125756 -227211 18357 43391
6052 43391 99605 514787 48600 15362 299370 144615 161582 -202409 -397541 -251507
6042 -251507 151462 139881 295982 190004 92529 -327742 -37428 78312 -225201 -276384
6032 -276384 -238873 51482 -186140 -106285 68309 78032 -48565 409575 125673 -90793
6022 -90793 -175089 -203800 325187 483404 -100453 -26628 96686 -209613 -357624 146978
6012 146978 469301 157264 231923 29268 324927 401417 278070 357349 350111 238474 82007
6001 82007 173896 59919 131527 14814 214621 -21791 -89716 490569 320252 279068 384013
5990 384013 479631 256823 382761 741695 684406 138853 -194411 -151599 -51192 -276601
5980 -276601 336541 384677 327010 432951 436634 403409 480631 570444 409003 536800 594732
5969 594732 500011 402238 493340 122137 111389 451589 864526 613406 466723 304975
5959 304975 511082 784418 775158 582917 506348 562073 441740 34101 -176395 150538
5949 150538 353034 462828 365054 590459 860695 629230 456240 436543 661255 877929
5939 877929 508559 449644 534529 843949 815568 536756 282625 302823 309997 507288 694835
5928 694835 433149 635876 325187 225680 733370 877248 685233 604633 472427 162714
5918 162714 499882 369539 203063 199991 278015 553519 579499 660292 574620 409126 493833
5907 493833 275681 299777 328172 534785 759918 180334 281241 427235 226085 -60894
5897 -60894 155033 -189224 -453737 -331293 105244 315272 781542 669700 204032 208760
5887 208760 482647 281895 474271 540235 285042 287085 632615 710987 97664 -289571
5877 -289571 -131930 358925 364456 441424 37387 -121297 94213 506451 492388 436142 397553
5866 397553 216751 381190 542637 341839 -218797 -66988 -296128 114811 616888 220662
5856 220662 -118361 -71672 134949 -61670 236122 66765 -110118 -365267 -349602 -53245
5846 -53245 189847 -65843 -125493 -44178 291878 681291 123739 -234950 25207 180633
5836 180633 -223950 -22874 419331 -114861 -415112 -166475 -121916 123666 254685 110751
5826 110751 -8578 573996 729780 608000 689055 470087 340303 413273 459992 -75959
5816 -75959 69542 480249 57134 -68713 -147886 -195057 48584 -210927 -63220 22235
5806 22235 101601 160017 273309 523549 -54574 58715 -132226 -359486 -102805 -11682
5796 -11682 -258848 -528619 -482341 -701202 -324812 -758915 -936760 -558483 -76022 227905
5786 227905 521902 447533 583531 504100 289825 246232 534721 663295 394059 148308
5776 148308 145771 251120 11083 557909 56801 47219 -348118 -534596 -243689 -6254
5766 -6254 622196 254945 101604 193747 -59073 143482 227015 -68320 180094 50975
5756 50975 313115 454957 -460 196362 287328 -221938 342739 244161 -253245 5781
5746 5781 7826 -184274 -189383 36697 -292882 94796 160879 -409848 -391896 -18073 -73232
5735 -73232 -160879 -246063 123941 291278 -56267 -171714 -322237 152814 78306 221305
5725 221305 169839 -39215 30649 5550 -120945 337595 97773 -416692 -461866 -431287 -19846
5714 -19846 -217184 -11341 -142391 -1406 -60110 168945 496583 311899 -356406 -367980
5704 -367980 39091 120546 249259 168358 590202 241159 -127137 232742 450236 422797
5694 422797 218886 234904 394596 354048 226766 -49136 40893 246641 218792 345261
5684 345261 780283 750068 294811 75120 148607 229654 -128791 -265256 -114862 94863
5674 94863 157368 248511 222512 49775 70164 -45623 -106368 -145837 35714 -264717 -209522
5663 -209522 145967 397024 142696 294931 236620 -276739 -595691 -194224 511333 672451
5653 672451 595160 6896 243998 102285 168644 52120 -52101 44766 272226 -226925
5643 -226925 -231461 189139 670292 553449 139874 216448 -6860 425476 577496 796111
5633 796111 653893 529257 548401 -24532 560833 975845 595533 305354 346628 166393
5623 166393 378303 174826 136159 689964 122523 235874 812382 342207 627741 615486
5613 615486 725659 647151 513627 307869 206179 178739 189236 269652 18587 229191
5603 229191 57685 230375 -62625 -38391 53093 361511 176704 499589 482847 -184608
5593 -184608 -127476 -313747 -157006 107628 328075 129282 209950 223624 218032 283196 791981
5582 791981 365423 -44037 31743 192470 88914 180077 460406 491885 1036915 760393
5572 760393 860742 788740 598913 639518 417426 93808 291669 -11636 296510 -21804
5562 -21804 -142320 345319 618264 585685 154505 344859 847235 588223 552744 795321
5552 795321 532354 299132 398788 317793 558546 464663 381375 361814 315046 145990 278007
5541 278007 -71537 157117 491844 415988 464969 237275 168691 697717 658934 645636 483300
5530 483300 728066 980476 883791 993717 750906 564900 633982 742520 665744 861558
5520 861558 988026 1015926 355345 455374 489467 371068 436747 6479 284429 658863
5510 658863 587450 1007205 1110507 1040842 740822 511802 243098 624380 869201 801188
5500 801188 477064 296866 278544 212140 660062 653467 825672 1410803 825785 466063
5490 466063 570617 483334 402593 256376 512867 793347 620515 640723 589467 609104 867208
5479 867208 719782 688083 780145 790623 751365 578929 816621 983229 713655 786764 813400
5468 813400 1373961 1143762 687653 825787 826007 969724 1050963 1602479 963988 1300497
5458 1300497 1321599 982075 1067718 1209970 1046134 970724 900454 906932 1221761 1133850 913882
5447 913882 1444471 1419791 1185305 1106215 1079201 1397278 1680690 1294155 1304599 1397995 1005987
5436 1005987 1109117 1418720 1549510 1787390 1825441 1759208 1776289 1555704 1469619 1558041
5426 1558041 1448624 906649 1258557 1218103 1102741 1211477 1427028 1211270 1030959 1103757
5416 1103757 1071208 960678 974689 1129150 861412 1177585 1494461 1348451 1240225 1595549
5406 1595549 2004896 1737683 1570660 1415675 1501547 1497146 1348342 1177302 1511416 1422068
5396 1422068 1425194 1489497 1205752 1430783 1318911 1094045 1301622 1364489 993440 705665
5386 705665 1051466 1318766 1517770 1657453 1723495 1945588 1819380 1745437 1716317 2137306
5376 2137306 2031637 1950214 1596218 1735792 2003890 2257505 1883449 1556885 1827915 1516705
5366 1516705 1475263 1417082 1744718 1727119 1952319 1761296 1607521 1772551 1789760 1768595
5356 1768595 1612309 1550746 1730683 1657889 1426799 1525937 2018400 1760547 1608351 1999910
5346 1999910 2008282 1677464 1775669 1667911 2072574 2194038 2411716 2295052 2283075 2238904
5336 2238904 2510635 2331254 2604026 2626762 3013909 3062302 2948939 3087026 3078904 3494781
5326 3494781 3495206 3419091 3202297 3539963 3757559 3279863 3189867 3875234 3285687 3162383
5316 3162383 3790242 3663936 4056493 4419673 4668261 5011414 5099019 5658204 6339800 6709428
5306 6709428 7191981 7649890 7456381 7520485 8062874 8124339 7944449 7391342 7414310 7304266
5296 7304266 6542592 6483070 6169945 5692324 5764378 6217453 6569822 6054774 5934164 6384281
5286 6384281 6561589 6833049 7005117 7550389 7832577 8179776 8572849 9414407 9568359 10486763
5276 10486763 10975409 11307416 11197703 11153006 10892721 10255927 9308131 8563569 7972971 7964513
5266 7964513 7495554 6855087 6554816 6695567 6570391 6369783 6179577 6167453 6308847 5835120
5256 5835120 5921870 6744380 6680663 6352753 6613995 7247616 8226213 8485790 8654711 8749181
5246 8749181 8646466 8687906 8296886 7650792 7466554 7219490 7018339 6066754 5128858 4712079
5236 4712079 4763706 4743020 4210750 3813989 3757175 3912126 4051566 3745928 3530104 3626904
5226 3626904 3577358 3324501 3160234 3508127 3300393 2852690 3247024 3857240 3893116 3559973
5216 3559973 3167135 2802188 3048074 2622853 2161820 1946524 2150351 2274119 2144324 2264743
5206 2264743 1837785 1723288 1681901 1857608 1896611 1514916 1443797 1348080 1220938 1195424
5196 1195424 1237066 1707663 1571801 1421658 1537204 1150522 1074005 1227104 767205 1329274
5186 1329274 1338720 1328524 1182693 1112977 1218764 1028748 592499 324203 825437 1103762
5176 1103762 1343582 1232479 955393 1162415 1171312 989820 1269718 1186084 1115784 734100
5166 734100 1064900 1389648 1826981 1054429 587389 471746 970020 909790 926412 839930
5156 839930 200930 273067 830157 528589 288867 657982 919385 606773 680628 719436
5146 719436 782102 570391 388544 409819 716853 865295 1244239 1133140 950458 773921
5136 773921 844021 841371 730301 745655 863951 790330 1206224 1691252 1365542 971456 936070
5125 936070 616936 728824 752966 1066346 922157 768365 1285525 905506 895166 750264
5115 750264 593260 588154 871301 881775 764125 691234 889189 374628 709139 1140079
5105 1140079 978196 833905 821658 941922 1186557 648320 817150 669880 1039390 737022
5095 737022 772054 1386096 1007269 872418 875965 458729 414358 876285 928075 515747 647739
5084 647739 1146047 1640095 1349990 1502825 1589634 1466921 1022786 1648752 1203735 1236453
5074 1236453 1179955 948188 1362845 900073 648427 832282 521131 641852 900654 1128986
5064 1128986 1134579 1274966 1757383 1082695 1044659 849802 952193 1190395 1280923 1153869
5054 1153869 1359421 1206190 1236821 972577 920316 1040112 1269654 1305959 1149395 1270144
5044 1270144 1309770 1577739 1739739 1457012 1346934 1537742 1529071 1346187 1269706 1533300
5034 1533300 1312363 1219923 1393670 1386553 1642968 1767141 1976371 2035618 1918708 1812891
5024 1812891 1849222 2000605 1521532 1566103 2610588 2851833 2541418 2146421 2046224 2571032
5014 2571032 2479676 1729867 1492280 1598787 1957373 1891017 1446202 1406756 1736661 1585019
5004 1585019 1363870 1615003 1920397 1703675 1230872 1477448 2214898 2389052 1847027 1675646
4994 1675646 1320323 1169523 1546847 1449340 1490241 1943875 2241786 2231120 2435680 2292373
4984 2292373 2346601 2586202 2680296 2572490 2346093 2384940 1903896 2070935 2452677 2691519
4974 2691519 2641640 2326831 2057327 1804214 2335392 2365941 2058450 1874397 2310778 2155258
4964 2155258 1789663 2175208 2320707 2213323 1957931 1869039 2165890 2316245 2272142 2081846
4954 2081846 2045335 1759705 1922820 1986875 1627569 1484276 1703662 1391402 1409414 1631113
4944 1631113 1982509 2703658 2401919 2034180 1604062 1689706 940308 1256486 1992433 2043834
4934 2043834 2845197 2400333 1931092 1683483 1765341 1938404 1895766 1909073 1407980 1166050
4924 1166050 1265207 1110401 1384382 1427644 1563212 1985403 1723011 1594828 1384608 1635244
4914 1635244 1515244 1066268 993451 670124 794978 1168602 1284646 821502 1109613 905851
4904 905851 941585 1243625 820857 1039364 1193427 1248085 1549260 1418096 1224327 1147081
4894 1147081 1201371 1113174 1424194 1921923 1524048 1287531 1166138 1121280 1194290 1238729
4884 1238729 1179052 1156343 1432541 1654148 1447033 1555935 1194488 782823 832979 1023019
4874 1023019 1209030 879059 937873 1370768 1320293 1672334 1279947 1102427 885701 425118
4864 425118 448778 832504 1101988 1159033 1167084 1796470 1801110 1494402 1529471 1389325 1177424
4853 1177424 1451582 1405186 1419915 1496903 1456044 1507014 921275 627630 934831 804980
4843 804980 728729 931545 794691 1062206 1411546 1226899 1242110 1329712 1467098 1016893
4833 1016893 957630 864272 1024181 764611 657617 1313075 1336565 1590560 1429965 1149306
4823 1149306 1275765 1085327 948202 1008027 1091919 1694082 1686220 1524315 1580257 1330832
4813 1330832 1173620 1303864 744959 524094 710923 1053183 852930 1151755 1232738 703493
4803 703493 769278 504674 219428 846252 1026964 1057040 1020635 1235469 1253374 1221103 1218543
4792 1218543 953313 1119463 1438012 1227643 1082926 846066 708674 1086839 1165548 1265511
4782 1265511 1352501 993970 1250844 986803 1024693 1114917 1450038 1298721 1298079 1603639 1689860
4771 1689860 1594556 1320765 1388783 1304066 1115229 1530024 1392858 1292360 1414099 1094488
4761 1094488 1186165 1341229 1547959 1702682 1940588 1919300 1765097 1554439 1629101 1645801
4751 1645801 1644432 1372867 1671855 1559353 1504761 1676906 1919822 2150557 1742810 1318816
4741 1318816 1668055 1739053 1485792 1350480 1509652 1674827 1832949 1273503 1154180 1389385
4731 1389385 1867969 2144134 2035710 1847504 1595185 1528054 1335085 1543981 2028596 2271149
4721 2271149 2122298 1793739 1754596 1482458 1584629 1193685 1299638 1003892 1006803 1408681
4711 1408681 1198161 875317 866898 1099221 939393 1494615 1635121 1779387 1666592 1262521
4701 1262521 1301932 1285360 1069028 1401384 1313410 1305794 1521026 1436617 1057200 1263058 1577438
4690 1577438 1581868 1425456 1645431 1818883 1490881 1626381 1561954 1549590 1679440 1393880
4680 1393880 1101396 1354332 1392736 1962894 2234835 1540449 1359542 1461297 1933345 1892614
4670 1892614 1898808 1927458 1908599 1756675 1889441 1734517 2162371 2123183 2164580 2091764 1952973
4659 1952973 2110379 1844467 1778050 2129916 1939334 1653334 1905489 1870278 1834843 2163101
4649 2163101 2302920 1911242 2297404 2723669 3114682 2949847 2611295 2540866 2561827 2885574
4639 2885574 2778784 3019382 3107421 2662725 2930338 2868885 2732937 3400331 3911924 3105999
4629 3105999 3000105 3651263 3516135 3256933 3668648 3660817 3889958 4191424 4385570 4745933
4619 4745933 4678319 4060628 3782501 3897315 4525060 4430331 4033136 4567067 4496580 3937470
4609 3937470 3851289 3942489 3744881 4133443 4869734 4610148 4500152 4226653 4151382 4207090
4599 4207090 4197190 4704096 4364785 4003738 4139652 4205326 4138672 4183361 4300771 4468471
4589 4468471 4336646 4404550 4294015 4352869 3998392 4273283 4142811 3706927 3857486 3638952
4579 3638952 3647452 3829911 3808007 3914582 3908423 3722962 3729791 4174476 4395411 3890809 3938734
4568 3938734 4121152 4178109 4196613 3796110 3605056 3788330 3759260 4234755 4076750 3700290
4558 3700290 4149034 4507242 4198899 3803905 3817915 3386683 3565135 3823224 3586257 3418953
4548 3418953 3542323 3255482 3192685 3506442 3381968 3485938 3716669 3789950 3824437 3677442
4538 3677442 3324397 3200166 3149097 2902061 2892844 3337681 3069772 3287012 3395336 3307542
4528 3307542 3211085 2988188 3064005 2941260 2938340 3207522 2686781 2422371 2361871 2465960
4518 2465960 2549236 2693962 2880000 2881132 3119182 3516685 3183393 3028225 3105166 2902507
4508 2902507 3188402 3596230 3316819 3581384 3900820 3497243 3519998 3896664 3777313 3259495
4498 3259495 3674659 3745570 3219661 3458049 3609104 3749188 3939535 4023450 4107617 4260352
4488 4260352 4434240 4365348 4316643 4056740 4403630 4285250 4229749 4186279 4181854 4244640 4193970
4477 4193970 4573104 4917084 4871783 4736068 4259306 4432335 4338118 4708332 4731673 5070137
4467 5070137 5433092 5494876 5946289 5563069 5565658 5965725 5734211 5795647 5943296 5935452 6274372
4456 6274372 6721357 6806044 6950329 7657090 7736720 7701578 8309567 8531011 8454538 8847870
4446 8847870 9873724 10252858 10987512 11631282 12274276 13214113 14095942 15273421 15731853
4437 15731853 15983451 16150589 16468984 16701853 16512427 16052761 15720676 15936490 15509929
4428 15509929 15548208 15745364 15713845 15405513 15559457 15698276 15897457 16525038 16769897 17003921
4418 17003921 17719372 18675942 18526009 18534710 18535523 18529428 19353954 19773668 20514463 21935716
4408 21935716 22864689 23609634 24129206 24394673 24894721 25073632 24534921 24710421 24930467
4399 24930467 26203634 26311874 27295887 27435164 26846873 26169515 25220889 24284677 22579732
4390 22579732 21215104 20448661 19433958 18241564 17208808 16444865 16080357 16180686 15729913
4381 15729913 15173045 15261606 14607071 14808351 15639367 16153246 16131707 16117498 16583632 16553290
4371 16553290 16569245 16241361 16787043 17424389 17716986 17864258 17932336 17630263 16661457 15758802
4361 15758802 14608381 13799395 12778535 11751369 10987400 10412595 9625794 9158974 8607991
4352 8607991 8367929 7875469 7573829 7361283 7060993 7134535 6736055 6421245 6545678 6176848
4342 6176848 5855190 5576413 5628925 5866720 5746440 5633392 5524554 5370990 5080191 4635124
4332 4635124 4622416 4715286 4426846 4226174 4346005 4320092 4462027 4333972 4403475 4320908
4322 4320908 4273568 3862040 3663774 4222556 4003041 4046032 3677111 3422319 3654092 3535358
4312 3535358 3235738 3473496 3445119 3191052 3456324 3803656 3563962 3283669 3665598 3525689
4302 3525689 2714119 3176105 3935307 3688173 3671097 3266133 2918643 3159991 3279464 3336555
4292 3336555 3450293 3311553 3492349 3571937 3618810 3575986 3786578 3807096 3778630 3225122
4282 3225122 3166143 2848124 2695807 3169496 3102028 3181549 3603780 3862882 2854798 2893418
4272 2893418 3028718 3184940 3425903 3687936 3732320 3368693 3027689 2919119 2916221 2880492
4262 2880492 3127242 3111676 3028777 2935723 2716004 3099204 2799654 3063785 2971856 2817728
4252 2817728 2817984 3033800 3083986 2679831 3047909 3033203 2867212 2748048 2950220 2927216 3380928
4241 3380928 3111052 3318077 3245718 3517020 3385059 3477430 3364772 3378140 3163073 2875242
4231 2875242 3163594 3362528 3324568 3574361 3149628 3333950 3315469 3148215 3360971 3814086
4221 3814086 3557050 3209233 3448951 3637112 3764257 3196009 3249635 3465853 2959536 3005510
4211 3005510 3680551 3941197 3893715 3775832 4000065 3496793 3331988 3223331 3215648 3379760
4201 3379760 4072382 3648956 3559500 3594524 3888708 4458729 4600647 4160226 3997496 4107097
4191 4107097 3653330 3482654 3865058 3751605 3914232 3868750 4105333 4150661 4434675 4143205
4181 4143205 4123600 4392179 4620060 4790281 4859563 5175000 4894267 4713463 4706351 4340957
4171 4340957 4422525 4496094 4848529 4320567 4711982 4935589 4628910 4967888 5322127 5384805
4161 5384805 5368765 5759385 5608465 5832495 5539361 5416395 5668187 5563127 6049139 5990190
4151 5990190 6000444 6343650 6752911 6891962 6637108 6788932 7086498 7285087 7771293 8108541
4141 8108541 8004058 8205699 8863621 9451243 9513172 9928334 10396854 11249045 11733522 12293712
4131 12293712 12997298 13821525 14570035 15841917 16647147 17706376 18690765 19109021 19174675
4122 19174675 18719820 18538803 18000483 17511640 17216207 17276500 17495975 17206704 16975639 16466764
4112 16466764 16501679 16339355 16428567 16034341 16425046 16514161 16408029 16690281 17326595 18177176
4102 18177176 18705826 19859096 20921438 21957370 22844461 22893284 22736472 22687462 22814622
4093 22814622 22783716 22887923 22921323 22555050 22392534 22330469 22281329 21639459 21111100 21337236
4083 21337236 21270607 21124029 20284273 19359194 18372159 17840099 16552990 15756721 15046578
4074 15046578 14491233 14336134 13899259 13810011 14049361 14055287 13737943 13862220 14281351 14510646
4064 14510646 14593461 14861315 14999768 14850780 15296674 15956057 15840300 15824949 15562476 15318236
4054 15318236 14232350 13838816 13026235 12288056 11036626 10615479 10160040 9742684 9243561
4045 9243561 8096924 7589405 7571843 7493930 7535989 7483769 7476251 7058069 6487493 6565891 6745686
4034 6745686 6638491 6086597 5563773 5737605 5825742 5671412 5410945 5245558 5025998 4682957
4024 4682957 4604399 4602511 4295701 4051999 4347257 4897834 4944868 5173140 5352879 4637067
4014 4637067 4199286 4195779 4387628 4460587 4551854 4271837 4271383 4247394 4363860 4818026 4640010
4003 4640010 4144944 4119086 4296960 4078840 3919349 3931026 3698018 3925765 4011259 4260627
3993 4260627 4003348 4117815 4098900 3700054 3482299 3469496 3893714 3892358 3614941 3683068
3983 3683068 3550855 3200429 3317561 3200333 3336136 3553599 3642022 3669628 3845389 3952558
3973 3952558 4403164 4206271 3722047 3802114 3772955 3727515 3381856 3423330 3771786 3658354
3963 3658354 3481182 3390212 3157446 3206343 3691924 3853793 4047474 3852784 3955840 3618944
3953 3618944 3470136 3472202 3390800 3656198 3381273 3421080 3118931 3293210 3681976 3867627
3943 3867627 4339099 4004085 3572091 3696372 3694679 3922552 4094004 4139428 3979255 3990155
3933 3990155 4410835 4109526 3991867 3961466 3852056 3786896 3746788 3782153 4042971 4596939
3923 4596939 4726384 4566534 4591147 4499216 4285161 4139095 4126507 4452112 4607701 4586848
3913 4586848 4686961 4739441 4464114 4344451 4608000 4622767 4646977 4868947 5080803 5355314
3903 5355314 5415538 5413703 5137472 5363522 5750736 5442172 5570748 5566198 5780700 5691109 5168530
3892 5168530 5182902 4814432 4572231 4563204 5648810 5617929 5247710 5369063 5005416 4916110
3882 4916110 5444877 5280414 5242820 5257022 5523614 5716955 5546074 5370175 5789810 6156790
3872 6156790 6115820 5970714 5788512 5716864 5759836 6143794 5629905 5387893 4986120 5335672
3862 5335672 5571126 5897262 5967095 5467719 5648110 5647180 5753778 5754939 5550907 6004281 6282561
3851 6282561 6253187 6326795 6877109 6789082 6643759 6805679 6803726 6895411 6632015 6534377 6255816
3840 6255816 6670599 6810285 6500347 6486636 6501920 6257905 6169123 5999817 6082671 6190211
3830 6190211 6492087 6395906 6425405 6027018 6065485 6377741 6408553 6552589 6003523 5948525
3820 5948525 5999436 6541021 6309933 6431646 6726708 6593111 6253042 6673021 6650204 6339152
3810 6339152 6125923 5770973 6461727 6848974 6483724 6667039 6627293 6931510 6544996 6157417
3800 6157417 6777697 6334327 6392434 6680537 7058980 7226380 7279630 7314356 7032687 7098037
3790 7098037 6972166 7159587 7366311 7298227 6884602 6832673 6816012 7247741 7772741 7691247
3780 7691247 7685913 7904237 7830924 8012879 7955330 8082229 8084510 8038600 8318977 8573027 8791975
3769 8791975 8549797 8839076 8500996 8552230 8433911 9151402 9388940 9190704 9571869 9720869
3759 9720869 9931992 10166666 10182884 10146080 9984210 10529723 10684874 11089131 11634938 11670203
3749 11670203 11625587 11205841 11451589 11427517 11441760 11929733 11720958 11349664 11783570 12495887
3739 12495887 12588611 12882774 13145593 13520916 13496517 13982840 14555178 14383319 14665108 14426575
3729 14426575 14218916 14213358 14802208 14753537 14814917 15159993 15201736 15638112 15868560 15735031
3719 15735031 16086282 15811915 16002788 16020216 16641759 17077181 17283811 16786137 17169815 17437680
3709 17437680 17720784 17758628 18320122 18483643 18469477 18823153 18972894 19184523 19309246 19540958
3699 19540958 19986141 20753156 21049498 21406478 21727303 22310020 22774809 23332255 23734136
3690 23734136 23728129 24412866 24762093 24830318 25470979 26215828 26855806 27138160 28218765 28356920
3680 28356920 28565885 29329776 30260233 30320434 31144490 31426046 32258798 32645369 33127457 33362173
3670 33362173 33958294 34379912 34735458 35231695 36004569 36286096 37437279 38119915 38723262
3661 38723262 39429382 40275631 41519480 42452504 43739496 44986612 46241295 46837148 47538357
3652 47538357 48172947 49435500 50261819 51181693 52637676 54189456 55822274 57340721 59405262
3643 59405262 61587668 63690907 66023145 68414621 71034703 73905483 77301405 80826036
3635 80826036 84707353 88657385 93123325 97420507 102079916 107083759 112618114 119027598
3627 119027598 125399429 131796970 138210182 143625529 148678988 153232597 157792610 162867679
3619 162867679 167994574 173298533 177303552 179371181 180076455 179249890 178490465 177448810
3611 177448810 177344294 178881281 182085821 186698453 191808624 198201192 204899242 211145606
3603 211145606 217071634 222982164 228058863 232984587 238291310 243698677 250164999 256990248
3595 256990248 261753746 264599904 265481690 264305493 263344265 260865854 258045821 254854011
3587 254854011 249746172 242828535 235329263 227061526 219397410 213785284 210190983 209147120
3579 209147120 210874412 214096730 218942333 224562680 231116099 237670362 244532687 251392993
3571 251392993 257134858 262421017 265782886 267427555 267834782 267763450 266479468 263323952
3563 263323952 257759509 250470692 242848760 235721781 229412038 223412945 218053905 214447900
3555 214447900 212037497 211438512 213397291 217479956 223672109 231244349 239064080 247009596
3547 247009596 253761235 258662105 261183039 262116820 261796747 260383456 258859721 258243435
3539 258243435 257349629 253947503 247144850 238295742 230186270 223643472 218104000 213507078
3531 213507078 209262033 203810974 197960357 192622846 186554525 181044351 177346270 175615685
3523 175615685 175637507 177118350 178898745 180326197 180801340 179734714 176932976 171664420
3515 171664420 165548237 159206748 152694630 146489344 140085723 133511005 126894481 118942445
3507 118942445 110789965 103227400 96460339 90620075 86137727 82303613 78503541 74688836
3499 74688836 70885160 67355820 64334446 61253227 58396473 55947275 54023659 51630635
3491 51630635 50172543 49461963 47675280 46086012 44972187 43825366 42212452 40933800
3483 40933800 39472489 39076644 37933792 37104232 36445774 35074823 33980655 33226590 32307571
3474 32307571 31793599 31248848 30669180 29936942 29186301 28542958 27975442 27170425 26589827
3465 26589827 25705899 25204167 24797812 24252493 23583869 23063624 22555755 22250131 21752056
3456 21752056 21182958 20906938 20430640 20173349 19716249 19403650 18578761 18062544 17813106
3447 17813106 17816132 16932245 16470320 16274369 16319497 16571655 16099166 15752178 15157506 14839782
3437 14839782 14978118 14797471 14396453 14213363 14408932 13981336 13305587 13004993 13399556
3428 13399556 12984463 12991402 12976676 13333130 13126248 12271001 11792644 11746532 11734064 11276664
3418 11276664 11143007 11068270 11280498 11210879 11107285 10993669 10668231 10824751 10967113 10586351
3408 10586351 10210642 9520198 9613975 9825438 9619969 9273705 9163001 9357130 9201670 8921669
3398 8921669 9064629 9171278 9146761 9078776 8192995 7679306 7974610 8297869 8546908 8019563
3388 8019563 7777125 7574937 7587697 7830476 7571252 7697173 7504741 7243605 7425603 7367598
3378 7367598 7121572 7220400 7185181 6795496 6581205 6859543 7112185 7259381 7244315 7239632
3368 7239632 7221997 7199683 7125009 6795016 6451491 6327145 6237170 6063560 5927740 6456961
3358 6456961 6146756 5504055 5041161 5307227 5976177 6236570 6248507 5714000 5475549 5647543
3348 5647543 5808070 5382312 5412379 5417410 5081861 5030076 5246494 5235057 5066359 5054528 4842046
3337 4842046 4870668 5241356 4730240 4435811 4591502 4009959 4006305 4462330 4410362 4278438
3327 4278438 4262535 4654127 4834015 4635387 4672947 4412790 4399917 4461091 4238169 4173340
3317 4173340 4403120 4437015 4294584 4755283 4389683 4495283 4948900 5191366 4641945 4215592
3307 4215592 4490907 4364721 5027032 4781101 4391097 4298320 4121180 4151577 4298557 4560997
3297 4560997 4304988 4102748 4116525 4204933 4530504 4917933 5009245 4658406 4454057 4338743
3287 4338743 4330583 4596645 4274555 4390526 4429487 4938495 4760805 4741178 4045283 3413311
3277 3413311 3885303 4136021 4218666 4104516 4131013 3797026 3636089 3870315 3894010 3843558
3267 3843558 3999514 3683211 3675054 3769536 3777720 4133680 4223883 4375342 4670598 4455812 3967260
3256 3967260 3612240 4068501 4332458 4300746 3785651 4017078 4038084 3953181 4125110 4199793
3246 4199793 4432175 4222346 4310733 4172345 3966462 3880820 3717862 4163850 4328823 4466330
3236 4466330 3860926 3583290 4091911 3872687 3841822 4106530 4318548 4235155 4077732 3904223
3226 3904223 3737581 4078245 3998888 3865217 4096024 3708611 4166496 4011322 4282893 4180328
3216 4180328 3402706 3522075 3603530 4260644 3961627 3884402 3883179 3832435 4133821 4340081
3206 4340081 4535749 4192755 3815383 3950960 4065629 4166706 4096085 4043029 4157795 4076521
3196 4076521 4168005 3871083 3605920 3825217 4486223 4520678 4436002 4383869 4333865 4299506 4416784
3185 4416784 4172083 4233279 4430205 4517059 4395561 4026852 4535579 4790339 4446044 4408444
3175 4408444 4955831 5325915 5088300 4843821 4804963 4866380 4817167 4690248 5179848 5270101
3165 5270101 5459330 5355737 5478975 5573164 5594979 5785608 5660870 5397398 5768491 5892072
3155 5892072 6119979 6048145 5918177 6469566 6613954 6373020 6396511 6766011 6351860 6861465
3145 6861465 7032674 6916594 7461831 7731703 7650765 7953931 7866130 8183770 8312348 7750533
3135 7750533 8122456 8146252 8605436 8859694 8857624 8963169 9225235 9323472 8901313 9310945
3125 9310945 9091082 9521034 9558231 9641481 10032218 10081398 10080630 9935375 10476879 10394507 11278312
3114 11278312 11419732 11087657 11116944 11594601 12389131 12252197 11973596 11616022 11640383 11930977
3104 11930977 12610849 12398872 12360120 12840600 12796130 12761323 12949504 12728318 12659332 12826162
3094 12826162 12593091 12759598 12909778 13098625 12696810 12939111 12571337 12748310 12785657 12869024
3084 12869024 13389004 13688543 13663983 13908744 14048492 13957832 14245150 13900183 14215674 13624083
3074 13624083 13408497 13357545 13490896 13818189 13405055 13284417 13743981 13365960 13188970 13210144
3064 13210144 13170074 13019397 13477023 13768582 14027374 14476591 14633427 14355445 14333208 14474813
3054 14474813 14809181 14674922 15279768 16047800 15616224 15858584 15623338 15720617 16397078 16685183
3044 16685183 16678076 17062227 17765624 18328634 17836320 18318669 18921391 19754955 20388067 20465276
3034 20465276 20801524 21192724 21688748 21942241 22889698 23527534 24236167 25194919 25881597
3025 25881597 26711093 27466718 28174419 29025503 29749154 30517338 31253799 32086404 33177677
3016 33177677 33655260 34525449 35711521 36672065 37143559 37863692 38811772 39627625 39681955
3007 39681955 40231751 40948303 41383231 42138708 43020427 43450155 44350350 44724176 44390792
2998 44390792 45121656 45520394 45596087 45360103 45517119 45444700 45590948 45171261 44783746 44775140
2988 44775140 44461657 43884950 43669968 43072896 42473088 41954420 41070050 40311187 40419241
2979 40419241 39785076 38850812 37743575 36236909 35752059 35224028 34635981 34049994 33059603
2970 33059603 31814468 31639140 31303893 30452239 29721180 28760041 27881206 27090134 26468166
2961 26468166 25620198 24912716 24974847 24199424 23588543 22833488 22594090 22298360 22172673 22003517
2951 22003517 21299821 21081669 20824863 20797688 20452862 19990444 19775486 19942300 19616867 19730719
2941 19730719 19834049 19420671 19783867 19690420 19350969 19424860 19709703 19445481 19233999 19475115
2931 19475115 19710753 20050595 20098319 20441467 20588679 20874407 20482788 20516331 20510360 21003184
2921 21003184 21429136 21523667 21973082 22332680 22547594 22800860 23439507 23713754 23948948 24119186
2911 24119186 24403861 24964322 25601171 25894097 26295146 27368688 27966983 28280625 28886211
2902 28886211 29632883 30493771 31065200 31842814 32579537 32864804 33650081 34969429 35916883
2893 35916883 37324162 38706900 40310912 41426111 43060257 45029040 46546953 47912997
2885 47912997 49761733 50766667 52087103 53614140 54411129 55669356 56911217 58142868
2877 58142868 59894102 61247500 62403904 63871511 65283537 66640845 68868899 71458539
2869 71458539 74053660 76817129 79805119 82125441 83646564 84272248 85074476 85389538 85956224
2860 85956224 87431994 89054089 90790722 92040885 93785002 95927598 98058891 100481967
2852 100481967 104082165 108043929 111975658 115268185 118898655 122103015 124423971 126411939
2844 126411939 129169655 132495451 136657926 142009118 148378926 155929208 163642258 170805631
2836 170805631 176372121 180722274 183578416 185540904 187980091 191066976 194953975 198071397
2828 198071397 199816437 202058812 205971365 210914065 217663806 224723596 231193458 236870176
2820 236870176 243178087 250805290 260290884 270767874 283759719 298362124 313569601
2813 313569601 328720134 341359832 350562015 354891355 353746012 350237187 347119534 344258916
2805 344258916 341814143 341420951 342374803 344181031 347996895 352605022 355370384 355259097
2797 355259097 351862293 348585793 348292103 350873654 353232070 352088632 346096959 338247317
2789 338247317 332961223 331050802 330285976 329724650 329570875 328721289 328214210 327429362 324675965
2780 324675965 315225485 298978168 280657999 264532589 251643974 241161687 232073299
2773 232073299 223873288 217822167 213130179 208133370 203328323 198982510 193801622 188809176
2765 188809176 185059034 181736937 178969549 175556005 172298071 169295577 166532970 163688435
2757 163688435 160896033 157132457 151783792 145352959 138844455 132147364 126236365 122194540
2749 122194540 119289480 117353678 115619354 113632149 111985451 108998471 104864425 100244396
2741 100244396 96309968 93153356 90722822 88247993 86469815 85259577 83939410 82360202
2733 82360202 81065703 79756154 78748548 77656491 76921941 76299730 74744348 72923547
2725 72923547 70326112 66765087 63645114 61161642 58757286 57134942 55588375 54551363
2717 54551363 52961325 51295739 49426983 47679345 46121145 44882053 43943738 43050334
2709 43050334 42378562 41587501 40375336 39292879 38192478 36857924 34991776 34058867 33594395
2700 33594395 32118172 31252332 30387023 29495214 28521114 27447780 26792468 26170476 25868413
2691 25868413 25338970 24909676 24813740 24069045 23629067 23470409 23422841 22984144 22445811 22051825
2681 22051825 21875901 21407348 20812844 20941932 20741847 20725052 20851375 20981131 20577354 20205450
2671 20205450 20685546 20687725 20332949 20505477 20466168 20085676 20181961 19892674 20163991 20383962
2661 20383962 19675807 19895908 20149975 20151361 20187432 20524378 20314100 20303346 20813671 20701947
2651 20701947 20815388 21338927 21728208 22638222 23066837 23446464 23573483 23798776 24554644
2642 24554644 25460524 25738309 25990016 26692587 27162217 27112286 27537106 27665634 28102206 28725223
2632 28725223 29020265 29365856 29549264 29788859 30298944 30560780 30562009 30560004 30693440 30621522
2622 30621522 30380659 29961730 30140770 30624075 30318025 29717733 29413958 29467498 29501012 29484629
2612 29484629 30071166 30226260 30090864 30146220 29603342 29977943 29934650 29946428 30333522 30285325
2602 30285325 30546831 31115451 31378426 31462300 31049755 31645395 32896531 33787521 34738679
2593 34738679 36136236 36702776 37340262 38296993 39240624 40527191 41554352 42646817 44086796
2584 44086796 45569801 46782775 48040551 49778560 50819930 52097469 53461737 54543698
2576 54543698 55279092 56645712 57804853 58663689 60245505 61284608 62168500 62564430 62725208
2567 62725208 63407395 64876881 65281436 65295262 65240543 64661295 64253771 63862062 63443847 62727981
2557 62727981 62600060 62397429 62084920 61613838 60925831 60814418 60318502 60217730 60310531 60513878
2547 60513878 60243136 60095004 60285513 60464972 61092149 61775021 62330639 62777219 63667392
2538 63667392 64878537 66208490 67229550 68613520 69394041 70550441 71666287 72581812
2530 72581812 73001082 73342415 74623348 75019456 75578863 76452202 76838448 77341339 77865738
2521 77865738 78286950 79326721 79469454 79053730 78757623 78224283 78170099 77314202 76546460
2512 76546460 76257605 75145914 74104055 73168059 72473132 71955886 71810711 71739952 71174229
2503 71174229 71529335 72050618 72616425 73640484 74363584 75375048 77195713 79662808 81929132
2494 81929132 85029109 88782129 93007474 97719126 102063623 106105735 109896380 113645209
2486 113645209 116041040 117904791 118856668 119330592 119712376 118928194 117678318 116790509 116348969
2477 116348969 116250296 116416297 116263590 116203423 116331729 115690660 113970842 111743174 108749448
2468 108749448 104764533 100168319 94857388 89193602 84346249 79467119 74504031 70617892
2460 70617892 66825536 62575874 59397607 56856014 54247979 52026546 49400284 47447358
2452 47447358 45494522 43464837 42395438 40857926 39273307 37336189 36093750 34829490
2444 34829490 33220524 31966536 31006164 30150472 29071142 28101687 26883006 26506401 25765916
2435 25765916 24788839 24067537 23145118 22393261 21465680 21126238 20491016 20054152 18759166
2426 18759166 18041628 17917616 17004827 16457951 16240704 16154650 15633157 15558102 15111108 14848083
2416 14848083 14603292 14270417 13923108 13685170 13534919 12968621 12904140 12566088 11988247 12227874
2406 12227874 12205918 12032664 12270641 11688814 11178715 11291326 11437368 10903970 10816386 10595418
2396 10595418 10409720 10294072 9742713 9770701 9769758 9126887 8995915 9080685 9481912 9086254
2386 9086254 8855681 9390625 9276908 8685286 8732882 8805335 8419648 8170955 7729140 7819375
2376 7819375 7366217 7646958 7894044 7751611 7739251 7728627 7507823 7078886 7255621 7327419
2366 7327419 7014909 6952615 7089487 7038529 6675639 6544291 6281383 6600594 7048056 6684318
2356 6684318 6259582 6812340 6398646 6196202 6173505 6107214 6121987 6544952 6430038 6347882
2346 6347882 6685773 6186313 6124112 5896597 6146235 6300550 6281174 5993182 6422892 6236466
2336 6236466 5705478 5253259 5306654 5541749 5436477 5459081 5555239 5585761 6007227 5888100
2326 5888100 5985415 5880184 5574387 5640572 5468857 5482837 5716726 6263841 6089780 6118665
2316 6118665 5969632 5876432 5493392 5024913 5213493 5209541 5185783 5176120 4600102 4646548 5079047
2305 5079047 5225903 5308982 5457413 5706700 5409852 5722896 5376741 5260052 5275213 5280732
2295 5280732 5459835 5189558 5326238 5141667 4761239 4622373 4745070 4063609 3919026 4273388
2285 4273388 4682599 4862997 4735383 4670660 4514277 3936018 4102216 4427120 4504864 4416881
2275 4416881 4066367 3973956 4361335 4777813 4924436 5063886 4832073 4244933 4549914 4532910
2265 4532910 4787167 4856404 5012435 4718769 4742607 4996106 5270173 5218801 5127957 5179116
2255 5179116 4987781 5063721 5453109 5655092 5816927 6063061 6152121 5793802 5906272 6177808
2245 6177808 6024587 6163916 5818333 6040499 5905931 5600966 5592488 5746107 5651961 5976281
2235 5976281 5878499 5721849 5745352 5561431 5808832 6245946 6180086 6061567 5980481 6192105
2225 6192105 6139305 6317426 6162714 6047191 5508000 5661431 5652779 5892819 5887663 5990646
2215 5990646 5543091 5585927 6350187 6481007 6384269 6429783 6426476 6696415 6915449 6481594
2205 6481594 6339921 6280487 6223444 6532756 6865757 6617884 6443045 6593491 6618352 6356708
2195 6356708 6159274 6044479 5812387 5878205 5891272 5541653 5755051 6188674 5948562 5858961
2185 5858961 5852028 5869624 6675543 6747978 6600214 5849886 5311832 5367547 5295575 5085749 4752849
2174 4752849 4594311 4869493 4729106 4744198 4930081 4445978 4349133 4752468 4951986 5092439
2164 5092439 4937480 4601127 4635265 4533223 4565621 4462369 4133512 4180454 3821651 3359940
2154 3359940 3336242 3178400 3658690 3627842 3026882 3452948 3104605 3072687 2800643 2584648
2144 2584648 2630517 2216527 2213002 2626672 2918265 2280048 1930330 1867099 2280072 2803745
2134 2803745 2387836 2331222 2421984 2382941 2853069 2608737 2629109 2186120 1419822 1771225
2124 1771225 1818569 1783022 1848293 2178644 2143610 2328477 2185213 1903678 1887403 1951610 1741013
2113 1741013 2176448 2095909 2480479 2326023 2060890 2217381 1722346 1841897 1590272 1824725
2103 1824725 2366300 2135907 1798633 1696598 1567723 1298629 1570508 2288495 2145871 1628515
2093 1628515 1366115 1215431 1420507 1502962 1025913 1070917 1606833 1818507 1999247 1925411
2083 1925411 1428909 1418879 1318165 1587820 1374042 1620214 1499285 1421521 1362308 1764744
2073 1764744 2428984 2019703 1602430 1195356 1245379 1510389 1644304 1935487 1442996 710699
2063 710699 1083409 1581838 1358596 1311200 1441311 1219700 1098256 1189353 1343016 1446676
2053 1446676 1402292 1316291 1716004 1494957 1076123 612661 846877 1221982 1496743 1340436
2043 1340436 1049583 631434 127463 429368 1142365 1058756 949954 1131252 838809 1061727
2033 1061727 900711 708660 1026754 646072 1060771 961889 1030509 973018 744661 991228
2023 991228 1292095 1272455 1103592 1236771 890975 1098071 982708 1009702 828033 1034372
2013 1034372 976623 1056932 1265675 1085507 1076130 1028482 701877 717468 422963 443962 520852
2002 520852 830561 721230 549951 615453 694150 859320 628066 625453 951322 1081339
1992 1081339 904502 775150 1138053 830862 795982 1210225 1303826 844132 775015 707066
1982 707066 948944 906304 723973 956412 488496 850022 808053 1009822 833893 722710
1972 722710 903401 841726 824957 881142 1377606 1331694 989504 921139 919292 884794 1377982
1961 1377982 1395183 826870 644589 538682 547276 651167 808621 752836 1041501 983016
1951 983016 1222041 794467 711143 739904 801824 690007 645981 1118821 1152748 1103629 790357
1940 790357 1062696 796540 667218 485512 367074 816360 1121072 765371 547577 584565
1930 584565 505579 605344 587513 618701 868929 687233 501632 432972 573673 908249 555720
1919 555720 157659 438224 592472 751335 1056255 579498 264306 61669 205718 904344
1909 904344 617803 610175 647147 257273 369491 827285 903535 838606 986531 744153 545889
1898 545889 406160 381420 900743 1194785 970277 1131017 1502003 1368138 1568645 1574575
1888 1574575 626926 828804 1087546 675415 135705 903014 1036550 948121 947149 881392
1878 881392 981906 1157018 1292766 1191599 1046859 958411 1087887 1571187 2032657 1670446
1868 1670446 1365419 1237993 1229387 1180644 1221561 1585728 1521007 1562330 1848479 1676592 1479653
1857 1479653 1477335 1119975 1454346 1277698 1318882 1676715 1773588 1558424 1636040 1522160
1847 1522160 1290970 1524627 1988119 2020345 2054515 2284700 2159133 1841373 1772211 2435147
1837 2435147 2064753 2026444 2513304 2256209 2127407 2265587 2307412 2213182 1831746 1655140
1827 1655140 1292072 1396868 974035 832138 785275 983954 1228140 1441073 1346158 1213690
1817 1213690 1451218 1460932 1181191 1069991 1177342 1350687 1136546 1220901 1439208 2061169
1807 2061169 1801062 1465937 1191823 1182340 889775 1074761 844498 837355 1278546 1429904
1797 1429904 1359620 1052392 1085114 1090383 919378 621199 666086 856558 686378 703123 727965
1786 727965 600921 641359 341381 587639 498250 646170 750819 422163 322523 645848
1776 645848 362359 -86611 277430 517185 798482 645787 383816 333139 384907 225352
1766 225352 -60532 348474 220560 338681 260530 325066 503149 312434 -12424 253968
1756 253968 478007 739332 762726 523458 365118 239130 94901 449189 814950 415252
1746 415252 476997 447222 503758 281394 14132 287812 164626 232676 331495 487824 338535
1735 338535 243489 357709 587399 623625 476116 566249 960128 1146973 701435 577186
1725 577186 433429 422896 408098 536316 371097 -163442 411623 383683 362141 140838
1715 140838 -74019 213785 475785 413403 352331 173521 106086 84558 585114 527691 165295
1704 165295 428257 476086 715600 616866 434588 185679 -60673 -231433 -278236 42879
1694 42879 -291211 -115794 21583 -418569 -216973 -328101 -83389 128064 5053 573903
1684 573903 1183248 620396 297384 230451 621599 493812 699374 850170 415665 720859
1674 720859 410056 241178 285493 362572 -59711 293981 500651 52210 127497 208479
1664 208479 162435 182390 249386 -3949 567609 419019 -158129 31886 296976 382515
1654 382515 319631 68706 197286 49161 86034 118860 409823 665783 600829 214304
1644 214304 -174269 -204890 122806 50605 -131608 -317603 -104088 249014 657123 768503
1634 768503 780421 741997 599723 418755 544225 701854 187087 453206 281678 -52782
1624 -52782 -9005 40588 -84289 52434 481284 416027 361604 337462 -116532 -168646 -237426
1613 -237426 162799 505989 434292 556728 286025 54626 141893 98409 232296 177759
1603 177759 -360758 -431418 -222259 -200434 -232028 -246362 75382 236132 281097 598097 146489
1592 146489 195337 258741 344176 373789 -289895 -346979 384292 728702 -6295 124672 116932
1581 116932 -190527 -176690 -95434 -69818 -34944 -59018 -289439 240282 575377 424767 14192
1570 14192 21905 -77595 -43214 -194142 -205175 187582 103756 250972 268992 -29223 -277659
1559 -277659 -267255 -246050 64701 56697 206486 -303969 -484866 -276000 -66465 114294
1549 114294 21635 12218 -30434 112651 400647 496565 405236 360777 282864 22363 283
1538 283 56974 56354 220708 245782 282574 159482 263091 472982 426700 946225 437509
1527 437509 -17566 136610 230068 49001 -29506 67625 163712 435014 241685 4722
1517 4722 -43232 -233107 157856 262134 -16452 116943 592643 566287 498821 289140 185416
1506 185416 337817 57685 -14235 -246181 -171722 273162 796356 419527 -223556 -234581
1496 -234581 -207928 -94727 -70497 -308197 -229156 -257176 -184761 -73855 105315 141422 105225
1485 105225 -261893 -285927 -148978 61996 69612 -195454 402862 568335 237812 65561
1475 65561 -418197 -123303 -217163 -14590 317195 210177 -111207 177498 -192311 -377541
1465 -377541 -127201 -291729 -374096 -565727 -497556 45268 215 -404650 -494174 94656
1455 94656 -75079 89563 -252368 -702355 -221772 -156193 -262370 -180988 -292960 -170924
1445 -170924 394129 302013 388298 403442 785159 742783 488149 -68866 -427448 -779071
1435 -779071 -588423 -775482 -529966 -119150 -468074 -647306 -350231 71141 272869 155714
1425 155714 125603 -35220 40331 19790 174702 240705 311469 569667 157242 -1208 205396
1414 205396 349414 401214 290871 253708 139290 -156068 -159767 109548 10835 -74708 362228
1403 362228 112767 255422 74006 -78887 14329 278876 530611 86453 -175060 -109824
1393 -109824 -133330 -151418 53111 45452 -454001 -134435 -73437 17073 406821 134115 313453
1382 313453 -80907 -12805 317483 367993 -213662 -279764 66478 382725 197374 -134530
1372 -134530 -134157 -547388 -229277 166154 45194 67007 -393580 -445439 -419350 -176166 -159987
1361 -159987 -450589 -496001 -420969 29250 -609520 -597293 -214475 120333 236097 343198
1351 343198 467260 260499 -96344 -142080 241803 37104 184843 -39248 -170230 -123670
1341 -123670 -250420 -30339 151577 -68784 84397 -406577 -309672 302790 245045 292408
1331 292408 422949 260592 514598 341628 167548 -143683 -322675 -23689 11976 293398
1321 293398 248658 172664 448107 223355 70233 79667 194218 403320 258352 -46164
1311 -46164 -591118 -213128 -67429 -331161 215084 392234 37428 330858 407599 588784
1301 588784 179563 59743 302694 77943 -381555 -91401 615094 608705 273544 42704
1291 42704 -119249 248224 181384 103708 31416 -54301 13865 366234 559557 78958 33293
1280 33293 292023 529289 160929 201607 291484 -105834 19911 5993 344765 510106
1270 510106 266507 253315 117485 74792 -312413 -320649 -230877 33058 990795 843775 639086
1259 639086 482010 457730 74204 139101 610220 579499 433295 53624 -214279 -29624
1249 -29624 -413740 -162161 -29266 -13442 137073 347052 594419 359014 53461 -263463
1239 -263463 41470 -125923 2230 219356 182802 194925 377671 482555 223923 269278
1229 269278 239861 451329 440638 165371 -151262 -72029 -228043 -224722 462853 468931 80411
1218 80411 94298 304607 70884 -48510 -571992 -263960 -34635 -231657 -10314 121753
1208 121753 109465 -288631 -168966 70763 -150277 66728 562197 585689 -117155 113459
1198 113459 771752 725060 272495 264351 111649 462990 226537 153680 -205979 -319006
1188 -319006 -143592 105106 415490 412629 200494 254991 738339 893384 779949 399831
1178 399831 148078 199535 505002 418478 93344 427152 863965 248299 -169763 -370031
1168 -370031 -4494 418586 690344 384747 22057 359937 261679 60485 123107 -12953
1158 -12953 -135426 24261 229787 603985 1020331 890306 320653 114453 365432 608708
1148 608708 790223 795582 553962 692696 373546 704722 825464 1084116 1294543 1307960
1138 1307960 1235257 974637 854774 686373 770700 619298 867848 1424800 1768121 1836656
1128 1836656 1811489 1506221 1058507 853456 1076413 1026322 1272697 1088507 786123 503953
1118 503953 937398 1297254 1226705 988125 811461 648173 798479 1189559 1267075 741589
1108 741589 775299 984455 983532 789650 561752 1146563 1360360 1391474 1250607 1037201 1188000
1097 1188000 1668348 1574289 1256988 986648 925633 1186270 1201730 936722 1184589 1075833
1087 1075833 888337 1057175 1612921 1582062 1126605 1346317 1269757 1420542 1262935 1596056
1077 1596056 2093710 1980443 2134274 2437824 2097487 2004883 2187222 2038162 2019344 1944219
1067 1944219 1956671 2147538 2087415 1687367 2095537 2066733 2378009 2843577 3064550 3147031
1057 3147031 2877526 3176931 3558472 3765144 3651443 3494042 3582113 3484244 3919067 4500479
1047 4500479 3926180 3914650 3639448 3884815 3988087 4102996 4335464 4316659 4448237 4451411
1037 4451411 4611547 4942556 5175676 4706891 4750816 4933647 5133831 5144118 5660241 6114398
1027 6114398 6589949 6679628 6638323 7141493 7119409 7441725 7193028 7360656 7867489 8601462
1017 8601462 8837425 9371376 9972463 10347473 11216185 11507820 12295297 13010728 13454209 14348404
1007 14348404 15005144 15775007 16786187 18294071 19613398 20953640 22358209 24523023
999 24523023 25953336 26909326 28137835 29968125 31522780 34576342 37779921 41938770
991 41938770 47847678 55606685 64717634 75347249 87319689 100635597 115047897 130669255
983 130669255 129531777 101983326 77327137 62012984 51561941 44106474 38308143 33628867
975 33628867 30224397 27305176 24835477 23178722 22065088 20904023 21056661 20610383 19339912
966 19339912 17460329 16100572 15034488 14187501 13469496 12461494 11534738 10848859 10625126
957 10625126 10255101 9935627 9220194 8540035 8321227 8102679 7948808 7645029 7180975 6700880
947 6700880 6477021 6070464 5673844 5775416 5244289 5037387 5075585 4989665 4800960 4483090
937 4483090 4539467 4892875 4675086 3809302 3935520 4483603 3712128 3450137 3678866 3925776
927 3925776 3470777 3118603 3308577 3366819 3351489 3221644 3308286 3213653 2731521 2650274 2785948
916 2785948 2561146 2713771 2848457 3149931 3072620 3062784 3025674 2093293 2266099 2082754
906 2082754 1917191 2077346 1768991 2183864 2357924 1879905 1455714 1348768 1669864 1872056
896 1872056 1653161 1345124 1413413 1540227 1101397 1087469 1366533 1480862 1454188 1628633
886 1628633 1588768 1266016 1530000 1148768 1184574 1377657 1322315 1194837 1253343 1479970
876 1479970 1630585 1171962 655899 352471 124866 288759 553790 757380 1015642 832989
866 832989 429615 269254 472549 585501 293971 455855 1210165 1084174 1285210 1300946
856 1300946 1042727 1046178 713582 527432 409914 108813 206503 777592 478551 442348
846 442348 452012 275416 743698 216259 182984 630939 257177 437283 381142 230886 479835
835 479835 699131 696716 737349 915677 1053294 1004622 426835 33179 454926 290790 192952
824 192952 504567 156782 144573 -151781 -72537 812444 719073 647827 1094170 729989 234505
813 234505 209157 -63483 -238737 -11707 358959 708231 329164 388997 413040 76412
803 76412 232647 499988 206294 -117566 -221460 492816 594953 229641 236431 86450
793 86450 380264 518583 202614 2783 168886 247963 -144034 -82818 417748 299312
783 299312 506048 70115 -121627 -924 127503 -19008 -192300 26680 85413 199073
773 199073 456434 547602 463111 -93257 -50088 -55339 -222171 -458378 -329429 -168176 -264229
762 -264229 232557 -133422 -275651 -65626 75116 -11733 274900 5974 -476667 -378788
752 -378788 -323403 -338811 -576372 -712436 -488666 -286353 -367237 -412907 -258784 149427 -213978
741 -213978 -470252 -204451 -61698 190270 90995 -179879 176986 -101632 -331432 -499391
731 -499391 -379913 -402363 -357433 -153459 90125 92973 -70866 -58910 -230435 -381696 -109785
720 -109785 -155608 -104679 -560011 -434795 -308102 61822 -169006 -411086 -138571 66151
710 66151 278000 42543 -81628 -353967 -275997 -313924 -248392 305801 738384 705527 693303
699 693303 531120 867560 1020853 700921 325008 296105 174404 246379 -178365 -38289
689 -38289 106678 -232950 -94218 73256 16932 144456 259134 -65644 -403739 -644346
679 -644346 52004 -23491 -34569 427392 408066 64300 415274 482478 261873 18218 -248543
668 -248543 213391 427804 80064 -68170 -54248 -394615 -114500 -292544 11831 602246
658 602246 463131 301420 196106 217482 472380 344153 -1374 -162017 -19027 30876
648 30876 -257737 -370048 95895 -63324 -241852 -445419 -7818 -333171 -374149 -290223
638 -290223 -208919 -591918 -408639 237358 233606 198362 -60563 -534427 -342299 -343651 -663400
627 -663400 -546934 -28215 -88162 -108765 197740 -269477 34281 116018 165101 169378 -151350
616 -151350 -104559 -289857 6665 74272 331299 182716 9495 154704 -212910 -380960
606 -380960 -488706 -576681 -351321 -303558 -431772 -643225 -786807 -463148 -104030 318777
596 318777 247911 -325160 -770307 -509119 -465537 -261067 -426010 -265030 -90843 -487923
586 -487923 -755105 -551473 -766624 -689523 -514993 -540819 -447897 -473353 47365 266060 -85973
575 -85973 -372457 -853471 -958222 -714793 -787913 -1106957 -886399 -627716 -665874 -542296
565 -542296 -532144 -408734 -205126 -522260 -292943 -258175 -192614 58923 -518362 -593168 -233958
554 -233958 -393008 77680 -222236 -164909 -98118 -769852 -931865 -736052 -937985 -509977
544 -509977 -213332 -443608 -129131 -136015 212612 -20821 -457815 -6571 207744 -165351
534 -165351 -507490 -576219 -142669 -466087 -604023 -89302 -76001 -150621 -318989 -54224
524 -54224 19448 -267977 -480455 -299150 -765373 -228004 381555 -45442 -43351 -65244 -490464
513 -490464 -539625 -153660 274625 103917 7582 -296283 -548621 -280512 -559699 -574440
503 -574440 -336613 183806 -18064 -156873 -319090 263214 -288774 -279474 80657 -9311
493 -9311 218583 -274366 -243872 -238641 -336309 -116889 200059 145808 -66767 -198055 -15164
482 -15164 -67144 72363 -34255 -498481 -369443 -440074 -755219 -718542 -692598 -638594 -463443
471 -463443 -697502 -521798 -547308 -507971 -528731 -443443 -365522 -733369 -886975 -728887 -297665
460 -297665 -344510 -400780 -762140 -467571 -243743 74637 -123186 -480273 -429144 -556981
450 -556981 -398480 -317874 103849 117828 22952 -139531 -138763 -40856 -117456 -128378 -153825 -143071
438 -143071 -487655 -787529 -513737 -506664 -529297 -286727 -46878 -207217 -451190 -666459
428 -666459 -610364 -465071 -832955 -984012 -963486 -895895 -389417 -368798 -433742 -582386 -454043
417 -454043 -277863 -540852 -624713 -85481 -325178 -758528 -957155 -392181 -189544 -311880
407 -311880 -319448 -564186 -537664 -259786 -182620 -292060 -190926 -333363 -480593 -475551 -304472
396 -304472 94188 294567 55210 -124487 -404899 78797 9764 42087 102914 -206055
386 -206055 -282811 -241483 -405288 -111158 106189 -552486 -652946 -258659 -97438 360107
376 360107 238094 -605675 -829159 -643539 -92827 5186 231911 194461 -47360 -322616
366 -322616 45744 170011 -142997 -455898 -211904 -123719 -856759 -517035 -129085 104018
356 104018 -250402 -365622 -251746 -625293 -794795 -541967 -747003 -516403 -527707 -403382
346 -403382 -357592 -607214 -385465 -417179 -375303 -222042 -333789 -482796 -588381 -575746 -232021
335 -232021 -314331 -374804 -289108 -266589 -343441 -186378 -13095 177475 77603 -324355 -430096
324 -430096 -481780 -199032 -457597 -735553 -666911 -634634 -330763 -150539 -505006 -656702
314 -656702 -266310 -76237 -315010 -365375 -451428 -748437 -549185 -335965 -629024 -480706
304 -480706 -110101 -460102 -517184 -138035 -39537 -78361 -165639 -350168 -301004 -138045 420502
293 420502 453117 -95372 -466045 -600338 -526183 -419631 -450593 -256161 -21154 -92478 86667
282 86667 -87463 -2859 231703 -143553 -338347 -63161 -106125 239157 -6485 12057 -100414
271 -100414 -370106 -485018 -459177 -261034 -427459 -654707 -723310 -314012 -384597 -573535
261 -573535 -300124 -372435 -846639 -877644 -914639 -524738 -480669 -302594 241198 128537 -392424
250 -392424 -1049028 -1008141 -1238006 -872923 -425350 -563392 -503556 -561082 -1044250 -823704
240 -823704 -622037 -505819 -279735 -559010 -518446 -343600 -167389 -191675 -286062 -245783 -266895
229 -266895 -514544 -612349 -610890 -764356 -653808 -400162 -227189 -501859 -965050 -629761
219 -629761 -695587 -647039 -530866 -460851 -104208 -456652 -454954 -326999 -1276384 -634761 -371035
208 -371035 -419587 170301 59046 -314668 -289142 -48959 -130450 35345 41147 -35648 -464803
197 -464803 -571880 -813520 -1016073 -758905 -899048 -900379 -604084 -352507 -604914 -500930
187 -500930 -771358 -1077394 -896905 -697598 -462477 -497376 -456473 -388572 -465105 -472644 -391169
176 -391169 -220537 -602047 -652267 -449847 -578708 -789120 -340067 -234306 154649 355969
166 355969 -172693 -248220 -198887 -81395 -307682 -732908 -909764 -915381 -683874 -639345 -449008
155 -449008 -708938 -790831 -646043 -442568 -349268 -578245 -773216 -866935 -672576 -613923 -701166
144 -701166 -460538 -305273 -625530 -631130 -444378 -356052 -435911 -878807 -893454 -997593 -352028
133 -352028 -335042 -524045 -764754 -962559 -627152 -946873 -646363 -322962 -109971 -370820
123 -370820 -710929 -812274 -402772 -492806 -353496 -409775 -467843 -243825 -348001 -459643
113 -459643 -399447 -714213 -612826 -487655 -531275 -637699 -614069 -759985 -337007 -244596 -492101
102 -492101 -412750 -551975 -651024 -347591 -301193 -345178 -676537 -755896 -773325 -1004158 -942791
91 -942791 -849557 -751796 -516878 -774491 -479209 -461616 -577944 -783589 -726460 -621381 -895421
80 -895421 -486636 -529530 -744232 -968616 -663637 -542525 -726913 -707656 -523757 -577955 -812864
69 -812864 -756496 -911789 -777278 -544239 -430711 -495221 -871910 -741560 -665070 -417708 -436966
58 -436966 -451730 -429483 -1018981 -841215 -691609 -953577 -685037 -571626 -545896 -432224 -391877
47 -391877 -454641 -474635 -616874 -655594 -741480 -696064 -383522 -636166 -704654 -804887 -685680
36 -685680 -826298 -895015 -863116 -921514 -668406 -673394 -798813 -803218 -722949 -860039 -932708 -895291
24 -895291 -911948 -836216 -817468 -855634 -969530 -971200 -863107 -742127 -661316 -555139 -499476
13 -499476 -693473 -524459 -446311 -585324 -886210 -942842 -799520 -530963 -564990 -596663 -572666
2 -572666 -408547 -836565
0 -836565
$$ Imaginary data points
##PAGE= N=2
##DATA TABLE= (X++(I..I)), XYDATA
16383 -3951376 -4187777 -4046432 -3997798 -4020995 -3845827 -3863275 -3642063 -3877462 -3885055 -3634110
16373 -3634110 -3614739 -3593287 -3402570 -3248263 -2988201 -3075518 -3069620 -3157776 -3262729 -3046233
16363 -3046233 -2789082 -2640948 -2789368 -2664698 -2764469 -2708209 -2602520 -2580654 -2640524 -2468543
16353 -2468543 -2482430 -2208202 -2316999 -2527307 -2497175 -2189106 -2152067 -2327963 -2199491 -2014101
16343 -2014101 -2076582 -1870714 -1769312 -1801797 -1722857 -1440287 -1472175 -1799352 -1581024 -1575455
16333 -1575455 -1764803 -1514708 -1563703 -1752564 -1581797 -1387676 -1325191 -1115321 -1124388 -1023928
16323 -1023928 -1288277 -1307083 -994776 -538981 -518756 -814829 -770834 -556885 -838112 -765640
16313 -765640 -691555 -489376 -362297 -149590 105886 -108821 -386755 -255674 39687 102336
16303 102336 -65852 160692 107655 95953 66460 -95111 -280327 -46430 290125 172600
16293 172600 19886 203496 576509 568090 305605 333030 407404 310290 205597 300655 412966
16282 412966 347195 410330 761470 770730 399591 278283 556867 615175 581530 802262 830455
16271 830455 1328362 1417157 1311271 1396610 1323299 1279410 1239541 1343255 1432797 950106 636547
16260 636547 749088 1162889 1472903 1536399 1296102 1156131 1425058 1652173 1570805 1779906
16250 1779906 1493680 1688745 1451085 1757088 2007650 1940561 1557814 1525116 1812259 2048192
16240 2048192 1908979 1834721 1886945 2073320 2018831 1874614 1871479 1672634 1744513 1474403
16230 1474403 1257420 1500228 1744932 2227945 2073354 1855311 1462400 1754880 2157525
16221 2157525 2040649 1822615 1636282 1799587 1803312 1802060 1926133 2309506 1920903 2189504
16211 2189504 2527872 2888864 2724030 2289500 2327716 2962253 3266283 3059823 2746909 2922541
16201 2922541 2968354 2820780 2680475 2097261 2010426 2749875 2781319 2308341 2328231 2675148
16191 2675148 3024311 2783569 2902901 2825859 2704614 2600075 2603740 2731741 3080501 2800732
16181 2800732 2625924 2872368 2778446 2828181 2871378 2994625 3198015 3089328 2784607 2842312
16171 2842312 3314251 3266115 3389654 3422723 3527793 3622694 3210905 3450591 3485510 3346458
16161 3346458 3272994 3392780 3799480 3852120 3753209 3709690 3730684 3878345 3665287 3528111
16151 3528111 3177460 3518242 3490117 3259724 3017113 3456593 3645846 3609306 3416484 3056614
16141 3056614 2795144 3320702 3074168 2901420 3207936 2967681 3082649 3050558 3316140 3296725
16131 3296725 3624710 4042867 3863803 4194224 3924948 3725783 3535187 3522788 3880674 4179492
16121 4179492 4197800 3690667 3812904 3579137 3614171 3630369 3654550 3669410 3678522 3502726 3616491
16110 3616491 3590143 3601746 3589611 3745483 3814096 3895592 4033072 4059342 4312287 4485866
16100 4485866 3906948 3745908 4062936 3485714 2958010 3114492 3390169 3431752 3459457 3177948
16090 3177948 3282552 3473555 3571078 3652351 3590604 3633580 3725473 4055098 4434490 4138055
16080 4138055 3722118 3747067 3732987 3782153 3253459 3085961 3589174 3861151 3689909 3920540
16070 3920540 3607584 3836860 4437142 4350733 4205007 3947467 3964739 3850825 4043313 4095468
16060 4095468 3887150 4107003 4189691 4239715 3980123 3772096 3831765 3669074 3513470 3584360
16050 3584360 3844301 3673987 3617155 3550892 3629483 3867119 3947480 4082664 4086828 4305472
16040 4305472 4515799 4193519 4116214 3944739 4182062 4030280 3987630 4141616 4045634 4176930
16030 4176930 4654427 4083098 4005323 4173889 3449453 3696435 3932811 4341585 4051462 4167261
16020 4167261 4657926 3886254 3328770 3710685 4176837 4027488 3905846 3717373 4063511
16011 4063511 3687002 3620743 3808205 3785357 3641139 3841421 4007737 4095583 4016464 3681912
16001 3681912 3863613 3953739 4385827 4423557 4100423 3664198 3809940 3862255 3720687 3422732
15991 3422732 4009678 4623143 4284404 4232260 4308666 4155231 4247649 3717548 3788601 4170685
15981 4170685 4284390 4194502 3990270 4279082 4412207 3869407 3841478 3932335 4087246 3930362
15971 3930362 3876734 3952783 4244849 4368534 4175260 4222773 4114709 4034551 4015562 3694403
15961 3694403 3550731 3784297 3371330 3588396 4066058 3725525 3840584 4058316 4375180
15952 4375180 4227930 3467439 3357621 3816621 3811189 3980531 3932461 3898789 3991621 3547406
15942 3547406 3751377 3655758 3798163 4126889 4190226 4278629 4587907 4070265 3746444 4009210
15932 4009210 3997390 3804040 4014967 3843195 3747822 3957235 3682143 4160646 4064572 4098510
15922 4098510 4227408 4120417 4177434 3977613 4038836 4261196 4259855 3914719 3695068 4061008
15912 4061008 4190676 3739928 3797382 3545461 4014198 4071076 3774964 3772557 3895904 3539778
15902 3539778 3748043 3995586 3922109 3266618 3543329 3617873 3652810 3830022 4000430 4003273
15892 4003273 3998136 4435097 4327152 4231142 3718926 3569116 4033557 4351598 4301045 4386128
15882 4386128 4214549 4093727 4072993 4079337 3831468 4087771 4235514 3945236 3695289 3729205
15872 3729205 4140533 4347401 4071426 3629874 3142667 3629433 4077090 4026220 4000241 4221733
15862 4221733 4381845 4277388 4483867 4517438 4341279 4349735 4297066 4210955 4111110 3725318
15852 3725318 3276328 3647032 3773782 3902778 3935137 3833536 3780696 3659101 4114758 4083282
15842 4083282 3630866 3664446 3975366 3916392 3790420 4358555 4380118 4029320 3685251 4155928
15832 4155928 3845331 3708691 3719318 3821672 3975543 4055679 3911099 4360568 4288662 3724982
15822 3724982 3588125 3618267 3897846 3613546 3643003 3440498 3735629 3913553 3974684 3947140
15812 3947140 4129141 4302241 4048823 4170838 4087002 3833562 4007733 3891033 4132859 4138877
15802 4138877 4082763 4287543 4046622 3950540 3922020 3725514 3766986 4043454 4280379 3919279
15792 3919279 3902700 3831919 3803366 4201703 3956709 3960994 4095709 4246348 4358642 4557888
15782 4557888 4563494 4112577 3680109 3272129 3601393 3875242 3810452 4211409 4235909 4057490
15772 4057490 3991439 3722467 3693179 3632911 3993680 4029572 3850418 3651129 3604320 3313104
15762 3313104 3362201 3297521 4077761 4210002 3831542 4101536 4170781 4309699 4617855 4498469
15752 4498469 4346289 4188624 3862514 4196148 4541229 4308003 4173643 4026476 3969588 3985718
15742 3985718 4133444 4168630 3820936 3714935 4048700 3772297 3362925 3419658 3540217 3501005
15732 3501005 3677105 3628241 3769496 4282362 4147851 3851738 3842137 3968499 3768039 3725484
15722 3725484 3333503 3189510 3604496 4025220 3905084 4019598 3750840 4245654 4063343
15713 4063343 3695604 3449208 3947192 3590040 3420058 3534788 3495433 3785654 4088763 4116036
15703 4116036 4023838 3902944 3862529 4321371 4319504 4232633 4021240 4016082 3852596 4163738 4098759
15692 4098759 3965479 3739736 3826117 3637554 3739186 3957691 3711681 4137627 4433229 3618994
15682 3618994 3712286 4019625 3749749 3705765 3761281 3987656 3752432 4199502 3918330 4097429
15672 4097429 4572070 4296769 4304018 4264611 4382018 4189203 3747941 3734244 4107298 4104978
15662 4104978 4256915 4105313 4106628 4347259 4351385 4413478 4204666 4457238 4418934 4178461
15652 4178461 4202640 3861967 3923623 4312163 4293675 3761048 3839998 3960778 3846674 3591481
15642 3591481 3712772 3794921 4372920 4455004 4576790 4504976 4004069 4248579 4112039 3887124
15632 3887124 4106211 4376605 4102140 4179244 4136821 4234641 4589853 4960961 4509521 4258331
15622 4258331 4242047 4426937 4372559 4238261 4004816 3919062 3841519 3940165 3830841 4122140
15612 4122140 4058717 4112316 4148682 3806989 3301195 3264227 3511351 3413276 3871733 3807300
15602 3807300 4064144 4037634 3920378 4116677 4340268 4410433 4495249 4082423 4026820 3995169
15592 3995169 4272156 4069696 3694938 3732052 4151663 3662627 3624848 3726584 3921593 4215789
15582 4215789 3767185 3719354 3622501 4181896 4433092 4577845 4442591 4127955 4080665 4356416
15572 4356416 4453223 4409457 4430881 3749682 4121429 4111816 4175528 4374815 4126934 4246429
15562 4246429 4196329 4136266 3934350 4076868 4286365 4056115 4079595 4583850 4555629 4725446
15552 4725446 4220825 4060458 4189093 4214445 3832190 3992657 3827271 3980049 4171637 4071983
15542 4071983 4317600 4023549 4207883 4431822 4038531 4346009 4512248 4061340 3907650
15533 3907650 4000815 4224540 4002069 4351099 4499292 4140258 3839046 3861181 4147154 4393391
15523 4393391 4041702 3771920 3861093 4367905 4038954 4181422 4177790 4054977 3791312 4025002
15513 4025002 3973322 4701948 4510637 4032858 3885282 3963121 4109656 3872638 3807734 3752830
15503 3752830 4052796 4218891 4339584 4429645 4507447 3789572 4186849 4381962 4011370 4060992
15493 4060992 4493636 4042782 3782204 3399121 3506804 3570642 3801377 4046212 3805778 3615889
15483 3615889 4021201 4110898 3781614 3690494 4014709 4347742 4307904 4087380 4131466 4057084
15473 4057084 3819438 3877224 3697497 3903349 4037172 3868117 3978141 3846640 3473132 3327264
15463 3327264 3304472 3655633 3761516 3817470 4103577 4251598 4161176 4333092 4200858 4159451
15453 4159451 4490262 3988042 3808112 4092433 4017767 3969476 3808364 3425101 3419446 3604743
15443 3604743 4184621 3963968 4081415 4417025 4506940 4320093 4130794 4076300 4036935 3858956
15433 3858956 3760536 3992915 4218085 3792323 3702819 4451843 4407507 4367515 3844143 3732762
15423 3732762 3928628 4089252 4345104 4535118 4536380 4074582 4315004 4195748 4190202 3880550
15413 3880550 4648081 4647716 3945041 4082676 3999780 4533044 4232246 4270492 4156005 3726998
15403 3726998 4064951 4410991 4393103 4429255 4477408 4350404 3869360 4297661 4187558 4349823
15393 4349823 4396305 4067153 4217569 4384810 4212249 4494672 4384131 4227839 4453295 4379993
15383 4379993 4538547 4418843 4342779 4213677 3945357 3821559 3566635 3785192 3818926 3777229
15373 3777229 3794638 4218250 4333786 4120605 3836571 4275925 4591694 4171863 4065831 3854345
15363 3854345 3773598 4188798 3778577 3829268 4260219 4052695 3882586 3786210 4065231 4293141
15353 4293141 4291912 4284042 4477869 4700680 4602159 4282302 3857981 3835621 3866680 3659495 4195351
15342 4195351 4083628 3942417 3970678 4056277 3659326 4280818 4370521 4092298 3896367 4285235
15332 4285235 4085916 4131325 4095260 3825793 4369788 4472643 4246961 4196293 4370333 4303668
15322 4303668 4560817 4238634 3534566 3848638 4346407 4179882 3781471 4168232 4416255
15313 4416255 4526897 4200577 4095953 4375501 4119633 4363101 4463185 4127593 4152010 4423002
15303 4423002 3981680 3981321 4337790 4415894 4065482 4458953 4501524 4453419 3943732 3692980
15293 3692980 4020630 4416293 4358921 4572160 4630718 4645581 4597492 4529657 4687640 4536613
15283 4536613 4172982 4409766 4263076 4307555 4390570 4045555 4375556 3972760 3613127 3877259
15273 3877259 4539072 4320068 4380786 4061810 4151871 4485933 4454994 4343211 4197410 4275426
15263 4275426 3730763 3802604 4244795 4167815 4202949 4091112 4175428 4389045 4216500 4370950
15253 4370950 4788286 4576597 4126393 4119730 4485837 4572965 4443173 4309649 3742865 3870453
15243 3870453 4030834 4061126 4574851 4627611 4064536 3833786 4016257 3800548 4099652 4357535
15233 4357535 3970749 3468285 4020597 4241298 3977791 4107441 4431745 4296774 4156430
15224 4156430 4434454 4411787 4009743 4190806 4267603 4168288 4181621 4262032 4383596 4251093
15214 4251093 4414242 4155109 4233622 4480155 4536268 4322924 4799685 4965538 4612592 4320834
15204 4320834 4301773 4264756 4027650 4171041 4549727 4628274 3984698 3673926 3509040 3874420
15194 3874420 4169384 4029209 3767790 4039363 4167149 3718311 3891720 3979644 4439854 4257623
15184 4257623 4171847 4178983 4453783 4255778 4365995 4528940 4348478 4156064 4292471 4632690
15174 4632690 4273581 4227266 3803081 4123057 4375523 4012304 4002079 3883363 3931228 4108869
15164 4108869 4159461 4123186 3995399 4167522 4305542 4450814 4171990 4019215 3861580 3861160
15154 3861160 3768599 3672362 3835388 4055195 3644126 3951942 4525187 4613041 4226393 4020909
15144 4020909 4718615 4980051 4616936 4409062 4257244 3991644 4448580 4753146 4495559
15135 4495559 4273730 4091218 3694230 3695871 4068711 4428072 4403027 4305518 4278686 4190877
15125 4190877 4314790 4595360 4636351 4106023 3404320 3599386 4421677 4202962 4200026 4255161
15115 4255161 4504182 4994614 4668745 4775946 4403151 4466178 4606186 4471120 4344431 4273808
15105 4273808 4155748 4174201 4295470 4522251 4514663 4534023 4527477 4217514 4346667 4281699 4176052
15094 4176052 4138575 4064362 4227445 4355808 4179770 4334557 4147688 3921681 4307706 4151708
15084 4151708 4244126 4193031 3719727 4441489 4429295 3736338 3825202 3972909 4422874 4629619
15074 4629619 4305422 4342645 4583437 4199839 4078901 4162926 4279510 4072406 3685711 3761622
15064 3761622 3913511 4381370 4569797 4392526 4267863 3849450 3714047 3977207 4080768
15055 4080768 4294797 4099663 4035607 4148893 4301983 4034676 4651619 4634570 3591927 3917502
15045 3917502 4038594 3958752 4132448 4083059 3678420 3980353 4316519 4346047 4051389 3924939
15035 3924939 4179441 4607035 4618704 4759221 5072868 4830210 4942880 4518348 4170616 4372453
15025 4372453 4319935 4259531 3940090 4132608 4276357 4195870 4099623 4328846 4357069 4435687
15015 4435687 4437056 4258141 4474550 4134167 4186381 3640689 4155665 4667687 4327768 4290808
15005 4290808 4980746 4769183 4747101 4772405 4379335 4216887 4193888 4674811 4365373 4591655
14995 4591655 4686767 4009720 4240800 4238902 3775971 3915088 4156229 4178257 4455784 4660208
14985 4660208 4760480 4862274 4551190 4852305 4847648 4588738 4261944 4202237 3933963 4123117
14975 4123117 4155959 4432670 4483358 4263675 4120619 4238054 4088369 4149514 4618958 4326567
14965 4326567 4107034 4150469 4410069 4541020 4684686 4360150 4014902 4261310 4846653 4423231
14955 4423231 4347718 4140446 4458135 4768354 4811335 4772360 4616191 4730371 5151346 5353011
14945 5353011 5337987 4667998 4145092 4252353 3807630 3878057 4469460 4404416 4285372 4327551
14935 4327551 4302772 4184932 4214982 4255559 4696998 4913446 4586650 4762693 4572165 4532722
14925 4532722 4951701 4857714 4756192 4605710 4519198 4701188 4383711 4427752 4711983 4330292
14915 4330292 4062903 4091732 4044674 4130675 4177350 4516104 4853076 4668188 3951420 3396681
14905 3396681 4034082 4470103 4640976 4732504 4263499 4642171 4582729 3992334 4385635 4815499
14895 4815499 4020706 3958122 3836281 4174207 4079898 4375254 4749865 4609849 4025254 4033956
14885 4033956 4210263 4254345 4131030 4474620 4132642 4037512 4666266 4599420 4652265 4362561
14875 4362561 4561991 4521390 4519008 4110079 4382087 4433001 4122874 4424548 4512465 4289764
14865 4289764 4107714 4585513 4987244 4643351 4547446 4634662 4423158 4612153 4020737 3742229
14855 3742229 4450020 4332178 4181543 4062505 4373850 4637552 4392565 4327076 4412850 4752451
14845 4752451 4590682 4126133 4320003 4346528 4232297 4241537 4433425 3967288 3966749 4047274 3901888
14834 3901888 3845731 3897578 3934500 3834629 4234991 4380313 4028368 4085241 4453000 4372158
14824 4372158 4006685 4191947 4295145 4384363 4392005 4480446 4377965 3881662 4478549 4534988
14814 4534988 4415864 4465601 4613371 4865304 4583780 4657558 4583981 4658507 4911585 4667523
14804 4667523 4486478 4672965 4791583 4457654 4430824 4388645 4089605 4116465 4356030 4398504
14794 4398504 4227391 4734549 4937754 5073798 4589230 4415384 4302661 4766704 5294324
14785 5294324 4472122 4450757 4699929 4304917 4568447 4945802 4923528 4687033 4407505 4547259
14775 4547259 4250031 4293562 4393107 4710805 4575290 4287308 4309597 4145865 4113397 4177363
14765 4177363 4265392 4338572 4057147 4323043 4361112 4470888 4474916 4383329 4180491 3980506
14755 3980506 4250137 4296177 3993378 4415113 4820502 4532009 4092648 4217982 4565846 4654864
14745 4654864 4640603 4793900 4694970 4464064 4473150 4060899 4070508 4202479 4673344 4448861
14735 4448861 4585490 4529558 4116924 4119699 4572457 4319666 4680128 4629306 4506370 4564781
14725 4564781 4339211 4190279 4473133 4221718 4138644 4323499 4225241 4583354 4480065 4142789
14715 4142789 4288346 4019670 3744332 4188154 4299553 4346671 4170334 3815126 3945110 3855486
14705 3855486 3900162 3529495 3571467 4248170 4294022 4635349 4136256 4294083 4229631 3989927
14695 3989927 4060976 3964552 3676391 3747301 3823425 4187020 3852181 4127974 4088308 4411617
14685 4411617 4437159 4282865 4503247 4727986 4520322 4480884 4310633 4717625 4801833 4351043
14675 4351043 5035793 5045598 4822911 4658032 4586328 4526609 4546671 4385889 4595143 4873327
14665 4873327 4836850 4249814 4448330 4572390 4360074 4807263 4607122 4271616 4457809 4159677
14655 4159677 4423107 4790233 4285119 4002360 4852875 5099255 5024196 4419287 4457658 4945379
14645 4945379 4757995 4569441 3980565 4055212 4131063 4241584 4682871 4285401 4577742 4782712
14635 4782712 4579765 4859508 4645784 4849651 5197579 4703121 3932518 3973117 4762552 3991660
14625 3991660 3108232 3826065 4119443 4575722 5148208 4703554 4277441 4248435 4575898 4577211
14615 4577211 4149127 4762456 4723004 4773657 4786388 4743239 4742515 4827313 5025342 4791096 4570965
14604 4570965 4552238 4184740 4178733 4035767 4472071 4789876 4466818 4322738 4171788 4416843
14594 4416843 4561520 4504760 4381554 4056966 4182510 4477979 4550979 4480331 4261410 4571565
14584 4571565 4619255 4656827 4522777 4369874 4365743 4235647 4333700 4242429 4503156 5063332
14574 5063332 4511839 4881136 4683223 4273121 4019159 4383632 4635296 4677705 4697570 4485355
14564 4485355 4420489 4454648 4138983 3734490 4130515 4508498 4594343 4723641 4927117 4877468
14554 4877468 4743021 4849139 4867068 4602267 4834988 5074164 4923650 4608774 4317921 4802243
14544 4802243 4896708 4629308 4753709 4594011 4121241 4442750 4592794 4608870 4803829 4481914
14534 4481914 4372821 4269251 4391429 4491950 4756079 5026429 4825364 4754468 4781996 4800808
14524 4800808 4420101 4412839 4727857 4875735 4814112 4552470 4817045 4697400 4437964 4325913
14514 4325913 4062987 4398923 4599629 4585847 4545185 4715329 4929888 4637440 4585217 4561310
14504 4561310 4452916 4445900 4404281 4190780 3616188 4094882 4655080 4487191 4271355 4017828
14494 4017828 4465433 4566710 4398569 4721741 4539865 3790546 3969168 4370345 4859585
14485 4859585 5011419 4885352 4622725 4406190 4084409 4726085 5056977 4634269 4732956 4843996
14475 4843996 4347947 4039592 4207381 4355450 4330057 4758676 4932807 4801850 4740056 4542735
14465 4542735 4347478 4234492 4287454 4521486 4560392 4346192 4655669 4931269 4630554 4165876
14455 4165876 3885887 4394202 4522419 4274199 4290363 4455010 4646581 4662081 4447469 4319640
14445 4319640 4407327 4695686 4130890 4061120 4419122 4818557 4656664 4335596 4431896 4446168
14435 4446168 4552732 4582571 4578197 4385671 4557552 4358571 4315762 4121412 4428990 4291897
14425 4291897 3864653 3722170 4299023 4427253 4435330 4570843 4280318 4334202 4502615 4341173
14415 4341173 4574458 4714049 4416130 4522921 4762774 4562087 4225228 4358631 4527177
14406 4527177 4232412 3925204 4294154 4699924 4650294 4535902 4531720 4482494 4709865 4711583
14396 4711583 4601006 4614870 4658495 4489646 4381212 4710802 4397671 4276367 4177855 4165979
14386 4165979 4153103 4122115 4274286 4728435 4687608 4832987 4848631 4767047 4193194 4267495
14376 4267495 4644150 4496632 4863064 4657036 4899403 4434110 4252870 4395575 4347705 4688565
14366 4688565 4793235 4807608 4868103 4550405 4166015 4116671 4428231 4744271 4521878 4794974
14356 4794974 4865483 4611383 4770415 4640202 4858753 4299990 4431822 4713757 4552765 4641735
14346 4641735 4738409 4821492 4552251 4785181 4383648 4194834 4123239 3920581 4669782 4576630
14336 4576630 4502510 4791396 4502297 4850719 4638500 4602892 4771464 4938212 4971247 4514780
14326 4514780 4167131 4355814 4391086 4750992 4724140 4843190 5008799 4818537 4865124 4662180
14316 4662180 4410268 4370988 4490548 4750703 4383374 4618746 4805029 4527741 5274305 5030666
14306 5030666 4769481 4736585 4693800 4271899 4265745 4450134 4717514 4552618 4308500 4527401
14296 4527401 4607631 4596567 4037685 4068456 4164904 4270079 4338545 4518833 4671100 4888703
14286 4888703 4948703 4570973 4159471 4203203 4516913 4135376 4516469 4867129 5128991 4727678
14276 4727678 4656195 4820637 4515851 4502921 4525458 4421729 4858415 4963465 5044288 5016551
14266 5016551 5198730 5041384 4496254 4300707 4447567 4710674 4636920 4435203 4561105 4540681
14256 4540681 4703829 4914187 4872225 4429123 4905856 4962113 4439053 4684541 4639862 4442786
14246 4442786 3752156 4291772 4618659 4726044 4727282 4766223 4678632 4394407 4312965 4681413
14236 4681413 4471697 4391913 4328489 4518238 4953328 4696030 4659911 4355014 4292006 4488982
14226 4488982 4389617 4440270 4389338 4395145 4365932 4466911 4796609 4560656 4442207 4897832
14216 4897832 4999356 4895717 4811354 4301467 3953893 4583838 4513360 4117753 4319110 4218178
14206 4218178 4142533 4216198 4195341 4369480 4687883 4450343 4599958 4316694 4090744 4435916
14196 4435916 4536911 4549211 4593209 4951698 4553738 4458281 4600587 4493382 4786294 4834774
14186 4834774 4949318 4605798 4379785 4703326 4524214 4339326 4219131 4596224 4764622
14177 4764622 4779397 4672044 4418933 4303865 4457686 4806470 5095040 4467722 4064162 4444676
14167 4444676 4551496 4530135 4575381 4512009 4489009 4376170 4478914 4766006 4488210 4871612
14157 4871612 4714443 4532258 4713692 4413487 4555320 4834664 4430980 4184502 4131270 4627160
14147 4627160 4761098 4895811 5118755 5140131 5537516 5563433 5173551 5106614 4999388 4944572
14137 4944572 5166541 4817374 4598645 4468339 4526452 4761883 4467251 4221892 4487504 4412324
14127 4412324 4465758 4826530 4586205 4448231 4522653 4528381 4818494 4699681 4351259 4462386
14117 4462386 4231865 4413285 4441224 4427151 4716410 4787079 4890563 4984353 5022405 4949893
14107 4949893 4577724 4109069 4280277 4873383 4911874 4667964 4817247 4464099 4181716 4535339
14097 4535339 4443474 4249493 4617060 4878476 4898380 4687406 5228445 5149638 4665574 4115923
14087 4115923 4505286 4737299 4575604 4796086 4408177 4449339 4480059 4439361 4327834 4704917
$$ [...]
##END NTUPLES=NMR SPECTRUM
##END=
