##TITLE=1H_CA-8833-8
 CDCl3, 8 sc, 
 9.06.2021
##JCAMPDX= 6.0         $$ Bruker NMR JCAMP-DX V2.0
##DATA TYPE= NMR SPECTRUM
##DATA CLASS= NTUPLES
##ORIGIN= UXNMR, Bruker Analytische Messtechnik GmbH
##OWNER= root
$$ XWIN-NMR		Version 3.5
$$ Wed Jun  9 10:49:40 2021 Russian Standard Time (UT+4h)  she@DPX200
##.OBSERVE FREQUENCY= 200.131506
##.OBSERVE NUCLEUS= ^1H
##.ACQUISITION MODE= SIMULTANEOUS
##.ACQUISITION SCHEME= undefined
##.AVERAGES= 8
##.DIGITISER RES= 18
##SPECTROMETER/DATA SYSTEM= spect
##.PULSE SEQUENCE= zg30
##.SOLVENT NAME= CDCl3
##.SHIFT REFERENCE= (INTERNAL, CDCl3, 0, 17.5215)
##AUDIT TRAIL= $$ (NUMBER, WHEN, WHO, WHERE, WHAT)
$$ ##TITLE= Audit trail, XWIN-NMR		Version 3.5
$$ ##JCAMPDX= 5.01
$$ ##ORIGIN= Bruker BioSpin GmbH
$$ ##OWNER= she
$$ F:/spectra/data/she/nmr/H-F/1/pdata/1/auditp.txt
$$ ##AUDIT TRAIL=  $$ (NUMBER, WHEN, WHO, WHERE, WHAT)
(   1,<2021-06-09 10:48:11.37 +0400>,<she>,<DPX200>,
      <created by zg, POWCHK disabled, PULCHK disabled
       configuration hash MD5:
       00 E9 B6 7A A2 85 ED C7 34 08 36 98 17 FE 4E 26
       data hash MD5: 16K
       F0 E7 74 0C B7 C4 99 E3 88 DB 92 B0 70 B3 B5 29>)
(   2,<2021-06-09 10:48:13.68 +0400>,<she>,<DPX200>,
      <Start of raw data processing
       efp BC_mod = 2 LB = 0.24 FT_mod = 6 PKNL = 1 PHC0 = -11484.75 PHC1 = 10.60101 SI = 16K 
       data hash MD5: 16K
       19 E8 2A 09 AD 65 58 A0 EA 98 FC D2 D6 A9 B8 AA>)
(   3,<2021-06-09 10:48:43.15 +0400>,<she>,<DPX200>,
      <pk PHC0 = 2.990901 PHC1 = -1.4 
       data hash MD5: 16K
       81 DF 9A B6 17 00 CE 51 C3 81 53 23 10 04 9B D9>)
(   4,<2021-06-09 10:48:46.50 +0400>,<she>,<DPX200>,
      <abs ABSG = 5 
       data hash MD5: 16K
       CC 38 BE 79 29 AE E6 82 51 2C 15 8E 8B 4E 07 80>)
$$ ##END=
$$ 
$$ hash MD5
$$ F5 C8 2F C2 E7 29 4D 12 26 4A 4A 70 4D 71 3A 0D
##$RELAX= 
##$RELAX= 
##$RELAX= 
##$RELAX= 
##$RELAX= 
##$RELAX= 
$$ Bruker specific parameters
$$ --------------------------
##$DU= <F:/spectra>
##$EXPNO= 1
##$NAME= <H-F>
##$PROCNO= 1
##$TYPE= <nmr>
##$USER= <she>
##$AMP= (0..31)
100 100 100 100 100 100 100 100 100 100 100 100 100 100 100 100 100 100 
100 100 100 100 100 100 100 100 100 100 100 100 100 100 
##$AQSEQ= 0
##$AQ_mod= 1
##$AUNM= <au_zg>
##$AUTOPOS= <>
##$BF1= 200.13
##$BF2= 200.13
##$BF3= 200.13
##$BF4= 200.13
##$BF5= 200.13
##$BF6= 200.13
##$BF7= 200.13
##$BF8= 200.13
##$BYTORDA= 1
##$CFDGTYP= 0
##$CFRGTYP= 5
##$CHEMSTR= <none>
##$CNST= (0..31)
1 1 145 1 1 1 1 1 1 1 1 1 1 1 1 1 1 1 1 1 1 1 1 1 1 1 1 1 1 1 1 1 
##$CPDPRG= <>
##$CPDPRG1= <>
##$CPDPRG2= <>
##$CPDPRG3= <>
##$CPDPRG4= <mlev>
##$CPDPRG5= <mlev>
##$CPDPRG6= <mlev>
##$CPDPRG7= <mlev>
##$CPDPRG8= <mlev>
##$CPDPRGB= <>
##$CPDPRGT= <>
##$D= (0..31)
0 1.2 0 0 0 0 0 0 0 0.06 0 0.03 0 0 0 0 0.0002 0 0 0 0 0 0 0 0 0 0 0 0 
0 0 0 
##$DATE= 1623221290
##$DBL= (0..7)
120 120 120 120 120 120 120 120 
##$DBP= (0..7)
150 150 150 150 150 150 150 150 
##$DBP07= 0
##$DBPNAM0= <>
##$DBPNAM1= <>
##$DBPNAM2= <>
##$DBPNAM3= <>
##$DBPNAM4= <>
$$ [...]
##$SUBNAM3= <"">
##$SUBNAM4= <"">
##$SUBNAM5= <"">
##$SUBNAM6= <"">
##$SUBNAM7= <"">
##$SUBNAM8= <"">
##$SUBNAM9= <"">
##$SW= 20.0188882624521
##$SWIBOX= (0..15)
0 0 2 0 0 0 0 0 0 0 0 0 0 0 0 0 
##$SW_h= 4006.41025641026
##$TD= 16384
##$TD0= 1
##$TE= 0
##$TE2= 300
##$TE3= 300
##$TEG= 300
##$TL= (0..7)
0 120 120 120 120 120 120 120 
##$TP= (0..7)
150 150 150 150 150 150 150 150 
##$TP07= 0
##$TPNAME0= <>
##$TPNAME1= <>
##$TPNAME2= <>
##$TPNAME3= <>
##$TPNAME4= <>
##$TPNAME5= <>
##$TPNAME6= <>
##$TPNAME7= <>
##$TPOAL= (0..7)
0.5 0.5 0.5 0.5 0.5 0.5 0.5 0.5 
##$TPOFFS= (0..7)
0 0 0 0 0 0 0 0 
##$TUNHIN= 0
##$TUNHOUT= 0
##$TUNXOUT= 0
##$USERA1= <user>
##$USERA2= <user>
##$USERA3= <user>
##$USERA4= <user>
##$USERA5= <user>
##$V9= 5
##$VALIST= <valist>
##$VCLIST= <CCCCCCCCCCCCCCC>
##$VD= 0
##$VDLIST= <DDDDDDDDDDDDDDD>
##$VPLIST= <PPPPPPPPPPPPPPP>
##$VTLIST= <TTTTTTTTTTTTTTT>
##$WBST= 1024
##$WBSW= 4
##$XGAIN= (0..3)
0 0 0 0 
##$XL= 0
##$YL= 0
##$YMAX_a= 452424
##$YMIN_a= -464047
##$ZGOPTNS= <>
##$ZL1= 120
##$ZL2= 120
##$ZL3= 120
##$ZL4= 120
##$ABSF1= 17.50321
##$ABSF2= -2.515829
##$ABSG= 5
##$ABSL= 3
##$ALPHA= 0
##$AQORDER= 0
##$ASSFAC= 0
##$ASSFACI= 0
##$ASSFACX= 0
##$ASSWID= 0
##$AUNMP= <proc_1d>
##$AZFE= 0.1
##$AZFW= 0.1
##$BCFW= 0
##$BC_mod= 2
##$BYTORDP= 0
##$COROFFS= 0
##$CY= -3
##$DATMOD= 1
##$DC= 0
##$DFILT= <>
##$DTYPP= 0
##$F1P= 0
##$F2P= 0
##$FCOR= 1
##$FTSIZE= 16384
##$FT_mod= 6
##$GAMMA= 0
##$GB= 0
##$INTBC= 1
##$INTSCL= 1.334414e-10
##$ISEN= 128
##$LB= 0.24
##$LEV0= 0
##$LPBIN= 0
##$MAXI= 10000
##$MC2= 0
##$MEAN= 0
##$ME_mod= 0
##$MI= 1.114404
##$NCOEF= 0
##$NC_proc= -5
##$NLEV= 6
##$NOISF1= 3.799351
##$NOISF2= 2.8
##$NSP= 0
##$NTH_PI= 0
##$NZP= 0
##$OFFSET= 17.52155
##$PC= 1
##$PHC0= -11481.76
##$PHC1= 9.201011
##$PH_mod= 1
##$PKNL= yes
##$PPARMOD= 0
##$PSCAL= 0
##$PSIGN= 0
##$REVERSE= no
##$SF= 200.130002617082
##$SI= 16384
##$SIGF1= 3
##$SIGF2= 2
##$SINO= 5.538805
##$SIOLD= 16384
##$SREGLST= <1H.CDCl3>
##$SSB= 0
##$STSI= 16384
##$STSR= 0
##$SW_p= 4006.41025641026
##$SYMM= 0
##$S_DEV= 0
##$TDeff= 16384
##$TDoff= 0
##$TI= <>
##$TILT= no
##$TM1= 0
##$TM2= 0
##$TOPLEV= 0
##$USERP1= <user>
##$USERP2= <user>
##$USERP3= <user>
##$USERP4= <user>
##$USERP5= <user>
##$WDW= 1
##$XDIM= 16384
##$YMAX_p= 270381715
##$YMIN_p= -470663
$$ End of Bruker specific parameters
$$ ---------------------------------
##NTUPLES= NMR SPECTRUM
##VAR_NAME=  FREQUENCY,     SPECTRUM/REAL,   SPECTRUM/IMAG
##SYMBOL=    X,             R,               I
##VAR_TYPE=  INDEPENDENT,   DEPENDENT,       DEPENDENT
##VAR_FORM=  AFFN,          ASDF,            ASDF
##VAR_DIM=   16384,         16384,           16384
##UNITS=     HZ,            ARBITRARY UNITS, ARBITRARY UNITS
##FACTOR=    0.24454680195387, 1,            1
##FIRST=     3506.58769222527, 0,            0
##LAST=      -499.822564184995, 0,           0
##MIN=       -499.822564184995, -470663,     0
##MAX=       3506.58769222527, 270381715,    0
$$ Real data points
##PAGE= N=1
##DATA TABLE= (X++(R..R)), XYDATA
$$ [...]
6432c2700L9294j28610j9089J75667O961j32451P6874M6852j6637j03831N3440
6421c4230J59047q4743j03324L7482n0J10712P465k26090k2106J62822j3919L659
6409c275j64410l6455J43603L9634J06633n1814j41154j48211K10226P6853n6334
6398b4704j3417p0202J35475n5138j6406K1413n706J5460j7769o0431N5989O4886
6386B9450n7383N7583k0693l1671J01615q4034J7599j47513J18895N5393P0901
6375A10142k06604k9667J45178n300J07083K0382k0660k50055R5120l7173K8358
6364d3196P8533n0778K7111p0965J29234M2367r1081r3959p3357J35008K5649
6353A4566r0777l731J6074J5572k5800p6249J30703Q1783o9717k340N236O1633
$$ y = [-32700, 6594, -122016, -141105, 34562, 41523, -90928, -14054, 32798, 16161, -87670, -34230, 124817, 40074, -63250, -25768, -25818, 84894, 92359, -133731, -155837, 6985, -6934, -3275, -167685, -204140, -60537, -20903, 85730, 33916, -107238, -255449, -45223, 31630, -24704, -38121, -108323, 27152, -27986, -44392, -22979, -28685, -13225, -30994, -91425, -35436, 29450, -27933, 29650, 8957, -22714, 78901, -5133, 12466, -135047, -16152, 39241, 110142, -96462, -126129, 19049, 13749, 120832, 141214, 120554, -129501, -34381, -71554, -43196, 35337, -15441, 11670, -59295, 69939, 112306, 21225, -72734, -146091, -11083, 14566, -76211, -79942, -63868, -48296, -74096, -150345, -19642, 62141, -7576, -9916, -4680, 56953]
6341E6953N0940j60557m2306O7185J50364j01372j19752l1975O0330n2142J39806
6330A7474J16053j31861l2097N2677M4134N8670j13811M1403k7667N3627l8119
6319D0483K6214j79150j0219N5802L3809j8432R4573m3063q7227Q6673N129j36335
6307a31743N1491J12958L0535j747j05071m6093J2391J7561p4528J64346K44618
6296B74718k04608n1656n6123O3247N7264j21231M97M5274m0899J1690L1543R134
6284A8850q5039J02467j4229o1167k5346l0060J89137j55564J03122j62040J72709
6273E2840J823O7348j79537j38086Q2275K29649l4919p7968o2763J27198m6490
6262B1370n444J008o2700K05204o8493J6268o0567j66520k23J35500k3498p4204
$$ y = [56953, 107893, -52664, -94970, -27785, 122579, 21207, -98545, -130520, -70190, -122332, 17474, 133527, 1666, -30431, 22246, 66380, 125050, 11239, 52642, 24975, 78602, 40483, 66697, -112453, -122672, -66870, -33061, -51493, 43080, 17, -87210, -537, 4592, -131743, -80252, 32706, 63241, 61494, -43577, -89670, -77279, -59718, -134246, 30100, 274718, 70110, 18454, -37669, 25578, 82842, -38389, -37892, 7382, -33517, -21827, 9716, 18850, -66189, 36278, 22049, -39118, -64464, -94524, 94613, -60951, 42171, -119869, 52840, 54663, 122011, -57526, -195612, -113337, 116312, 81393, 3425, -59338, 67860, 21370, 15926, 16934, -45766, 159438, 90945, 107213, 46646, -119874, -120097, 15403, -8095, -82299]
6250h2299J73183j43813m4763N0922O5047m2671M7850p9114N3603l7297j70182
6239b09534J73796J01671j32484J11477J49226k13507r4341J15495j56503J26591
6229b8113J64383j67250j06574P432Q6219J01526L1598q4032J1010P556m0740
6218a6985j46302R1439L6174l7123k3962J26073n6949k1700N1254r8374R8826
6207B371J39120q7203r116n0564o1938J55266o8719j31655J34987L756p0165O1599
6195A7739l9734M4352P7672j25230J6453q6514o6713P1448R1399j6605K1616o7892
6183f2009l0943L2769J93568m9757j37830M3055K8290p9043l7323J01727k4454
6172b1950j66755K04871J03242k15814l7149J69086l898o7986J46940m4367j66316
$$ y = [-82299, 90884, -52929, -97692, -46770, 18277, -24394, 23456, -55658, -2055, -39352, -209534, -35738, 65933, -66551, 44926, 194152, -19355, -113696, 1799, -154704, -28113, 136270, -30980, -137554, -130122, -43903, 57623, 89221, 5189, 16199, 23755, -16985, -163287, -71848, -35674, -72797, -96759, 29314, -27635, -49335, 1919, -96455, 2371, 141491, 54288, 45172, -5392, -67330, 87936, 19217, -112438, 22549, 26305, -43860, 17739, -21995, 22357, 100029, -25201, -8748, -95262, -161975, -90527, 872, -15733, 5883, -62009, -92952, -60183, 133385, 83628, -54202, -11147, 17143, -61900, -99223, 2504, -21950, -188705, 16166, 119408, -96406, -133555, 35531, 31633, -36353, 110587, 66220, -100096]
6161a00096J2744n0698P2302Q9518n125N4457j04241l9601P2273j5075n5599n3040
6149a22181P5965J39164K2376j65616J60621k03464l1123N3097J34415k0502j14460
6138g1708n58O3541P8513j41557Q1937J22061m2646l0027j06021L6919n4543J8643
6126d5446N8440m499J2897j2109Q398p5477P3269P6806q2641j76831J00786n1466
6114a17873J75484j32735J04157p2278Q6951N3273o9063L001j05288q2146J09760
6103d6757J41365j57510o8243J25059P3016j02637j09715J28119j01714J18476
6093e41O8302m1232j00347P3240R5869j1904n3698j32916J89284n6387o7166o1829
6081i9325J2812O9935n2422J70024p9579j22588J02801q1315n4620N6290J76505
$$ y = [-100096, -87352, -138050, -65748, 23770, 18645, 73102, -31139, -70740, 1533, -13542, -69141, -122181, -46216, 92948, 115324, -50292, 110329, -93135, -124258, -71161, 63254, 42752, -71708, -72266, -8725, 69788, -71769, 10168, 132229, 89583, 59556, -46465, -9546, -64089, -45446, 12994, 8495, 21392, 9283, 17681, -57796, 15473, 92279, 9638, -167193, -66407, -117873, 57611, -75124, 29033, -43245, 43706, 96979, 27916, 30917, -74371, -156517, -46757, 94608, -62902, -131145, -6086, 66930, -35707, -145422, -17303, -119017, -541, 67761, 26529, -73818, -578, 95291, 83387, 29689, -103227, 86057, 29670, -37496, -99325, -86513, -16578, -69000, 101024, 21445, -101143, 1658, -79657, -134277, -77987, 98518]
6070I8518k51650J67999n56n1231P8330m5006J03491J1790k7493j36168J04463
6059E2487m1351k3907o2273l6585J7176O1521n0343m7869K14149p1883j11111
6048i9989J48007J26430K5341j62799k9526o6855N7947k6398l4493P5199o5974
6037e3110r9248M9959M5264J55466j03078m4327K88626p8772j02924J2971o5879
6026D948p4718J14412j19034L5948P7403j38029R2201J37323j06313J0726p5075
6015d0208O1035Q0223j44119R066R7983o0128j32150J21100M6214J1074Q050p7188
6003a9048j5704M7480K2652j3018k5296j25560R3708J08902M5239j8522k2065
5992G8768j22837M8066p7024n4023J24537o756N5116l4764j56166R630J27984
$$ y = [98518, -153132, 14867, 14311, -36920, 41410, -3596, 99895, 111685, 84192, -51976, 52487, 11136, -12771, -75044, -111629, -94453, -32932, -83275, -131144, 83005, 11122, -99989, 48018, 174448, 199789, 36990, 7464, -59391, -1444, -27842, -62335, 12864, -53110, -152358, -102399, -57135, 98331, -4747, -49074, 239552, 160780, 57856, 70827, 4948, -69770, 44642, -74392, -38444, 38959, -99070, -6869, 130454, 24141, 34867, -40208, 20827, 101050, -43069, -34003, 63980, 3852, -128298, -7198, 39016, 50090, 58140, -19048, -34752, 12728, 35380, 22362, -2934, -128494, -34786, 74116, 119355, 100833, 78768, -44069, 3997, -73027, -127050, -2513, -9269, 45847, 11083, -145083, -135453, -7469]
5981g469Q4746l6519k6621p5784O1947J19847o5227l0025J9454m9841O1338N4482
5969A10328j09306j05511O9793J43353r6795o2440J29654K9848k7488j82127J9449
5958h1242P4997N3902m3941K8466n5510M3913K53881k97752l691N4566n4142N3417
5946B6864k0901q0262J34777k5959j71537J45330p3516K1761j2918Q1899N5509
5935H1047p0749l4067l2088L0367o3107J07739o0214J07889K9888m8611k2862
5924B5232j9716n6446k7479l1407J24921j9082K6674P8998j24497L1652P5323
5913H4173l1206J5904k5435j20124P6676l379k1382J6995N7123o0964p2707l5576
5901a19902J98805l7855l7428L9647M9153K2498r3542n467j4986O6324P374J5160
$$ y = [-7469, 77277, 40758, 14137, -61647, 300, 120147, 54920, 24895, 44349, -5492, 55846, 110328, 1022, -104489, -34696, 108657, 11862, -50578, 79076, 108924, 81436, -100691, -81242, -6245, 47657, 3716, 32182, -23328, 20585, 274466, -23286, -26977, 27589, -26553, 26864, 5963, -74299, 60478, 34519, -137018, 8312, -65204, -43443, -56361, 25538, 81047, 10298, -23769, -55857, -25490, -88597, 19142, -41072, 66817, 96705, 48094, 25232, 5516, -50930, -78409, -109816, 15105, -3977, 22697, 101695, -22802, 8850, 84173, 52967, 68871, 43436, -76688, -12, -3391, -24773, -7778, 49345, -11619, -84326, -119902, 78903, 41048, 3620, 43267, 92420, 114918, 21376, 15909, 923, 67247, 74621, 89781]
5889H9781p0460l3144K5608L7419l2428P1234k29722Q9373R8861o368q9042P5708
5877B6820k2400K4422p5689N9616O7502M8336j0725p8678K4219n0592N9899p0203
5865B527J9329r5237J71782M7959j12671Q6472k9660j20051K38611j99075J06300
5854A16286q0114N774N1473K5960j56233J04083m8204L2773R2250l7133p8968
5843B7947J06878J4813j42804K2741j41097J56211J24270j6212j45655R6987j7770
5832H6309l2956L0591m3668J18808M1738j48040L4563K8939N1753r261p845N2946
5820B03877q6645q5366J32576q7436P4636r0630N5991l617P0500j46280J47224
5809A84830o051O072n2631J00992Q9910j21652O790n0911j3592P7427R134j09465
$$ y = [89781, 19321, -13823, 11785, 49204, 16776, 88010, -141712, -52339, 46522, 40154, -48888, 26820, 4420, 28842, -46847, 12769, 80271, 128607, 117882, 39204, 63423, 12831, 72730, 2527, 21856, -73381, 98401, 146360, 33689, 120161, 90501, -29550, 209061, 9986, 116286, 36172, 41946, 93419, 119379, -36854, 67229, 19025, 51798, 144048, 106915, 27947, 134825, 149638, 6834, 29575, -111522, 44689, 168959, 152747, 7092, 104079, 86309, 53353, 83944, 40276, 159084, 200822, 52782, 87345, 116284, 168037, 158776, 150931, 203877, 117232, 31866, 164442, 77006, 151642, 61012, 117003, 113386, 183886, 37606, 184830, 178779, 184851, 132220, 233212, 323122, 201470, 208260, 157349, 143757, 221184, 230318, 120853]
5797A20853O303m811J60617p1768Q1790l4596K8978o887p2260J35536j19590L1173
5785B55338J14662r1148J05119j34104Q5835Q8985j29578J48727L6922j56297
5775C24461q8300J73492J39173j6011R369j3010Q9459l1364l3229N4200J02408
5764G10648J43315J02661k0936J6491N1269K23830K0228p2149j64327P1838O3945
5753A146813M4913j00767j00796o9045J91347J46641J6832J5737Q02K75798N1968
5742A620243M4142K66372L15320J40292J41067L44751K15557J82558O9429j20139
5732C219592j31590k21797j47509k16029j92363p7223n4559m1049p2479j4577
5722B050417K38911j3430J16318J66903J54761L14583J95202J24746M21946L58681
$$ y = [120853, 127156, 122345, 282962, 211194, 292984, 258388, 287366, 280479, 208219, 343755, 224165, 255338, 370000, 278852, 383971, 249867, 335702, 424687, 295109, 443836, 480758, 324461, 236161, 409653, 548826, 532815, 542184, 529174, 618633, 587269, 554040, 608240, 710648, 853963, 956624, 935688, 952179, 1003448, 1227278, 1247506, 1175357, 1011030, 1082868, 1146813, 1191726, 1090959, 990163, 921118, 1112465, 1259106, 1275938, 1291675, 1292477, 1568275, 1620243, 1664385, 1930757, 2246077, 2386369, 2527436, 2872187, 3087744, 3270302, 3339731, 3219592, 3088002, 2866205, 2718696, 2502667, 2310304, 2233081, 2178522, 2137473, 2064994, 2050417, 2289328, 2275898, 2392216, 2559119, 2713880, 3028463, 3223665, 3348411, 3770357, 4129038]
5712D129038L60197K77815K3656j48583l8875l10585n50926k59604m45851j67380
5702B868902j94929k86910m3154j42000O2189J01146l727j11456K3120O1170L21980
5691B656331K10183R2366K58056J46983K18581l8556L6274j65281l03541m31611
5681B679785j96298j57045j65048j75057l80845j14640n4069J12828k15320j0168
5671A324123r2826J1018J4865j79624R2441P0859r4054J50837o987o0879J33123
5660A362896p4653j52710o4671j00850l7737Q263k62942j12259k6306J01911j51889
5649D89053J08757p2165J13330j92342l8150N4417L7785j02978o9180M8233J4952
5638C91712l0523M052j11316k8989P2576J10061j3289k33068K48815j32928O5977
$$ y = [4129038, 4489235, 4767050, 4790706, 4642123, 4603248, 4292663, 3741737, 3482133, 3036282, 2868902, 2673973, 2387063, 2343909, 2201909, 2264098, 2365244, 2361517, 2250061, 2273181, 2334351, 2656331, 2866514, 2958880, 3216936, 3363919, 3582500, 3543944, 3580218, 3414937, 3111396, 2679785, 2483487, 2326442, 2161394, 1986337, 1605492, 1490852, 1436783, 1549611, 1334291, 1324123, 1231297, 1242315, 1257180, 1077556, 1169997, 1240856, 1146802, 1297639, 1290652, 1229773, 1362896, 1288243, 1135533, 1070862, 970012, 932275, 940538, 677596, 565337, 539031, 640942, 489053, 597810, 525645, 638975, 446633, 408483, 462900, 500685, 397707, 328527, 376760, 391712, 361189, 365241, 253925, 224936, 297512, 407573, 394284, 161216, 410031, 277103, 343080]
5627C43080J6080r4050p8326M3974N8699J30554j35922k10307O2488N5748o7792
5616A24226K3487N3479J9861R0743k12922q7565J42298L5496L8629r3364N1146
5605A85514m5031K2107L2484j5064j09796L0989J99589k6229j78659J46749j11986
5594A30667m1596J04778m7018l5165k1905J03075r2537k7790J01602o3211j42204
5583c1304M7983J45697K2619j00315K4842o5958J11370P0558K3347k37028O2076
5572G3887J54865j5342q0100n0441J8702l3093m5318o967k35k0428K26027r2167
5560A29390K246j45947P0148J663J00986j112j4904M0355j33140K6927N5261j3696
5548A18177o4772k3836k7890L2508O0092L9626J59661j23534j76386O2844O8187
$$ y = [343080, 359160, 265110, 186784, 230758, 289457, 420011, 284089, 73782, 136270, 192018, 124226, 147713, 201192, 221053, 311796, 98874, 11309, 153607, 189103, 227732, 134368, 185514, 140483, 162590, 195074, 180010, 70214, 101203, 300792, 274563, 95904, 242653, 130667, 89071, 193849, 146831, 111666, 89761, 192836, 100299, 72509, 174111, 110900, -31304, 16679, 162376, 184995, 84680, 109522, 43564, 154934, 225492, 248839, 11811, 73887, 228752, 213410, 133310, 82869, 101571, 68478, 23160, 16193, 15958, -4470, 221557, 129390, 131636, -14311, 55837, 57500, 158486, 157374, 142470, 182825, 49685, 76612, 131873, 118177, 53405, 29569, 1679, 34187, 94279, 133905, 293566, 170032, -6354, 56490, 124677]
5537A24677l5862j0237K285L321J7785m016j07221L7554J67906j78342Q4460N2909
5525A55219M4389k56883Q9022O2813K2295O4169k6671l7033k2020m9859J8964
5514F4405K2029q1338N6837Q3162n5905k4009L4165Q2868j25372Q1029n8472o6880
5502A2519O2404J552k05813K77270P1247j16700m2787p9576P9583O8625P8168
5491B06492m2799J8292j31147q1973O4197J08931j31710N2575m3445Q7705r593
5480I7525M3051K136p7610r95K3975k6825J14789j61470P4700J41194j75387M3358
5468I8441m069J249P0322q9306n2732R8158p8372Q1927K8564n9566l2370l536
5456E8710L8460J43534J1668k11616J10475L8815N8861L5554j64684N159P6385
$$ y = [124677, 88815, 78578, 80863, 84184, 101969, 97953, -9268, 28286, 196192, 17850, 102310, 155219, 199608, -57275, 31747, 94560, 116855, 181024, 154353, 117320, 95300, 45441, 64405, 86434, 5096, 61933, 145095, 89190, 65181, 99346, 182214, 56842, 137871, 79399, 12519, 74923, 76475, -129338, 147932, 219179, 102479, 59692, -19884, 59699, 128324, 206492, 163693, 181985, 50838, -31135, 33062, 141993, 10283, 62858, 19413, 107118, 97525, 140576, 142712, 65102, 64107, 88082, 61257, 176046, 14576, 89276, 230470, 55083, 98441, 94372, 95621, 165943, 76637, 23905, 122063, 43691, 125618, 154182, 94616, 62246, 58710, 97170, 240704, 252372, 40756, 151231, 190046, 248907, 284461, 119777, 124936, 201321]
5445B01321r7495L4928q192K9423l7403M1702L8878k2137j24933J30595j6827
5434A69860K9424r227o8430J01218M7860l6745q9175O7542k3924P4220q0030O8733
5422B51326K0953j86481J16298O1545r3201J49368r2691k4404l2315l3941N0417
5411A86874m9764k9586J34163o0173P5308N2727j08483k6859J34782n9468m5796
5400B03725O8101j12180J01773J9235j25500O1900l0794o7909j5295J27740N2996
5389B83792q8838l4137N9073N8692j73937J80627q9185M9161P5902p7573j16677
5378A26900J08360M6803o2815L5810L9624k138R066l1045l2348J88750j30369
5367B96598J15600j33529m2990O4851j35461J31215M5641o9640n9805Q2065k9448
$$ y = [201321, 103826, 138754, 130562, 159985, 122582, 164284, 203162, 181025, 56092, 186687, 169860, 199284, 190057, 121627, 222845, 270705, 233960, 144785, 212327, 188403, 262623, 182593, 251326, 272279, 85798, 202096, 263641, 170440, 319808, 227117, 202713, 170398, 136457, 186874, 137110, 107524, 241687, 181514, 256822, 309549, 201066, 174207, 308989, 249521, 203725, 271826, 159646, 261419, 280654, 155154, 217054, 186260, 118351, 103056, 230796, 283792, 194954, 160817, 219890, 278582, 104645, 285272, 196087, 245248, 321150, 243577, 126900, 235260, 282063, 219248, 255058, 294682, 292544, 301610, 270565, 238217, 426967, 296598, 412198, 278669, 235679, 300530, 165069, 296284, 341925, 272285, 212480, 294545, 265097]
5356B65097j18045J45796R3306j43638O1036J00558r1746O2834J9011P2809m0108
5345D26910j24926N5288m3836L0711l3133q9562K4681J3799J4600j15232J28039
5334B87339J1172O258P1493l8576j39838J62106O3784j08328k0651j1119j24897
5323A58743J05307l1422m3259K01000o5163j6563j18966K04841j14695o1139J42103
5312C60787n6371p7984O3596J6253k09554N7142J06195J29681j64421j6062l4438
5301A74824J89371J26313k08964K4681l8186N2376m3803M7797l7672l8074R095
5290B57758J57040k4604M2625j03384k8445R555Q7615J33870o5962j12820Q512
5279C61760n9839J03279n1835L525J49206P913r8933J32914L6664m2339m9751
$$ y = [265097, 147052, 292848, 386154, 242516, 303552, 404110, 312364, 375198, 394209, 467018, 426910, 301984, 357272, 313436, 344147, 311014, 221452, 246133, 259932, 274532, 159300, 287339, 298511, 304769, 376262, 337686, 197848, 359954, 423738, 315410, 294759, 283640, 158743, 264050, 232628, 189369, 390369, 325206, 308643, 189677, 394518, 279823, 218684, 360787, 304416, 226432, 290028, 306281, 96727, 153869, 260064, 389745, 225324, 209262, 174824, 364195, 490508, 281544, 306225, 268039, 320415, 276612, 324409, 286737, 248663, 257758, 414798, 390194, 432819, 329435, 300990, 310545, 398160, 532030, 466068, 353248, 361760, 301921, 405200, 353365, 356890, 506096, 514009, 415076, 547990, 584654, 542315, 492564]
5268D92564J56609j95861p979N4539n2876K64025j1235k7162j05904P2358L2831
5257F71909m973p769N479j43929P1499J13022M8045j13222L5346j08125K10368
5246G77650l8699J66124l4200J7539m6150N3155R3717j9262j36173j2290L0676
5235H52087L4530M3708o0091P5900r4223K01558k15893m550M2779J08472r9092
5224H85185R3795J0780j8051R5453O6797M3583o5038J15167l0972J52289m9238
5213A299750P7176K8911J08705O2971j64702P5321J38990m9283R223L54824m7444
5202A894442j55439J19381K53626R4217j10139P4494K26760J00601N9141J91711
5192B748795J87398L8798K87836L54490L78177J56102J85502M15107K35999j06846
$$ y = [492564, 649173, 453312, 445333, 499872, 446996, 711021, 699786, 672624, 566720, 639078, 671909, 666936, 659167, 664646, 520717, 592216, 705238, 753283, 640061, 675407, 567282, 777650, 738951, 905075, 870875, 888414, 842264, 895419, 989136, 969874, 833701, 821411, 852087, 886617, 930325, 870234, 946134, 851911, 1053469, 837576, 833026, 875805, 984277, 885185, 978980, 989760, 971709, 1067162, 1133959, 1177542, 1112504, 1227671, 1196699, 1348988, 1299750, 1376926, 1405837, 1514542, 1577513, 1412811, 1488132, 1627122, 1577839, 1587062, 1941886, 1894442, 1739003, 1858384, 2112010, 2206227, 2096088, 2170582, 2397342, 2497943, 2557084, 2748795, 2936193, 2974991, 3262827, 3617317, 3995494, 4151596, 4337098, 4752205, 4988204, 4881358]
5182D881358j01596j00866j52017L704R6348O3778J30338K22737L64073M35221
5172E843078L59096M11700N09937N85048M84814M87942K80078L87749K55036K94681
5162I899159L94702Q2368m45965k50777j23847q5537l1244K33238J30814L26977
5152A0129888M13829J99404J53282M47403L47207M33737M82572L18247j9218p5947
5142A2830404r300J3131L6843M5302J29871r9902l8447j5880j83563N4235J89400
5131A2952094L4485J80121j40022k05568k15227m15436l99321j19745m3748k71067
5121A1356566k84643q5959l18773J58562R1456K48161J78552L00850k6829k90698
5111A1327245k32916k28002l69584m37855m04122n65748p58333o23326p48389
$$ y = [4881358, 4779762, 4678896, 4526879, 4530583, 4626931, 4690709, 4821047, 5043784, 5407857, 5843078, 6202174, 6613874, 7123811, 7708859, 8193673, 8681615, 8961693, 9349442, 9604478, 9899159, 10293861, 10376229, 9930264, 9679487, 9555640, 9470103, 9438859, 9672097, 9802911, 10129888, 10543717, 10743121, 10896403, 11343806, 11691013, 12124750, 12607322, 12925569, 12906351, 12830404, 12821104, 12834235, 12871078, 12916380, 13046251, 12946349, 12907902, 12892022, 12708459, 12762694, 12952094, 12986579, 13166700, 13026678, 12821110, 12605883, 12190447, 11791126, 11671381, 11627633, 11356566, 11071923, 10985964, 10667191, 10825753, 10917209, 11165370, 11343922, 11644772, 11617943, 11327245, 11094329, 10866327, 10496743, 10058888, 9654766, 9089018, 8330685, 7707359, 6958970]
5102F958970k93823k07561k94808j83902j25951J62401L1498K14711K54635K66875
5092F783045R3487j12369q6288n06929n14684n41641l95064m21230j89683k73775
5082C834869j60642j15636O1196o8385j69520m9351o7448R6352J31123K6708j51155
5071C368111j29782K3633k61584k38152k8855r0513j3863l1113O0243j26939j12620
5060B418566R1027j8056M3178l0635q683J15523p620J43545l5698J57313r429
5049B859031J31778m19145j38346L285n4943j00464K57100j11582q7996Q2309
5039B421027L0129j79830J91875R5176j55088J1745J82858L9467n5695k1299J00486
5028B660851j274J75176Q7238Q36j39100K08475j2266J03369O4672J96497L5167
$$ y = [6958970, 6665147, 6457586, 6162778, 5978876, 5852925, 6015326, 6046824, 6261535, 6516170, 6783045, 6876532, 6764163, 6677875, 6170946, 5656262, 5114621, 4719557, 4298327, 4108644, 3834869, 3674227, 3558591, 3619787, 3551402, 3381882, 3332531, 3265083, 3361435, 3492558, 3519266, 3368111, 3238329, 3261962, 3000378, 2762226, 2733371, 2642858, 2628995, 2597882, 2658125, 2531186, 2418566, 2509593, 2491537, 2534715, 2504080, 2495397, 2610920, 2603300, 2746845, 2711147, 2868460, 2859031, 2990809, 2571664, 2433318, 2436603, 2381660, 2281196, 2538296, 2426714, 2338718, 2421027, 2451156, 2271326, 2463201, 2558377, 2403289, 2415034, 2597892, 2637359, 2581664, 2560365, 2660851, 2659577, 2834753, 2921991, 2922827, 2783727, 2992202, 2979936, 3083305, 3147977, 3344474, 3379641]
5017C379641q5794K56646L03042K8444j33045K82354J47941K91626K34328K81370
5007D986553K41967J49856N7979J21812j89400j7885r1861o5653j0853J8356J06052
4996E306923L13194J33983J63834R5579L35565J55048K50916J40289M07017L82431
4986G684779L25498M43132L78628J55315L10304K70094J48425N19359L99976N09650
4976A1145160O43760O43778R24791J160625J107854J195729J708294J935015K247324
4967B2712330K591302K908834L473980M017845M514451N152056M709344L598282
4959E3678424K012080R8515j619472k492503l831630m494404m591242l700756
4951C5059012k709831j792512j038330o77196j20390K72247R03726J417173J866768
$$ y = [3379641, 3293847, 3550493, 3853535, 3881979, 3748934, 4031288, 4179229, 4470855, 4705183, 4986553, 5228520, 5378376, 5436355, 5558167, 5368767, 5350882, 5259021, 5193368, 5182515, 5200871, 5306923, 5620117, 5754100, 5917934, 6013513, 6349078, 6504126, 6755042, 6895331, 7302348, 7684779, 8010277, 8453409, 8832037, 8987352, 9297656, 9567750, 9716175, 10235534, 10635510, 11145160, 11788920, 12432698, 13357489, 14518114, 15625968, 16821697, 18529991, 20465006, 22712330, 25303632, 28212466, 31686446, 35704291, 40218742, 45370798, 50080142, 53678424, 55690504, 55789019, 54169547, 51677044, 47845414, 43351010, 38759768, 35059012, 32349181, 30556669, 29518339, 28841143, 28720753, 28993000, 29896726, 31313899, 33180667]
4942C3180667K199901K990518K700981J920310J015869q7239o43134n03598M606
4933D2778881R2891q68108k120407l230440l701514l184912k280955k154408k024397
4924B3306631j832285j769863j534573j220913j263773q90898o74721o07757l57945
4915A3153903j91093j70807M1593J55277j92411j70110k01868q8415l10449m01141
4905A1624479o9720k95279j17510O7234m5648l72715l88345p16399o69088n26948
4895H490061m21014o79253l26722k66908j58817k99406j57275q8770q0598m5465
4885E965833m27546l88185l78279l76247j33251j18740k23407j8404k39464j16387
4875C545923n5372j942k08443M677j07000p4483j35559j74614O8428j21735k11804
$$ y = [33180667, 35380568, 38371086, 41072067, 42992377, 44008246, 43921007, 43277873, 42774275, 42778881, 42871772, 42003664, 39883257, 36652817, 32951303, 29766391, 27485436, 25331028, 23306631, 21474346, 19704483, 18169910, 16948997, 15685224, 14794326, 14119605, 13511848, 13153903, 12962810, 12792003, 12833596, 12988873, 12796462, 12626352, 12424484, 12336069, 12025620, 11624479, 11554759, 11259480, 11141970, 11209204, 11163556, 10790841, 10402496, 9686097, 9017009, 8490061, 8069047, 7389794, 7063072, 6796164, 6637347, 6337941, 6180666, 6091896, 6011298, 5965833, 5538287, 5150102, 4771823, 4395576, 4262325, 4143585, 3920178, 3901774, 3662310, 3545923, 3490551, 3488609, 3280166, 3284843, 3177843, 3103360, 2967801, 2793187, 2861615, 2739880, 2528076]
4864B528076O8946N1646j74619q8792K7878l6149j21452l9463m6528n316k5406
4853B138821r1153l3231k7342M073n8668o9689n7115J3479k08866J26606M1409
4842A778324J66727l19306j16484N9656k3675M9542q4740m3290j61348J48966
4832A454372l6303K5838j48719p580K5974n0946J37739r6252o7152l1209q5175
4821A120587O1900N5607J24124j33926k8949N5457m9417n4910j14359j548K3717
4810A058283K6541P8412l2961J1480k51609O3398J73502N2869l878k06399O8073
4799A037711p6205j4957R5991J08206r5195o6910j33570O9199L1393L3356p9131
4788I09888n953L3295P9075n9790j5059L6729j25880J00092N3427m6284k20894
$$ y = [2528076, 2597022, 2648668, 2474049, 2385257, 2413135, 2376986, 2255534, 2216071, 2169543, 2164227, 2138821, 2047668, 2014437, 1987095, 1991168, 1932500, 1862811, 1805696, 1819175, 1610309, 1736915, 1778324, 1945051, 1625745, 1509261, 1568917, 1545242, 1594784, 1510044, 1466754, 1305406, 1454372, 1418069, 1443907, 1295188, 1287608, 1313582, 1262636, 1400375, 1304123, 1236971, 1205762, 1120587, 1182487, 1238094, 1362218, 1228292, 1199343, 1254800, 1205383, 1150473, 1036114, 1034566, 1058283, 1084824, 1163236, 1130275, 1141755, 890146, 953544, 1127046, 1179915, 1176037, 969638, 1037711, 961506, 946549, 1042540, 1150746, 1055551, 988641, 855071, 924270, 955663, 989019, 909888, 903935, 937230, 1016305, 956515, 941456, 978185, 852305, 952397, 1005824, 959540, 738646]
4777G38646J62307L4546k2288o1359M6822o0794P5619L4942m5325J097J10012
4766A014225Q6896r8447k1704Q180k0575K0374k902M0996k6094k109J11577q1071
4754A029346N6710L8257R8734j02998q4613O1137n5567O3622l2689k7416J69082
4743A213605r4822K9582L0393Q9921r0485l113J60838m0375J15204r361k0649
4732A380738k8815r2087Q8852J79128R9862j05637J09163Q5985n0681K92799j38935
4721A820372J25746P2405l7017J52147k1788j4671L15995J22375J19203j1131
4711B643636L66166K75502K48531J01532L66309N72338L81713N44871N44685O25489
4701F670772M55666K30460j23315j37838j38604k07382j43246j58111l6505k2763
$$ y = [738646, 900953, 935499, 913211, 851852, 898674, 837880, 913499, 948441, 903116, 904213, 1014225, 1101121, 1002674, 980970, 989150, 968575, 988949, 986047, 1027043, 1000949, 998840, 1110417, 1029346, 1086056, 1124313, 1223047, 1120049, 1035436, 1096573, 1041006, 1104628, 1071939, 1044523, 1213605, 1118783, 1148365, 1178758, 1268679, 1178194, 1175081, 1335919, 1295544, 1410748, 1401387, 1380738, 1351923, 1259836, 1348688, 1527816, 1627678, 1522041, 1631204, 1717189, 1666508, 1959307, 1820372, 1946118, 2018523, 1981506, 2133653, 2111865, 2097194, 2413189, 2535564, 2654767, 2643636, 3009802, 3285304, 3533835, 3635367, 4001676, 4574014, 4955727, 5500598, 6045283, 6670772, 7126438, 7356898, 7233583, 7095745, 6957141, 6749759, 6606513, 6448402, 6411897, 6389134]
4691F389134k37870j68698k75568J2330m224J65721N0921J99675K74069M47542
4681F853032L99672L99448P26875O82407M09783L18472j62300R0023j3803k4315
4671I679294o8094k31765k7755j01181m5023l72957l33860k46497n06771o42562
4661G102829n07774l14916l91424k24665n9206m0221M7485k19523J43664K17452
4651E753701K36319P1660J48472P639j50857J00451J40279J28774l2471M1903
4641F445870l50394l28216m92025n25654m46191k25958j90100k21717l32139j15043
4631C218433J2143k05779j61577p4903j55565j47468K2806P2727k52946l51980
4621A975891J18610k15J61188j67251r0364k8270j28261O4891j9645q16q5549
$$ y = [6389134, 6151264, 5982566, 5706998, 5719328, 5715104, 5880825, 5931746, 6131421, 6405490, 6853032, 7252704, 7652152, 8379027, 9061434, 9471217, 9789689, 9627389, 9717412, 9703609, 9679294, 9611200, 9379435, 9351680, 9250499, 9205476, 8832519, 8498659, 8252162, 7745391, 7102829, 6595055, 6280139, 5888715, 5664050, 5604844, 5564623, 5612108, 5392585, 5536249, 5753701, 5990020, 6061680, 6210152, 6217791, 6066934, 6167385, 6307664, 6436438, 6403967, 6445870, 6095476, 5767260, 5275235, 4749581, 4303390, 4077432, 3887332, 3665615, 3333476, 3218433, 3230576, 3024797, 2863220, 2788317, 2632752, 2485284, 2508090, 2580817, 2327871, 1975891, 2094501, 2094286, 2255474, 2088223, 1997859, 1969589, 1841328, 1906219, 1886574, 1885758, 1800209]
4610A800209q7328k5697J2633R8859k3262j80083J64280n1366q2883J6909P2269
4599A714540n9879k1245J22753n4249n0913n9080N3147o346M6929N5831q8057
4588A653431q0199L0976L4953n1020l5098J02420r8945J09763q7796L9505K7192
4577A645182J7116N1425q0230K4470l7186j02213Q2797J7982l586J3063K7612
4566A656432o2683j27759N2953l0955Q3335N4636q0273m1351o9760J51173J52133
4555A737881k05813Q9800P6965p5232r2497k25J82393L0591r0497p9522Q9512
4544A663356r145R493O7612o8367O1647J4908j70038Q1886J51478p622P8760M0797
4532A914765o4255m8558O1399M1575j2254L5341M5361l8227o9787Q3040J48460
$$ y = [1800209, 1712881, 1687184, 1699817, 1798676, 1775414, 1595331, 1759611, 1708245, 1625362, 1642271, 1714540, 1654661, 1633416, 1756169, 1701920, 1651007, 1591927, 1645074, 1638728, 1685657, 1741488, 1653431, 1573232, 1604208, 1639161, 1588141, 1553043, 1655463, 1556518, 1666281, 1578485, 1617990, 1645182, 1662298, 1713723, 1633493, 1657963, 1620777, 1518564, 1601361, 1619343, 1615757, 1628820, 1656432, 1593749, 1465990, 1518943, 1487988, 1571323, 1625959, 1545686, 1504335, 1434575, 1585748, 1737881, 1532068, 1621868, 1698833, 1623601, 1531104, 1530879, 1713272, 1743863, 1653366, 1573844, 1663356, 1654211, 1663704, 1731316, 1662949, 1724596, 1739504, 1569466, 1651352, 1802830, 1795208, 1873968, 1914765, 1850510, 1801952, 1863351, 1904926, 1892672, 1928013, 1973374, 1935147, 1865360, 1948400, 2096860]
4521B096860P3887p0367j03951J18024L6315M9014r5529J60137J55694j29366
4511B290718j0571P2752m4769L2992K08821j26637J04787l8851l1697R4763J8731
4500B571039P1576J02657j1455j21471J71580N0297j9586P3683p2464J77352k1737
4489B971471O5084O2052k0699J63372l4652p3182J37054Q6561J20421o6735n059
4478C405688Q6905J08334N8755J34676J15749k50295J95038K57781j5331L5736
4468D133036P7529P7660M9913K28K8369J49990J22229J59878m3427m5597J85084
4457D894892J98368J35813R4872M1585l4527J79727K02768l0112P4123K98288
4447F055797J24762j2971K61549Q0300J07360K37585j33560L46018J27543J05593
$$ y = [2096860, 2170747, 2100380, 1996429, 2114453, 2150768, 2199782, 2104253, 2264390, 2420084, 2290718, 2280147, 2352899, 2308130, 2341122, 2549943, 2423306, 2528093, 2489242, 2457545, 2552308, 2571039, 2642615, 2745272, 2733817, 2612346, 2783926, 2834223, 2814637, 2888320, 2815856, 2993208, 2971471, 3036555, 3098607, 3077908, 3241280, 3206628, 3133446, 3270500, 3357061, 3477482, 3410747, 3405688, 3492593, 3600927, 3659682, 3794358, 3910107, 3659812, 3854850, 4112631, 4097300, 4133036, 4210565, 4288225, 4338138, 4338366, 4366735, 4516725, 4638954, 4798832, 4755405, 4709808, 4894892, 5093260, 5229073, 5323945, 5365530, 5331003, 5510730, 5713498, 5683386, 5757509, 6055797, 6180559, 6167588, 6429137, 6509437, 6616797, 6854382, 6720822, 7066840, 7194383, 7299976]
4437G299976K21209J51807O2689K27850J57184K13504L35684J72930J13833L72612
4427I329278K4066L30110L25667J59509K99756K93453J81020L59266L60540K80344
4417A1943009R6365M95461L98500K38012M08079L76492M88900L94137N86226M83615
4407A5908796M28292N56293P46570O84600Q39055P41776R03605Q80407J110558
4398B2799952J302557J366480J406246J416675J118978N43300J14305m48446l54811
4389B9265236k4307J73895L62289O10607P38565P78098J055546J150343J180055
4380C5290327J412491J377061J143896O73899J30916n13941p90974m37046j76599
4371C8110030J0679l9461L3544J81297l1361J41903N09797K634L3329J32597O0889
$$ y = [7299976, 7521185, 7672992, 7735681, 7963531, 8120715, 8334219, 8669903, 8842833, 8956666, 9329278, 9353344, 9683454, 10009121, 10168630, 10468386, 10761839, 10942859, 11302125, 11662665, 11943009, 12039374, 12534835, 12933335, 13171347, 13579426, 13955918, 14444818, 14838955, 15425181, 15908796, 16337088, 16893381, 17639951, 18324551, 19163606, 19905382, 20808987, 21689394, 22799952, 24102509, 25468989, 26875235, 28291910, 29410888, 29954188, 30068493, 29620047, 29265236, 29240929, 29414824, 29777113, 30387720, 31126285, 31904383, 32959929, 34110272, 35290327, 36702818, 38079879, 39223775, 39897674, 40028590, 39514649, 38723675, 38286629, 38110030, 38120709, 38081248, 38114792, 38296089, 38264728, 38406631, 38916428, 38919062, 38952391, 39084988, 39145877]
4360C9145877O0421K41413n6842p3924L6324K16108Q7799K85875L84802M88016
4350D0815869P10074O41662J015051J145581J040611O52914l53460j201988k122408
4341D2343906k542214k103005j713667j129079r34508m45936k57848j75789K23525
4332C3265385L92650N43868O26703N44007j57545j045450k070411k651854k342159
4323B7105194j930250j675529j247802j115356q47078q69591p23113o39660o03980
4314A7452835o76203n14443n10977m30043l35248n69358m89582k89904k35058
4305A3402019l87261l85693k64915k29105k50907l12672k45889m22759j00844
4296A0801974k45522k02750k75406j79819l549k26157k92328j68676p2086m00046
$$ y = [39145877, 39206298, 39447711, 39390869, 39316945, 39353269, 39569377, 39657176, 39943051, 40327853, 40815869, 41525943, 42167605, 43182656, 44328237, 45368848, 46021762, 45668302, 44466314, 42343906, 39801692, 37698687, 35985020, 34855941, 33921433, 33475497, 33217649, 33041860, 33265385, 33658035, 34201903, 34828606, 35372613, 35215068, 34169618, 32099207, 29447353, 27105194, 25174944, 23499415, 22251613, 21136257, 20289179, 19419588, 18696475, 18056815, 17452835, 16776632, 16262189, 15751212, 15321169, 14985921, 14416563, 13926981, 13637077, 13402019, 13014758, 12629065, 12364150, 12135045, 11884138, 11571466, 11325577, 10902818, 10801974, 10556452, 10353702, 10078296, 9898477, 9894928, 9668771, 9376443, 9207767, 9135681, 8735635]
4286H735635J0316j35461l58981p5340j13034k01958J0747k14596R9379j07081
4276G649626k01536k02367L7878j00260k0313q3247m516r1676k4154k0288j62
4265F938985j57169R3480o1721j29676J09388k5039j81409o5507K03021J39973
4255F864326O929L385J77680J25159O5994J53208K22505K46622K07989K18052
4245H291849M07005M60251O68456P10047O69968Q70580J053539J235791J305524
4236A5673010J673154J533412R53118K67240r33416j801227j998306j745400j478938
4227A2142647q65778q15235n53080n98919l34298k37642j74181j49810N0111k98983
4217H164832o9939K91853K09688K71351K37607L63485N34252M96567O16243R09460
$$ y = [8735635, 8745951, 8610490, 8251509, 8176169, 8063135, 7861177, 7871924, 7657328, 7756707, 7649626, 7448090, 7245723, 7283601, 7183341, 7163028, 7079781, 7075265, 6983589, 6959435, 6939147, 6938985, 6781816, 6875296, 6813575, 6683899, 6793287, 6768248, 6586839, 6521332, 6724353, 6864326, 6871255, 6874640, 7052320, 7177479, 7243473, 7396681, 7619186, 7865808, 8073797, 8291849, 8698854, 9159105, 9827561, 10537608, 11207576, 12078156, 13131695, 14367486, 15673010, 17346164, 18879576, 19832694, 20099934, 19166518, 17365291, 15366985, 13621585, 12142647, 11276869, 10461634, 9908554, 9309635, 8975337, 8737695, 8563514, 8413704, 8463815, 8164832, 8094893, 8386746, 8596434, 8867785, 9105392, 9468877, 10003129, 10499696, 11115939, 12025399]
4207A2025399R60014J024551J323271J400067J362196R98693L562q69988j682065
4198A6545700j718686j515211j149608q42089m91709q3458j39361M5447J49601
4189A0800626J51954M95438N37783P54166N62757J64597n31258j077545j387593
4180A0470925j074090q92634o07505n87878l98253k85196l10139k35639k39986
4171E839605j01227q7082N4230j36201K8560R4084M7256K48718m679J24244K30941
4160F338449L46427M49721M39389M42462N25251P97058P44423O69103J22207n29666
4150A0344824r45390j227534j047958p86462n12823m05032o12397j96240k68784
4141D342204k91937j72771Q428l23999l21378Q6259k75986Q1357l9902k48417
$$ y = [12025399, 12985413, 14009964, 15333235, 16733302, 18095498, 19094191, 19097753, 18227765, 16545700, 14827014, 13311803, 12162195, 11320106, 10828397, 10744939, 10605578, 10651025, 10800626, 10952580, 11448018, 11985801, 12739967, 13302724, 13467321, 12936063, 11858518, 10470925, 9396835, 8504201, 7896696, 7308818, 6910565, 6625369, 6315230, 6079591, 5839605, 5738378, 5651296, 5705526, 5569325, 5597885, 5691969, 5739225, 5987943, 5983264, 6107508, 6338449, 6684876, 7134597, 7573986, 8016448, 8541699, 9338757, 10083180, 10752283, 10874490, 10344824, 9399434, 8171900, 7123942, 6337480, 5824657, 5419625, 4807228, 4610988, 4342204, 4050267, 3877496, 3885924, 3561925, 3240547, 3326806, 3050820, 3132177, 3092275, 2843858]
4131B843858p7784l1370p480k13239l126M8127o0734j77524M3247m1531L0155
4120B352599j9624k54523K82O3562p1521j06716l3571J9913m2419j03514k2106
4109A782362J0390n8777J05459n8515O2772m2598j01333K1333L538O7874j01169
4098A691336J5905n1098k3125j8705O943J97K6198j14621k4614M368j03034m5173
4086A364577L6059J1688o3396l1994Q7014r460n110k9357j43665J9463M7619J6125
4074A299563j9619j29874O5425P5674M599L4616j9139o343j99351K14592j73206
4063A146937J05474J02341k59884J69732J20507o1490N2059o978k5005r6985m6467
4052A200241P6288J09045n5666q7971n2801m967J49061L7335O3356j06323r1770
$$ y = [2843858, 2766074, 2734704, 2727224, 2513985, 2510859, 2558986, 2498252, 2320728, 2363975, 2322444, 2352599, 2332975, 2078452, 2078734, 2142296, 2070775, 1964059, 1930488, 1950401, 1907982, 1804468, 1782362, 1792752, 1733975, 1839434, 1780919, 1843691, 1801093, 1699760, 1721093, 1724631, 1792505, 1691336, 1707241, 1656143, 1633018, 1614313, 1621256, 1621453, 1647651, 1533030, 1508416, 1512784, 1409750, 1364577, 1400636, 1412324, 1348928, 1316934, 1403948, 1394488, 1389378, 1360021, 1216356, 1235819, 1283438, 1299563, 1279944, 1150070, 1215495, 1291169, 1295768, 1330384, 1311245, 1304902, 1105551, 1320143, 1146937, 1252411, 1354752, 1094868, 1264600, 1385107, 1323617, 1375676, 1368698, 1343693, 1246708, 1200241, 1276529, 1385574, 1329908, 1241937, 1189136, 1184169, 1333230, 1370565, 1433921, 1327598, 1235828]
4041A235828R1255p0421j23420J41367J72026j70570J01326P2924r9956M652J9590
4030A374601l8648k7642J54480Q688j92878K4005q9571M0912J01448m2467p2718
4019A240210l7390J04580j63371J35510q7685J41059j53079L4497Q801p7707J52481
4008A297906M0626q0794l5119R5064L303j58820j32048O0360J31914K8850j54417
3997A096825Q3408j4550M911l7300O8607l6188l6143o8222n0534N4470j08421
3986I56863N9802P9725j08454K0473L4356j72496N4517J4700k0053O9454n6233
3975I32654p062L8288n9645P5539k38482R2134P7472j25113L1155L075Q4098O9265
3963I73378n7688p2426J07773j4929r3006L5608l2608J63360j47367N875l8578
$$ y = [1235828, 1327083, 1256662, 1133242, 1274609, 1446635, 1276065, 1377391, 1450315, 1350359, 1355011, 1374601, 1335953, 1308311, 1462791, 1471479, 1278601, 1302606, 1213035, 1253947, 1355395, 1312928, 1240210, 1202820, 1307400, 1144029, 1279539, 1191854, 1332913, 1179834, 1214331, 1223132, 1145425, 1297906, 1338532, 1257738, 1222619, 1317683, 1320986, 1162166, 1030118, 1090478, 1222392, 1251242, 1096825, 1180233, 1165683, 1170594, 1133294, 1201901, 1165713, 1129570, 1061348, 1010814, 1065284, 956863, 1016665, 1096390, 987936, 1008409, 1042765, 870269, 924786, 939486, 919433, 988887, 932654, 925592, 963880, 904235, 979774, 741292, 833426, 910898, 785785, 816940, 820015, 904113, 973378, 915690, 843264, 951037, 936108, 843102, 878710, 846102, 1009462, 862095, 867970, 829392]
3952H29392O177N1868J49892j74614l6668J05602J2559n150q2096q4075K7149
3941H00036J10440J37408M4072j25791q0884J2185M7613Q523J40988r7011k5174
3930I72405R5688q2053R787m1610O8308J7503n3178k7918P7318J20609k14462
3919I42397J10834L4569n5941l4235P7157l595J41333m3778j5335L5486P1615
3908A260507j18353K2467o1182j1891M3494L3637L2641L3489l5019J4391m3192
3897A170989J13866k4050O9309j57492J1396J37916M8447M370j5922N6493o208
3886A409114M3842q3151J69839R846L9969J0030j81607J32870l843K60638j21275
3875A686272j340J42021k1895j24365n9951P1263J36700M2523M318q1167k4255
$$ y = [829392, 835569, 887437, 1037329, 862715, 826047, 931649, 944208, 939058, 856962, 772887, 800036, 910476, 1047884, 1091956, 966165, 885281, 897466, 945079, 953602, 1094590, 997579, 972405, 1068093, 986040, 995827, 954217, 1022525, 1040028, 986850, 958932, 1036250, 1156859, 942397, 1053231, 1087800, 1031859, 997624, 1074781, 1071186, 1212519, 1168741, 1153406, 1188892, 1260507, 1142154, 1164621, 1103439, 1091548, 1135042, 1168679, 1201320, 1234809, 1199790, 1214181, 1170989, 1284855, 1260805, 1330114, 1172622, 1184018, 1321934, 1370381, 1374751, 1358829, 1415322, 1409114, 1452956, 1369805, 1539644, 1549490, 1589459, 1599489, 1417882, 1550752, 1546909, 1807547, 1686272, 1684932, 1826953, 1805058, 1680693, 1620742, 1692005, 1828705, 1871228, 1875546, 1794379, 1770124]
3864A770124J77385L6234l2882R8396O9929j13746J76408k03136O9668Q7545J36189
3853B272114Q9524l5687o0462l3996J63401o9210J38826O7667P748O1525J3775
3842B615225O2750n2212J36223J27676J66634J52586m4499K6006K31J84318J17348
3831C492286l72R6796p582L09845J32802R3722J61698Q2423J4844J50643J91020
3820D718125J72542P2655P7271J63943R7528K94194R9930K66388K47937J59028
3810F369541J29780J15657L17593J96223L73076K11663L39697K05256L05647N23097
3800I087230L47771K56093N03215L32547L95773O16021O63108M26735O46853O11370
3790A3886716O11916O74403R12028P86889Q75419Q61843J063384Q38274J000500
$$ y = [1770124, 1947509, 1983743, 1950861, 2049257, 2119186, 2005440, 2181848, 1978712, 2048380, 2135925, 2272114, 2361638, 2325951, 2265489, 2231493, 2394894, 2325684, 2464510, 2532177, 2539925, 2601450, 2615225, 2677975, 2625763, 2761986, 2889662, 3056296, 3208882, 3164383, 3190389, 3190620, 3374938, 3492286, 3491914, 3588710, 3581128, 3890973, 4023775, 4117497, 4279195, 4361618, 4376462, 4527105, 4718125, 4890667, 4963322, 5040593, 5204536, 5302064, 5596258, 5696188, 5962576, 6210513, 6369541, 6499321, 6614978, 6932571, 7128794, 7501870, 7713533, 8053230, 8258486, 8564133, 9087230, 9435001, 9691094, 10194309, 10526856, 10922629, 11538650, 12201758, 12628493, 13275346, 13886716, 14498632, 15173035, 16085063, 16871952, 17747371, 18609214, 19672598, 20510872, 21511372]
3781B1511372J270807J161209J147694J354263J341645J376017J557920J284310
3773C2005237J456012J828473J579951J352687J734696J886592J702128J664765
3765D5210541J738706J596209J801033J889955J742580J565971J797597J624397
3757E8966989J552241J488840J428722J254106J343735R79901R55767R63702J030104
3748F9964107O07049Q57598O47099M36719L15169J42336O8649l05858m68477n40735
3738G1723656m35781p02615o93794q27041r87613r60009j157716j177587j223040
3729F3558460j331423j592680j745732j563255j703461j564429j896284j783934
3721E0377262j556881j642608j701362j735400j757885j622984j487091j700677
$$ y = [21511372, 22782179, 23943388, 25091082, 26445345, 27786990, 29163007, 30720927, 32005237, 33461249, 35289722, 36869673, 38222360, 39957056, 41843648, 43545776, 45210541, 46949247, 48545456, 50346489, 52236444, 53979024, 55544995, 57342592, 58966989, 60519230, 62008070, 63436792, 64690898, 66034633, 67014534, 67970301, 68934003, 69964107, 70571156, 71428754, 72075853, 72512572, 72827741, 72970077, 73038726, 72732868, 72264391, 71723656, 71287875, 70585260, 69891466, 69064425, 68076812, 67116803, 65959087, 64781500, 63558460, 62227037, 60634357, 58888625, 57325370, 55621909, 54057480, 52161196, 50377262, 48820381, 47177773, 45476411, 43741011, 41983126, 40360142, 38873051, 37172374]
3713C7172374j627443j601869j600904j495409j320944j362991j537862j261800
3705B5363152j307005j223629q84500j064645j016736r28437r39721q36037p79175
3696A6383267p93598q46509p17488o60002n94654n48250o79732m41045l19997
3687A0781992n05329m17383l44247m67266j58862m02977l01779j09135m23905
3678G651109k15524j69760n3850j76216j47271k88577k45476j123j36298j19562
3668F097452p3604q9189j92806P3866j57291j13371p1068O1037K276q6110p1645
3657E379547q6495q2451N8643o8978j04817k74277J19561J15441j51520l6278
3647D868376L3759j7628o6058m2808J82727j16235j20349j47613k7295J95732
$$ y = [37172374, 35544931, 33943062, 32342158, 30846749, 29525805, 28162814, 26624952, 25363152, 24056147, 22832518, 21948018, 20883373, 19866637, 18938200, 17998479, 17162442, 16383267, 15589669, 14743160, 14025672, 13365670, 12771016, 12222766, 11543034, 11101989, 10781992, 10276663, 9859280, 9515033, 9047767, 8888905, 8485928, 8184149, 8075014, 7651109, 7435585, 7265825, 7211975, 7035759, 6888488, 6599911, 6354435, 6353312, 6217014, 6097452, 6023848, 5934659, 5741853, 5815719, 5658428, 5545057, 5473989, 5535026, 5537302, 5451192, 5379547, 5293052, 5210601, 5269244, 5200266, 5095449, 4821172, 4940733, 5056174, 4904654, 4868376, 4902135, 4884507, 4818449, 4775641, 4958368, 4842133, 4721784, 4574171, 4546876, 4742608]
3637D742608j93440J41417l6363J10884k13335p0259Q7812q1301J01517k21703
3627D367837n486l9495k1707n8890j98187J53139j24859n6432j91696L9987P6327
3616C940538j02856k24392P3820q9859q5593N0535l2618j86414L635R4027l6031
3605C404792n2296j37092K8796P1878m3210J7549r3565N3451l1342J3941o2654
3594C170248Q3588l4048q1193N3525l0992J70r8790m5032M9019R0407m0112j8730
3582C098060k6138M936k7409R4462r0784m7358R4317O6368q750m6209p5106o4222
3570B972167J40319n5178l6491J90080j15534o6166k6621L02821k01353K9482
3560C133526p7803J54444J70457j29939k6163l8316J9285j0676L2922N6753K8230
$$ y = [4742608, 4549168, 4690585, 4654222, 4765106, 4551771, 4481512, 4569324, 4488023, 4589540, 4367837, 4362351, 4322856, 4301149, 4242259, 4044072, 4197211, 4072352, 4015920, 3824224, 3864211, 3940538, 3837682, 3613290, 3687110, 3597251, 3511658, 3562193, 3529575, 3343161, 3346796, 3440823, 3404792, 3352496, 3215404, 3244200, 3316078, 3272868, 3290417, 3196852, 3250303, 3218961, 3232902, 3170248, 3253836, 3219788, 3138595, 3192120, 3161128, 3161298, 3062508, 3017476, 3066495, 3156902, 3116790, 3098060, 3071922, 3076858, 3049449, 3143911, 3053127, 3005769, 3100086, 3166454, 3157704, 3111495, 3036389, 2972167, 3112486, 3057308, 3020817, 3210897, 3095363, 3029197, 3002576, 3305397, 3104044, 3133526, 3055723, 3210167, 3380624, 3250685, 3224522, 3186206, 3205491, 3194815, 3227737, 3284490, 3312720]
3549C312720L0777M6775L6216P6730P7358l4820M6430o162r2619K46956r1377
3538C648984r656K54858N2368p148J4009P8149L3537P8138J21966p4536J53385
3527D344054Q6086J19600R483J737J38315O4453J44643R7002j7989J0674K11236
3516E209294J10744J11270N3034O4088K07826P4901K07511j31699J02344J24823
3506F134136K33826j01086K52687N2993L5506K56008R1228J17143Q9972K62717
3496G425130J27960J17788J12017J02721L06930K29992J65055J84681J76692J66309
3486I115275K77616K15800J15678L47726M34161K12372J93931K77471M21060M21494
3476A2032584K84733M82418N64742L35412N13814O89259N76346O37579O31739
$$ y = [3312720, 3343497, 3390272, 3426488, 3503218, 3580576, 3545756, 3592186, 3586024, 3493405, 3740361, 3648984, 3639328, 3894186, 3946554, 3939406, 3953415, 4031564, 4065101, 4143239, 4265205, 4190669, 4344054, 4430140, 4549740, 4559223, 4560960, 4699275, 4763728, 4908371, 5005373, 4987384, 4998058, 5209294, 5320038, 5431308, 5484342, 5548430, 5756256, 5831157, 6038668, 5906969, 6009313, 6134136, 6367962, 6266876, 6519563, 6572556, 6608062, 6864070, 6955298, 7072441, 7162413, 7425130, 7553090, 7670878, 7782895, 7885616, 8192546, 8422538, 8587593, 8772274, 8948966, 9115275, 9392891, 9608691, 9724369, 10072095, 10506256, 10718628, 10912559, 11190030, 11611090, 12032584, 12317317, 12799735, 13364477, 13699889, 14213703, 14902962, 15479308, 16116887, 16748626]
3467A6748626Q06583O75223Q97135R22897Q90747R04800J041325R60758Q68102
3458B4716196R12545Q50324R05824R28079P20695Q13637R05724P69158P44027
3449C2266209J017478P01459P76373N30338N60396M64816M74585L58482M12633
3440C7562769L55303K89978N05972N11053M76327N65798N89908Q23101N26573
3431D2206782P55425P81806P34771R03198P62146J107405R69863J326845J538434
3422E1086675J429885J654839J900236K075793K448968K634757K587143K864301
3414F8682597L233072L133128L348465L518599L390703L628147L586428L488756
3406I6009895L503234L711378L664510L827195L866430M025805M119149M089827
$$ y = [16748626, 17555209, 18230432, 19127567, 20050464, 20941211, 21846011, 22887336, 23848094, 24716196, 25628741, 26479065, 27384889, 28312968, 29033663, 29847300, 30753024, 31522182, 32266209, 33283687, 33985146, 34761519, 35291857, 35852253, 36317069, 36791654, 37150136, 37562769, 37918072, 38208050, 38714022, 39225075, 39701402, 40267200, 40857108, 41680209, 42206782, 42962207, 43744013, 44478784, 45381982, 46144128, 47251533, 48221396, 49548241, 51086675, 52516560, 54171399, 56071635, 58147428, 60596396, 63231153, 65818296, 68682597, 71915669, 75048797, 78397262, 81915861, 85306564, 88934711, 92521139, 96009895, 99513129, 103224507, 106889017, 110716212, 114582642, 118608447, 122727596, 126817423]
3398A26817423M014801M065857M170098L856496M214312L938145M147994M282238
3390A59507364M744165M831345N116838N745911O122761O456704O706291P255935
3382B06487314P495371P720034Q102476P939265P559113O932376O104559M829988
3374B63170496L652823K440700J072312M5384r21647j734378k106017k369881
3366B63249792k815398l250000l956729m729068n685283o740948p288083p841689
3358B20942594q167051q144036p968751p312432o578246n737928m742825m118100
3350A68173225l646890k922428k705899k779096k715875k721399k470503j960231
3342A46250904j394329r98541o24405l40217n62888r49454j557788k403114l392450
$$ y = [126817423, 130832224, 134898081, 139068179, 142924675, 147138987, 151077132, 155225126, 159507364, 164251529, 169082874, 174199712, 179945623, 186068384, 192525088, 199231379, 206487314, 213982685, 221702719, 229805195, 237744460, 245303573, 252235949, 258340508, 263170496, 266823319, 269264019, 270336331, 270381715, 269460068, 267725690, 265619673, 263249792, 260434394, 257184394, 253227665, 248498597, 242813314, 236072366, 228784283, 220942594, 212775543, 204631507, 196662756, 189350324, 182772078, 177034150, 172291325, 168173225, 164526335, 161603907, 158898008, 156118912, 153403037, 150681638, 148211135, 146250904, 144856575, 143858034, 143233629, 142893412, 142330524, 141381070, 139823282, 137420168, 134027718]
3333A34027718m101815m418335m773809m432062m104813l767298l471819l057838
3325A01899929k781560l167716l176577l670643l916817l871904l915238l993476
3317G3405998l528131l283156l203778k803950k605968k157876k125455k038803
3309E1658881j889555j989681j877604j813043j644087j842298j744079j563228
3301C7295306j625571j568663j401320j352834j281130j261210j197874r64188
3293B6642516r36156q82415j059645j009115q30065p19340j030730o29537n94107
3284A8951406n63323o80179m72408n63377n34099n78177l39388k22466n46778
3275A4451211n63015m04625k20639l59191k80820k62560k91489m96262k05556
$$ y = [134027718, 129925903, 125507568, 120733759, 116301697, 112196884, 108429586, 104957767, 101899929, 99118369, 95950653, 92774076, 89103433, 85186616, 81314712, 77399474, 73405998, 69877867, 66594711, 63390933, 60586983, 57981015, 55823139, 53697684, 51658881, 49769326, 47779645, 45902041, 44088998, 42444911, 40602613, 38858534, 37295306, 35669735, 34101072, 32699752, 31346918, 30065788, 28804578, 27606704, 26642516, 25706360, 24823945, 23764300, 22755185, 21925120, 21205780, 20175050, 19545513, 18951406, 18388083, 17707904, 17235496, 16672119, 16138020, 15559843, 15220455, 14997989, 14451211, 13888196, 13483571, 13262932, 12903741, 12622921, 12360361, 12068872, 11572610, 11367054]
3266A1367054l10426j29051k29116l45252j49568j57607k26877l16784k48118
3257I254255j67821j24315j87403k06274j41396m9597k61057j09307j92053j86500
3247G628532j16547k41121j52781p0680o7854k03955j35898j54313j27121o5679
3237F292583r7137r6840P6395k80216q1867L8929j95401l2135P1810p9901j62029
3226E454191j10817j30927r6631P3678M2829j40847j30963M6410R146o0281M485
3215D960273R6745J56620j42801J9801q2367p2889q471k97410j82921j37760l3066
3204D275754j03368l7838j80567J05574p3889j75555j13511M6495l8018r6704
3194C608373k7900p5790Q2244Q5638j37971j37400l1706J23427N0868j39850j05017
$$ y = [11367054, 11056628, 10927577, 10698461, 10353209, 10203641, 10046034, 9819157, 9502373, 9254255, 9086434, 8962119, 8774716, 8568442, 8427046, 8377449, 8116392, 8007085, 7815032, 7628532, 7511985, 7270864, 7118083, 7047403, 6979549, 6775594, 6639696, 6485383, 6358262, 6292583, 6195446, 6098606, 6175001, 5894785, 5812918, 5851847, 5656446, 5624311, 5696121, 5616220, 5454191, 5343374, 5212447, 5115816, 5189494, 5232323, 5091476, 4960513, 5006923, 5016069, 4955788, 4960273, 5057018, 5213638, 5070837, 5090638, 5008271, 4935382, 4926911, 4629501, 4446580, 4308820, 4275754, 4172386, 4134548, 3953981, 4059555, 3985666, 3810111, 3696600, 3743095, 3705077, 3608373, 3580473, 3504683, 3586927, 3672565, 3534594, 3397194, 3365488, 3488915, 3539783, 3399933, 3294916]
3183C294916R2574J9922j16498l5155k694j0623j5581j11205P5380r5844R868
3172C105060N2182N2814M8655j557k701n6557M7835m5956J71j2206J58658p4832
3160C271566p0005J12761J90597n0834j23754R7495J36614J86791k6846J7676
3150C742061o6893O9033L8472L9146J29778j0537O2382j22399K51016m9745P7719
3139D160033J7236k1347J86934J17212n4358l0999K41929N5411Q3893J71751M9398
3128D977093K53252k5463J13694j991Q8425M68314J13698K4748r576K09285K39263
3117F450742L4236J31357J1389R7882J74258J19556J35367P7992J46066K49542
3107G628387J21654J55685J42186K25203K05481K24179L73812Q9172k1622L03405
$$ y = [3294916, 3387490, 3407412, 3290914, 3255759, 3253065, 3242442, 3226861, 3115656, 3191036, 3095192, 3105060, 3157242, 3210056, 3258711, 3257154, 3254453, 3197896, 3245731, 3199775, 3199946, 3187740, 3346398, 3271566, 3201561, 3314322, 3504919, 3454085, 3330331, 3427826, 3564440, 3751231, 3724385, 3742061, 3675168, 3744201, 3782673, 3821819, 3951597, 3941060, 4003442, 3881043, 4132059, 4082314, 4160033, 4177269, 4155922, 4342856, 4460068, 4405710, 4374711, 4616640, 4672051, 4755944, 4927695, 4977093, 5230345, 5204882, 5318576, 5316585, 5405010, 5873324, 5987022, 6011770, 6002194, 6211479, 6450742, 6484978, 6616335, 6627724, 6725606, 6899864, 7019420, 7154787, 7232779, 7378845, 7628387, 7750041, 7905726, 8047912, 8273115, 8478596, 8702775, 9076587, 9165759, 9144137, 9447542]
3097I447542K04090L25118M05361L77220L55365N26843L83072O70578O86357P14902
3087A4096448O74655O85776L34266L90733L50110p9055N796k24742o23862n83152
3077A5026973l88584p54387n68354n49442m01997n40533l20619n95784m47031
3068A0460242n55429n31649l10255n72491n01798l83859m60118k72590k82131
3059F589922m58558l60640j36464k14034k99592j93622k26064j81697k18707j97923
3049D102621j75372k24730l6849L4876k04216l21103n3104J7473n7285j49592
3039B932719o7978q3121j55539l3776j43431j5154l0704l3670j89740L4781K9416
3028B243803j35405m36j17531j26006j90673Q8661P0688k4659P8755k22789p6511
$$ y = [9447542, 9651632, 9976750, 10382111, 10759331, 11114696, 11641539, 12024611, 12695189, 13381546, 14096448, 14771103, 15456879, 15791145, 16181878, 16531988, 16452933, 16458729, 16233987, 15610125, 15026973, 14638389, 13884002, 13315648, 12766206, 12364209, 11823676, 11503057, 10907273, 10460242, 9904813, 9373164, 9062909, 8490418, 7988620, 7604761, 7144643, 6872053, 6589922, 6131364, 5770724, 5634260, 5420226, 5120634, 4927012, 4700948, 4519251, 4300544, 4102621, 3927249, 3702519, 3665670, 3700546, 3496330, 3175227, 3122123, 3139596, 3082311, 2932719, 2864741, 2781620, 2626081, 2592305, 2448874, 2433720, 2403016, 2369346, 2179606, 2214387, 2243803, 2108398, 2107962, 1990431, 1864425, 1673752, 1762413, 1833101, 1808442, 1887197, 1664408, 1587897]
3017A587897J01468J2199j18645j39681R1358q5056j6958j90181M8333m7927K5254
3006A268061J9299j44273M4124J6609R6341n5789j24002j14317r2899J46656P3770
2995A133580q0143J2145o4949M5489j01365k2691o3526N5712O4013r0786q9401
2984G98078J27220l4995q1023j5057m7655n6398M1744P4141n15k02298n4247J30135
2972F79130P6975J1234j76695O6409O0790j8601L3322l5759l7767M2478j8768
2961F82748n7489m368n942L9992M7635k36505Q1995J8790J44952n2426n3980q0940
2949E24462J45915Q3355j28060r4774P1804L6592L8076n1563o5428J02249J3444
2938F76072k34555N7785P202K5909o8455M6500j22664J02917R7475j88379N0136
$$ y = [1587897, 1689365, 1701564, 1582919, 1443238, 1534596, 1449540, 1432582, 1242401, 1290734, 1242807, 1268061, 1287360, 1143087, 1187211, 1203820, 1300161, 1244372, 1120370, 1006053, 913154, 1059810, 1133580, 1053437, 1065582, 1000633, 1046122, 944757, 922066, 858540, 914252, 978265, 887479, 798078, 925298, 890303, 809280, 794223, 746568, 690170, 731914, 806055, 805540, 603242, 548995, 679130, 756105, 767339, 590644, 657053, 717843, 699242, 732564, 696805, 659038, 701516, 682748, 625259, 620891, 614949, 654941, 702576, 466071, 548066, 566856, 711808, 659382, 605402, 524462, 670377, 753732, 625672, 530898, 602702, 639294, 677370, 625807, 560379, 662628, 676072, 441517, 499302, 506504, 532413, 463958, 510458, 387794, 490711, 588186, 399807, 449943]
2927D49943K410Q9240r1086J64207p7253n6611p5579J49430k0125j03671k7790
2916D03115O8946R014R8473j09507j7983p9547P7786J08805n9979k45554J56279
2905D09848P1650o118j3434q5497m1114J38991R089j9736K3037j15948M5318M1375
2893D57461k162n4202L5770K1736J05088p9417j06932J17162L2204l2086r6160
2882C98462M5773J69707j50191o0682N9095M9905k1270Q8733j12435n9134R3321
2871E01284r0337J12698Q1135j24920L7547J42274r3907l3771j0321L7701L7002
2860E96385J0265j42894l9007J38768O1964J4400O1222n152O7274r3494P329J94747
2848H71807p0019O9876m4311j10685o702J40711J15775j01860L014P3557Q3720
$$ y = [449943, 452353, 541593, 450507, 614714, 537461, 480850, 405271, 554701, 534576, 430905, 403115, 472061, 481075, 579548, 470041, 452058, 372511, 450297, 559102, 499123, 253569, 409848, 481498, 475380, 461946, 376449, 335335, 474326, 483415, 463679, 486716, 370768, 416086, 457461, 455299, 401097, 436867, 458603, 563691, 484274, 377342, 494504, 526708, 494622, 398462, 444235, 613942, 463751, 403069, 462164, 512069, 490799, 579532, 467097, 407963, 501284, 410947, 523645, 604780, 479860, 517407, 659681, 565774, 532003, 521682, 559383, 596385, 606650, 463756, 424749, 563517, 625481, 639881, 701103, 695951, 763225, 669731, 677060, 871807, 801788, 871664, 827353, 716668, 709966, 850677, 966452, 864592, 867606, 941163, 1024883]
2837A024883O833j70186j7575R2840M9730n878J88607j02599P7152M8820R2563
2826A285190O8433m0540k6272m3541J72308J17186P6308J1011P0956j04605J48110
2815A734544J9318J24935J44658J44508j14619J3865J99971K20103J13264j16036
2805B484511L15764J89725L49764J81337J56635K98168J79169K96093K04047L90769
2795E045982K30905J27920J74771j8104K13987M6673j9364R191J7015J3808l003
2784E839781N1496P5997J00484J17429K1116J53155O4215L06251L22540L34182
2774G386646J74798M79339M72775N83149O97272P32855M52194j05710m26188p13364
2764I733766j207675p61687m51678o79592n64220k49965j57017k43677p8998k05842
$$ y = [1024883, 1031716, 861530, 843955, 936795, 986525, 980647, 1169254, 1066655, 1143807, 1192627, 1285190, 1353623, 1313083, 1286811, 1243270, 1415578, 1532764, 1609072, 1620083, 1691039, 1586434, 1734544, 1753862, 1878797, 2023455, 2167963, 2053344, 2067209, 2267180, 2487283, 2600547, 2484511, 2800275, 2990000, 3339764, 3521101, 3677736, 3975904, 4155073, 4451166, 4655213, 5045982, 5276887, 5404807, 5579578, 5561474, 5775461, 5822134, 5802770, 5811961, 5828976, 5842784, 5839781, 5891277, 5967274, 6067758, 6185187, 6206303, 6359458, 6423673, 6729924, 7052464, 7386646, 7561444, 8040783, 8513558, 9096707, 9793979, 10526834, 10979028, 10873318, 10447130, 9733766, 8526091, 7764404, 7312726, 6633134, 6068914, 5818949, 5661932, 5418255, 5339257, 5133415]
2754E133415k31372j86486N0777p677J1693L1441P1811O4044P2010m2033K97064
2743E264687J18442O5306j00138q4609o4897k09868j28560m29347l49012k29406
2733C852598m06057j29919l13157k51270k71630q947K4868k98111j59135m8684
2723A990556r1142j60683r7443j98221m9856J4137Q3982j40290k30804p988J02000
2712A214248m0288o3423J7894p6467j0314j39698n1512J25186p0313j42475k167
2701G60671L3836k0775o0409m5438J1163l3480j580n6591r422P1010l6436r056
2689F03493j837j40121N7920J8897n2648J6279Q4502k09613N160R4792O1480o6413
2677D71891K2886j62432j35518J0487R0993R1370o1239J80491j46327r4358N6784
$$ y = [5133415, 4902043, 4715557, 4766334, 4758657, 4770350, 4801791, 4873602, 4937646, 5009656, 4967623, 5264687, 5383129, 5448435, 5348297, 5263688, 5198791, 4988923, 4860363, 4431016, 4082004, 3852598, 3446541, 3316622, 3003465, 2752195, 2480565, 2471618, 2496486, 2198375, 2039240, 1990556, 1899414, 1738731, 1641288, 1443067, 1393211, 1407348, 1491330, 1351040, 1120236, 1112248, 1214248, 1173960, 1110537, 1128431, 1051964, 1041650, 901952, 850440, 975626, 905313, 762838, 760671, 794507, 773732, 713323, 667885, 679048, 645568, 643988, 587397, 577975, 648985, 612549, 603493, 601656, 461535, 519455, 538352, 485704, 501983, 586485, 376872, 382032, 476824, 538304, 471891, 494777, 332345, 196827, 207314, 298307, 389677, 328438, 508929, 362602, 268244, 325028]
2666C25028K3035j00048j057k2562k52J1501l2753l0401Q3915Q2404o6697n4623
2654B17490q643J2297J13486r2040n7478j63652J13592P3916O0098J4890j70874
2643A13082P7077m0069q8277O5120K4765Q2081p9322M4584q3792j8443P6923R0727
2631B64456k1247N7647l8444k38024J98429p224q7385j17764J02706O8752o109
2620A75793m9222n5510J33304r8033k9711K7729m8127O4423j42464k7524J60452
2609A11110m8900k5691M5746m4664K9201J62728l2310j69702m1926R3680M4796
2598A24068m0684k1322J17168j19302o1369j01111J38526J01766n8952o1997J6689
2587C3480J62044p5326l9902L6702j9078j20278P185n3390L8874N737N4731Q2481
$$ y = [325028, 348063, 248015, 246958, 224396, 224144, 235645, 202892, 172491, 256406, 338810, 272113, 217490, 208847, 221144, 334630, 242590, 185112, 21460, 135052, 208968, 269066, 283956, 113082, 190159, 150090, 61813, 126933, 151698, 233779, 154457, 199041, 115249, 96806, 173729, 264456, 243209, 300856, 262412, 24388, 222817, 215593, 128208, 10444, 113150, 181902, 175793, 126571, 71061, 204365, 106332, 76621, 104350, 56223, 120646, -21818, -49342, 111110, 62210, 36519, 82265, 37601, 66802, 229530, 197220, 27518, -14408, 79272, 124068, 83384, 62062, 179230, 59928, -1441, -102552, 35974, 137740, 78788, 16791, 33480, 195524, 120198, 80296, 116998, 97920, -22358, -15173, -68563, -29689, -23952, 30779, 113260]
2575A13260o0057n9924M4369R0974j0868m3350j52340R2641J56027J5297l1954
2564A54075r7279J6533q2406O7988R3474j47759n4768J04031J44488j02616k03846
2553a08085N6679J15243O3601n9470k3840l2646J5072n6095Q5204q7184P5063
2542D3542N4569j8544j1598O1965j04729J00646L5496j49729p6579R3513m4672
2531a6120L3619Q3781o1898l8855K0688L4694j32674P1403O3573p0232Q0182o1163
2519F998J8307j8849l2299J31435Q211q1625L0390n289j9340j00124O4947M6805
2507D9567M3632r0866R4538J5293R653n395j65886m0880J04917J22641k81607
2496a44393R1240O2020J36214j4185q1509R28J5612L9070k43664J6529J85943
$$ y = [113260, 53203, -6721, 37648, 128622, 117754, 74404, -77936, 14705, 170732, 186029, 154075, 56796, 73329, -9077, 58911, 152385, 4626, -50142, 53889, 198377, 95761, -108085, -51406, 63837, 127438, 67968, 44128, 11482, 26554, -29541, 55663, -31521, 43542, 98111, 79567, 67969, 129934, 25205, 125851, 161347, 11618, -64961, 28552, -16120, 17499, 101280, 39382, 527, 21215, 55909, -76765, -5362, 58211, -12021, 68161, 6998, 25305, 6456, -25843, 105592, 113803, 32178, 62568, 57279, 37939, -62185, 2762, 49567, 93199, 2333, 96871, 112164, 121817, 116422, -49464, -90344, 14573, 137214, -144393, -53153, 8867, 145081, 130896, 49387, 50315, 65927, 104997, -138667, -122138, 63805]
2485F3805L000j62577P0641J05540l1225m9794j4024N2019j25012M4178J69176
2474A25727j26618j29603R0849L5051L6709r5457O08j40480J72708J36285l2383
2463G3396k00208M2661J07392J29750j52386J2184J5749J08416j00150j17642
2453h0838j3243O5174J5529J59028j18065r057o8713O7839K7262n4258J816l2697
2441d0223R7155j22846L1732M0504q759j27749P333J21862l8509l5476P812P3137
2429E973j15426O0407J88189m5374j32488K13k6922K7165Q839m7002K9794R998
2417c6634M5841N5524Q5312j67930J1605m4428P9924l6776J9677j58299O6730
2406g9454n4032J52428p9559p766R8119P5745r0596j08271k838l246M0604m205
$$ y = [63805, 66805, -95772, -25131, 80409, 49184, -610, -14634, 37385, -87627, -43449, 125727, -891, -130494, -39645, -4594, 32115, -63342, -62734, -203214, -30506, 105779, 73396, -126812, -84151, 23241, 152991, 605, 12789, 28538, 136954, 36804, -80838, -94081, -28907, -13378, 145650, 27585, 18528, -50185, 17654, 44916, -9342, -7526, -40223, 56932, -65914, -34182, 6322, -2437, -130186, -122853, -991, -39500, -74976, -67164, 5973, -109453, -49046, 139143, 93769, -38719, -38506, -65428, -38263, -29424, -76426, -46632, -36634, 9207, 64731, 150043, -17887, -6282, -50710, 29214, -7562, 12115, -146184, -79454, -133486, 18942, -60617, -68383, 29736, 105481, 14885, -93386, -96224, -99470, -58866, -63071]
2394f3071R6000m2305J189L5770K371r6313O0533r13K0635J8963j05180l6647
2382a08968P758l6751O8724j5412j726J1616J00689j89994n0911J96228N5834
2371C7087K4273j55719M8774m9784R9095k6289P780j3768o1384J3914O8956m0880
2359d7945R2956j16699r878J19839J05749j50568J6184q4112j7024J43666j78554
2348a26386j7759J07469Q7232J0346r4694J7114n0460k3806J58535r8899j9907
2337e1215R0307K0855l7095K442o0091N1424J19584Q17j88614o5632j54p300l3228
2324a57900J22655Q2160j78195J19747J37355j50698P2005m451n524l2931K4521
2313B8744k19629Q4907R5487n6091j508K1502M5413m803J8089j84258J18698P1873
$$ y = [-63071, 32929, -9376, -8187, 27583, 29954, -66359, -5826, -6739, 13896, 32859, -72321, -108968, -101210, -137961, -69237, -84649, -86375, -74759, 25930, -164064, -214975, -18747, 37087, 61360, -94359, -45585, -95369, 3726, -22563, -14783, -28551, -89935, -76021, -7065, -47945, 45011, -71688, -81566, 38273, 144022, -6546, 9638, -74474, -91498, 52168, -126386, -144145, -36676, 50556, 60902, -33792, -16678, -67138, -90944, 67591, -31308, -51215, 39092, 59947, 22852, 25294, -34797, 16627, 136211, 137028, -51586, -117218, -117372, -124672, -157900, -35245, 46915, -131280, -11533, 125822, -24876, 47129, 42678, 37154, 4223, 28744, -190885, -105978, -10491, -66582, -68090, -46588, -1175, -5978, 12111, -172147, -53449, 18424]
2301A8424k6760K35K9206j07055m6722K10084k8648M0520L1974m2606j66064l3880
2289a21292J48260L6177n4827m8008P3609l5048J15516M149r2298O4474L3694
2278A24406q1601n6095N1012q861j9517o5093N4793M5234L7123n0703j89202J3795
2266a44709K11515q5421l8996J9670P9690m4551l4259Q6846M3094J0452j06558
2255c227k1316J76864j46215j5891j66714Q478J97002J24604o6153j08413J34968
2244A13987k17423P1760J07593P181R7358j07960j04595n7435J81538p3338P350
2233B6016J03875k17001R8170r8846J13852O0426o3295k4560j84575R4026J59832
2222F7920M000n9766p1200J19678m7762p7612r087J68978r2146q0408k305R4716
$$ y = [18424, -8336, -8101, 21105, -85950, -132672, 77412, 48764, 89284, 121258, 78652, -87412, -121292, 26968, 63145, 8318, -39690, 33919, -1129, 114387, 118536, 26238, 90712, 124406, 42805, -13290, 37722, 28861, 9344, -55749, -956, 44278, 81401, 30698, -158504, -144709, 66806, -18615, -57611, -37941, 41749, -2802, -37061, 49785, 92879, 103331, -3227, -24543, 152321, 6106, -9785, -176499, -168021, 28981, 153585, 87432, -20981, 113987, -103436, -31676, 75917, 83098, 180456, 72496, -32099, -89534, 92004, 18666, 26016, 129891, -87110, 11060, -87786, 26066, 86492, 23197, -1363, -185938, -91912, 67920, 71920, 12154, -59046, 60632, 12870, -64742, -73829, 95149, 3003, -77405, -79710, 15006]
2210A5006m0731P818m0356J58066M31j14894K268L1203m5867Q4995m0159p7989
2198f0209P2623l2938O9755m5708O8977o6904M7545j24400J58248l4273m0795
2187A1921o7333m3432J66400k0083r0805K4737R6320n8738l1541L8157O4915p9496
2175A1022N5338J03032j09008J0102N236J3058K6401J12822K1414j67937N2233
2164A33713n7166K2013P8812N7573q8867m3913N1775Q619o0732k7530O6921r1682
2152D9536Q2082J27914j34951j2101J5589L5181M2073O1196r9109L0072K7427
2141B24909j16218R8671R8219j19118j48225P574J19848j06671p453J93794j05157
2130A40173M4555j23979L7409J32224l3778J08918p0346p4052N4284L8372m0535
$$ y = [15006, -25725, -17907, -58263, 99803, 100234, -14660, -12392, 18811, -27056, 57939, 17780, -60209, 12414, -20524, 49231, 3523, 72500, 5596, 53141, -71259, 86989, 52716, 11921, -55412, -98844, 67556, 47473, -43332, -18595, 77725, 18987, -12554, 25603, 90518, 11022, 66360, 169392, 60384, 70486, 75722, 88780, 115181, 228003, 249417, 81480, 133713, 76547, 98560, 177372, 234945, 146078, 102165, 153940, 162559, 101827, 74297, 141218, 49536, 131618, 259532, 124581, 112480, 128069, 163250, 205323, 266519, 167410, 197482, 224909, 108691, 207362, 305581, 186463, 38238, 45812, 165660, 58989, 51536, 245330, 140173, 184728, 60749, 98158, 230382, 196604, 305522, 235176, 161124, 215408, 253780, 213245]
2119B13245m9493J35357J1851m7951n4006n1858P4836J63141j51296Q9609M5469
2108C78904m2982o2287M4473M9381J11994N7778j36986q6387J50933R2058O0791
2097F17670l9455l5884j20877J51830l9900R0792O6081O1704j94296m670J24102
2086F77097m4851J68963J01327j60772r0260P7871J09040Q7001Q2095O0475P702
2075A075688Q0441n8591M4363J1493K62094M7483N7429J46979J69202l8229K67526
2064B065878Q2490L29966N7625J43470K02630L77678K39339N57236L27646M70209
2054D854167N32086P56152O33541R15692J227153J680444J739039K216490K002737
2045A6557501J522786K47836k359035l393739k809999j849745j629427p91313
$$ y = [213245, 163752, 299109, 310960, 263009, 209003, 157145, 231981, 395122, 243826, 333435, 378904, 335922, 273635, 318108, 367489, 479483, 537261, 400275, 313888, 464821, 556879, 617670, 578215, 542331, 421454, 573284, 533384, 624176, 690257, 751961, 557665, 552995, 677097, 632246, 801209, 902536, 741764, 651504, 729375, 838415, 925416, 1007511, 1067986, 1075688, 1156129, 1097538, 1141901, 1153394, 1415488, 1462971, 1520400, 1667379, 1836581, 1798352, 2065878, 2148368, 2478334, 2535959, 2679429, 2882059, 3259737, 3499076, 4056312, 4383958, 4854167, 5386253, 6142405, 6775946, 7691638, 8918791, 10599235, 12338274, 14554764, 16557501, 18080287, 18328123, 15969088, 12575349, 9765350, 7915605, 6286178, 5494865]
2037E494865n29517o36691l51585l18427m05636n2702j14903l48017m32032l380
2027B301975j4086k79359m22290j80959J70020N4869j23297k31112j69745K29886
2017A335902k48253j7484o2089J11261o0176j55163r9016K7023Q9606p4368j31148
2006G16095p1010N021P4171m2523k2375k83313M9124K3476N5460J28832j32919
1995E00039q8208M5696J45012j63802m8321r7752K18745m620r8982j4823j01882
1984B91102r0369J14760Q0712J021j2323j24425M8180K4569P154j39099Q4287
1973B85569l017K3238j00947K7602m3915j6281P8507p388j92058l2997K35810
1962B54123M131k4992k8843j68166K50541N5395k10273J0737j064P9786j5052
$$ y = [5494865, 4965348, 4328657, 3977072, 3658645, 3253009, 3200307, 3085404, 2737387, 2305355, 2301975, 2287889, 2008530, 1586240, 1405281, 1575301, 1630170, 1506873, 1275761, 1106016, 1335902, 1087649, 1070165, 1008076, 1119337, 1059161, 903998, 804982, 832005, 921611, 847243, 716095, 645085, 650106, 724277, 681754, 659379, 376066, 425190, 448666, 504126, 632958, 500039, 411831, 457527, 602539, 438737, 390416, 292664, 511409, 506789, 407807, 392984, 291102, 200733, 315493, 396205, 397226, 384903, 260478, 308658, 333227, 340381, 201282, 285569, 282552, 305790, 204843, 232445, 188530, 172249, 250756, 243368, 51310, 18313, 254123, 258254, 233262, 204419, 36253, 286794, 342189, 131916, 142653, 141589, 221375, 206323]
1951B06323p6640O4797j08672M3878O7901K3842j17245r7309J73649n7139J9367
1940A42752M2367p8264r7069M8646O5601l9071j48296R079J0826p2254J51114
1929C5431R4064p3107l2196q1998O1297K4748L3015N073K0327j6183r1690Q6535
1917F5316m6525j5370j834l2315m6849J7481P8005m2361O9512P4022O6686j23169
1905F2599l6251q3446L5667J07656M2434j69181M9093l4511K0805K8982j13421
1894h9574P4814N3298n2721K6868K4257O7437o5335l8447p4682J29781J22228
1883A77924k13315n4773J49612o3650K9847j01364K07436M6268j70289o5792L9724
1872a8372j3113K3820K2069q745p2548j9520K629J46134J2223l8056r5972R7739
$$ y = [206323, 129683, 194480, 85808, 129686, 197587, 221429, 104184, 6875, 180524, 123385, 142752, 185119, 106855, 9786, 58432, 124033, 84962, -63334, -54255, -43429, -115683, 35431, 129495, 56388, 24192, -57806, 3491, 28239, 61254, 66327, 86654, 70471, -21219, 65316, 18791, 3421, 1587, -30728, -77577, -60096, 17909, -24452, 45060, 119082, 185768, 62599, 26348, -57098, -21431, 86225, 128659, -40522, 8571, -25940, -5135, 23847, -89574, -14760, 38538, -14183, 12685, 36942, 104379, 39044, 597, -74085, 55696, 177924, -35391, -90164, 59448, -4202, 25645, -75719, 131717, 177985, 7696, -58096, -18372, -31485, -7665, 14404, 5659, -66889, -86409, -83780, 62354, 74577, 36521, -59451, 38288]
1860C8288m22Q398n2468l2398k2471j0993K2770p845K9782q9256Q7351j8379j8623
1847f6266J80471Q4190l42555R8600M3984P7739L249j31194K5698P269r970J2842
1835a5943k7537L3227J6210J12422l51700J95264l4397q8405J71005L8346n4975
1824f483Q702j05083J61802p0921m8756N1678J20967j24170J14799j38180l5620
1813g1265N5201k7333R385K0343r617J20865l4763o0888P1313M049l8054k5071
1801A4165Q9106o1929N8100p2992k6160L7801J14825j36743O722j20408J08552
1790A1039K1393N9834j68310M77N5043R6312m2187j41763K4841J20217Q4151j41757
1778b0710j7210L8319M6276m6702Q4396n5714r4114N2351P4740q1944n8329j03164
$$ y = [38288, 37866, 46264, -6204, -38602, -61073, -72066, -49296, -57141, -27359, -116615, -29264, -47643, -66266, 114205, 198395, -144160, -45560, -1576, 76163, 79412, -51782, -26084, -18815, -28785, -15943, -43480, -10253, 5957, 118379, -233321, -38057, -72454, -160859, 10146, 48492, -6483, 2219, -102864, 58938, -11983, -60739, -9061, 111906, -12264, 102535, -35645, -71265, -16064, -43397, -34012, -13669, -23286, 97579, 62816, 1928, 73241, 77290, 39236, 14165, 103271, 41342, 99442, 26450, 290, 38091, 152916, 16173, 22895, -97513, 11039, 32432, 92266, -76044, -75567, -20524, 75788, 33601, -108162, -83321, 36896, 121047, -20710, -37920, 399, 46675, -27, 84369, 28655, -65459, -13108, 61632, -20312, -78641, -181805]
1766a81805R1650J13721Q068j484j79271N331R0666R5276r9731K828k0447k7072
1754a02270L7825j53041Q2927m4704N7002K80699q107k34357n588J5451O7618
1743f545M1189q7664J38079J0089j16086q8144J96775p0479j07039J16351J25803
1732A52329k37999O0075P9626N5530K5163j03425k08497O4188J25723r1676n9426
1721a38389K12074J194j58858L2158m7402J54491q3788O2681j18745j6475L5416
1710f5643p4678M9611N1692P6367j93983O6769K8129K5862J8415M3218m2200N3400
1698C6959j16266j11807J26531r9388J52306k4942K4685L6093n5816L5380j13448
1687a09713J01037N7275R695m1152j7560k7539K8139l9472P509J47043k33614
$$ y = [-181805, -90155, 23566, 31634, 30150, -149121, -143790, -53124, 42152, -57579, -54751, -75198, -102270, -64445, -217486, -134559, -179263, -122261, 158438, 150331, -84026, -89614, -74163, -6545, 34644, -53020, 85059, 95148, -20938, -109082, 87693, 17214, -89825, 26526, 152329, -85670, -25595, 54031, 109561, 134724, 31299, -177198, -113010, 12713, -78963, -138389, 73685, 74879, -83979, -51821, -99223, 55268, -28520, 34161, -84584, -101059, -65643, -140321, -90710, -39018, 37349, -156634, -89865, -61736, -35874, -17459, 25759, -16441, 36959, -79307, -191114, -64583, -163971, -11665, -36607, -11922, 24171, -31645, 3735, -109713, -8676, 48599, 58294, 17142, -418, -27957, 182, -39290, -31781, 115262, -118352]
1676a18352j0327P5436J4712n0078N3350k3504J68515p5842j69940N4766O2129
1665a9135o3088r5921J69625j2464o893J5509q8253J51519L8875j68555n032O4083
1653a9730L7577o7255R0141j03018n7262J01713Q4759q8518k9627Q1784J3267
1642D3831l1964K3527o3309J2742K3130r5072r5074O6187J38075j4528m2821k9719
1630f4995J1342J02112K1201j45421O2969m4044n2346o5574J38320J4461l8678
1619f0653m9614R9289k7390J1556J11451j89661o4962J79447j32494O351L6752
1608g9928R5421j17565J04133j00123P1374J32687r2520J9983o7502q5809P2160
1597d7689O2418j5225n0435k8281j2776r800J78057j61627J86606m8866j3114
$$ y = [-118352, -128679, -53243, -38531, -88609, -35259, -58763, 109752, 33910, -136030, -81264, -19135, -82223, -178144, -8519, -20983, -27876, -12367, -100620, 50899, 89774, -78781, -83813, -19730, 17847, -49408, 40733, -62285, -119547, -17834, 66925, -21593, -51220, 30564, 43831, 11867, 35394, -27915, -15173, 7957, -87115, -182189, -116002, 22073, 7545, -35276, -64995, -53653, 48459, 69660, -75761, -12792, -56836, -109182, -174756, -36436, -21975, -60653, -110267, -10978, -38368, -26812, 84639, -105022, -169984, 9463, -123031, -116680, -79928, 15493, -102072, 2061, -98062, -26688, 105999, 13479, 33462, -34040, -119849, -47689, 14729, -496, -50931, -79212, -91988, -101788, 76269, -85358, 101248, 52382, 39268]
1586C9268j56027J00602R955p5252n7909R2835O3065m1757J3573o1247J2374l2223
1574i2743K4690J49273l9852p0014j48286J80262M096j02233K16299q2397r6158
1563e7063k4453p086L7285P4410j56687P0413o6635J16060k463o5526K3446k2763
1551h1062J27942j29495P5385K2748p9407j3245m6823K05423j64440Q8342K7458
1540C2826J311k9946o3393o9659Q5335R8856q1232Q8097O2206r0431p3171k2152
1528f1353L7661q2226Q5438P2973j4473m1170j36057J3856j2499L36162n1730
1517A46582j93139m2137J04943O1732r1247p2540K2014L0272n8031J00129K3327
1506C1905k4634O895m1596R1174j64115l7185L0077L0202R0819R5315m9156o7650
$$ y = [39268, -116759, -16157, -6202, -81454, -139363, -46528, 16537, -25220, -11647, -72894, -60520, -92743, -68053, 81220, 41368, -28646, -176932, 3330, 7426, -94807, 121492, 39095, -57063, -81516, -88602, -51317, 23093, -133594, -63181, -129816, -13756, -16219, -81745, -58299, -81062, 46880, -82615, -7230, 15518, -63889, -77134, -123957, 81466, -82974, 5368, 32826, 34137, 4191, -59202, -128861, -43526, 55330, -25902, 62195, 124401, 33970, -39201, -61353, -23692, -105918, -20480, 52493, 38020, -3150, -139207, -125351, -137850, 198312, 146582, -46557, -88694, 16249, 77981, -13266, -85806, -63792, -33520, -91551, 8578, 31905, 7271, 14166, -27430, 63744, -100371, -137556, -107479, -77277, 13542, 108857, 59701, -7949]
1494g949K0159o9447j51485J62410n2577l667p401N1851J05574n9099j66129R1830
1482h5930j3171Q4445O0910M3801m6518j00319J9073j9067m389O3557l169j00968
1470a01745J31716q4411k7563J79940q7298o3548O4252r0412K5412n0263m9387
1459a53307J28421J7212J6699o0154K8587j11871R1666p0730L8192J29760j45311
1448i0836L586J74494p351j72014O2596p4369J0205q826l5711o3914J71361J45402
1436A14623j95621k28399K69496r7663J45192M5228m125j78049P3830L5818J26640
1425A06970l0369k12889m883K26810j06600N6318j4460J9946r7373j08997Q2164
1414h3363P342N1933L6316l4184p5851J69156j86663J3054J06455Q1236q1764
$$ y = [-7949, 12210, -57237, -208722, -46312, -98889, -102556, -109957, -58106, 47468, -11631, -177760, -85930, -99101, -14656, 46254, 90055, 43537, -56782, -37709, -56776, -61165, 2392, -777, -101745, 29971, -54440, -82003, 97937, 10639, -52909, 11343, -79069, -53657, -103920, -153307, -24886, -7674, 9025, -51129, -22542, -134413, -42747, -113477, -75285, 54475, -90836, -87250, 87244, 79893, -92121, -29525, -103894, -93689, -102515, -138226, -202140, -30779, 114623, -80998, -309397, -39901, -137564, 7628, 52856, 48731, -129318, -55488, -19670, 106970, 76601, -136288, -141171, 85639, -20961, 35357, 20897, 40843, -56530, -165527, -83363, -76021, -24088, 12228, -21956, -97807, 71349, -115314, -102260, 4195, 85431, 3667]
1403C667j21919J2866J50078r4625o5860R7284R509m010K6955l8701K9814L9835
1391D4893K1664m924l1602r9656l0857J68766q7493m6243M6271n3012j04244P1136
1379a05301J89752j06292J241Q4171Q4598j15677j93484J9870P8548k493k9692
1368i4759J05055m0996K9417q3505k9366K17463m0499j38973M5132K9129q3861
1357h5763m4598N7286M5704K8684j43539K4833J05802m5769L4096l9404J91405
1346A28737j05952j32470O0160J18647j37207m4252q7599J01246J48667o2463
1336a2486m9883Q4235l1746O3472q9221j29375R2516j9840j53157J48398J72415
1325G5328j30463m642j3189O0596Q6928p9958K4157N7748o8715p0339P6281K2706
$$ y = [3667, -118252, -105386, 44692, -49933, -115793, -18509, -9000, -13010, 13945, -24756, 5058, 44893, 66557, 61633, 30031, -69625, -100482, 68284, -19209, -65452, -19181, -72193, -176437, -105301, 84451, -21841, -20600, 63571, 148169, 32492, -160992, -141122, -62574, -65067, -94759, 10296, -30700, -1283, -84788, -114154, 103309, 62810, -76163, -31031, -1902, -85763, -130361, -73075, -27371, 1313, -142226, -117393, -11591, -57360, -23264, -62668, 128737, 22785, -109685, -49525, 69122, -68085, -112337, -199936, -98690, 49977, -12486, -62369, 21866, -9880, 53592, -35629, -165004, -72488, -92328, -245485, -97087, 75328, -55135, -59777, -72966, -12370, 74558, -5400, 18757, 76505, 7790, -62549, 13732, 36438]
1313C6438m5159N5759r0872l5268J85769j73403o1898K0492O7517M4104M3995
1302D7474M7130k38827J4001K16918J13017l8902j74573l1036l9204J18007K5383
1291E9388p3973M5615k6611n3457q385M5263N2932l1289j3292J12955j49679O0235
1279A9702j80717J0994J79819J43621n3942j87992m4602j0017J98502m5241p36
1268B9391M4228j09606J4073N7239p4471k453L7742j16383N3336Q3147R2399j27881
1256a9239q697o5426J86325j70996N7817n4130J09862J16738m3473r4326j01187
1245h6732J47459J282l452j22325j00770O7084R8243q6984N6361j03676K4571
1234a08939J39333P3681J4342j69251J6675J6151O378o3800R5639n2051o1700
$$ y = [36438, -8721, 47038, -43834, -79102, 106667, -66736, -128634, -108142, -40625, 3479, 47474, 94604, -144223, -130222, 86696, 199713, 160811, -13762, -44798, -84002, 34005, 59388, -14585, 31030, 4419, -49038, -57423, -12160, 40772, 9483, -3809, 109146, -40533, 19702, -161015, -150021, 29798, 173419, 119477, -68515, -113117, -123134, 75368, 30127, 29391, 73619, -35987, -21914, 35325, -39146, -41599, -3857, -120240, -66904, 16243, 108642, -19239, -27936, -93362, 92963, -78033, -20216, -74346, 35516, 152254, 108781, 14455, -86732, 60727, 62009, 58557, -63768, -164538, -97454, 789, -86195, -29834, -133510, -108939, 30394, 104075, 118417, -50834, -34159, -18008, -11630, -75430, 20209, -31842, -93542]
1223i3542k4013P0547J01284j39109J00527m7590J10471j0050K3647j01628N4455
1212D4999p6249j823k0926N6305k2093J09127r6081q7685N9222N7095m7956N042
1200b1023m8482k7258J23146m7110J6673M958m7973L9373l5116k4303R7897j983
1188B8799O2112o9810j21209p93K41425j68187O2669r3807k7680J20491K9635
1177F3645k0042J6086r3795n9563J09912L4100q2445o1927j5771L0156J26689
1166D7045o7451m1694O9618P4204r6869L3314m1967O9777K8586k29578Q5621R6487
1154B7093p9590K9512L189p3477Q9059k3625q2538J09162j14429O2544L1431J08080
1142H6411J4733r8828J6396p1659J9597P7714k5235P626r7024l4259J60399q4868
$$ y = [-93542, -117555, -47008, 54276, -84833, 15694, -31896, 78575, 68525, 92172, -9456, 44999, -31250, -33073, -53999, 2306, -19787, 89340, -6741, -94426, -35204, 21891, -26065, -21023, -69505, -96763, 26383, -20727, -4054, 904, -47069, -7696, -42812, -67115, 30782, 28799, 90911, 21101, -100108, -100901, 140524, -27663, 35006, -58801, -86481, 34010, 63645, 43603, 59689, -34106, -93669, 16243, 50343, -32102, -94029, -109800, -79644, 47045, -20406, -62100, 7518, 81722, -15147, 18167, -23800, 45977, 74563, -155015, -69394, 27093, -52497, -22985, -19796, -93273, -4214, -27839, -110377, -1215, -115644, -53100, -21669, 86411, 101144, 2316, 18712, -52947, -33350, 44364, 19129, 26755, -70269, -104528, 55871, -28997]
1130b8997l987J40139o1775j68066K04378m3442M7045r7684k2983Q8306K9449
1119H2383j85906J27802P227j06022J58398n4724K7039j28909J1704O9705O5863
1108G4560k1635j7934j03206P5778n8166J51288j2852o5883j23671m3285J25296
1097a9710j7407q766Q8314n4634p1433J17959K6559Q5898k15162l2075L7827P1818
1085I188L4869j17108O7966P1808j39158o1952J18902J0507m2956N7576q6213
1074g6571J22250J29818k10863o8348j1348Q9231J32811p4422j32089k9216R9702
1063b9045N3569r7876M9540j18404J75908M7203r1203j02597j05753K39584L9253
1052F0179J5140j23147j32838J40820O2666J09919j46K8551k11173N09M7843o5490
$$ y = [-28997, -32984, 107155, 45380, -122686, 81692, 38250, 85295, -12389, -35372, 52934, 82383, -103523, 24279, 31506, -74516, 83882, 29158, 56197, -72712, -61008, 8697, 74560, 52925, 34991, -68215, 7563, -50603, 100685, 87833, 21950, -101721, -145006, -19710, -37117, -45883, 42431, -12203, -83636, 34323, 60882, 146780, -68382, -100457, -62630, 9188, 44057, -73051, -5085, 66723, -72435, -134387, -15485, -4978, -47934, 9642, -76571, 45679, 175497, -35366, -103714, -115062, -25831, 106980, 32558, -99531, -128747, -29045, 24524, -73352, -23812, -142216, 33692, 80895, -10308, -112905, -218658, 20926, 60179, 75319, -47828, -180666, -39846, 22820, 132739, 132593, 161144, -50029, -49520, -1677, -67167]
1040f7167M6103l1709q201j1792J1623J44504O4473j72481o9344J34252L3471
1029G3732j03537Q7755j99277K2593n78N4726k3903L2770K1517L5032m6370j50928
1017a96468J90872R9294m5259L9464n4589q551J298l2874j08073J61760K2723
1006F9597m6802l7393P2805j9350j5347j7608O9520p8473r8483j7221Q1675L2831
994d249j03420J06103j7669J15471n0118o1111q5181J23051n6256o242k0946J20651
982F0084j02107N68M9059j14314K6650O4908l9004J58961q4228m1486o7109J02704
970A4686q5769o1340L7209L4727R4258p2890r0474O9449K33627j4643k10325O3928
958A2443M6047P379J01659k90519L7545J37714J02679j93217K1664n407o2241
$$ y = [-67167, -21064, -52773, -60974, -72766, -61143, 83361, 147834, -24647, -93991, 40261, 73732, -29805, 57950, -141327, -118734, -119312, -64586, -88489, -55719, -34202, 830, -45540, -196468, -5596, 93698, 48439, 87903, 33314, 24763, 26061, -6813, -114886, 46874, 69597, 22795, -14598, 58207, 38857, 23510, 5902, 75422, -3051, -101534, -118755, -37080, -4249, -107669, -1566, -19235, 96236, 46118, -14993, -100174, 22877, -33379, -39621, -60567, 60084, -42023, -41455, 7604, -106710, -80060, -15152, -54156, 104805, 20577, -20909, -88018, 14686, -71083, -132423, -95214, -60487, 33771, -39119, -129593, -60144, 173483, 158840, -51485, 12443, 58490, 65869, 167528, -122991, -85446, 52268, 154947, -38270, -16606, -22013, -84254]
947h4254J13101J12692j29100o9350m471m1118k1500K21305n4560r5707N4806
936A844M1670l7934l0410L3558L3671R3951k442k09195J29352K1616p7369k086
924c774n8823m7469J23018M6219j91146J43539l234Q6674P1003k29979j11594
913a75566J37146P0583j3859l7976K6059p852O7570p5751p2011P9444K9824K7760
901E5371m5796l6973Q8908k7551j45207L9952J7370J20602j1139n3147n4124J38127
889H6393n0049l612o9097p9871J16468J5374Q4706q9168p4084K9719R8638j65322
877i9905J59434M2015j36520L9685J0196n895n001L2498l5475P2095n5642p5327
865e7842K5834K0222N4985o7132O8221l629p5283p9443O8968J57179j07149q2558
$$ y = [-84254, 28847, 141539, 12439, -56911, -61382, -102500, -124000, 97305, 42745, -52962, 1844, 43514, 5580, -24830, 8728, 42399, 136350, 133908, -75287, 54065, 75681, -1688, -3774, -62597, -110066, 12952, 59171, -131975, 11564, 8330, 95004, 166007, -63972, -175566, -38420, 32163, 18304, -19672, 6387, -1465, 66105, -9646, -81657, -2213, 27611, 55371, 9575, -27398, 61510, 33959, -111248, -71296, -53926, 66676, 55537, 2390, -51734, 86393, 36344, 32732, -36365, -116236, 232, 15606, 100312, 11144, -62940, -33221, 65417, -99905, 59529, 101544, -34976, 4709, 14905, 9010, 4009, 36507, 1032, 73127, 17485, -57842, -32008, -11786, 43199, -23933, 44288, 40659, -34624, -114067, -45099, 112080, 4931, -77627]
853g7627R0021k6732l0998J69266j74521q1650J72258n7161n007p706p7274Q947
841i8184L17937j51430m1539J1748j23523J31065l2957n1720J18116m996j36988
830f2471L5134P7151l2648k8309l6748Q0478J1795j92124J05180K05800q8006
819G5232J08190j25882j10892J5247N3506P7218J07132k48896o0390J40374k5859
808D980Q7937p8261q8867l0765K09663j94061J25381k572k3874r9275N7340N1873
796A9499n2116Q8669j44435q4205P7292K54439q0440n9059j2688j8862n9425O1340
784i991j06685J09636r8929J41268o7292m0001Q3794L0371P9934o2608j32608
773g3111J23888J1623j17121n2925L1594J1920p1429R8370P4474J14084j83617
$$ y = [-77627, 12394, -14338, -45336, 123930, -50591, -132241, 40017, -17144, -22151, -29857, -107131, -98184, 219753, 68323, 26784, 38532, -84991, 46074, 13117, -38603, 79513, 74517, -62471, -27337, 49814, 17166, -11143, -47891, 32587, 44382, -147742, -42562, 163238, 75232, 183422, 57540, -53352, -38105, 15401, 92619, 199751, -49145, -109535, 30839, 4980, 92917, 14656, -74211, -104976, 104687, -89374, 36007, 33435, 9561, -89714, -32374, 19499, -32617, 56052, -88383, -172588, -95296, 159143, 78703, 19644, 6956, -11906, -71331, -9991, -116676, -7040, -105969, 35299, -31993, -71994, 11800, 42171, 122105, 59497, -73111, 50777, 62400, -54721, -107646, -76052, -64132, -135561, -37191, 37283, 151367, -32250]
762c2250L309n2910J87798p4636l1227L8862j26550l8806J56362j8598K0295j32867
750a01218N0404O7552J34419q0250j01285K5643J15248j48414l543O9561K3244
739E1361j41344N0057M5212j32001J27238M8633j52110O0610J65963q8482m8505
728a3368j1112j08185P1876J21271q7517n0081K4245O6980R9704K7431o2755q8557
716a0068l8143J7187p9325J19068n7999J30835o176J3344J8001o406o9309m7743
704a6734N2093p7979J05209j09079O6938k8877Q6234M6120p6985j44M4649q0466
692A0979l0725R6753r5053K8224l4343Q0220M0643p2400l8015N9556q9377l5091
680g8629r8769P9574n2874J45149R6885j64860J26177P0615k5781j51809N0376
$$ y = [-32250, -28941, -81851, 105947, 31311, 84, 38946, -87604, -126410, 29952, 11354, 31649, -101218, -50814, 16738, 151157, 70907, -30378, -4735, 110513, -37901, -41444, 28117, 51361, -89983, -39926, 5286, -126715, 523, 49156, -102954, -42344, 123619, 35137, -13368, -24480, -132665, -60789, 60482, -27035, -77116, -52871, 14109, 113813, 141244, 78489, -10068, -48211, -31024, -110349, 8719, -49280, 81555, 75379, 88723, 106724, 100318, 31009, -16734, 35359, -42620, 62589, -46490, 20448, -8429, 77805, 123925, 46940, 46796, 91445, 10979, -19746, 77007, -18046, 10178, -24165, 56055, 96698, 24298, -13717, 45839, -43538, -78629, -177398, -97824, -150698, -5549, 91336, -73524, 52653, 123268, 97487, -54322, -3946]
669c946N1216j2948O9042l2588Q177j25670O6141j4709L1551M3697K2581j841
657A00703j35595j3699M8932J6466L7485O2833J3409j59009K4844N4733n1608
646e06J6454K1257r5049J27912K1540k3924j07647J1693J53553j5012o6055j07927
634f3711N3224J42515k7582l6430m6359q7910O2266n0578J9512l2453J11017l0966
622A2545M9864k7948M7486n6416j11582J60202r673r0100P7786J97760j55804
611I4120j49995M3537K5737N3832r9348K7917K715K3232m6164K9799J03320k1346
599H7356J01343j43375o9709m0439J84948O009q0186n6500M9973J6939m046L291
587E5604q9968n2068J21628m4842j2821J23612j03819j13370P8018l0541N3197
$$ y = [-3946, 47270, 34322, 103364, 70776, 78953, -46717, 19424, 4715, 36266, 79963, 102544, 100703, -34892, -48591, 341, 16807, 54292, 117125, 130534, -28475, -3631, 51102, -506, 15948, 37205, -57844, 70068, 91608, 67684, -39963, -28270, 125283, 110271, 44216, -63711, -10487, 132028, 104446, 68016, 21657, -66253, -3987, -54565, -35053, -67506, 43511, 12545, 62409, 34461, 81947, 25531, -86051, 74151, 64478, -25622, 52164, 249924, 94120, -55875, -12338, 13399, 67231, -32117, -4200, -1485, 21747, -24417, 5382, 108702, 87356, 188699, 45324, -24385, -64824, 120124, 126133, 45947, -10553, 39420, 56359, 52313, 55604, -34364, -86432, 35196, -9646, -22467, 101145, -2674, -116044, -38026, -68567, -15370]
576a5370n455J14738n0959r4807J32931m774r8481R0513K3082p0928j469J25057
564A44078j36364m5898K02603j15901o3126O2087o1175J03405j30167J7585N1692
553B8819j05455J65220k9402k8551j11990J54111o3360k7778L7234o4056N5357
542A0149J18550l7506L2069k24301K34010j56947R1684L97J02017j62427o3369
531e5674J49292O9800j7160j57799r5494Q3681N6917k8653M6883j8573J6800N5875
519A05895p2557o296p6613O8461L4264R3277m7495K2209l0326j68804L0902j26904
507a73987J28460J40202K6967L4596m7506n1358l2456J39655j1135k84606N7767
496g3401J23828P0371m4230j09998j13692K62268O3720o899j28066k8834j7652
$$ y = [-15370, -20825, 93913, 42954, -51853, 81078, 76304, -22177, 68336, 91418, 20490, 19021, 144078, 7714, -38184, 164419, 48518, -14608, 47479, -13696, 89709, -40458, -22873, 28819, -76636, 88584, 59182, 30631, -81359, 72752, 9392, -18386, 18848, -45208, 10149, 128699, 91193, 123262, -101039, 132971, -23976, 67708, 68105, 170122, 7695, -55674, 93618, 163418, 146258, -11541, -107035, -23354, 33563, 4910, 51793, 33220, 50020, 105895, 33338, 27042, -49571, 18890, 53154, 146431, 98936, 121145, 90819, -77985, -47083, -173987, -45527, 94675, 121642, 156238, 108732, 57374, 24918, 164573, 153438, -131168, -73401, 50427, 120798, 76568, -33430, -147122, 115146, 178866, 171967, 43901, 15067, -2585]
485b585P2982k8347N0656L7200q0513j06137O8445J01599n8640K373m3549l9466
473b5982j659M1688O9289j04235N1896l1438L722R3486q7358J23595j04821o4080
461c5897R4598p6795N0236k6860M3524J2796O412K1681j13541L9915O5351r6731
449a5311l6824J2249K12510p2199p7684j03881M7292P9765Q3449j93002J12346
438D8710L5744k8755l2051p808Q8811p6384P8260k45242J35868K21979l2120j60198
426B6814K69o0671j0779J41635q5782O1432m1371k0720K703J6444n1968N6350
414C4356J12024j33248J2611j58072J50872M5760J4557M5551j07580J4757K20736
403B52324j86664j72774J17406L44K8417j03420O9320m4864Q4412k1413l0766
$$ y = [-2585, 70397, 42050, 92706, 129906, 49393, -56744, 11701, 113300, 54660, 57033, 13484, -25982, -27641, 14047, 83336, -20899, 30997, -441, 3281, 96767, 9409, 133004, 28183, -35897, 58701, -18094, 32142, 5282, 48806, 61602, 68014, 89695, -23846, 16069, 81420, -15311, -52135, -39886, 172624, 100425, 22741, -81140, -33848, 45917, 129366, -63636, 48710, 84454, 55699, 23648, 15840, 104651, 28267, 106527, -138715, -2847, 219132, 187012, 26814, 27083, -33588, -44367, 97268, 11486, 72918, 31547, 10827, 13530, 29974, -21994, 34356, 146380, 13132, 25743, -132329, 18543, 64303, 78860, 124411, 16831, 31588, 252324, 65660, -107114, 10292, 10636, 39053, -64367, 4953, -39911, 44501, 23088, -7678]
392g678q662N4322K6773K0902j02223J36740k18917Q043J34432O132M4293O4968
380A59125p0148m2119o2147M033N4611n3746R3246j08027Q4571m0086R2868q3478
368B8703Q4262Q0787l2900j26752o4388K0324J19804N3826k23428K4Q5818m0147
356a4067n0200J70294k1682o2523k0442m9443L9834K3032J01594p8873P9851k9599
344H7776n1047j10665k3334M5970J62130o7874L6197L091N2903p4514k1429n6025
332a6821J20364j01392M7092j4319k0609J02107J07242k05352L836l9044J13787
321I6891L9151j27905l6062P4829O5223j2094l1807j62956N2713j1362K32275
310A78896m951k9230j71167j1070J00048k2907j20j2906N0403O839q8875L5911
$$ y = [-7678, -16340, 37982, 64755, 85657, -16566, 120174, -98743, -90700, 43732, 49864, 94157, 159125, 88977, 46858, -15289, -11256, 43355, -10391, 82855, -25172, 59399, 19313, 112181, 28703, 112965, 193752, 160852, 34100, -30288, -9964, 109840, 163666, -59762, -59738, 26080, -14067, -64267, 106027, 84345, 21822, 1380, -48063, -8229, 14803, 116397, 37524, 117375, 87776, 36729, -73936, -97270, -51300, 110830, 42956, 79153, 82244, 135147, 60633, 39204, -16821, 103543, 2151, 49243, 34924, 14315, 116422, 223664, 18312, 22148, -16896, 96891, 136042, 8137, -27925, 46904, 112127, 100033, 68226, -94730, -42017, -53379, 178896, 173945, 144715, -26452, -37522, 62526, 39619, 39499, 26593, 76996, 83835, -5040, 30871]
298C0871R0101m8007r9545j2038J21433r3257N522K10611j91094o911o5715K4465
286c3564J18614L8129j04761J05418m8125p7678k1289J546l0743J46883m8457
275D5973K8970r5361J21502k7427p3115N401j6774J18761R5509j98317q3538P527
263g0889J01608o34m333L6657N9899K9947j27194N6179j01322R9136L1739j05803
251D990p4407P5240N7159R3234o6806p6550m7327R4144K6259M5846j77206Q5404
239C9980m7351L4375P8400o4652P30Q4512m2449q6359J26607j38438M6510O2883
227I4748j08676Q8598L1499m8689j0478P3044M5045j46525J6721j9080j1621J29121
215A33707p8319j24251J47144L9862l391n7747l3897Q228M7528j59853M9620K5360
$$ y = [30871, 120972, 72965, -26580, -38618, 82815, -10442, -4920, 205691, 14597, 7686, -58029, -33564, 85050, 123179, 18418, 123836, 75711, -1967, -23256, -21710, -52453, 94430, 45973, 74943, -20418, 101084, 73657, 542, 5943, -10831, 107930, 203439, 5122, -78416, -70889, 30719, 30085, 25752, 62409, 122308, 152255, 25061, 81240, -20082, 79054, 110793, 4990, -69417, 5823, 62982, 156216, 89410, 12860, -34467, 59677, 85936, 131782, -45424, 39980, -7371, 27004, 105404, 40752, 41482, 125994, 83545, -2814, 123793, -14645, 31865, 94748, -13928, 74670, 106169, 57480, 47002, 120046, 165091, 18566, 35287, 16207, 4586, 133707, 55388, -68863, 78281, 118143, 114752, 57005, 23108, 31336, 78864, -80989, -31369, -6009]
203f009o1383J19026J04113r4954r5456P7106P7184P5478l7737j33070j06793
192h2495L6563J90796k1817k9336P4366j18202l369O6498q9817L5428J89066j78907
180F8774j04498J29376q5125n4915P9773M8175j9547p2575r0103M6115O4057L3051
168D2558M0710O2971r8173M8848j08286O6387k889J5887M8169p1089m2073J04068
156A07088P7533j84003m4172M0821R2530q4122N4132j19176J03483J3401Q7849
145A45364m7711J6194j18342o3495P9095P1977K5072j08109J2605k5377K09679
134A96952r2996o8530l6788L1202N5691N1347J4687j09309l9179M3256l3518N0159
122F2974K8521m5525L1289O8146j0012j15727Q7367M288K7973j32806K2939N7325
$$ y = [-6009, -67392, 51634, 155747, 60793, -34663, 42443, 119627, 195105, 157368, 24298, -82495, -45932, 144864, 123047, 93711, 168077, 49875, 46506, 113004, 23187, 58615, 247681, 68774, -35724, 93652, 8527, -46388, 33385, 81560, 62013, -10562, -100665, -54550, 9507, 42558, 83268, 146239, 48066, 96914, -11372, 55015, 52126, 68013, 116182, 45093, 3020, 107088, 184621, 618, -43554, -2733, 89797, 5675, 59807, -59369, 44114, 57515, 145364, 97653, 113847, -4495, -67990, 11105, 83082, 108154, 45, 12650, -12727, 196952, 103956, 35426, -1362, 29840, 85531, 136878, 151565, 42256, 3077, 46333, 12815, 62974, 91495, 45970, 77259, 145405, 135393, 19666, 107033, 111321, 139294, 6488, 29427, 86752]
110H6752j2884m8537n936O6887R1829j98038L7277K2384J6674n795l2249m7738
98b9374L7762J51704j29937m087L7621N5896m0631n9739J58017n4776j34909K5769
$$ y = [86752, 73868, 25331, 19395, 86282, 178111, -19927, 17350, 39734, 56408, 50613, 18364, -29374, 8388, 160092, 30155, 26068, 63689, 119585, 78954, 19215, 177232, 122456, -12453, 13316]
$$ [...]
##END NTUPLES=NMR SPECTRUM
##END=
