##TITLE=1H_CA-8833-7
 DMSO, 8 sc, 
 7.06.2021
##JCAMPDX= 6.0         $$ Bruker NMR JCAMP-DX V2.0
##DATA TYPE= NMR SPECTRUM
##DATA CLASS= NTUPLES
##ORIGIN= UXNMR, Bruker Analytische Messtechnik GmbH
##OWNER= root
$$ XWIN-NMR		Version 3.5
$$ Mon Jun  7 11:33:56 2021 Russian Standard Time (UT+4h)  she@DPX200
##.OBSERVE FREQUENCY= 200.131506
##.OBSERVE NUCLEUS= ^1H
##.ACQUISITION MODE= SIMULTANEOUS
##.ACQUISITION SCHEME= undefined
##.AVERAGES= 8
##.DIGITISER RES= 18
##SPECTROMETER/DATA SYSTEM= spect
##.PULSE SEQUENCE= zg30
##.SOLVENT NAME= DMSO
##.SHIFT REFERENCE= (INTERNAL, DMSO, 0, 17.5313)
##AUDIT TRAIL= $$ (NUMBER, WHEN, WHO, WHERE, WHAT)
$$ ##TITLE= Audit trail, XWIN-NMR		Version 3.5
$$ ##JCAMPDX= 5.01
$$ ##ORIGIN= Bruker BioSpin GmbH
$$ ##OWNER= she
$$ F:/spectra/data/she/nmr/H-F/1/pdata/1/auditp.txt
$$ ##AUDIT TRAIL=  $$ (NUMBER, WHEN, WHO, WHERE, WHAT)
(   1,<2021-06-07 11:32:55.34 +0400>,<she>,<DPX200>,
      <created by zg, POWCHK disabled, PULCHK disabled
       configuration hash MD5:
       00 E9 B6 7A A2 85 ED C7 34 08 36 98 17 FE 4E 26
       data hash MD5: 16K
       EE 3F 95 37 B6 72 7E 5D 70 6D 78 33 52 12 57 63>)
(   2,<2021-06-07 11:32:57.85 +0400>,<she>,<DPX200>,
      <Start of raw data processing
       efp BC_mod = 2 LB = 0.24 FT_mod = 6 PKNL = 1 PHC0 = -11481.69 PHC1 = 9.601011 SI = 16K 
       data hash MD5: 16K
       9E CC E3 23 B8 8A 01 A2 0E 43 D6 E1 46 03 89 D9>)
(   3,<2021-06-07 11:33:18.26 +0400>,<she>,<DPX200>,
      <pk PHC0 = -2.229138 PHC1 = 1.4 
       data hash MD5: 16K
       FF 5D 51 86 FE 5D C9 7F 78 F5 61 DD 5C C6 4C A8>)
(   4,<2021-06-07 11:33:21.90 +0400>,<she>,<DPX200>,
      <abs ABSG = 5 
       data hash MD5: 16K
       E0 9F B9 01 42 1A 48 26 36 E8 11 E0 15 93 77 75>)
$$ ##END=
$$ 
$$ hash MD5
$$ 43 1E 8C D6 20 68 44 E9 AF 3E 95 83 DC BA 6D D5
##$RELAX= 
##$RELAX= 
##$RELAX= 
##$RELAX= 
##$RELAX= 
##$RELAX= 
$$ Bruker specific parameters
$$ --------------------------
##$DU= <F:/spectra>
##$EXPNO= 1
##$NAME= <H-F>
##$PROCNO= 1
##$TYPE= <nmr>
##$USER= <she>
##$AMP= (0..31)
100 100 100 100 100 100 100 100 100 100 100 100 100 100 100 100 100 100 
100 100 100 100 100 100 100 100 100 100 100 100 100 100 
##$AQSEQ= 0
##$AQ_mod= 1
##$AUNM= <au_zg>
##$AUTOPOS= <>
##$BF1= 200.13
##$BF2= 200.13
##$BF3= 200.13
##$BF4= 200.13
##$BF5= 200.13
##$BF6= 200.13
##$BF7= 200.13
##$BF8= 200.13
##$BYTORDA= 1
##$CFDGTYP= 0
##$CFRGTYP= 5
##$CHEMSTR= <none>
##$CNST= (0..31)
1 1 145 1 1 1 1 1 1 1 1 1 1 1 1 1 1 1 1 1 1 1 1 1 1 1 1 1 1 1 1 1 
##$CPDPRG= <>
##$CPDPRG1= <>
##$CPDPRG2= <>
##$CPDPRG3= <>
##$CPDPRG4= <mlev>
##$CPDPRG5= <mlev>
##$CPDPRG6= <mlev>
##$CPDPRG7= <mlev>
##$CPDPRG8= <mlev>
##$CPDPRGB= <>
##$CPDPRGT= <>
##$D= (0..31)
0 1.2 0 0 0 0 0 0 0 0.06 0 0.03 0 0 0 0 0.0002 0 0 0 0 0 0 0 0 0 0 0 0 
0 0 0 
##$DATE= 1623051174
##$DBL= (0..7)
120 120 120 120 120 120 120 120 
##$DBP= (0..7)
150 150 150 150 150 150 150 150 
##$DBP07= 0
##$DBPNAM0= <>
##$DBPNAM1= <>
##$DBPNAM2= <>
##$DBPNAM3= <>
##$DBPNAM4= <>
$$ [...]
##$SUBNAM3= <"">
##$SUBNAM4= <"">
##$SUBNAM5= <"">
##$SUBNAM6= <"">
##$SUBNAM7= <"">
##$SUBNAM8= <"">
##$SUBNAM9= <"">
##$SW= 20.0188882624521
##$SWIBOX= (0..15)
0 0 2 0 0 0 0 0 0 0 0 0 0 0 0 0 
##$SW_h= 4006.41025641026
##$TD= 16384
##$TD0= 1
##$TE= 0
##$TE2= 300
##$TE3= 300
##$TEG= 300
##$TL= (0..7)
0 120 120 120 120 120 120 120 
##$TP= (0..7)
150 150 150 150 150 150 150 150 
##$TP07= 0
##$TPNAME0= <>
##$TPNAME1= <>
##$TPNAME2= <>
##$TPNAME3= <>
##$TPNAME4= <>
##$TPNAME5= <>
##$TPNAME6= <>
##$TPNAME7= <>
##$TPOAL= (0..7)
0.5 0.5 0.5 0.5 0.5 0.5 0.5 0.5 
##$TPOFFS= (0..7)
0 0 0 0 0 0 0 0 
##$TUNHIN= 0
##$TUNHOUT= 0
##$TUNXOUT= 0
##$USERA1= <user>
##$USERA2= <user>
##$USERA3= <user>
##$USERA4= <user>
##$USERA5= <user>
##$V9= 5
##$VALIST= <valist>
##$VCLIST= <CCCCCCCCCCCCCCC>
##$VD= 0
##$VDLIST= <DDDDDDDDDDDDDDD>
##$VPLIST= <PPPPPPPPPPPPPPP>
##$VTLIST= <TTTTTTTTTTTTTTT>
##$WBST= 1024
##$WBSW= 4
##$XGAIN= (0..3)
0 0 0 0 
##$XL= 0
##$YL= 0
##$YMAX_a= 744106
##$YMIN_a= -644645
##$ZGOPTNS= <>
##$ZL1= 120
##$ZL2= 120
##$ZL3= 120
##$ZL4= 120
##$ABSF1= 17.53132
##$ABSF2= -2.487719
##$ABSG= 5
##$ABSL= 3
##$ALPHA= 0
##$AQORDER= 0
##$ASSFAC= 0
##$ASSFACI= 0
##$ASSFACX= 0
##$ASSWID= 0
##$AUNMP= <proc_1d>
##$AZFE= 0.1
##$AZFW= 0.1
##$BCFW= 0
##$BC_mod= 2
##$BYTORDP= 0
##$COROFFS= 0
##$CY= -3
##$DATMOD= 1
##$DC= 0
##$DFILT= <>
##$DTYPP= 0
##$F1P= 0
##$F2P= 0
##$FCOR= 1
##$FTSIZE= 16384
##$FT_mod= 6
##$GAMMA= 0
##$GB= 0
##$INTBC= 1
##$INTSCL= 1.334414e-10
##$ISEN= 128
##$LB= 0.24
##$LEV0= 0
##$LPBIN= 0
##$MAXI= 10000
##$MC2= 0
##$MEAN= 0
##$ME_mod= 0
##$MI= 1.114404
##$NCOEF= 0
##$NC_proc= -5
##$NLEV= 6
##$NOISF1= 3.799351
##$NOISF2= 2.8
##$NSP= 0
##$NTH_PI= 0
##$NZP= 0
##$OFFSET= 17.53132
##$PC= 1
##$PHC0= -11483.92
##$PHC1= 11.00101
##$PH_mod= 1
##$PKNL= yes
##$PPARMOD= 0
##$PSCAL= 0
##$PSIGN= 0
##$REVERSE= no
##$SF= 200.130000662074
##$SI= 16384
##$SIGF1= 3
##$SIGF2= 2
##$SINO= 5.538805
##$SIOLD= 16384
##$SREGLST= <1H.CDCl3>
##$SSB= 0
##$STSI= 16384
##$STSR= 0
##$SW_p= 4006.41025641026
##$SYMM= 0
##$S_DEV= 0
##$TDeff= 16384
##$TDoff= 0
##$TI= <>
##$TILT= no
##$TM1= 0
##$TM2= 0
##$TOPLEV= 0
##$USERP1= <user>
##$USERP2= <user>
##$USERP3= <user>
##$USERP4= <user>
##$USERP5= <user>
##$WDW= 1
##$XDIM= 16384
##$YMAX_p= 325692194
##$YMIN_p= -208551
$$ End of Bruker specific parameters
$$ ---------------------------------
##NTUPLES= NMR SPECTRUM
##VAR_NAME=  FREQUENCY,     SPECTRUM/REAL,   SPECTRUM/IMAG
##SYMBOL=    X,             R,               I
##VAR_TYPE=  INDEPENDENT,   DEPENDENT,       DEPENDENT
##VAR_FORM=  AFFN,          ASDF,            ASDF
##VAR_DIM=   16384,         16384,           16384
##UNITS=     HZ,            ARBITRARY UNITS, ARBITRARY UNITS
##FACTOR=    0.24454680195387, 1,            1
##FIRST=     3508.54319766126, 0,            0
##LAST=      -497.867058748999, 0,           0
##MIN=       -497.867058748999, -208551,     0
##MAX=       3508.54319766126, 325692194,    0
$$ Real data points
##PAGE= N=1
##DATA TABLE= (X++(R..R)), XYDATA
$$ [...]
6414d1728M9296m3704K8071L6594o6675l93M1779J2701L629n219L149K1494o2720
$$ -41728 7568 -36136 -8065 28529 -38146 -38539 3240 15941 19570 14351 17500 38994 -23726
6401b3726J09945M2968j18159k8566J9817K3015k6584P5343n4478j7898L3455
$$ -23726 86219 129187 11028 -17538 2279 25294 -1290 74053 19575 1677 35132
6390C5132m0765l3902j4617L8914M1674o161K8120k2327m834l803k4278P346J3506
$$ 35132 -5633 -39535 -54152 -15238 26436 20275 48395 26068 21234 17431 -6847 499 14005
6377A4005J0553J5204j757j6865R0026m8069m5969k0435J4458l7012K2590j62
$$ 14005 24558 39762 38005 21140 111166 63097 17128 -3307 11151 -25861 -3271 -3433
6365c433M8847J5314j4857k5160m1155L2014j486n14K4791l3027J5660k2072J6000
$$ -3433 45414 60728 45871 20711 -20444 11570 10084 9570 34361 1334 16994 -5078 10922
6352A0922k1186M4968j8945k9228P8042m4171P397l7720n3172N2623Q8224L2623
$$ 10922 -10264 34704 15759 -13469 64573 20402 27799 -9921 -63093 -10470 77754 110377
6340A10377m1086o1215N7893M4790j7033n2724K6096J1489n9376P619P4541o163
$$ 110377 69291 8076 65969 110759 93726 41002 67098 78587 19211 26830 101371 95208
6328I5208m2485p4641K3550M2614L5370J09m0305l2987L9652l3802l3409O937
$$ 95208 52723 -21918 1632 44246 79616 79725 39420 6433 46085 12283 -21126 -14189
6316a4189K1234p575L073j5746n9521J8559Q8164K6833O7581m5328q7470K7843
$$ -14189 7045 -530 2543 -13203 -72724 -54165 33999 60832 128413 83085 -4385 23458
6304B3458P701q557K918N626j5324K2226j0323L6424m0268l0723M0299m130m400
$$ 23458 31159 22602 25520 31146 15822 38048 27725 64149 23881 -6842 33457 29327 24927
6291B4927j8820k3644J0512j9077o103J0841L0060r131L4966N1247r6833M247
$$ 24927 6107 -17537 -7025 -26102 -32205 -21364 8696 -435 34531 85778 -11055 -6808
6279f808N8844l7448J690j7255l179K9589j5870R227J493J7984j3565K0328M3308
$$ -6808 52036 14588 16278 -977 -4156 25433 9563 18790 20283 38267 24702 45030 88338
6266H8338J3268j3402k8445r868j159k478N2163J0644n9000M828P312J0342j3005
$$ 88338 101606 88204 59759 49891 48732 46254 98417 109061 50061 54889 62201 72543 59538
6253E9538k5759L3188J7605j6326N921l7261J3311J5949p3080J2932L7353l2923
$$ 59538 33779 66967 84572 68246 74167 36906 50217 66166 -6914 6018 43371 10448
6241A0448J2622l793J6798M62k4527K4658L926J4385L9290o01j9513k2154j409
$$ 10448 23070 19277 36075 36537 12010 36668 40594 54979 94269 93668 74155 52001 50592
6228E0592O1157j1095k4841J4281o1987J207O7546j4481K9099M0479l4380o8500
$$ 50592 111749 100654 75813 90094 28107 29314 96860 82379 111478 151957 117577 49077
6216D9077K0803M8398P711k3605j4936j7926j0368L4588k9549J8574M0333J9811
$$ 49077 69880 118278 125989 102384 87448 69522 59154 93742 64193 82767 123100 142911
6204A42911N59K365r624m588m1470N1485l9608m0560R7223M2904j18970l3478
$$ 142911 143470 145835 136211 131623 90153 141638 102030 61470 158693 201597 82627 49149
6192D9149N2737j2648J5860N7596O8751j8357l5446l7971r061N331M7226l0356
$$ 49149 101886 89238 105098 162694 231445 213088 177642 139671 130610 135941 183167 152811
6180A52811j8099J1130L3573j5753l0077K8625J8508M0661m3045r185k5017j514
$$ 152811 134712 145842 179415 163662 133585 162210 180718 221379 178334 169149 144132 142618
6168A42618q693L2191M348N5143n1816m3005P308L7993M490j8503K5057k9805
$$ 142618 133925 166116 170464 225607 173791 130786 138094 176087 180577 162074 187131 157326
6156A57326O0733p293n2399J0235k288J6210l9507l4553M3487M2880R2960m1897
$$ 157326 218059 210766 158367 168602 166314 182524 143017 108464 151951 194831 287791 245894
6144B45894n7434m09m5577l1977O7378p705l461n1898K4903l1713j692M4295l8819
$$ 245894 188460 188051 142474 110497 177875 170170 166709 114811 139714 108001 106309 150604 111785
6131A11785K0530k4529j1454o111L2068J7477n115J1063K3822o9039k6922k241
$$ 111785 132315 107786 96332 90221 122289 139766 134651 145714 169536 100497 73575 71334
6119G1334m3155P3757N7320K448o7613L1538j8048P663J7342L1222J167j4885
$$ 71334 28179 101936 159256 161704 94091 125629 107581 115244 132586 163808 164975 150090
6107A50090K0093p6147P290L3481k4806l0202j4617L9856j8473l1781J5398J5387
$$ 150090 170183 94036 101326 134807 110001 79799 65182 105038 86565 54784 70182 85569
6095H5569K2645m2668K3133L824j5633j919M601l887L8384J0071k4974O188p010
$$ 85569 108214 65546 88679 92503 76870 74951 79552 75665 114049 124120 99146 105334 98324
6082I8324k4155J227R960J0784J4580J3517l2968j1114O658j0293J6255j3605
$$ 98324 74169 75396 85356 96140 110720 124237 91269 80155 86813 76520 92775 79170
6070G9170k4964Q824J2970k5596L1272M5289k8297m6754K2264K4567L2516n8554
$$ 79170 54206 63030 76000 50404 81676 126965 98668 51914 74178 98745 131261 72707
6058G2707O971M0363K9513k1696K6029p943k1219Q926L3147k3012p9998j4164
$$ 72707 79678 120041 149554 127858 153887 145944 124725 133651 166798 143786 63788 49624
6046D9624M6606P5864n8956K3472k052j5583P765N604j6225L3173k1620p535J5551
$$ 49624 96230 172094 113138 136610 134558 118975 126740 132344 116119 149292 127672 120137 135688
6033A35688j7999O5063k7438j8615R620p613m716j2169o811J9491j4798k7177
$$ 135688 117689 182752 155314 136699 146319 138706 133990 121821 115010 134501 119703 92526
6021I2526o2173K0065O9893K5460j4026r4131N4470N4528k0879r1M5923J3375
$$ 92526 30353 50418 120311 145771 131745 37614 92084 146612 125733 125642 171565 184940
6009A84940q098l7088K85M3026K5083j18876J1093K1779L1967N03O641M1906K5670
$$ 184940 176842 139754 140039 183065 208148 89272 100365 122144 154111 154614 161255 203161 228831
5996B28831k4584j5354j6222k17J1066j980K427q31L2515j07762m724K2776P273
$$ 228831 204247 188893 172671 172454 183520 181540 183967 183136 215651 107889 103165 125941 133214
5983A33214M9063n227n8585K6591l4581k4172M2495J1378K5963R166J6856k865
$$ 133214 182277 177050 118465 145056 110475 86303 128798 140176 166139 175305 192161 189296
5971A89296k1798j5877m4097N3489j5466N193J048J6550O0432J9441o4804m0857
$$ 189296 167498 151621 107524 161013 145547 150740 151788 168338 228770 248211 183407 142550
5959A42550N4049j6131j0180P552J8831M807J8702j8685p692J115O582Q02j7133
$$ 142550 196599 180468 170288 177840 196671 201478 220180 201495 193803 194918 201500 202302 185169
5946A85169L0431l4544n0859J6793M0000l143M9806l825l531Q940j3941j0199
$$ 185169 215600 181056 130197 146990 186990 183847 233653 229828 226297 235237 221296 211097
5934B11097j8873J2165M1126O0855n9556m2714K2542o8743j90R4406l9693j4016
$$ 211097 192224 204389 245515 306370 246814 204100 226642 157899 157709 252115 212422 198406
5922A98406l7144q0778J22171j8435q923K9743k1082L8658J7457K4106j1173l5671
$$ 198406 161262 80484 202655 184220 175297 205040 183958 222616 240073 264179 253006 217335
5910B17335R889K2779L7443r931k3086K7939n0116R889M631L581J431l2799L6619
$$ 217335 227224 250003 287446 277515 254429 282368 232252 242141 246772 250353 251784 218985 255604
5897B55604k0688J9994l5765l7744K1082l8620O9284J2177j8444O461K4086K4789
$$ 255604 234916 254910 219145 181401 202483 163863 233147 245324 226880 233341 257427 282216
5885B82216k8129j8833j570L6762j4267j8681L6272m5300K6055J5566l9705l288
$$ 282216 254087 235254 233684 270446 256179 237498 273770 228470 254525 270091 230386 227098
5873B27098M2483n646j880l7558J3413p365J8173K0989J621K8549r932k3516k0716
$$ 227098 269581 263935 262055 224497 237910 230545 248718 269707 271328 299877 289945 266429 245713
5860B45713L6540M7642P876q042n9647n653K0311K625r14K4094k55M5959N2405
$$ 245713 282253 329895 337771 329729 270082 264429 284740 287365 286451 310545 310290 356249 408654
5847D08654o0003j2814j1079l696J2147N5347n4002k2424j1335K9688M457N774
$$ 408654 348651 335837 324758 321062 333209 388556 334554 312130 300795 330483 334940 340714
5835C40714L5122j517m7475p065P182n8417J9278P0159l9880O9849k0079J8997
$$ 340714 375836 374319 326844 319779 326961 268544 287822 357981 318101 387950 367871 386868
5823C86868K2029j4495J7465l8391l305k8214N0018R372j0508l8955L5500r008
$$ 386868 408897 394402 411867 373476 370171 341957 391975 401347 390839 351884 387384 378376
5811C78376l7038J9283K975P011M8852O775N832n7784L7996K3503p06j4995j8622
$$ 378376 341338 360621 363596 370607 419459 426234 432066 374282 412278 435781 435075 420080 401458
5798D01458M1639J7697j0105n6101n3184k6979K2269j5716M4629j7998n5853K4887
$$ 401458 443097 460794 450689 394588 341404 314425 336694 320978 365607 347609 291756 316643
5786C16643J6593l4392J17101l7700o5857O9789M1405J2832n9410K9541k1227
$$ 316643 333236 298844 415945 378245 312388 382177 423582 436414 377004 406545 385318
5775C85318k8983O0754J9825j3410J3099M2286k9016p8261M3301K2674k6802N239
$$ 385318 356335 417089 436914 423504 436603 478889 449873 371612 414913 437587 410785 416024
5763D16024K5804l3263k1420k6925J2404L0705l933N6544Q859n2869j5035k4255
$$ 416024 441828 408565 387145 360220 372624 403329 399396 455940 464799 411930 396895 372640
5751C72640N994P8857L5459n8777J873M7108m4720K581q114Q4474N35l9558n4128
$$ 372640 378634 457491 492950 434173 436046 483154 438434 441015 432901 517375 517910 478352 424224
5738D24224J7116K5409k8458j5785K7447k5137M5499j0248K1618L8749m6860r305
$$ 424224 441340 466749 438291 422506 449953 424816 470315 460067 481685 520434 473574 464269
5726D64269O398j5596M8864m3368j1731o461k2601O2186J278j238l8589J1145
$$ 464269 470667 455071 503935 460567 448836 442375 419774 481960 483238 482000 443411 454556
5714D54556k1009L5043K5844J0418l545j2142k3229M9283L622O074l3999M1885
$$ 454556 433547 468590 494434 504852 501307 489165 465936 515219 518841 524915 490916 532801
5702E32801l9701N6J5887J8723O542J978k3559K4777J5393l1974j8361m1139L6994
$$ 532801 493100 493156 509043 527766 534308 536286 512727 537504 552897 520923 502562 461423 498417
5689D98417k8555p970J4405j4226P9393K8861O695N558m8292l434J5050j4540
$$ 498417 469862 461892 476297 462071 541464 570325 577020 582578 534286 530852 545902 531362
5677E31362P526M29P453M3355L4785m1500J754k5393R040l397n073k2404K2398
$$ 531362 538888 539317 546770 590125 624910 583410 585164 559771 568811 565414 560341 537937 560335
5664E60335m111o27j0548J0126L6358l7193j7581J3414l2209M1259M5603m9969
$$ 560335 556224 555597 545049 555175 591533 554340 536759 550173 517964 559223 604826 554857
5652E54857P079o212M5539m457p150k484P0170n41k5897J1245q842j817M6940
$$ 554857 561936 555724 601263 596806 589656 587172 657342 656801 630904 642149 633307 631490 678430
5639F78430n730j8781o4939K1236M7879j1603m5157j2856J19940N9726p8047n3879
$$ 678430 672700 653919 588980 610216 658095 646492 601335 588479 708419 768145 690098 636219
5627F36219N322N7550j5003P372J8954K0226j8547l2380l9417O9179K2607r320
$$ 636219 641541 699091 684088 691460 710414 730640 712093 679713 640296 709475 732082 722762
5615G22762J2851L507j9142j1258n520J1369P334j8317O8867k9904J0098j0574
$$ 722762 735613 739120 719978 708720 703200 714569 721903 703586 772453 742549 752647 742073
5603G42073l1305J649J0362L8172K6108J2438N364K4459l3547m8006K2707J8626
$$ 742073 710768 712417 722779 760951 787059 799497 804861 829320 795773 747767 770474 789100
5591G89100k2702O943K080K8649k1302j2434O1072k9993J9324j9500k8410M7307
$$ 789100 766398 773341 775421 804070 782768 770334 831406 801413 820737 801237 772827 820134
5579H20134k1221O2244J0695l5625j9539m5629K2464N1177L5417j5644M122k1515
$$ 820134 798913 861157 871852 836227 816688 771059 793523 844700 880117 864473 868595 847080
5567H47080l49J0022K8691l221R203L982J4699O0708o5486k6303N6245j6433m4361
$$ 847080 846731 856753 885444 882223 891426 895408 910107 970815 905329 879026 935271 918838 874477
5554H74477K9476k1275q496J49Q1395M4532L5126m3242J6895M0227p6281L2397
$$ 874477 903953 882678 874182 874331 955726 1000258 1035384 992142 1009037 1049264 972983 1005380
5542A005380N239j9132k2422q258Q0422l7148J6855K558o1628N1322J0363M7246
$$ 1005380 1010619 991487 969065 960807 1041229 1004081 1020936 1023494 961866 1013188 1023551 1070797
5530A070797m3245j399N8788l546l1599K6684K0135L0002k603N9842O048j8365
$$ 1070797 1027552 1026153 1084941 1081395 1049796 1076480 1096615 1126617 1124014 1183856 1189904 1171539
5518A171539l7984J9726L6790q038q092J6078J3501J4542L5644j5495p0287k0971
$$ 1171539 1133555 1153281 1190071 1182033 1173941 1190019 1203520 1218062 1253706 1238211 1167924 1146953
5506A146953Q3721M7296N116k1353l8890M6550K4816J177M133j6420N402L4644
$$ 1146953 1230674 1277970 1283086 1261733 1222843 1269393 1294209 1295386 1299519 1283099 1288501 1323145
5494A323145Q1341K8033k4166k6164K512M2046L9597K4112m1794R2321M6150L751
$$ 1323145 1404486 1432519 1408353 1382189 1384701 1426747 1466344 1490456 1448662 1540983 1587133 1590884
5482A590884j3984K961j151L043j6458N0518K7092J2747J7132m1024N0162P4698
$$ 1590884 1576900 1579861 1578710 1581753 1565295 1615813 1642905 1655652 1672784 1631760 1681922 1756620
5470A756620M2104N688K8107J2014J5761l380q967O7070K3146N93M4220N4850
$$ 1756620 1798724 1804412 1832519 1844533 1860294 1856914 1847947 1915017 1938163 1938756 1982976 2037826
5458B037826P1188L1990k91j9188L0889K4495k9904k6824N6117j3261J3859L1858
$$ 2037826 2109014 2141004 2140713 2121525 2152414 2176909 2147005 2120181 2176298 2163037 2176896 2208754
5446B208754K7120j9449K7544M9942O0194n6020K2046R4208J7511j2851M9374
$$ 2208754 2235874 2216425 2243969 2293911 2354105 2298085 2320131 2414339 2431850 2418999 2468373
5435B468373N9991L8786Q5927l4442k0614K6531R90j2158k1677k1784M7827q5606
$$ 2468373 2528364 2567150 2653077 2618635 2598021 2624552 2625542 2613384 2591707 2569923 2617750 2532144
5423B532144P56q433K6548q246l2247O408j8364Q3548j5527R7436Q495O3746m1581
$$ 2532144 2532900 2524467 2551015 2542769 2510522 2516930 2498566 2582114 2566587 2664023 2672518 2736264 2694683
5410B694683N6383j3956p382L0775l8071O198k1209J3852m5286m3413J1521l8985
$$ 2694683 2751066 2737110 2729728 2760503 2722432 2728630 2707421 2721273 2675987 2632574 2644095 2605110
5398B605110L1947L309M8004K5406o0671p381O5686P644l5838m12l7961M3383
$$ 2605110 2637057 2640366 2688370 2713776 2653105 2645724 2711410 2719054 2683216 2682804 2644843 2688226
5386B688226J7195O4635L485p931K4205l4219n989O5270M3213m2598k8409L2642
$$ 2688226 2705421 2770056 2773541 2765610 2789815 2755596 2749607 2814877 2858090 2815492 2787083 2819725
5374B819725R6331K588p7660O3088Q982k319Q1437j5641N0991J1216k9779Q548
$$ 2819725 2916056 2918644 2840984 2904072 2913054 2910735 2992172 2976531 3027522 3038738 3008959 3017507
5362C017507K0026M3297K4441N5335M075N2934L6172J0378m1166P394m664N8381
$$ 3017507 3037533 3080830 3105271 3160606 3164681 3217615 3253787 3264165 3222999 3230393 3225729 3284110
5350C284110K2502P4153M923O6062r18m3967O1671N1426j5226L3494K9633K3753
$$ 3284110 3306612 3380765 3385688 3451750 3450832 3406865 3468536 3519962 3504736 3538230 3567863 3591616
5338C591616N1667O0889L9330J159l3450J1772J26901R329J2247L9741q676n583
$$ 3591616 3643283 3704172 3743502 3744661 3711211 3722983 3849884 3859213 3871460 3911201 3902525 3896942
5326C896942O9342M9281O6923J9050k6236M5784M3035O6569P8505J1494N5980
$$ 3896942 3966284 4015565 4082488 4101538 4075302 4121086 4164121 4230690 4309195 4320689 4376669
5315D376669j4524L6339P5770M4927L1687J5040P226k4721M7893M1211M4766Q6616
$$ 4376669 4362145 4398484 4474254 4519181 4550868 4565908 4573134 4548413 4596306 4637517 4682283 4768899
5303D768899J5085L2443J1171L2108O0607M2796P6510K7379N0066J22569Q0292
$$ 4768899 4783984 4816427 4827598 4859706 4920313 4963109 5039619 5066998 5117064 5239633 5319925
5292E319925J4294j5463P0643P6123K6405M3965N12O1416L7539N0363N3968K8144
$$ 5319925 5334219 5318756 5389399 5465522 5491927 5535892 5536404 5597820 5635359 5685722 5739690 5767834
5280E767834P0186O4165K8856O3623N0847R2578m3726L5399J03792P7612J26855
$$ 5767834 5838020 5902185 5931041 5994664 6045511 6138089 6094363 6129762 6233554 6311166 6438021
5269F438021R3545K7283K5745p174R0045J44687N7187J02246m287P0934R8141
$$ 6438021 6531566 6558849 6584594 6577420 6667465 6812152 6869339 6971585 6967298 7038232 7136373
5258G136373O4730M5841P7193J50428Q6791J6329O3786P6978O0361J05650R9940
$$ 7136373 7201103 7246944 7324137 7474565 7561356 7577685 7641471 7718449 7778810 7884460 7984400
5247G984400N6404J17330P0880O3768J13738O5429J07321J42336J09892R7251
$$ 7984400 8040804 8158134 8229014 8292782 8406520 8471949 8579270 8721606 8831498 8928749
5237H928749K0648J01040Q5640J36200Q4856K179J32277J07722J21399J14992
$$ 8928749 8949397 9050437 9136077 9272277 9357133 9359312 9491589 9599311 9720710 9835702
5227I835702O5916J23485J34571N8906J24806J99298J33326J37339J08085J52712
$$ 9835702 9901618 10025103 10159674 10218580 10343386 10542684 10676010 10813349 10921434 11074146
5217A1074146P4862J22796J78429J23510R1548J73226J58474K04641J08365R9679
$$ 11074146 11149008 11271804 11450233 11573743 11665291 11838517 11996991 12201632 12309997 12409676
5207A2409676J89294J53695J47997J07934K25986K53901J04956Q9220K35426J73970
$$ 12409676 12598970 12752665 12900662 13008596 13234582 13488483 13593439 13682659 13918085 14092055
5197A4092055J58639P0431K14822J78355K12469K49512J48171J32566J82729K76513
$$ 14092055 14250694 14321125 14535947 14714302 14926771 15176283 15324454 15457020 15639749 15916262
5187A5916262K10453J99592J64823K97037J75045K56225L40332K28308K59867
$$ 15916262 16126715 16326307 16491130 16788167 16963212 17219437 17559769 17788077 18047944
5178A8047944K22387K73937K31472K58344K18337K76044L22171L34527L17896
$$ 18047944 18270331 18544268 18775740 19034084 19252421 19528465 19850636 20185163 20503059
5169B0503059K29359L27010L33751L03260K73459L16034L34354L46575L34187
$$ 20503059 20732418 21059428 21393179 21696439 21969898 22285932 22620286 22966861 23301048
5160B3301048M03668L88045L51175L99577M38947L59185M23716M58982M80549
$$ 23301048 23704716 24092761 24443936 24843513 25282460 25641645 26065361 26524343 27004892
5151B7004892M21974M59994M55893M65052M76244M05967M75391N04499N50462
$$ 27004892 27426866 27886860 28342753 28807805 29284049 29690016 30165407 30669906 31220368
5142C1220368N43756N25196M62468N89165O08579O26735N03027O45531O73388
$$ 31220368 31764124 32289320 32751788 33340953 33949532 34576267 35079294 35724825 36398213
5133C6398213O88107O61418O54413P03564O67254O97164P69587P74625P82365
$$ 36398213 37086320 37747738 38402151 39105715 39772969 40470133 41239720 42014345 42796710
5124D2796710P82906Q29190Q87977Q00217Q99857R59829Q57624Q88499R59876
$$ 42796710 43579616 44408806 45296783 46097000 46996857 47956686 48814310 49702809 50662685
5115E0662685J063406J039296J013785J028691J086014J117277J155533J143510
$$ 50662685 51726091 52765387 53779172 54807863 55893877 57011154 58166687 59310197
5107E9310197J189712J154939J173191J291771J339282J368238J281539J381142
$$ 59310197 60499909 61654848 62828039 64119810 65459092 66827330 68108869 69490011
5099F9490011J461534J452827J481155J508775J582314J556553J631428J680723
$$ 69490011 70951545 72404372 73885527 75394302 76976616 78533169 80164597 81845320
5091H1845320J706554J777934J746340J818424J756182J742085J767377J896267
$$ 81845320 83551874 85329808 87076148 88894572 90650754 92392839 94160216 96056483
5083I6056483J842213J857350J916117J913700J996664J947528K019896K117719
$$ 96056483 97898696 99756046 101672163 103585863 105582527 107530055 109549951 111667670
5075A11667670K108998K108913K102780K123554K126504K086469K061550J916457
$$ 111667670 113776668 115885581 117988361 120111915 122238419 124324888 126386438 128302895
5067A28302895J896670J827406J710402J713213J562665J517770J474178J418289
$$ 128302895 130199565 132026971 133737373 135450586 137013251 138531021 140005199 141423488
5059A41423488J355028J351644J311878J321207J369189J278005J254984J234174
$$ 141423488 142778516 144130160 145442038 146763245 148132434 149410439 150665423 151899597
5051A51899597J232489J189802J041997R18332P88933O90726M91493K88572M4201
$$ 151899597 153132086 154321888 155363885 156282217 157071150 157761876 158253369 158541941 158586142
5042A58586142p9710k12079l72537m26146o11531o35276p41170r14429j109660
$$ 158586142 158506432 158294353 157921816 157495670 156884139 156248863 155507693 154593264 153483604
5033A53483604j330746j591297j928854k248359k407105k498232k561562k507496
$$ 153483604 152152858 150561561 148632707 146384348 143977243 141479011 138917449 136409953
5025A36409953k425727k353089k175214k015922j949351j766783j718196j577145
$$ 136409953 133984226 131631137 129455923 127440001 125490650 123723867 122005671 120428526
5017A20428526j492009j402569j375376j284392j256287j168116j027440r80019
$$ 120428526 118936517 117533948 116158572 114874180 113617893 112449777 111422337 110442318
5009A10442318q72754o98529n60998l71118l29331k70168l76952o55071r84424
$$ 110442318 109569564 108871035 108310037 107938919 107609588 107339420 106962468 106307397 105322973
5000A05322973j391400j767420k066071k303330k291407k231147k186552j992337
$$ 105322973 103931573 102164153 100098082 97794752 95503345 93272198 91085646 89093309
4992H9093309j905607j740187j535231j314472j097149j032238r04569r01821
$$ 89093309 87187702 85447515 83912284 82597812 81500663 80468425 79563856 78662035
4984G8662035r20833j033410j191560j463873j547348j597510j704131j591645
$$ 78662035 77741202 76707792 75516232 74052359 72505011 70907501 69203370 67611725
4976F7611725j483985j326956j222545j056690r72993q00380o89910n65328m24830
$$ 67611725 66127740 64800784 63578239 62521549 61548556 60748176 60058266 59492938 59068108
4967E9068108k61450j81547r9916p6197N177o1303n3042j90565l04355n63542
$$ 59068108 58806658 58625111 58525195 58448998 58454175 58392872 58339830 58149265 57844910 57281368
4957E7281368o46857p64656q37332q82429q88602q47580q68330q83916p73435
$$ 57281368 56634511 55869855 55032523 54150094 53261492 52413912 51545582 50661666 49888231
4948D9888231p38645o97862o59112o24764n29000m82456m39834l81422k54846
$$ 49888231 49149586 48451724 47792612 47167848 46638848 46156392 45716558 45335136 45080290
4939D5080290j91676j98888j19730J5232N8013Q4165l9883q4419k52493n39011
$$ 45080290 44888614 44689726 44569996 44585228 44643241 44727406 44687523 44603104 44350611 43811600
4929D3811600q03728j044531j096692j111096j131719j037443r75664q25966p47971
$$ 43811600 43007872 41963341 40866649 39755553 38623834 37586391 36610727 35784761 35036790
4920C5036790n28928m38810l82632k81930k60779j50544q0262j12169j64289k76352
$$ 35036790 34507862 34069052 33686420 33404490 33143711 32993167 32912905 32800736 32636447 32360095
4910C2360095m58034n89751p28361p89434p98879q06511p92863p31612o01758
$$ 32360095 31902061 31312310 30583949 29794515 28995636 28189125 27396262 26664650 26062892
4901B6062892n63307m66372n20191m22644l28365k72605l25529l22280k67785
$$ 26062892 25499585 25033213 24513022 24090378 23762013 23489408 23163879 22841599 22573814
4892B2573814k94467k90660k58045j70249k50999l15131l12908k99698l15487
$$ 22573814 22279347 21988687 21730642 21560393 21309394 20994263 20681355 20381657 20066170
4883B0066170l14789l44888l90404m16708l99630m13416m08048m28124l58482
$$ 20066170 19751381 19406493 19016089 18599381 18199751 17786335 17378287 16950163 16591681
4874A6591681m20318l35367l52813l53063k76333k42520k68569k88030j98482
$$ 16591681 16171363 15835996 15483183 15130120 14853787 14611267 14342698 14054668 13856186
4865A3856186k78269k08240j63145k40658k39782j60540j74851j84882j25956
$$ 13856186 13577917 13369677 13206532 12965874 12726092 12565552 12390701 12205819 12079863
4856A2079863j34484k12912j44611j22720j41857j96045j36180j48838o1091j52663
$$ 12079863 11945379 11732467 11587856 11465136 11323279 11127234 10991054 10842216 10781125 10628462
4846A0628462j33901j00240j31693j46378j97075j33060j06628k5055j65078r9106
$$ 10628462 10494561 10394321 10262628 10116250 9919175 9786115 9679487 9654432 9489354 9390248
4836I390248n1830l3937q7462j38913j40833q5767o6672j39464j09295j05867
$$ 9390248 9338418 9304481 9217019 9078106 8937273 8851506 8784834 8645370 8536075 8430208
4826H430208r4118r3953o3050o4324j16187p4493m2799r8892r3808p1934r0148
$$ 8430208 8336090 8242137 8179087 8114763 7998576 7924083 7881284 7782392 7688584 7616650 7526502
4815G526502m5757j5221j19251k6468q0127m8660n2450q1804p2273q3289q2644
$$ 7526502 7480745 7465524 7346273 7319805 7239678 7191018 7138568 7056764 6984491 6901202 6818558
4804F818558r5238q9102k7709k2876o6887l8389q2583n1957j41350l6416o094
$$ 6818558 6723320 6634218 6606509 6583633 6516746 6478357 6395774 6343817 6202467 6166051 6159957
4793F159957k4979r7726n2053k8187m9733r5530m1523J3248m5413q955m4703r4406
$$ 6159957 6134978 6037252 5985199 5957012 5907279 5811749 5770226 5783474 5738061 5729106 5684403 5589997
4781E589997o3466m1841J3443o4006o8663L8584n8168q1979m7419n1311j7852
$$ 5589997 5526531 5484690 5498133 5434127 5365464 5404048 5345880 5263901 5216482 5165171 5147319
4770E147319L621m3931j3425n8279o236j10476k9144j5179j6176n0075l5504m6051
$$ 5147319 5150940 5107009 5093584 5035305 5029069 4918593 4889449 4874270 4858094 4808019 4772515 4726464
4758D726464k3984N1015k6547o0429k2808p98J4526o3170m643k7954m2708P491
$$ 4726464 4702480 4753495 4726948 4666519 4643711 4642913 4657439 4594269 4589626 4561672 4518964 4526455
4746D526455n9491m739o3730l7232N61k5008K0646m1984k8845J8600k3720N6470
$$ 4526455 4466964 4462225 4398495 4361263 4361824 4336816 4357462 4315478 4286633 4305233 4281513 4337983
4734D337983m0104l3998n4499j3538p9731O6941L6037k6813L070K44L7229N1490
$$ 4337983 4297879 4263881 4209382 4195844 4116113 4183054 4219091 4192278 4195348 4195592 4232821 4284311
4722D284311J4817j1599J4844J8553j090O1489L5328J22556l5300L1248Q6930
$$ 4284311 4299128 4287529 4302373 4320926 4319836 4381325 4416653 4539209 4503909 4535157 4622087
4711D622087p0349n6858l9510l2698o922j7628k4541N2297j1180J3934k3628N361
$$ 4622087 4551738 4494880 4455370 4422672 4415750 4398122 4373581 4425878 4414698 4428632 4405004 4410365
4699D410365L7731R8923q925L8151O4581K1016O5091P1062N3339J1679Q344P0775
$$ 4410365 4448096 4547019 4538094 4576245 4640826 4661842 4726933 4797995 4851334 4863013 4871357 4942132
4687D942132K4981k323j8167r8182r212l4719q2073o7337r7769q8691j1839j01369
$$ 4942132 4967113 4964790 4946623 4848441 4839229 4804510 4722437 4655100 4557331 4468640 4456801 4355432
4675D355432o8498j4294n6796o9936j8618m9262p721k9381l186O95k6746k591
$$ 4355432 4286934 4272640 4215844 4145908 4127290 4078028 4070307 4040926 4037740 4038435 4011689 4009098
4663D009098k6388J3769m5921l8025J372k7569m2351J1435o4598n1271o8392q8891
$$ 4009098 3982710 3996479 3950558 3912533 3913905 3886336 3843985 3855420 3790822 3739551 3671159 3582268
4651C582268m1987K3090l8955k2784j9207K402L2973P503O9926K3732m5209n7214
$$ 3582268 3540281 3563371 3524416 3501632 3482425 3484827 3517800 3525303 3595229 3618961 3573752 3516538
4639C516538k02379j62332l3808r7309q5408m8757m5251j2528n8725K745o2240
$$ 3516538 3314159 3151827 3118019 3020710 2935302 2886545 2841294 2828766 2770041 2772786 2710546
4628B710546o0786P234n676R811p235r8411p9064M710n1364k5758O9899m4933
$$ 2710546 2649760 2656994 2651318 2661129 2653894 2555483 2476419 2481129 2429765 2404007 2473906 2428973
4616B428973R272p6243n6671l5171L7844J217J0197L215q2369J2844l6016n3982
$$ 2428973 2438245 2362002 2305331 2270160 2308004 2309221 2319418 2322633 2240264 2253108 2217092 2163110
4604B163110q58J4816j1031o1682k2359j1301N7931n620o2557N902j0710k3327
$$ 2163110 2162252 2177068 2166037 2104355 2081996 2070695 2128626 2123006 2060449 2066351 2055641 2032314
4592B032314j591Q260j8720N195k3925K3767l7498n6009K7679K303M5585R630
$$ 2032314 2030723 2038983 2020263 2025458 2001533 2025300 1987802 1931793 1959472 1961775 2007360 2016990
4580B016990K9549m381n8014M0467o4743J946k813J2986l3745L643L7970m840
$$ 2016990 2046539 2042158 1984144 2024611 1959868 1961814 1959001 1971987 1938242 1941885 1979855 1975015
4568A975015K3934K7389M644L3760j4853l4477k8178Q7940J3618L7761J0800j0864
$$ 1975015 1998949 2026338 2030982 2064742 2049889 2015412 1987234 2075174 2088792 2126553 2137353 2126489
4556B126489k7736k3036O1421p905p435K5291O7985J08633M7228l1639M9690O7035
$$ 2126489 2098753 2075717 2137138 2129233 2121798 2147089 2215074 2323707 2370935 2339296 2388986 2456021
4544B456021P3092Q1836O430N4839P1839K6463L9049J0744K2853N0182M1756k5845
$$ 2456021 2529113 2610949 2617379 2672218 2744057 2770520 2809569 2820313 2843166 2893348 2935104 2909259
4532B909259L5968j4205m8158j132N7772j5971j8817K4167j4191N8911J8001Q3638
$$ 2909259 2945227 2931022 2882864 2881732 2939504 2923533 2904716 2928883 2914692 2973603 2991604 3075242
4520C075242M1406Q6055J16705Q6346L7869N6490L0564R4035L5059L2454o1097
$$ 3075242 3116648 3202703 3319408 3405754 3443623 3500113 3530677 3624712 3659771 3692225 3631128
4509C631128m8160p402m5032p0013m2698l7860m5551m6666J9018j690k7335N3804
$$ 3631128 3582968 3575566 3530534 3460521 3417823 3379963 3334412 3287746 3306764 3305074 3277739 3331543
4497C331543j1809m464R3735Q1064N7016J30192J67754J44809P7145O4862k7322
$$ 3331543 3319734 3315270 3409005 3490069 3547085 3677277 3845031 3989840 4066985 4131847 4104525
4486D104525o6354j34024j20769j24280j54081r1065k6845j42063n8147o2950
$$ 4104525 4038171 3904147 3783378 3659098 3505017 3413952 3387107 3245044 3186897 3123947
4476C123947k9524J9063m1210l0403n5370L3624L9757k1006J7714R376l3089n422
$$ 3123947 3094423 3113486 3072276 3041873 2986503 3020127 3059884 3038878 3056592 3065968 3032879 3027457
4464C027457m327L5543j9833m6875R0609m1352K6147l3261j7210K6622L615l8614
$$ 3027457 3023130 3058673 3038840 2991965 3082574 3041222 3067369 3034108 3016898 3043520 3047135 3008521
4452C008521K3518M6609k9919j688M2672k7229j5747j2884k9859J4612K7994p549
$$ 3008521 3032039 3078648 3048729 3047041 3089713 3062484 3046737 3033853 3003994 3018606 3046600 3039051
4440C039051L9844O1839M0231K215O0120Q9288J34559O1434R8978J58922R7691
$$ 3039051 3078895 3140734 3180965 3183180 3243300 3332588 3467147 3528581 3627559 3786481 3884172
4429C884172J95622K27355K61941K34556L19061L71386L62139M78821N85857O44446
$$ 3884172 4079794 4307149 4569090 4803646 5122707 5494093 5856232 6335053 6920910 7565356
4419G565356O67990Q16464R66994J007766R91118R14758N26548p5441n96959j072856
$$ 7565356 8233346 9049810 10016804 11024570 12015688 12930446 13456994 13381553 12784594 11711738
4409A1711738j226510j169836r46194p68459p26093o37171m82796l99368m73648
$$ 11711738 10485228 9315392 8369198 7600739 6874646 6237475 5754679 5355311 4881663
4400D881663k89870j97687k33225k16619j97643j29242j30851j40232r2867o0846
$$ 4881663 4591793 4394106 4160881 3944262 3746619 3617377 3486526 3346294 3253427 3192581
4390C192581q6400j13740j34742k5866j9556p6418o5546n2415q1274L0254j4479
$$ 3192581 3106181 2992441 2857699 2831833 2812277 2735859 2670313 2617898 2536624 2566878 2552399
4379B552399p4244j5446j9625p833n6601q5500k8441n5098J1835k2715m7177j9977
$$ 2552399 2478155 2462709 2443084 2435251 2378650 2293150 2264709 2209611 2221446 2198731 2151554 2131577
4367B131577J5127k7832r8441k6829L9634l742j1212l7797j02816N834N9706J231
$$ 2131577 2146704 2118872 2020431 1993602 2033236 2029494 2018282 1980485 1877669 1883503 1943209 1944440
4355A944440m1889O3334J6932q1679N7225J2606o8292m0481M5107L8424j761j2396
$$ 1944440 1902551 1965885 1982817 1901138 1958363 1970969 1902677 1862196 1907303 1945727 1943966 1931570
4343A931570K9940l4894q46M2874K5533L2838N0549n0163K3496O1934k7182M9661
$$ 1931570 1961510 1926616 1925770 1968644 1994177 2027015 2077564 2027401 2050897 2112831 2085649 2135310
4331B135310L4417o92q55k0193L0535O7265R5612m3114M6720M1755L0940R935
$$ 2135310 2169727 2169035 2168180 2147987 2178522 2245787 2341399 2298285 2345005 2386760 2417700 2427635
4319B427635N2249N3965Q7314M4266J4751P0652P0961M8004J0458J36973R4054
$$ 2427635 2479884 2533849 2621163 2665429 2680180 2750832 2821793 2869797 2880255 3017228 3111282
4308C111282L8277J27098J76864R4765J36374J56338J77727J54200K27566J58953
$$ 3111282 3149559 3276657 3453521 3548286 3684660 3840998 4018725 4172925 4400491 4559444
4298D559444K31874L08147L57404L03507M20957N52475N41330O82402P18323P81793
$$ 4559444 4791318 5099465 5456869 5760376 6181333 6733808 7275138 7957540 8675863 9457656
4288I457656R24331J061425J050635Q51529N62463M5492m36527q57664j013773
$$ 9457656 10381987 11443412 12494047 13345576 13908039 13953531 13517004 12659340 11645567
4279A1645567j096372r99883q15934p10299n19454n02275l73461l10904j92032
$$ 11645567 10549195 9549312 8733378 8023079 7503625 7001350 6627889 6316985 6124953
4270F124953j65938k30567p3669k2114m1092j08753r4541q6064l90k894R4014
$$ 6124953 5959015 5728448 5654779 5632665 5591573 5482820 5388279 5302215 5301825 5298931 5392945
4259E392945M8761P5588M1288M5192J23752J12372J43283J18273J19718J81102
$$ 5392945 5441706 5517294 5558582 5603774 5727526 5839898 5983181 6101454 6221172 6402274
4249F402274J71439J48858K44072K20953K19328K73480L38914K97259L17554L45115
$$ 6402274 6573713 6722571 6966643 7187596 7406924 7680404 8019318 8316577 8634131 8979246
4239H979246K80685K79636K26747R8364R9264K5450p8223P7948J6004J00242J42078
$$ 8979246 9259931 9539567 9766314 9864678 9963942 9989392 9911169 9989117 10005121 10105363 10247441
4228A0247441J25694J48578K45116K43846K67324L09494L05139L33662K78793
$$ 10247441 10373135 10521713 10766829 11010675 11277999 11587493 11892632 12226294 12505087
4219A2505087K64698K14544J90434J04146M7656N6871R0925J46601K53026K83565
$$ 12505087 12769785 12984329 13174763 13278909 13326565 13383436 13474361 13620962 13873988 14157553
4209A4157553L06775L74733M53602M63285N21253O80499P24278Q28232R19826
$$ 14157553 14464328 14839061 15292663 15755948 16277201 16957700 17681978 18510210 19430036
4200A9430036R14677J002127J114113J107526J164598J284253J226039J230123
$$ 19430036 20344713 21346840 22460953 23568479 24733077 26017330 27243369 28473492
4192B8473492J122141J003777Q21941O69108N28637M18979L41770L71863K91661
$$ 28473492 29595633 30599410 31421351 32090459 32619096 33038075 33379845 33751708 34043369
4183C4043369M84378N84926O47743P84792Q14103Q98902R90565J077682J075238
$$ 34043369 34527747 35112673 35760416 36545208 37359311 38258213 39248778 40326460 41401698
4174D1401698J034738R90161Q80698P58903L62517P4122l56398o84832r60821
$$ 41401698 42436436 43426597 44307295 45066198 45428715 45502837 45146439 44461607 43500786
4165D3500786j182448j235827j268188j201207j203953j054603q87542p46080
$$ 43500786 42318338 41082511 39814323 38613116 37409163 36354560 35467018 34720938
4157C4720938n57654l46977j01152J1638J53005L78220N02269O01722P11945P42361
$$ 34720938 34163284 33816307 33715155 33726793 33879798 34258018 34760287 35362009 36073954 36816315
4147C6816315Q10146P64545O40551O67660O20304N26222N59539N97398P26010
$$ 36816315 37626461 38391006 39031557 39699217 40319521 40845743 41405282 42002680 42728690
4138D2728690J051833J269351J731783K150012K594435L091077L468780L281003
$$ 42728690 43780523 45049874 46781657 48931669 51526104 54617181 58085961 61366964
4130F1366964J968161k76286k690602m056819l975613l391583k749366k232730
$$ 61366964 63335125 63058839 60368237 56311418 52335805 48944222 46194856 43962126
4122D3962126j859377j490706j117645q49045n91772l01134p7373R9324J39914
$$ 43962126 42102749 40612043 39494398 38645353 38053581 37752447 37675074 37774398 37914312
4113C7914312J20509J03369J85104K54232L77277N39130N02501M09081J58571
$$ 37914312 38034821 38138190 38323294 38577526 38954803 39493933 39996434 40405515 40564086
4104D0564086L859p5194q2745J616P5988l3017l33254o69081r53635j025195j019100
$$ 40564086 40567945 40492751 40410006 40411622 40487610 40454593 40121339 39452258 38498623 37473428 36454328
4093C6454328j108163j019656j175816j381770j491527j591404j517492j467044
$$ 36454328 35346165 34326509 33150693 31768923 30277396 28685992 27168500 25701456
4085B5701456j320165j257240j224630j229597j297629j207443j160970r99534
$$ 25701456 24381291 23124051 21899421 20669824 19372195 18164752 17003782 16004248
4077A6004248r25034q34834p00899p09686o96655n59509m58463m05268l71667
$$ 16004248 15079214 14244380 13543481 12833795 12137140 11577631 11119168 10713900 10342233
4068A0342233m11452l42963l42381l24263k85820k15894k94741k82461j61046
$$ 10342233 9930781 9587818 9245437 8921174 8635354 8419460 8124719 7842258 7681212
4059G681212k48010k06145k44951k17584j97635j29348j13512j95211j92286j14583
$$ 7681212 7433202 7227057 6982106 6764522 6566887 6437539 6324027 6128816 5936530 5821947
4049E821947j52459j57201j37744j82135l7512j07597j42104q5404o5241j29617
$$ 5821947 5669488 5512287 5374543 5192408 5154896 5047299 4905195 4819791 4754550 4624933
4039D624933j22922o1263o6397j52488m5850n7144p2173o5625o5396o1711n0294
$$ 4624933 4502011 4440748 4374351 4221863 4176013 4118869 4046696 3981071 3915675 3853964 3803670
4028C803670p5064o7854o2233p9503k7759q2668o2984j37849p110o888n2911l1703
$$ 3803670 3728606 3660752 3598519 3519016 3491257 3408589 3345605 3207756 3200646 3193758 3140847 3109144
4016C109144q9292k0430m7676m5431o0702o7518j9034l5483o9764Q17m6191l0950
$$ 3109144 3019852 2999422 2951746 2906315 2845613 2778095 2759061 2723578 2653814 2654631 2608440 2577490
4004B577490J5261l6364l1656k252k840P590l9188q9641p3796N29l7302q4825
$$ 2577490 2592751 2556387 2524731 2522479 2519639 2527229 2488041 2398400 2324604 2325133 2287831 2203006
3992B203006R392j1544n9919L0420M909p9988l88R368j14002J8594l9772O819
$$ 2203006 2212398 2200854 2140935 2171355 2176264 2096276 2095888 2105256 1991254 2009848 1970076 1976895
3980A976895j5364k325P92j2276l0419K0416j5290m2632M8442j5992l321l0342
$$ 1976895 1961531 1959206 1959998 1947722 1917303 1937719 1922429 1879797 1928239 1912247 1908926 1878584
3968A878584J6368L8848K0889l3276p5462L0749K2924j9952m9277K2198N0985
$$ 1878584 1894952 1933800 1954689 1921413 1845951 1876700 1899624 1879672 1830395 1852593 1903578
3957A903578m2102K378k1528R501o85q429j9939J5058j1609k3985n8256O057k3809
$$ 1903578 1861476 1863854 1842326 1851827 1851142 1842713 1822774 1837832 1826223 1802238 1743982 1750039 1726230
3944A726230k5565k3095k2777j4669p890k4214n032J4224j1348n0674o118o7374
$$ 1726230 1700665 1677570 1654793 1640124 1632234 1608020 1602988 1617212 1605864 1555190 1549072 1481698
3932A481698j504k1317k7438j2576J1268N5710p043n8029j7092L1889P1319k4417
$$ 1481698 1480194 1458877 1431439 1418863 1430131 1485841 1478798 1420769 1403677 1435566 1506885 1482468
3920A482468J1582l1992j8764p895n229N0878o3579m5007K5078l135l0486L5594
$$ 1482468 1494050 1462058 1443294 1435399 1430170 1481048 1417469 1372462 1397540 1394405 1363919 1399513
3908A399513q27l5875m884L1743k0827l0685k1857L9103j9920m0836N1456j643
$$ 1399513 1398686 1362811 1357927 1389670 1368843 1338158 1316301 1355404 1335484 1294648 1346104 1344461
3896A344461j8344M2189J2164p2307k6072M9610L6003R564l7981J6391K1981o986
$$ 1344461 1326117 1368306 1380470 1308163 1282091 1331701 1367704 1377268 1339287 1355678 1377659 1370673
3884A370673J3933J8365l7464n2206n442J4441J846K4135j9802J6357l5241j1210
$$ 1370673 1384606 1402971 1365507 1313301 1307859 1322300 1324146 1348281 1328479 1344836 1309595 1298385
3872A298385j8796N7539N7312J9125k065k0822J0268K7260K1891q1068L3802Q1811
$$ 1298385 1279589 1337128 1394440 1413565 1411500 1390678 1400946 1428206 1450097 1369029 1402831 1484642
3860A484642J3398l7308J6735O027m7266P4502j1038j7888n748Q5525J17840l9889
$$ 1484642 1498040 1460732 1477467 1483494 1436228 1510730 1499692 1481804 1476056 1561581 1679421 1639532
3848A639532k1194K2752L4683l1921O7553k4344o5M1194l4873L639j1483j603
$$ 1639532 1618338 1641090 1675773 1643852 1711405 1687061 1686996 1728190 1693317 1696956 1685473 1683870
3836A683870P7595M1968j2587K1547K6890k3600K9410P4086j6939N1515K5203
$$ 1683870 1761465 1803433 1790846 1812393 1839283 1815683 1845093 1919179 1902240 1953755 1978958
3825A978958N569N9736N6293j4544K0997M5970k483N1791O2613K2854L2090J6013
$$ 1978958 1984527 2044263 2100556 2086012 2107009 2152979 2150496 2202287 2264900 2287754 2319844 2335857
3813B335857L2642j7860L4153J4867O2485J6347K5117K2272R3106M5207o3418
$$ 2335857 2368499 2350639 2384792 2399659 2462144 2478491 2503608 2525880 2618986 2664193 2600775
3802B600775O5527M7101j5219O0807R7942N5237M5667L5029N0008J06683R1927
$$ 2600775 2666302 2713403 2698184 2758991 2856933 2912170 2957837 2992866 3042874 3149557 3241484
3791C241484J3477P8493O4844P3215M6617Q0053J01093M1540J47988J51714N7705
$$ 3241484 3254961 3333454 3398298 3471513 3518130 3598183 3699276 3740816 3888804 4040518 4098223
3780D098223J26474J72107O5506J07105J66065J30043J53582K08664J65164J69053
$$ 4098223 4224697 4396804 4462310 4569415 4735480 4865523 5019105 5227769 5392933 5561986
3770E561986J89328J92132J89016J94055K13248K82195K31749J93471K84544K58856
$$ 5561986 5751314 5943446 6132462 6326517 6539765 6821960 7053709 7247180 7531724 7790580
3760G790580K28037L51252L22876K71211L57644K92391L60508L01146L67136M01519
$$ 7790580 8018617 8369869 8692745 8963956 9321600 9613991 9974499 10275645 10642781 11044300
3750A1044300L58957L73822M32452L78386L48205L73691M35835M33415M13143
$$ 11044300 11403257 11777079 12209531 12587917 12936122 13309813 13745648 14179063 14592206
3741A4592206M23513M34880M71242M96101M28363M36670M98880N71660N04864
$$ 14592206 15015719 15450599 15921841 16417942 16846305 17282975 17781855 18353515 18858379
3732A8858379N19405N44555N77906O68512O28684O92388P59066P73000Q24899
$$ 18858379 19377784 19922339 20500245 21168757 21797441 22489829 23248895 24021895 24846794
3723B4846794Q48838R34779J000738J060578J123272J166470J208347J309413
$$ 24846794 25695632 26630411 27631149 28691727 29814999 30981469 32189816 33499229
3715C3499229J328142J551459J580422J658690J618616J741597J780573J825689
$$ 33499229 34827371 36378830 37959252 39617942 41236558 42978155 44758728 46584417
3707D6584417J916110J814801J906357K017641K010270J982365K022408J922595
$$ 46584417 48500527 50315328 52221685 54239326 56249596 58231961 60254369 62176964
3699F2176964J879540J883615J856260J695494J566394J458173J450737J258129
$$ 62176964 64056504 65940119 67796379 69491873 71058267 72516440 73967177 75225306
3691G5225306J100532J052539Q82504O78363O15578L16481J87978l4557k23358
$$ 75225306 76325838 77378377 78260881 78939244 79554822 79871303 80059281 80024724 79801366
3682G9801366l67911o10239p68641q24570j031281j228604j291058j451957j571611
$$ 79801366 79433455 78823216 78054575 77230005 76198724 74970120 73679062 72227105 70655494
3673G0655494j635372j740121j807226j999438k008897k030915k037857k106955
$$ 70655494 69020122 67280001 65472775 63473337 61464440 59433525 57395668 55288713
3665E5288713k069114k069105k059483j999473j964687j954528j953578j865370
$$ 55288713 53219599 51150494 49091011 47091538 45126851 43172323 41218745 39353375
3657C9353375j789832j721068j779624j545392j520881j509293j437993j304061
$$ 39353375 37563543 35842475 34062851 32517459 30996578 29487285 28049292 26745231
3649B6745231j252431j185971j107696j090026j024784r69594q69495p72560p26489
$$ 26745231 25492800 24306829 23199133 22109107 21084323 20114729 19245234 18472674 17746185
3640A7746185p12458p44322o39880n58734n68723m91117m68262m70365m68980
$$ 17746185 17033727 16289405 15649525 15090791 14522068 14030951 13562689 13092324 12623344
3631A2623344l62853l79384l12199l39330l23599k85971k13161k66837k24004
$$ 12623344 12260491 11881107 11568908 11229578 10905979 10620008 10406847 10140010 9916006
3622I916006k22234j81492j85812j73160j55584j98416j18813j27376j45523r5884
$$ 9916006 9693772 9512280 9326468 9153308 8997724 8799308 8680495 8553119 8407596 8311712
3612H311712j06868j07867j40741j60068r3494m7270l2741r8487q4034m4302o3603
$$ 8311712 8204844 8096977 7956236 7796168 7702674 7655404 7622663 7524176 7440142 7395840 7332237
3601G332237p2363o5558o6108l0291p8462k3768m3374m1669n9504k6419k806n881
$$ 7332237 7259874 7194316 7128208 7097917 7019455 6995687 6952313 6910644 6851140 6824721 6821915 6816034
3589F816034r3176j02495j5066q3396l1259l4020n6458m1523j02139p4454p5560
$$ 6816034 6722858 6620363 6605297 6521901 6490642 6456622 6400164 6358641 6256502 6182048 6106488
3578F106488k7485j09268j8382o8645j04156o7598l2807p561j16939j12696j2600
$$ 6106488 6079003 5969735 5951353 5882708 5778552 5710954 5678147 5670586 5553647 5440951 5428351
3567E428351q8008j00869k9427l8092m9144k6623m1401q3418K272k7510J6673
$$ 5428351 5340343 5239474 5210047 5171955 5122811 5096188 5054787 4971369 4973641 4946131 4962804
3556D962804o02m6920r676p895J3736J78M5066J6725r320R5487M0459k9602k6397
$$ 4962804 4962202 4915282 4905606 4897711 4911447 4911625 4956691 4973416 4964096 5059583 5100042 5070440 5044043
3543E044043O8767M3557J2842J02236K6962M5728M1574Q5493Q6511J1409L7118
$$ 5044043 5112810 5156367 5169209 5271445 5298407 5344135 5385709 5471202 5557713 5569122 5606240
3532E606240K3880P6640P1498Q7412J27141J39784J01169M9301Q8121R9763J55038
$$ 5606240 5630120 5706760 5778258 5865670 5992811 6132595 6233764 6283065 6371186 6470949 6625987
3521F625987J88617J25857J33579K07132J48940J89689J78119J98970K76858K44960
$$ 6625987 6814604 6940461 7074040 7281172 7430112 7619801 7797920 7996890 8273748 8518708
3511H518708K13812K76775K76947L35984L08353L54780M27319M21327M49435M52479
$$ 8518708 8732520 9009295 9286242 9622226 9930579 10285359 10712678 11134005 11583440 12035919
3501A2035919N00581N43861N21017N39124N97525N51155N95862O62097N77642
$$ 12035919 12536500 13080361 13601378 14140502 14738027 15289182 15885044 16547141 17124783
3492A7124783N09165N61899M87965L97282L16135L54639K47660J79484J37648
$$ 17124783 17633948 18195847 18683812 19081094 19397229 19751868 19999528 20179012 20316660
3483B0316660P5640L1486o7189j52426j77614j83821k57940l00133l12378l46169
$$ 20316660 20392300 20423786 20356597 20204171 20026557 19842736 19584796 19284663 18972285 18626116
3473A8626116l96714m91761m14821l93591m33271m17076l81916l20576l68201
$$ 18626116 18229402 17737641 17322820 16929229 16495958 16078882 15696966 15376390 15008189
3464A5008189l45418k69361k57860k65416k00145j69078j71293j14666j82381
$$ 15008189 14662771 14393410 14135550 13870134 13669989 13500911 13329618 13214952 13032571
3455A3032571r8878n6423o1818l7610o0545M1936J0647N0354O5176J22708J22488
$$ 13032571 12933693 12877270 12815452 12777842 12717297 12759233 12769880 12820234 12885410 13008118 13130606
3444A3130606J06864Q6630P8004J93822K33452J78023J53490K12806K58353L22673
$$ 13130606 13237470 13324100 13402104 13595926 13829378 14007401 14160891 14373697 14632050 14954723
3434A4954723K54872K29850L28204L28901L17174L29135L48655M23358M58635
$$ 14954723 15209595 15439445 15767649 16096550 16413724 16742859 17091514 17514872 17973507
3425A7973507M66319M02334M38017N51460N59104N51006N61032O16012P44795
$$ 17973507 18439826 18842160 19280177 19831637 20390741 20941747 21502779 22118791 22863586
3416B2863586P33245P72853P51426P75483P97421Q77836Q69848R20655R38845
$$ 22863586 23596831 24369684 25121110 25896593 26694014 27571850 28441698 29362353 30301198
3407C0301198R74282R08867R09556R49525R39190R60723R56558R45980R89412
$$ 30301198 31275480 32184347 33093903 34043428 34982618 35943341 36899899 37845879 38835291
3398C8835291R65702R03727R40465R53189R14238Q39617Q84300Q54054Q54320
$$ 38835291 39800993 40704720 41645185 42598374 43512612 44352229 45236529 46090583 46944903
3389D6944903Q67764R18419R14685J000491J040416J071533J053678J147883J273657
$$ 46944903 47812667 48731086 49645771 50646262 51686678 52758211 53811889 54959772 56233429
3380E6233429J307048J367332J416437J547413J700440J749310J906089K134827
$$ 56233429 57540477 58907809 60324246 61871659 63572099 65321409 67227498 69362325
3372F9362325K362560K432731K617552K835305L063008L237190L538387L733060
$$ 69362325 71724885 74157616 76775168 79610473 82673481 85910671 89449058 93182118
3364I3182118M041671M283351M527429M730552M999596N261239N371994N701123
$$ 93182118 97223789 101507140 106034569 110765121 115764717 121025956 126397950 132099073
3356A32099073N815179O126226O347393O482685O818053P036772P310469P589033
$$ 132099073 137914252 144040478 150387871 156870556 163688609 170725381 178035850 185624883
3348A85624883P834370Q106547Q172191Q347600Q575477Q699831Q825626Q929401
$$ 185624883 193459253 201565800 209737991 218085591 226661068 235360899 244186525 253115926
3340B53115926Q934303Q967936Q838662Q666432Q249721P567819O631749N608580
$$ 253115926 262050229 271018165 279856827 288523259 296772980 304340799 310972548 316581128
3332C16581128M365949K955184J600734J89199r89060k079020l026070l797272
$$ 316581128 320947077 323902261 325502995 325692194 324703134 322624114 319598044 315800772
3324C15800772m576663n406502o248316p093064p961777q912187r769467j0620914
$$ 315800772 311224109 305817607 299569291 292476227 284514450 275602263 265832796 255211882
3316B55211882j1237255j1596551j1802763j1804810j1529943j1099626j0599681
$$ 255211882 243974627 232378076 220575313 208770503 197240560 186140934 175541253
3309A75541253r957824r387132q676086q023991p421754o808664o221446n695702
$$ 175541253 165583429 156196297 147520211 139496220 132074466 125265802 119044356 113348654
3301A13348654n166708m729886m283679l883604l585853l253179l023054k641203
$$ 113348654 108181946 103452060 99168381 95284777 91698924 88445745 85422691 82781488
3293H2781488k427453k348809k197154k033677j901780j751436j756594j653663
$$ 82781488 80354035 78005226 75808072 73774395 71872615 70121179 68364585 66710922
3285F6710922j529778j443754j391417j320911j249120j254654j177486j228679
$$ 66710922 65181144 63737390 62345973 61025062 59775942 58521288 57343802 56115123
3277E6115123j153482j205370j155091j236088j272791j208865j237723j232013
$$ 56115123 54961641 53756271 52601180 51365092 50092301 48883436 47645713 46413700
3269D6413700j160161j124714j141712j084875j108553j058993j055300r99268
$$ 46413700 45253539 44128825 42987113 41902238 40793685 39734692 38679392 37680124
3261C7680124j073769r64985r44308q25265q99386q58955p94700p49057p29801
$$ 37680124 36606355 35641370 34697062 33871797 32972411 32113456 31318756 30569699 29839898
3252B9839898n84641n56598n62896m21859n13578l96150k62403k33000k41070
$$ 29839898 29255257 28698659 28135763 27713904 27200326 26804176 26541773 26308773 26067703
3243B6067703j42399j57560r1902o4008r0539j00536q1490p4624r2367k45535
$$ 26067703 25925304 25767744 25675842 25611834 25521295 25420759 25339269 25264645 25172278 24926743
3233B4926743k26424l22491l02774l46111k90927l26077l80114l46461l85099
$$ 24926743 24700319 24377828 24075054 23728943 23438016 23111939 22731825 22385364 22000265
3224B2000265m27856m93854n09042n98971n56356n75456o19888o39117n69436
$$ 22000265 21572409 21078555 20569513 19970542 19414186 18838730 18218842 17579725 17010289
3215A7010289n96621n39463n94806n39444m36119m25779l58041m12644l82349
$$ 17010289 16413668 15874205 15279399 14739955 14303836 13878057 13520016 13107372 12725023
3206A2725023l21241k53413l19454k98389k72759k26784k03008k62575k04287
$$ 12725023 12403782 12150369 11830915 11532526 11259767 11032983 10829975 10567400 10363113
3197A0363113j65197k29621k31307j76462j67437k00985j27558j49880j42583
$$ 10363113 10197916 9968295 9736988 9560526 9393089 9192104 9064546 8914666 8772083
3188H772083j27031j41845j35135j07291j54326j44991j29861j56943j23450j22576
$$ 8772083 8645052 8503207 8368072 8260781 8106455 7961464 7831603 7674660 7551210 7428634
3178G428634q0523j07343j24930j04140q6094q4181j23552j12890p6597p9990
$$ 7428634 7348111 7240768 7115838 7011698 6925604 6841423 6717871 6604981 6528384 6448394
3168F448394p5777j05847p4507j37215j14951l6375j15952q8894q247r6423p2500
$$ 6448394 6372617 6266770 6192263 6055048 5940097 5903722 5787770 5698876 5690629 5594206 5521706
3157E521706l6802q6374p985l9761j6400o9006n1913o0852k3237n8967r9677n3061
$$ 5521706 5484904 5398530 5390545 5350784 5334384 5265378 5213465 5152613 5129376 5070409 4970732 4917671
3145D917671k9723n3197l3611j1279p9882P492o8416j6951J4425l9181o3439q6575
$$ 4917671 4887948 4834751 4801140 4789861 4709979 4717471 4649055 4632104 4646529 4607348 4543909 4457334
3133D457334o2168j933l3433l1633M260j6024q2621j6864K1915m3697K139n3240
$$ 4457334 4395166 4393233 4359800 4328167 4332427 4316403 4233782 4216918 4238833 4195136 4197275 4144035
3121D144035l0098m0158m2828O3315m7048j6727j7670p767l8994k705M2117k2736
$$ 4144035 4113937 4073779 4030951 4094266 4047218 4030491 4012821 4005054 3966060 3963355 4005472 3982736
3109C982736O051K7979j3129j9305J3785K6433K2557L3153k85J8374K9321j0371
$$ 3982736 3988787 4016766 4003637 3984332 3998117 4024550 4047107 4080260 4079975 4098349 4127670 4117299
3097D117299M8984K0301K5292L3061j4380K7329K4278L2475L2016L7445O6363
$$ 4117299 4166283 4186584 4211876 4244937 4230557 4257886 4282164 4314639 4346655 4384100 4450463
3086D450463N9307P8511j562M9161Q3681k6328J6483L3261O8484J8064R7168N0247
$$ 4450463 4509770 4588281 4586719 4635880 4719561 4693233 4709716 4742977 4811461 4829525 4926693 4976940
3074D976940M7552q707P3023L9716K3578N6875L6880k7569K9374N0409J074P3794
$$ 4976940 5024492 5015785 5088808 5128524 5152102 5208977 5245857 5218288 5247662 5298071 5299145 5372939
3062E372939Q48J9820K1036N3963J0665J1918L6889K0337r2663m1164j53791j74715
$$ 5372939 5373787 5393607 5414643 5468606 5479271 5491189 5528078 5548415 5455752 5414588 5260797 5086082
3050E086082m5842j39610j11704j39530j08939r7296j27362p3733j01239p3838
$$ 5086082 5040240 4900630 4788926 4649396 4540457 4443161 4315799 4242066 4140827 4066989
3040D066989r3528j05212j19176o7061r0149q9090r6310j42024p0270l6872o8695
$$ 4066989 3973461 3868249 3749073 3682012 3591863 3502773 3406463 3264439 3194169 3157297 3088602
3029C088602k6218r8809j29395j32494q1629K9939n3792k1256k0065o1706n3298
$$ 3088602 3062384 2963575 2834180 2701686 2620057 2649996 2596204 2574948 2554883 2493177 2439879
3018B439879n0607M3695o4944k1661o2308m1302m4712j7286p1296J5164J9910
$$ 2439879 2389272 2432967 2368023 2346362 2284054 2242752 2198040 2180754 2109458 2124622 2144532
3007B144532p2126j4553l1205o4242j4137j6472m4981k5098l4468j3593n5127
$$ 2144532 2072406 2057853 2026648 1962406 1948269 1931797 1886816 1861718 1827250 1813657 1758530
2996A758530J2282J3855l7461j5810m9547j1222K3855q591j3177n6138p089k3560
$$ 1758530 1770812 1784667 1747206 1731396 1681849 1670627 1694482 1685891 1672714 1616576 1609487 1585927
2984A585927K001k2405j6001M2732m3319k3129l759N3737k7670k9263m7498O872
$$ 1585927 1587928 1565523 1549522 1592254 1548935 1525806 1522047 1575784 1548114 1518851 1471353 1478225
2972A478225J650L2036n8281j2219k4614J9205L2963q9936L0588L039M3687o3302
$$ 1478225 1479875 1511911 1453630 1441411 1416797 1436002 1468965 1379029 1409617 1412656 1456343 1393041
2960A393041j21168k0868M2601L7913J9066n4323j1026J2836m0003q3622M8720
$$ 1393041 1271873 1251005 1293606 1331519 1350585 1296262 1285236 1298072 1258069 1174447 1223167
2949A223167M7080L388l6097k0615k2489K5851J9531l8536J2639K726J1725K2676
$$ 1223167 1270247 1273635 1237538 1216923 1194434 1220285 1239816 1201280 1213919 1216645 1228370 1251046
2937A251046q6145l7280P1519L9306m3622J4225P007J8241p4504k8260k8092K979
$$ 1251046 1164901 1127621 1199140 1238446 1194824 1209049 1216056 1234297 1159793 1131533 1103441 1106420
2925A106420k8615p1777N6970J6718M6932k6219o1107J2265K9526k3267n8795
$$ 1106420 1077805 1006028 1062998 1079716 1126648 1100429 1039322 1051587 1081113 1057846 999051
2914I99051K0812J7219n258r194K5320j6492k0239o131j3331J1049l5938l346
$$ 999051 1019863 1037082 1031824 1022630 1047950 1031458 1011219 1005088 991757 1002806 966868 963522
2902I63522k0334r3088J2281N0081J0805j0470K2627M016l1501o2639L4971K8889
$$ 963522 943188 850100 862381 912462 923267 912797 935424 939440 907939 845300 880271 909160
2890I09160Q40j3189k8397K0873R511j0099o2030K8904M4936p0136j8034M4544
$$ 909160 910000 896811 868414 889287 898798 888699 826669 855573 900509 830373 812339 856883
2878H56883K7666M927r4610R107K4337j4970P7906m3490j8114l9071j1291M0576
$$ 856883 884549 889476 794866 803973 828310 813340 891246 847756 829642 790571 779280 819856
2866H19856j1885n8634L824j567K1424J3718m5532P645m9165j599J30545m0866
$$ 819856 807971 749337 753161 751594 773018 786736 741204 748849 699684 698085 828630 787764
2854G87764q7530K147K4420M0964m5014N5179k9196M3017P226r694J754k0320
$$ 787764 700234 702381 726801 767765 722751 777930 748734 791751 798977 789283 791037 770717
2842G70717o2455J7453N1710m7501n3714j112K9762L7793o286L7865m6056N8034
$$ 770717 708262 725715 777425 729924 676210 675098 704860 742653 736367 774232 728176 786210
2830G86210L1541L3969k9106L189k6641j7750M6995k6896k8305J8707n026j8818
$$ 786210 817751 851720 822614 825803 799162 781412 828407 801511 773206 791913 786887 768069
2818G68069j7807K7380j5658R5953J7548n7740M5210m7296K6035n1004K7839L4397
$$ 768069 750262 777642 761984 857937 875485 817745 862955 815659 841694 790690 818529 852926
2806H52926l1138j8917M3945q075k6151N4311J0624m6235J3986K7321M3781P912
$$ 852926 821788 802871 846816 838741 812590 866901 877525 831290 845276 872597 916378 924290
2794I24290k1804p890k0588Q264M0338J4283j1944O9298L2142m4119p653K6519
$$ 924290 902486 894596 874008 882272 922610 936893 924949 994247 1026389 982270 974617 1001136
2782A001136J2640O1124K5709O0388J09530L6154j9490L4891P8113N31j7127M4562
$$ 1001136 1013776 1074900 1100609 1160997 1270527 1306681 1287191 1322082 1400195 1400726 1383599 1428161
2770A428161Q2453M3671L4966J1688M100N0860R6085l2199j8457Q563m596K0628
$$ 1428161 1510614 1554285 1589251 1600939 1605039 1655899 1751984 1719785 1701328 1709891 1705295 1725923
2758A725923k992K5239O2162R268M3513K7938M1788M8782L1510K7560J01079N1294
$$ 1725923 1722931 1748170 1810332 1819600 1863113 1891051 1932839 1981621 2013131 2040691 2141770 2193064
2746B193064J9527K8806M2980J0087J29545M1878p3975j6059p0462j44667n2118
$$ 2193064 2212591 2241397 2284377 2294464 2424009 2465887 2391912 2375853 2305391 2160724 2108606
2735B108606r5728K606n6841j17204r5355j0521k6425l5506o2692k6854l2338
$$ 2108606 2012878 2015484 1958643 1841439 1746084 1735563 1709138 1673632 1610940 1584086 1551748
2724A551748M2856O1897j06753m042K7994p0046l6335j2134o0541M0047j9617
$$ 1551748 1594604 1656501 1549748 1545706 1573700 1503654 1467319 1455185 1394644 1434691 1415074
2713A415074n3955K969j0758j26808J649j6711m1812J030k1358m6677l6819j1226
$$ 1415074 1361119 1364088 1353330 1226522 1228171 1211460 1169648 1170678 1149320 1102643 1065824 1054598
2701A054598k5887o0534n2296j8195k3669j01471O9298l584j4023k3752N971l768
$$ 1054598 1028711 968177 915881 897686 874017 772546 841844 838260 824237 800485 806456 802688
2689H02688m5744k8622J0652K9524o8806j6733k0221l3849J520O9098J8492j35925
$$ 802688 756944 728322 738974 768498 699692 682959 662738 628889 630409 699507 717999 582074
2677E82074n2443J0819N1725J2097K040q2142K4157n801k8010N9100m4832M141
$$ 582074 529631 540450 592175 604272 606312 524170 548327 542526 514516 573616 528784 532925
2665E32925L7699q675l6349k2921L4673n6962l61L9406k103J2726n4968j9011
$$ 532925 570624 561949 525600 502679 537352 480390 480029 519435 517332 530058 475090 456079
2653D56079j1663J2475J2944K4488L0567o6152o3636Q417K474P29n6587L1393
$$ 456079 444416 456891 469835 494323 524890 458738 395102 403519 405993 406722 350135 381528
2641C81528O2399N204n2550Q85J8646L586j0966J1540l156m6012j5021N4646m7730
$$ 381528 443927 449131 396581 397466 416112 419698 408732 420272 417116 371104 356083 410729 362999
2628C62999o1989n310j2823J3924M9529j4664M241j9760o950J3579m4704Q650
$$ 362999 301010 295700 282877 296801 346330 331666 335907 316147 309197 322776 278072 286722
2616B86722K7934O710J6919j0643N188J6411J52j1883l8642L0460j6438n179k4002
$$ 286722 314656 321366 338285 327642 332830 349241 349393 337510 298868 329328 312890 307711 283709
2603B83709k3897M3266K0148k3520n38M36J6841J4899R781l9205j5444N52k5228
$$ 283709 259812 303078 323226 299706 299168 299604 316445 331344 341125 301920 286476 287028 261800
2590B61800k598Q8539P167m5321q699p024m5991j3303O9783K4316k0082R4m3667
$$ 261800 259202 347741 354908 309587 300888 293864 247873 234570 304353 328669 308587 308681 265014
2577B65014N28j3186R463R369J0743K2783j2015N5650j6823J1900n3674l0079
$$ 265014 265542 252356 261819 271188 281931 304714 292699 348349 331526 343426 289752 259673
2565B59673J3823j6609o419L1021j4382J8924J6712j0442k4930m3087K5419J039
$$ 259673 273496 256887 250468 281489 267107 286031 302743 292301 267371 224284 249703 250742
2553B50742J4253j7038k42k9942k7821K8378o504J1145k7206J3168J8289K1033
$$ 250742 264995 247957 247715 217773 189952 218330 211826 222971 195765 208933 227222 248255
2541B48255J5552M4552m8063j2681M0087J0237l3233o479M740j5680j4028M66
$$ 248255 263807 308359 260296 247615 287702 297939 264706 258227 262967 247287 233259 233725
2529B33725J0351j0181j6851k3390K0369K6990N3147n8966l245q773K0832M9718
$$ 233725 244076 233895 217044 193654 214023 241013 294160 235194 231949 223176 244008 293726
2517B93726o8438k502o6789Q7129K2431l3565J1658q591j3881J0867l7593k2388
$$ 293726 225288 222786 155997 243126 265557 231992 243650 235059 221178 232045 194452 172064
2505A72064K6354K8971K2289N415k5898j0914k9661o7573O5029K3093j5126L9321
$$ 172064 198418 227389 249678 255093 229195 218281 188620 121047 186076 209169 194043 233364
2493B33364m2906J3595N9883m0726k9909K083k2589L407J5442k0356O4773l400
$$ 233364 190458 204053 263936 223210 193301 195384 172795 176202 191644 171288 236061 232661
2481B32661n7185n5974M0742L5938l5763J8111N1001m5821k7861L0821P0049o9910
$$ 232661 175476 119502 160244 196182 160419 178530 229531 183710 155849 186670 256719 186809
2469A86809L1067j6845m512m0247j072L4018p371p053k624k9697K2370l7376J2217
$$ 186809 217876 201031 196519 156272 155200 189218 181847 174794 172170 142473 164843 127467 139684
2456A39684K1689O9434P629M386K0242m1282n9913K148j0857m0761N0954K633
$$ 139684 161373 230807 238436 242822 263064 221782 161869 164017 153160 112399 163353 165986
2444A65986L1787l0478r001K3544J3537k2678k5297l0684p543J3111j5165K2805
$$ 165986 197773 167295 158294 181838 195375 172697 147400 116716 109173 122284 107119 129924
2432A29924O4064m3351j9811j6144K2310j6418J4221J0327N1801n0052j5784N7791
$$ 129924 193988 150637 130826 114682 136992 120574 134795 145122 196923 146871 131087 188878
2420A88878l6278l8333Q558m0644M8983R201l6414l6014N3718m186J866J7103
$$ 188878 152600 114267 122825 82181 131164 140365 103951 67937 121655 117469 119335 136438
2408A36438k4733M0317L8373p7243O143N9034j8126q177p1102P196N2348R696
$$ 136438 111705 152022 190395 113152 119295 178329 160203 152026 80924 88120 140468 150164
2396A50164j9162M4492M238k6419L175M8155m7440n2083L9035J36o2307J1663
$$ 150164 131002 175494 179732 153313 156488 204643 157203 105120 144155 144291 81984 93647
2384I3647J749O545j8040L9694J9132K6775k8087k8532L591J3873P7000q0420
$$ 93647 95396 101941 83901 123595 142727 169502 141415 112883 116474 130347 207347 126927
2372A26927k8145p995j834k0759L2656J4778m675N516m4393P364L151J4248K7972
$$ 126927 98782 90787 88953 68194 100850 115628 110953 116469 72076 79440 82591 96839 124811
2359A24811n8214L3866P4275k6668l6161j2944L3413K6154j7825n9736N2394n6582
$$ 124811 66597 100463 174738 148070 111909 98965 132378 158532 140707 80971 133365 76783
2347G6783k7074N2058k6K3557O1233K8406q017M2509p1464p2264m541P2688k2244
$$ 76783 49709 101767 101741 125298 186531 214937 206920 249429 177965 105701 101160 173848 151604
2334A51604k2258K0551j0345K18k7251m3961N1459m42J870j0987l9236O7789K7383
$$ 151604 129346 149897 139552 139770 112519 68558 120017 119575 121445 110458 71222 139011 166394
2321A66394j9897j967o2914O8813k8356J2126K8427l8569M5861l9908k8540K0799
$$ 166394 146497 144530 81616 150429 122073 134199 162626 124057 169918 130010 101470 122269
2309A22269K3512K8766l9428o118O6388j6792j8915k340K2055o03n1357l7559
$$ 122269 145781 174547 135119 129001 195389 178597 159682 157342 179397 178794 127437 89878
2297H9878K7563J2043K2935L2292J4332n8412o17l9674M1929k8833j9404m375
$$ 89878 117441 129484 152419 184711 199043 140631 140014 100340 142269 113436 94032 89657
2285H9657K6705J5613k2139J4189k2597J0052k61k985k9617K0333J8173j7309
$$ 89657 116362 131975 109836 124025 101428 111480 111219 108234 78617 98950 117123 99814
2273I9814K3976J437k1993n3516P2786j763k9000N824n606J1734K4863j1247o3458
$$ 99814 123790 125227 103234 49718 122504 120741 91741 97565 91959 103693 128556 117309 53851
2260E3851K8798j1500j939L5509M167l5485l4944J8428K3157n1899K5144N5643
$$ 53851 82649 71149 69210 104719 108886 73401 38457 56885 80042 28143 53287 108930
2248A08930l457P103l8L7262m2319l6572q761L114N4815N3N995k4361P203M3309
$$ 108930 105473 112576 112538 149800 107481 70909 62148 65262 120077 120130 126125 101764 108967 152276
2234A52276J0859l8265m9843k660j7366m11l4176O9830m3122j6750K2210N4875
$$ 152276 163135 124870 75027 72367 55001 54590 20414 90244 47122 30372 52582 107457
2222A07457k2372o541j7570K234J9119j7501P6047l2519m9365k8522N1232K4072
$$ 107457 85085 78544 60974 63208 82327 64826 140873 108354 58989 30467 81699 105771
2210A05771j171k430j9746j9355N3902m1712J4439j2819p8801J6292O5439K3408
$$ 105771 104600 102170 82424 63069 116971 75259 89698 76879 -1922 14370 79809 103217
2198A03217Q52j5585K8868J0502m1706k0830M9655L828K4239p8213o045M8952
$$ 103217 104069 88484 117352 127854 86148 65318 114973 118801 143040 64827 58782 107734
2186A07734J6274J765p216k5432j8664K2491k1163J883n337K83m8288N1594N978
$$ 107734 124008 125773 118557 93125 74461 96952 75789 77672 72335 72618 24330 75924 81902
2173H1902n3130N9639j5158l9600P387Q1321j1094j01052k2055N3201L9967J7244
$$ 81902 28772 88411 73253 33653 41040 122361 111267 10215 -11840 41361 81328 98572
2161I8572l1029m6601L9452K7595l5054k2136j65N5492J5126K4611m5567P377
$$ 98572 67543 20942 60394 87989 52935 30799 30634 86126 101252 125863 80296 87673
2149H7673j9372j8399k2376M2767L4021k8106l7172M2294M7894k0726k2395K9060
$$ 87673 68301 49902 27526 70293 104314 76208 39036 81330 129224 108498 86103 115163
2137A15163p8568J9142M4569j8886o907o7303Q0271j0571q807L398K0311R388
$$ 115163 36595 55737 100306 81420 74513 7210 87481 76910 68103 71501 91812 101200
2125A01200k5809M143k7104J5009K0460k6629M0040k8413M2348j9669N663k3426
$$ 101200 75391 79534 52430 67439 87899 61270 101310 72897 115245 95576 101239 77813
2113G7813n0561j2472N2234r104K6119k5909K1749n5277l8033O4302M4420J4631
$$ 77813 27252 14780 67014 57910 84029 58120 79869 24592 -13441 50861 95281 109912
2101A09912l9043j5173j7037O0277N2200k9801o4293l6413N2939N353N6671o0664
$$ 109912 70869 55696 38659 98936 151136 121335 57042 20629 73568 78921 135592 74928
2089G4928n4379K4295M0988l9891N6244O2224n5104m0570m865L3415K3137j5403
$$ 74928 20549 44844 85832 45941 102185 164409 109305 68735 63870 97285 120422 105019
2077A05019n5364l584P147J9379q689L1083L471O6157k3794m9458K7255L7319
$$ 105019 49655 46071 53218 72597 63908 94991 98462 164619 140825 91367 118622 155941
2065A55941N7541M100o5203k9748r270J4239m2179k8019K4865J9911O0483P9876
$$ 155941 213482 217582 152379 122631 113361 127600 85421 57402 82267 102178 162661 242537
2053B42537p5546J7914k933K0862K9358j4684N9621l2544M6823J6041Q0158M1481
$$ 242537 166991 184905 181972 202834 232192 217508 277129 244585 291408 307449 387607 429088
2041D29088L942P5482l969K3005J10298Q2076L9752N5722J05691O6780M0194j19737
$$ 429088 433030 508512 504543 527548 637846 719922 759674 815396 921087 987867 1028061 908324
2029I08324j55591q2992r5330l9006n4439o8122m7071l0498l292m9426k512J7059
$$ 908324 752733 669741 574411 535405 480966 412844 365773 335275 331983 282557 280045 297104
2017B97104l5621j4583l8925K5534k6383n2256K6524k3225n0713P9923j7816K171
$$ 297104 261483 246900 207975 233509 207126 154870 181394 158169 107456 187379 169563 171734
2005A71734n5285k0147P4218K3892j450l8659j108K9266n2444L169l9820N484
$$ 171734 116449 96302 170520 194412 192962 154303 153195 182461 130017 133186 93366 98850
1993I8850L2003m3716J7610k9870J1624p396O9K5160q120j2155m1766j2667O8857
$$ 98850 130853 87137 104747 74877 86501 79105 79174 104334 96214 84059 42293 29626 98483
1980I8483m2877n112M3357M9377o3616l9708L2910m087k3632k0548K7646l283
$$ 98483 55606 50494 93851 143228 79612 39904 72814 68727 45095 24547 52193 48910
1968D8910k0685k7951P9312j7456J1034k2576k324J2492P043j0340J2991j3814
$$ 48910 28225 274 79586 62130 73164 50588 48264 60756 67799 57459 70450 56636
1956E6636J2211j4103J879q139m6102L5073n611k8437L4167M4006l536l128J1438
$$ 56636 68847 54744 56623 48484 2382 37455 31844 3407 37574 81580 78044 74916 86354
1943H6354k0575k0618k6714J8116J7344K3745J451k430R972j2858J7828J8592
$$ 86354 65779 45161 18447 36563 53907 77652 79103 76673 86645 73787 91615 110207
1931A10207l1349M421J3072K182m0840K5114n6125l0976L2284j9332J8275l4304
$$ 110207 78858 83279 96351 98533 57693 82807 26682 -4294 27990 8658 26933 -7371
1919g371Q099j8422O5868N183J7475l2345L299L9122P466j04984K2643N9277j3107
$$ -7371 728 -17694 48174 53357 70832 38487 41786 80908 88374 -16610 6033 65310 52203
1906E2203k1897L5125J8106k593m7872l8113M6161J4791l8219L6138O039K2269
$$ 52203 30306 65431 83537 80944 33072 -5041 41120 55911 17692 53830 59869 82138
1894H2138n1916l5595J8963R74N7091j3700o6591L1711n216J2715N5338J1601
$$ 82138 30222 -5373 13590 14564 71655 57955 -8636 23075 17859 30574 85912 97513
1882I7513l1873j8813R145n3962j5816M3993J5662J6970K7028k6671l786n730
$$ 97513 65640 46827 55972 2010 -13806 30187 45849 62819 89847 63176 59390 53660
1870E3660l3922J3250j3938L2448l0338L0332J1962L3796m4391m2440L0260m7587
$$ 53660 19738 32988 19050 51498 21160 51492 63454 97250 52859 10419 40679 -6908
1858f908k615o216K0449K9390Q142n1818q170k2851l488K9952j3413J6477M7842
$$ -6908 -9523 -15739 4710 34100 42242 -9576 -17746 -40597 -44085 -14133 -27546 -11069 36773
1845C6773o419O065o465m2054j9816M7978n1397K7980j4741K9227M079j8130K2147
$$ 36773 30354 36419 29954 -12100 -31916 16062 -35335 -7355 -22096 7131 11210 -6920 15227
1832A5227J4124K6655k6584l8158K5991j9832j4882M3773M2288j9047p431m6330
$$ 15227 29351 56006 29422 -8736 17255 -2577 -17459 26314 68602 49555 42124 -4206
1820d206O0898l9381q1442P8424k8648J1311P929J5159L4430m4880k5484L6228
$$ -4206 56692 17311 -64131 14293 -14355 -3044 4885 20044 54474 9594 -15890 20338
1808B0338j8407M0061O153j4024J419j9431J1825k0923J0147N819j8888q302P7152
$$ 20338 1931 41992 48145 34121 35540 16109 27934 7011 17158 22977 4089 -4213 72939
1795G2939l3475l8965P2163p114n3567n0011J6852N3884p532p585l1757K9339
$$ 72939 39464 499 72662 65548 11981 -38030 -21178 32706 25174 17589 -14168 15171
1783A5171Q262j5434l3062m484r288K0127k363Q359N3246l2693j8661K9256k3297
$$ 15171 23433 7999 -25063 -29547 -38835 -18708 -21071 -12712 40534 7841 -10820 18436 -4861
1770d861k8632J9665k1226K6275P0030n811o1625N926M9105m2006J7816m282N651
$$ -4861 -33493 -13828 -35054 -8779 61251 55440 -6185 -259 48846 6840 24656 20374 26025
1757B6025r517k6318l710K6849j5016J5626J0793n4630L2593k1846O6626M2895
$$ 26025 16508 -9810 -13520 13329 -1687 13939 24732 -29898 2695 -19151 47475 90370
1745I0370l8989p481O2103m0593l5761l7048J83J5500N6018k0218m9476j6105
$$ 90370 51381 43900 106003 65410 29649 -7399 -7216 8284 64302 44084 -5392 -21497
1733b1497L0084L7807R276K4611m9412l3662K3665l2490l281O5515L9321o0950
$$ -21497 8587 46394 55670 80281 30869 -2793 20872 -11618 -14899 50616 89937 28987
1721B8987n7987K9122J9710p3142k6730J2433o740j0600O281L5855J7490J6843
$$ 28987 -29000 122 19832 -53310 -80040 -67607 -74347 -84947 -78666 -42811 -25321 -8478
1709h478M1291J5796k3568R043o4953K472K9566L817J7551j5040r460n3997P1842
$$ -8478 32813 48609 25041 34084 -30869 -28397 1169 4986 22537 7497 -1963 -55960 15882
1696A5882j305k2334O561M2786N475p2381k5865K2999k6331P1745M7873k7380
$$ 15882 14577 -7757 -1196 41590 47065 -25316 -51181 -28182 -54513 17232 65105 37725
1684C7725m0511k2315k1373j5869M7299j9051L2636J7036k5798N7191K4J1103
$$ 37725 -2786 -25101 -46474 -62343 -15044 -34095 -1459 15577 -10221 46970 46994 58097
1672E8097K3803n4048m482m2611M264K5212p108M0465L7456o9681m1901k9989
$$ 58097 81900 27852 23370 -19241 -14977 10235 3127 43592 81048 11367 -30534 -60523
1660f0523J1662J6826N6820k6328o059L909M451K5664O665n3121m6593P8524K2842
$$ -60523 -48861 -32035 24785 -1543 -7602 -3693 758 26422 33087 -20034 -66627 11897 34739
1647C4739N071j0549m4012k5125J1208M7220L6246l7405j4769p4672J9151L5932
$$ 34739 39810 29261 -14751 -39876 -28668 18552 54798 17393 2624 -72048 -52897 -16965
1635a6965r22j1601k192Q8377m3926l971k2688J1552q300K8163m9780J7493L0637
$$ -16965 -17887 -29488 -31680 56697 12771 8800 -13888 -2336 -10636 17527 -32253 -14760 15877
1622A5877q610Q267k1910k3908q031L2102m2810m1269P833M907Q1637L9634l7731
$$ 15877 7267 15534 -6376 -30284 -38315 -6213 -49023 -90292 -82459 -77552 4085 43719 5988
1609E988J0212l8958J2912l245L7K8503K330L4667K5555k283o1419o239Q790p0174
$$ 5988 16200 -22758 -9846 -13091 -13054 15449 17779 52446 78001 75718 14299 8060 16850 -53324
1595e3324M3262J7174l1012K9186L5716l9414j015l1577K8458j8761k9181L3590
$$ -53324 -10062 7112 -23900 5286 41002 1588 573 -31004 -2546 -21307 -50488 -16898
1583a6898j0286k1217M5287N3290k7070n0675N6187j3969j0858n317K6421l0695
$$ -16898 -27184 -48401 -3114 50176 23106 -27569 28618 14649 3791 -1526 24895 -5800
1571e800k873P2442j7393J4612k6458l0776K1693m6774l8289Q7166n5104J9771
$$ -5800 -8673 63769 46376 60988 34530 3754 25447 -21327 -59616 27550 -27554 -7783
1559g783K2030o419n2853K7661M8219n1567m2044L9008J1735N2607j810k0876
$$ -7783 14247 7828 -45025 -17364 30855 -20712 -62756 -23748 -12013 40594 38784 17908
1547A7908p7949o018J5919L5895p085j8873J2099J3031J9030m656m330k7988K2408
$$ 17908 -60041 -66059 -50140 -14245 -21330 -40203 -28104 -15073 3957 -699 -5029 -33017 -10609
1534a0609k0447O30M1885L6167m0789j8954k5002m3562m483O6062N3072l8470
$$ -10609 -31056 -30426 11459 47626 6837 -12117 -37119 -80681 -85164 -19102 33970 -4500
1522d500L096J8079p6463K3486q747L2051L4673P167j1584K0607l2144L8471m2556
$$ -4500 -1404 16675 -59788 -36302 -45049 -12998 21675 28842 17258 37865 5721 44192 1636
1509A636m7803J5528L9346L5040j9637k0130L8720k0711m0269M2770j6478K9853
$$ 1636 -46167 -30639 8707 43747 24110 3980 42700 21989 -18280 24490 8012 37865
1497C7865m4959j1808Q3974j6238m5763k0969q290M469K1075L2033l5478K8994
$$ 37865 -7094 -18902 65072 48834 3071 -17898 -26188 -21719 -644 31389 -4089 24905
1485B4905p886k4439K841M1940L8539j0834O364o0411k3725J2932L1517k5160
$$ 24905 17019 -7420 -4579 37361 75900 65066 71430 11019 -12706 226 31743 6583
1473F583k9512l2699k329L3515j1712m3178Q403L9963k2448l2131L2259L4407
$$ 6583 -22929 -55628 -57957 -24442 -36154 -79332 -70929 -30966 -53414 -85545 -53286 -18879
1461a8879K358j1430N7346j0392n5809K1198L5447O091k375n004m9449O696K8986
$$ -18879 -16521 -27951 29395 19003 -36806 -15608 19839 25930 23555 18551 -30898 -24202 4784
1448D784J4490l0359Q055l2516j6989N9982l2933J1411Q863N516M7660j9269Q324
$$ 4784 19274 -11085 -3030 -35546 -52535 7447 -25486 -14075 -5212 304 47964 28695 37019
1435C7019m394j3051m2006J4702K6621J5746k1410l0582O1222J3568q283m8362
$$ 37019 32625 19574 -22432 -7730 18891 34637 13227 -17355 43867 57435 49152 790
1423G90m3022J5932l5480K7262J2103k7993J3980L5713k8523k6668J1449M8205
$$ 790 -42232 -26300 -61780 -34518 -22415 -50408 -36428 -715 -29238 -55906 -44457 3748
1411C748K2982l7112J2251J2212m8061M2191j5526l4761j5018J04336j081p5377
$$ 3748 26730 -10382 1869 14081 -33980 8211 -7315 -42076 -57094 47242 46161 -29216
1399b9216M1547Q670j0261n7096J3985L742j584p183j4497N2775N6967j457l1578
$$ -29216 12331 21001 10740 -46356 -32371 -28629 -30213 -37396 -51893 882 57849 56392 24814
1386B4814N3374l1105p1785L9370L0414r123j8316m4977M3135J0335l89l4205
$$ 24814 78188 47083 -24702 14668 45082 35959 17643 -27334 15801 26136 25747 -8458
1374h458k4689K0777K2382l2502l0530j2874r408n143l8016R4542L8190j8734
$$ -8458 -33147 -12370 10012 -22490 -53020 -65894 -75302 -80445 -118461 -23919 14271 -4463
1362d463j4376Q073n6761p364k242Q1055m542m161j4566l8651L1316P1297r925
$$ -4463 -18839 -10766 -67527 -74891 -77133 3922 -620 -4781 -19347 -57998 -26682 44615 34690
1349C4690m3493j629o338R233l8101j126N331k2943R136O9905P30j5441m2519
$$ 34690 -8803 -10432 -16770 -7537 -45638 -46764 -41433 -64376 -55240 14665 15395 -46 -42565
1336d2565l1863J268L2778O2214m2701K514J4362l1911J0091j1137J8615M3298
$$ -42565 -74428 -73160 -40382 21832 -20869 -18355 -3993 -35904 -25813 -36950 -18335 24963
1324B4963K546m2444k3706K1876L8704m101j01592K4177j4013J7437K5346m1386
$$ 24963 27509 -14935 -38641 -16765 21939 17838 -83754 -59577 -73590 -56153 -30807 -72193
1312g2193L195L2324J5012N775O994j1317J4069m1607n9760L3562R3098l482q0100
$$ -72193 -68998 -36674 -21662 -15887 -8893 -20210 -6141 -47748 -107508 -73946 19152 15670 -64430
1299f4430K5068M4427o2695k3110L8173K5109j6380q707l5096L6186j9743J2546
$$ -64430 -39362 5065 -57630 -80740 -42567 -17458 -33838 -42545 -77641 -41455 -61198 -48652
1287d8652j9954L2816r436K1015K6253j3548k4890m250R463l5142l002L8815q706
$$ -48652 -68606 -35790 -45226 -24211 2042 -11506 -36396 -40646 -31183 -66325 -69327 -30512 -39218
1274c9218K4432L6628o2888N092K8659J3109O702o6283L4950R600n1215M6081
$$ -39218 -14786 21842 -41046 -35954 -7295 5814 12516 -53767 -18817 -9217 -60432 -14351
1262a4351q304J7459j5010N879L298J65k5069l822m5221J2162J0547M3186K7758
$$ -14351 -22655 -5196 -20206 -14327 -11029 -10864 -35933 -39755 -84976 -72814 -62267 -19081 8677
1249H677K8281N889q3054L7456N0953o3124J4149l9058j138M095j3171K9682k932
$$ 8677 36958 42847 -40207 -2751 48202 -14922 -773 -39831 -40969 -36874 -50045 -20363 -23295
1236b3295l4198M3520j7770K3440P4271J8301p8458n4809L497K1476k3692n1050
$$ -23295 -57493 -13973 -31743 -8303 65968 84269 5811 -48998 -45501 -24025 -47717 -98767
1224i8767L5189P943O3608k8860k8133n4960k0142O3499M7921j6932M9480K0846
$$ -98767 -63578 -55635 7973 -20887 -49020 -103980 -124122 -60623 -12702 -29634 19846 40692
1212D0692l1400n24k4606J3372L820r615O907j0588K5422k016n9912l7174j5569
$$ 40692 9292 8768 -15838 -2466 1354 -8261 -1354 -11942 13480 11464 -48448 -85622 -101191
1199a01191J9411P6833M5485l0322j3209K5758m8345M8887l2858r364L9799L413
$$ -101191 -81780 -4947 40538 10216 -2993 22765 -25580 23307 -9551 -18915 20884 24297
1187B4297r008j3229Q494m7769O9929m0671k8010J7788J2755O9705J1437o6331
$$ 24297 15289 2060 10554 -37215 32714 -7957 -35967 -18179 -5424 64281 75718 9387
1175I387m781Q509O416j9103j4619j6600m5436K6663K771K9902j4663M1085K6631
$$ 9387 4606 13115 19531 428 -14191 -30791 -76227 -49564 -46793 -16891 -31554 9531 36162
1162C6162j4647o4396N6141j7907k7092k3805J09609j5449j5848l3392m690L3026
$$ 36162 21515 -42881 13260 -4647 -31739 -55544 54065 38616 22768 -10624 -15314 17712
1150A7712j7063j4346M585j2492l2224P1395l5738P823L096L1577K1482j8954
$$ 17712 649 -13697 -9112 -21604 -53828 17567 -18171 -10348 -7252 24325 45807 26853
1138B6853K024m7191m0682P2291Q74p3827q050K9494P4169K2329o3332m4948L861
$$ 26853 28877 -18314 -58996 13295 14169 -59658 -67708 -38214 35955 58284 -5048 -49996 -46135
1125d6135N7867J6271K3926n1616J9409l4981N7619q267m438L316o4827L7177
$$ -46135 11732 28003 51929 313 19722 -15259 42360 34093 29655 32971 -31856 5321
1113E321j4791k0848K9516m23r22J661J5158p132M631j4478Q793m5653j989q058
$$ 5321 -9470 -30318 -802 -1225 -2147 -486 14672 7540 12171 -2307 6486 -39167 -41156 -49214
1099d9214n5144N0600J8015n8564N0092M0434l1500L6332k8660o4862m17k7019
$$ -49214 -104358 -53758 -35743 -94307 -44215 -3781 -35281 1051 -27609 -92471 -92888 -119907
1087a19907N8198l17J7286J5162j9737L6084o7966K2232L8786k1387N3300N7763
$$ -119907 -61709 -62026 -44740 -29578 -49315 -13231 -81197 -58965 -20179 -41566 11734 69497
1075F9497j1003o8341m262n2133m652K8852L0613M9514m7488j0338M0832K909
$$ 69497 58494 -9847 -14109 -66242 -70894 -42042 -11429 38085 -9403 -19741 21091 24000
1063B4000n8420K5872k4372J5839N0176n0167q714J9804k5450K3335P71j8679
$$ 24000 -34420 -8548 -32920 -17081 33095 -17072 -25786 -5982 -31432 -8097 -7326 -26005
1051b6005P443o280l5815l3755L5076O2385K6790m4564m2252n0903K3068R0755
$$ -26005 -18562 -24842 -60657 -94412 -59336 3049 29839 -14725 -56977 -107880 -84812 5943
1039E943k6022k1722n615R63o612n3007L6955M7558j4882P3139p8815j2412N8775
$$ 5943 -20079 -41801 -47416 -46453 -53065 -106072 -69117 -21559 -36441 36698 -42117 -54529 4246
1026D246K9355l8007n0130L4521P646K8798r416n4647p4757O0071J0856J7315
$$ 4246 33601 -4406 -54536 -20015 -12369 16429 7013 -47634 -122391 -62320 -51464 -34149
1014c4149M6037O675l6383j3276k4701j6396P99O299P852p389J9355o128K8933
$$ -34149 11888 18563 -17820 -31096 -55797 -72193 -71394 -65095 -57243 -64632 -45277 -51405 -22472
1001b2472K370J5231k6016J7651M327j359k655K9698l2620j8370J6513K6189M9353
$$ -22472 -20102 -4871 -30887 -13236 -8909 -10268 -12923 16775 -15845 -34215 -17702 8487 57840
988E7840M0190n6432m038k9187k5712k2450J3058N1074K1452k1590k8900M156
$$ 57840 98030 41598 37560 8373 -17339 -39789 -26731 24343 45795 24205 -4695 -539
976e39P927m5294o128J179j1153N2214N4248O002o9853n7062M7049j0081j4672
$$ -539 7388 -37906 -44034 -42855 -54008 -1794 52454 58456 -11397 -68459 -21410 -31491 -46163
963d6163L3213M1727l0982k9708K7376j3450J1723J6258k3852n9290J2648o290
$$ -46163 -12950 28777 -2205 -31913 -4537 -17987 -6264 9994 -13858 -73148 -60500 -66790
951f6790J5034J6488M3392j786l7729j261K5170r530m3474J4980P4604j0605k0570
$$ -66790 -51756 -35268 8124 6338 -31391 -32652 -7482 -17012 -60486 -45506 29098 18493 -2077
938b077k6904L9141K944j980k5848p210j2852k1779P331J4531k7161L7478L378
$$ -2077 -28981 10160 13104 11124 -14724 -21934 -34786 -56565 -49234 -34703 -61864 -24386 -21008
925b1008J2997k2888J2354Q4669K0864n3602k6099l9646K2093N4501j5021m3968
$$ -21008 -8011 -30899 -18545 66124 86988 33386 7287 -32359 -10266 44235 29214 -14754
913a4754P148n6460M3116M3106K5216l1698k257k8423k6707L7327o3344K116j4566
$$ -14754 -7606 -64066 -20950 22156 47372 15674 13417 -15006 -41713 -4386 -67730 -65614 -80180
900h0180K2597K2402k6412J3071L0681m599l701J4487K7756L1101l4109k4370
$$ -80180 -57583 -35181 -61593 -48522 -17841 -22440 -26141 -11654 16102 47203 13094 -11276
888a1276L8006r405m3809L1674K4097k9511J3290k9493k0615K2402N0580L1621
$$ -11276 26730 17325 -26484 5190 29287 -224 13066 -16427 -37042 -14640 35940 67561
876F7561k7985k5336L4246p6128K532q2625O4753L7754L4455k1327m7769l827
$$ 67561 39576 14240 48486 -27642 -25110 -107735 -42982 -5228 29227 7900 -39869 -43696
864d3696O102n6210L6452J3385O9549N759m9193M3809K3959k0473l422l1153P898
$$ -43696 -37594 -93804 -57352 -43967 25582 31341 -17852 25957 49916 29443 26021 -5132 2766
851B766J0648m0067N8291p2625l8466N092j1915K1618J9160M1642j0950o0084
$$ 2766 13414 -26653 31638 -40987 -79453 -74361 -86276 -64658 -45498 -3856 -14806 -74890
839g4890L3029Q233J1524P536K3670M5j8111q6024k493O9170J8517o2544k126
$$ -74890 -41861 -33628 -22104 -14568 9102 9147 -8964 -94988 -97481 -28311 -9794 -72338 -74464
826g4464M8924O5632j8118m2186k4961o306K0346k3482j860K5516m4769j8744
$$ -74464 -25540 40092 21974 -20212 -45173 -51479 -31133 -54615 -56475 -30959 -75728 -94472
814i4472N9549N581J9253J4571l062L4922n0380K3597K1374o0080Q943L5916m7433
$$ -94472 -34923 -29342 -10089 4482 1420 36342 -14038 9559 30933 -29147 -20204 15712 -31721
801c1721l1728J0870j9125O5225K3769k6134J7132L063j5751J5886k1983J7992
$$ -31721 -63449 -52579 -71704 -6479 17290 -8844 8288 11351 -4400 11486 -10497 7495
789G495L4876n7450J4213j2881P790m4541L2031P011k3844N7288k5836l643J9905
$$ 7495 42371 -15079 -866 -13747 -5957 -50498 -18467 -11456 -35300 21988 -3848 -7491 12414
776A2414p585m6411j6849O3965n0626Q840M3711J6203j2304N187m64n916l176
$$ 12414 4829 -41582 -58431 5534 -45092 -36252 7459 23662 11358 16545 16081 10165 6989
763F989k0594J6844j9677M8108o8587J7186K4178qO539k7511J4593p151n065J5314
$$ 6989 -13605 3239 -16438 31670 -36917 -19731 4447 4439 10978 -16533 -1940 -9091 -14156 1158
749A158l1825N2151K0874q924k3495J1589M4865j0358n9261l3726p707L5227O2419
$$ 1158 -30667 21484 42358 33434 9939 21528 66393 56035 -3226 -36952 -44659 -9432 52987
736E2987k4470R485k7692j236J3329m3332L8647R123j9757m4321N206L3179j0873
$$ 52987 28517 38002 10310 9074 22403 -20929 17718 26841 7084 -37237 -32031 1148 -9725
723i725k5186J7893k6777R917J9238k284L7400p094n635k7206o835k3223N3660
$$ -9725 -34911 -17018 -43795 -33878 -14640 -16924 20476 13382 7747 -19459 -26294 -49517 4143
710D143N5634p0787N3788n6463J3273m907q0948K8648M2618J1491k6829M4776
$$ 4143 59777 -11010 42778 -13685 -412 -5319 -86267 -57619 -15001 -3510 -30339 14437
698A4437j0086j5724P060l8763K6869J4340m1937k897N4609O5872k8794j7877
$$ 14437 4351 -11373 -4313 -43076 -16207 -1867 -43804 -46701 7908 73780 44986 27109
686B7109m1240j5185M2025j6020K1466J3740m6742M6999k8688l1147j673L9579
$$ 27109 -14131 -29316 12709 -3311 18155 31895 -14847 32152 3464 -27683 -29356 10223
674A0223l611J3908M7710m2088q699l4776j5747K9805j5485j8853K5930m3842
$$ 10223 6612 20520 68230 26142 17443 -17333 -33080 -3275 -18760 -37613 -11683 -55525
662e5525n8N9291k8064j3822J7193j032J5370m46p793O4360o150n656j1110k4627
$$ -55525 -55583 3708 -24356 -38178 -20985 -22017 -6647 -7093 -14886 49474 43324 37668 26558 1931
648A931J6288P5119k5977m7264K269M7398o7935K0451l2768J7747L1177j782j0047
$$ 1931 18219 93338 67361 20097 22366 69764 1829 22280 -10488 7259 38436 36654 26607
635B6607R93N297j8044o4224J3989K7992k4492k377L7056n941L1107J4859J827
$$ 26607 27600 32897 14853 -49371 -35382 -7390 -31882 -34259 2797 -3144 27963 42822 44649
622D4649j4655k9785N4342k658l4539p2808N6279J7622J4501l0669J3443M815
$$ 44649 29994 209 54551 51893 17354 -55454 825 18447 32948 2279 15722 20537
610B0537L3396m2945K2724K0828m1447K9451J4381R345r507m7931J5273m3220
$$ 20537 53933 10988 33712 54540 13093 42544 56925 66270 56763 8832 24105 -19115
598a9115j6076L5460P46K6826L5111k6510M0735k5754m6856K605k0242r752j8957
$$ -19115 -35191 269 1015 27841 62952 36442 77177 51423 4567 7172 -13070 -22822 -41779
585d1779j4948O9337n839m8952J5454j0306l515L1985L3808J9325j6466J0202
$$ -41779 -56727 12610 6771 -42181 -26727 -37033 -40548 -8563 25245 44570 28104 38306
573C8306k7522k3833L0942P867n4500M5514K8252J9828l9961k5196j4892Q601
$$ 38306 10784 -13049 17893 25760 -28740 16774 45026 64854 24893 -303 -15195 -6594
561f594J6931p141n4363K2061K6551M3902o450M756P094m1348K6722m950R9k6545
$$ -6594 10337 3196 -51167 -29106 -2555 41347 34897 39653 46747 5399 32121 27171 27270 725
547G25m4563k585J204J3394J04049l2951j9909q497n093n4860M421J0147K6067
$$ 725 -43838 -46423 -45219 -31825 72224 39273 19364 10867 5774 -49086 -44665 -34518 -8451
534h451J9913J7086p4195M5755K058j8963q7498M3170k5362J4483M6363j7017
$$ -8451 11462 28548 -45647 108 2166 -16797 -104295 -61125 -86487 -72004 -25641 -42658
522d2658j9882K017L3657L2546L639p3245k157L4432N8016k3978Q523k0288q194
$$ -42658 -62540 -60523 -26866 5680 9319 -63926 -66083 -31651 26365 2387 10910 -9378 -17572
509a7572K410l102m0125L9782K4634j9946o5687K4723M4041k8627O5468J8022
$$ -17572 -15162 -18264 -58389 -18607 6027 -13919 -79606 -54883 -10842 -39469 25999 44021
497D4021n9975k1915M319O5136j0514K3668k197n792j7464M5333l0249K6658J8227
$$ 44021 -15954 -37869 -33550 31586 21072 44740 42543 36751 19287 64620 34371 61029 79256
484G9256q4966L8895j4261p761j3444k9914R523Q675N1051j223j032m5190n913
$$ 79256 -5710 33185 18924 11163 -2281 -32195 -22672 -13997 37054 35831 34799 -10391 -16304
471a6304J4780l8904N7978M3334n6134j0788M5203k1986k8002n146K0560p110
$$ -16304 -1524 -40428 17550 60884 4750 -6038 39165 17179 -10823 -15969 4591 -2519
459b519N7699O306o2431j725q809m244M1867n2459R0315l2597K2887l9050l5372
$$ -2519 55180 61486 -945 -2670 -11479 -15723 26144 -26315 64000 31403 54290 15240 -20132
446b0132P500L6198r7j1657j9376M0505p264K150n12J6371M316Q78n860p5129
$$ -20132 -12632 23566 23469 11812 -7564 32941 25677 27827 27315 43686 48002 48880 43020 -32109
432c2109O1201k2084k2607n6886P7499N047k8334K433l340q514J5008L8391K5899
$$ -32109 29092 7008 -15599 -72485 5014 10061 -18273 -15840 -19180 -27694 -12686 25705 51604
419E1604l9719J1960J6073L6593k9545m6371N9415k6668k2581L5186j6323k2046
$$ 51604 11885 23845 39918 76511 46966 595 60010 33342 10761 45947 29624 7578
407G578J0012L3575m1050J8056K7110m563l3724O002M6387k5113k4807n8657O4081
$$ 7578 17590 51165 10115 28171 55281 50718 16994 22996 69383 44270 19463 -39194 24887
394B4887M1582o4554J5342K565j4433N993M3594K836n1720K6827J1984r4540J971
$$ 24887 66469 1915 17257 19822 5389 11382 54976 57812 6092 32919 44903 -49637 -47666
381d7666N6739J8696J901Q328m1471K187L991O637Q5356j5893k5991M3644k6317
$$ -47666 9073 27769 29670 37998 -3473 -1286 2705 9342 94698 78805 52814 96458 70141
368G0141m1956O4957J1108j88o5247K3464J5102n7768K6939m2481r37M1097o3059
$$ 70141 28185 93142 104250 104062 38815 62279 77381 19613 46552 4071 3134 44231 -18828
355a8828J6423M9180j2516j6223k4991J4063M825K5926k1514j6599L5109J5731
$$ -18828 -2405 46775 34259 18036 -6955 7108 11933 37859 16345 -254 34855 50586
343E0586j6453L029l2799M2447J4045M3478p5360l9731j3084N4456J3739j5638
$$ 50586 34133 37162 4363 46810 60855 104333 28973 -10758 -23842 30614 44353 28715
331B8715N6800m0404k9755o852Q9924k4894l6700k0097K8660J0124p6464L1984
$$ 28715 85515 45111 15356 8504 98428 73534 36834 16737 45397 55521 -20943 11041
319A1041K7916l9708j1717k390L3670M1163n9756l6174M9967N7664j7259n6289
$$ 11041 38957 -751 -12468 -14858 18812 59975 219 -35955 14012 71676 54417 -1872
307a872k8245P56M6717L146N12k2948P9366j0766m5447M8053p6444Q65N8044l4424
$$ -1872 -30117 -29361 17356 20502 21014 -1934 77432 66666 21219 69272 -7172 -6307 51737 17313
293A7313J0721O7880m2218j458j1584l4860M070k791M738o4307r623M3912l03
$$ 17313 28034 95914 53696 52238 40654 5794 9864 7073 11811 -52496 -62119 -18207 -18510
280a8510J4804N9924J7046j2155k5791K0024j0655q476K8738k812j8908M987j6450
$$ -18510 -3706 56218 73264 61109 35318 55342 44687 36211 64949 62137 43229 48216 31766
267C1766j9763L66M7747j566r124M607j866m2865Q50l3976M6382l1172m9580m767
$$ 31766 12003 12369 60116 58550 49426 54033 52167 9302 10152 -23824 22558 -8614 -58194 -62961
253f2961P5178K7033M0238l234M544K0027k5983J1948m411L0043m9039j1114N7824
$$ -62961 12217 39250 79488 76254 80798 100825 74842 86790 82379 112422 63383 52269 110093
240A10093j5822k5887K3808L5626l3840m257k4655m3416P68L4330j5719k0711
$$ 110093 94271 68384 92192 127818 93978 89721 65066 21650 22418 56748 41029 20318
228B0318O4452j8517k9757l9166J6923K5828m3685L0058L2594j3970k5365q960
$$ 20318 84770 66253 36496 -2670 14253 40081 -3604 26454 59048 45078 19713 10753
216A0753O0590k5754l5648n549N3214j8315p832M4222l3789m2668J0490K4052
$$ 10753 71343 45589 9941 4392 57606 39291 31459 75681 41892 -776 9714 33766
204C3766K3875p0960j4021j8169k943L5464O7090l1964K7084J0357j935P365j4802
$$ 33766 57641 -13319 -27340 -45509 -48452 -12988 54102 22138 49222 59579 57644 65009 50207
191E0207o1291k6316N4404L1693K8139q720o1524R158N1091J9946k8715r868N563
$$ 50207 -11084 -37400 17004 48697 76836 68116 6592 15750 66841 86787 58072 48204 53767
178E3767l6157K6194k0942k9649M4943R667m2137N697L7460m3646L1046N8480
$$ 53767 17610 43804 22862 -6787 38156 47823 5686 11383 48843 5197 36243 94723
166I4723l726l3720l0043l4613O887J3393j849j9632K9587L3637K5370o9450J3087
$$ 94723 90997 57277 27234 -7379 -492 12901 11052 -8580 21007 54644 80014 10564 23651
153B3651M2669k0002K967m6559K568j5531M93L9180J4722n3617Q96J4564L3794
$$ 23651 66320 46318 49285 2726 5294 -10237 -9744 29436 44158 -9459 -8563 6001 39795
140C9795K674O60K305J180P063J0037P812j7893m6156R2981n6273j0856P4260
$$ 39795 42469 43129 45434 46614 53677 63714 71526 53633 7477 100458 44185 33329 107589
127A07589K0348k8874m6267n340J056o40k9941K1621j04j617l1473M523M786p98
$$ 107589 127937 99063 52796 47456 48512 47872 17931 39552 39448 37831 6358 10881 15667 14869
113A4869O600J5856K4391K3853k0665j6046j4581k3282L0562J5214n42o170j045
$$ 14869 21469 37325 61716 85569 64904 48858 34277 10995 41557 56771 56229 50059 49014
100D9014L962K5634j6328j6592j7407J0924m893M2407N690l2174J0058m647m023
$$ 49014 52976 78610 62282 45690 28283 39207 34314 76721 82411 50237 60295 55648 51625
87E1625l7522P410j7163o835K126n4140K6432O7392K4120k7517m025p318L2074
$$ 51625 14103 21513 4350 -2485 -359 -54499 -28067 39325 63445 35928 31903 24585 56659
74E6659K0600j9432N554k6667J5616J5998l405j5858j5515M964l841k5931L3641
$$ 56659 77259 57827 63381 36714 52330 68328 64923 49065 33550 38514 34673 8742 42383
61D2383K3225j0211L2047k2970K2020q23k1325l9696k2236l6522K7233K0942L1264
$$ 42383 65608 55397 87444 64474 86494 85671 64346 24650 2414 -34108 -6875 14067 45331
48D5331p722K2190R305j6050L3938l3786l791k35J696l4013k7920j2844M4701
$$ 45331 37609 59799 69104 53054 86992 53206 49415 49180 50876 16863 -11057 -23901 20800
35B0800M5768N178M368j3196l6332l7059M2116J4490p014P590K9369j4628k1991
$$ 20800 66568 71746 76114 62918 26586 -10473 31643 46133 39119 46709 76078 61450 39459
22C9459K7096J4039r467J2064J5595o0601m493P854n219O457J5439j4246j8917
$$ 39459 66555 80594 71127 83191 98786 38185 33692 41546 36327 42784 58223 43977 25060
9B5060j4056K8487J3383J3087j9947l8645k908L2281K0005
$$ 25060 11004 39491 52874 65961 46014 7369 4461 36742 56747
0E6747
$$ 56747
$$ Imaginary data points
##PAGE= N=2
##DATA TABLE= (X++(I..I)), XYDATA
16383a514739k6045P92M4469M2511N4754l038N529R102J0860O2009Q297K134M7980
$$ -1514739 -1540784 -1539992 -1495523 -1453012 -1398258 -1401296 -1395767 -1386665 -1375805 -1313796 -1305499 -1303365 -1255385
16370a255385r318O6352j338J54K7107k229K2704N5175M892L6818L5518J0076
$$ -1255385 -1264703 -1198351 -1199689 -1199535 -1172428 -1174657 -1151953 -1096778 -1091886 -1055068 -1019550 -1009474
16358a009474J0171L3696k3666K8323P2799K1633K8534K7568L4984Q450M640L1533
$$ -1009474 -999303 -965607 -989273 -960950 -888151 -866518 -837984 -810416 -775432 -766982 -762342 -730809
16346g30809K764l622N5045J9956L1173j173j5426l50O2854K5135k4819M315M4737
$$ -730809 -728045 -731667 -676622 -656666 -625493 -626666 -642092 -642442 -579588 -554453 -579272 -574957 -530220
16333e30220j511M8456j1613M5830K5202N4521K3880o1228L4035R948J9203L7889
$$ -530220 -531731 -483275 -494888 -449058 -423856 -369335 -345455 -406683 -372648 -362700 -343497 -305608
16321c05608N4572P469j7567L555L5784M0423M4928k6153n6J1897M5233K2289
$$ -305608 -251036 -243567 -261134 -257579 -221795 -181372 -136444 -162597 -162653 -150756 -105523 -83234
16309h3234k9886O3895M0822J2082k595M6454o050K444j7253J1126O740L5338
$$ -83234 -113120 -49225 -8403 3679 1084 47538 41488 43932 26679 37805 44545 79883
16297G9883P5139J6049k0468K2794K3172K7398l7807K5622L8370M0278j6793M9324
$$ 79883 155022 171071 150603 173397 196569 223967 186160 211782 250152 290430 273637 322961
$$ [...]
##END NTUPLES=NMR SPECTRUM
##END=
