##TITLE=1H_CA-8822
 DMSO,8 sc, 
 11.02.2021
##JCAMPDX= 6.0         $$ Bruker NMR JCAMP-DX V2.0
##DATA TYPE= NMR SPECTRUM
##DATA CLASS= NTUPLES
##ORIGIN= UXNMR, Bruker Analytische Messtechnik GmbH
##OWNER= root
$$ XWIN-NMR		Version 3.5
$$ Thu Feb 11 10:24:12 2021 Russian Standard Time (UT+4h)  she@DPX200
##.OBSERVE FREQUENCY= 200.1315066352
##.OBSERVE NUCLEUS= ^1H
##.ACQUISITION MODE= SIMULTANEOUS
##.ACQUISITION SCHEME= undefined
##.AVERAGES= 8
##.DIGITISER RES= 18
##SPECTROMETER/DATA SYSTEM= spect
##.PULSE SEQUENCE= zg30
##.SOLVENT NAME= CDCl3
##.SHIFT REFERENCE= (INTERNAL, CDCl3, 0, 16.004)
##AUDIT TRAIL= $$ (NUMBER, WHEN, WHO, WHERE, WHAT)
$$ ##TITLE= Audit trail, XWIN-NMR		Version 3.5
$$ ##JCAMPDX= 5.01
$$ ##ORIGIN= Bruker BioSpin GmbH
$$ ##OWNER= she
$$ F:/spectra/data/she/nmr/H-F/1/pdata/1/auditp.txt
$$ ##AUDIT TRAIL=  $$ (NUMBER, WHEN, WHO, WHERE, WHAT)
(   1,<2021-02-11 10:22:50.78 +0400>,<she>,<DPX200>,
      <created by zg, POWCHK disabled, PULCHK disabled
       configuration hash MD5:
       00 E9 B6 7A A2 85 ED C7 34 08 36 98 17 FE 4E 26
       data hash MD5: 16K
       17 E4 B9 C5 43 5A DF E9 94 77 26 A1 D3 0C E9 88>)
(   2,<2021-02-11 10:22:53.17 +0400>,<she>,<DPX200>,
      <Start of raw data processing
       efp BC_mod = 2 LB = 0.24 FT_mod = 6 PKNL = 1 PHC0 = -10756.47 PHC1 = 12.00095 SI = 16K 
       data hash MD5: 16K
       31 29 E2 02 A9 B2 2D A0 3B 56 CD F3 8E 93 FE A9>)
(   3,<2021-02-11 10:23:13.89 +0400>,<she>,<DPX200>,
      <pk PHC0 = -2.352824 PHC1 = -0.2 
       data hash MD5: 16K
       FE 2F B8 71 45 8B 82 F9 E7 B4 FE B7 87 C4 33 97>)
(   4,<2021-02-11 10:23:16.70 +0400>,<she>,<DPX200>,
      <abs ABSG = 5 
       data hash MD5: 16K
       13 38 3D E8 40 9A DC 67 96 9D 5A 75 C8 2C 90 38>)
$$ ##END=
$$ 
$$ hash MD5
$$ 0A 96 8E BB D7 46 25 20 35 A1 75 EA A7 2F 0E 4A
##$RELAX= 
##$RELAX= 
##$RELAX= 
##$RELAX= 
##$RELAX= 
##$RELAX= 
$$ Bruker specific parameters
$$ --------------------------
##$DU= <F:/spectra>
##$EXPNO= 1
##$NAME= <H-F>
##$PROCNO= 1
##$TYPE= <nmr>
##$USER= <she>
##$AMP= (0..31)
100 100 100 100 100 100 100 100 100 100 100 100 100 100 100 100 100 100 
100 100 100 100 100 100 100 100 100 100 100 100 100 100 
##$AQSEQ= 0
##$AQ_mod= 1
##$AUNM= <au_zg>
##$AUTOPOS= <>
##$BF1= 200.13
##$BF2= 200.13
##$BF3= 200.13
##$BF4= 200.13
##$BF5= 200.13
##$BF6= 200.13
##$BF7= 200.13
##$BF8= 200.13
##$BYTORDA= 1
##$CFDGTYP= 0
##$CFRGTYP= 5
##$CHEMSTR= <none>
##$CNST= (0..31)
1 1 145 1 1 1 1 1 1 1 1 1 1 1 1 1 1 1 1 1 1 1 1 1 1 1 1 1 1 1 1 1 
##$CPDPRG= <>
##$CPDPRG1= <>
##$CPDPRG2= <>
##$CPDPRG3= <>
##$CPDPRG4= <mlev>
##$CPDPRG5= <mlev>
##$CPDPRG6= <mlev>
##$CPDPRG7= <mlev>
##$CPDPRG8= <mlev>
##$CPDPRGB= <>
##$CPDPRGT= <>
##$D= (0..31)
0 1.2 0 0 0 0 0 0 0 0.06 0 0.03 0 0 0 0 0.0002 0 0 0 0 0 0 0 0 0 0 0 0 
0 0 0 
##$DATE= 1613024570
##$DBL= (0..7)
120 120 120 120 120 120 120 120 
##$DBP= (0..7)
150 150 150 150 150 150 150 150 
##$DBP07= 0
##$DBPNAM0= <>
##$DBPNAM1= <>
##$DBPNAM2= <>
##$DBPNAM3= <>
##$DBPNAM4= <>
$$ [...]
##$SUBNAM3= <"">
##$SUBNAM4= <"">
##$SUBNAM5= <"">
##$SUBNAM6= <"">
##$SUBNAM7= <"">
##$SUBNAM8= <"">
##$SUBNAM9= <"">
##$SW= 16.9725356469052
##$SWIBOX= (0..15)
0 0 2 0 0 0 0 0 0 0 0 0 0 0 0 0 
##$SW_h= 3396.73913043478
##$TD= 16384
##$TD0= 1
##$TE= 0
##$TE2= 300
##$TE3= 300
##$TEG= 300
##$TL= (0..7)
0 120 120 120 120 120 120 120 
##$TP= (0..7)
150 150 150 150 150 150 150 150 
##$TP07= 0
##$TPNAME0= <>
##$TPNAME1= <>
##$TPNAME2= <>
##$TPNAME3= <>
##$TPNAME4= <>
##$TPNAME5= <>
##$TPNAME6= <>
##$TPNAME7= <>
##$TPOAL= (0..7)
0.5 0.5 0.5 0.5 0.5 0.5 0.5 0.5 
##$TPOFFS= (0..7)
0 0 0 0 0 0 0 0 
##$TUNHIN= 0
##$TUNHOUT= 0
##$TUNXOUT= 0
##$USERA1= <user>
##$USERA2= <user>
##$USERA3= <user>
##$USERA4= <user>
##$USERA5= <user>
##$V9= 5
##$VALIST= <valist>
##$VCLIST= <CCCCCCCCCCCCCCC>
##$VD= 0
##$VDLIST= <DDDDDDDDDDDDDDD>
##$VPLIST= <PPPPPPPPPPPPPPP>
##$VTLIST= <TTTTTTTTTTTTTTT>
##$WBST= 1024
##$WBSW= 4
##$XGAIN= (0..3)
0 0 0 0 
##$XL= 0
##$YL= 0
##$YMAX_a= 674075
##$YMIN_a= -614537
##$ZGOPTNS= <>
##$ZL1= 120
##$ZL2= 120
##$ZL3= 120
##$ZL4= 120
##$ABSF1= 16.00401
##$ABSF2= -0.9686546
##$ABSG= 5
##$ABSL= 3
##$ALPHA= 0
##$AQORDER= 0
##$ASSFAC= 0
##$ASSFACI= 0
##$ASSFACX= 0
##$ASSWID= 0
##$AUNMP= <proc_1d>
##$AZFE= 0.1
##$AZFW= 0.1
##$BCFW= 0
##$BC_mod= 2
##$BYTORDP= 0
##$COROFFS= 0
##$CY= -3
##$DATMOD= 1
##$DC= 0
##$DFILT= <>
##$DTYPP= 0
##$F1P= 0
##$F2P= 0
##$FCOR= 1
##$FTSIZE= 16384
##$FT_mod= 6
##$GAMMA= 0
##$GB= 0
##$INTBC= 1
##$INTSCL= 2.992141e-10
##$ISEN= 128
##$LB= 0.24
##$LEV0= 0
##$LPBIN= 0
##$MAXI= 10000
##$MC2= 0
##$MEAN= 0
##$ME_mod= 0
##$MI= 1.114404
##$NCOEF= 0
##$NC_proc= -5
##$NLEV= 6
##$NOISF1= 3.799351
##$NOISF2= 2.8
##$NSP= 0
##$NTH_PI= 0
##$NZP= 0
##$OFFSET= 16.00401
##$PC= 1
##$PHC0= -10758.82
##$PHC1= 11.80095
##$PH_mod= 1
##$PKNL= yes
##$PPARMOD= 0
##$PSCAL= 0
##$PSIGN= 0
##$REVERSE= no
##$SF= 200.130002122594
##$SI= 16384
##$SIGF1= 3
##$SIGF2= 2
##$SINO= 5.538805
##$SIOLD= 16384
##$SREGLST= <1H.CDCl3>
##$SSB= 0
##$STSI= 16384
##$STSR= 0
##$SW_p= 3396.73913043478
##$SYMM= 0
##$S_DEV= 0
##$TDeff= 16384
##$TDoff= 0
##$TI= <>
##$TILT= no
##$TM1= 0
##$TM2= 0
##$TOPLEV= 0
##$USERP1= <user>
##$USERP2= <user>
##$USERP3= <user>
##$USERP4= <user>
##$USERP5= <user>
##$WDW= 1
##$XDIM= 16384
##$YMAX_p= 319868164
##$YMIN_p= -294042
$$ End of Bruker specific parameters
$$ ---------------------------------
##NTUPLES= NMR SPECTRUM
##VAR_NAME=  FREQUENCY,     SPECTRUM/REAL,   SPECTRUM/IMAG
##SYMBOL=    X,             R,               I
##VAR_TYPE=  INDEPENDENT,   DEPENDENT,       DEPENDENT
##VAR_FORM=  AFFN,          ASDF,            ASDF
##VAR_DIM=   16384,         16384,           16384
##UNITS=     HZ,            ARBITRARY UNITS, ARBITRARY UNITS
##FACTOR=    0.207333158178281, 1,           1
##FIRST=     3202.88240453734, 0,            0
##LAST=      -193.856725897444, 0,           0
##MIN=       -193.856725897444, -294042,     0
##MAX=       3202.88240453734, 319868164,    0
$$ Real data points
##PAGE= N=1
##DATA TABLE= (X++(R..R)), XYDATA
$$ [...]
7499A934795r3405P1988j3953j84202j03099j00809m1967p3531p6755K3775n0020
7488A292817j0607k7430n8188k8282n1741n6112K5275o081o0696n2176M8283N6407
7476A071469j5392n7078n7569L4364r2847l4290l1123n6761O8474m2039j4217
7465G72991J7615m1451K2605o0819l0985q1222n1643L6005M7290K8448J6390o068
7453F69156n1573m7522l3834j4817L8412o1677Q0784m2472j08532N1563K8511
7442E07999J3252k2882M3467n6982k4587p6622o771M8524N442K5196n0049j012
7430D04975l8102L2552M1565o741J939k1617k4617j6345j4917J5252J383j8717
7418C56610o9650k9258L7159q789j0079N0014r7954o617M5760O1288P120n4221
$$ plain form
7499 1934795 1841390 1913378 1899425 1715223 1612124 1511315 1469348 1395817 1319062 1342837 1292817
7488 1292817 1282210 1254780 1196592 1168310 1116569 1060457 1085732 1079651 1018955 966779 1015062 1071469
7476 1071469 1056077 998999 941430 975794 882947 848657 817534 760773 829247 787208 772991
7465 772991 790606 749155 771760 710941 679956 598734 547091 583096 630386 658834 675224 669156
7453 669156 617583 570061 536227 521410 559822 498145 578929 536457 427925 479488 507999
7442 507999 521251 498369 541836 484854 460267 383645 376874 425398 430840 456036 405987 404975
7430 404975 366873 399425 440990 434249 436188 414571 389954 373609 358692 373944 375327 356610
7418 356610 286960 257702 294861 286072 275993 326007 228053 221436 267196 328484 335604 281383
7406B81383O899j2387p3432J0528j4238Q1614n3506J3470r78l1865l3617j0690
7394A63181N8933j0058n5687K3223M2503j5377k2594N6420n1349m1599j5511L175
7382A35260P9285n4003j8579n0855L8161l8295M675P7738j9162j07611K1208M7982
7370A15804o7076q5469n7481P1719Q3903p8567L862l1199R1953k4507J9432l0890
7358A1484o2475k8963N8178L0016O8713l9991l8148n8062p047P233N4194L7697
7346C2829l1447l5489O8929J7550j2826p6486M4253k4549J06417n5352J4372n6538
7334h337n9039N1983N2989o7217q1265K3020j4309P9730k2251M382q421L7132
7322a1603J8120J8390k1969j56952m1006P5210M2835R0890j1146m5274r5178Q2066
$$ plain form
7406 281383 288282 275895 202463 212991 198753 280367 226861 240331 239353 207488 173871 163181
7394 163181 222114 212056 156369 179592 222095 206718 184124 240544 189195 147596 132085 135260
7382 135260 214545 160542 141963 91108 129269 90974 95649 173387 154225 46614 67822 115804
7370 115804 48728 -36741 -94222 -22503 61400 -17167 -13305 -44504 47449 22942 42374 11484
7358 11484 -50991 -79954 -21776 8240 76953 36962 -1186 -59248 -66295 -59062 -4868 32829
7346 32829 1382 -34107 34822 52372 39546 -36940 7313 -17236 89181 33829 48201 -8337
7334 -8337 -67376 -15393 37596 -29621 -110886 -87866 -102175 -22445 -44696 -40314 -48735 -11603
7322 -11603 6517 24907 2938 -154014 -195020 -119810 -76975 13915 2769 -42505 -137683 -55617
7310e5617j406L1568m9886L4822j9158j6455k800k7813l3392o1722M2186O1598
7298i8075j607p3873j20487J20004J43730p929Q418k6921m7525j8300P9057J5782
7286b7726L0793q6125l0084k5125J8291j348K3656M5186M8729p0324L7201K1428
7274a5448m2506p9751k0720J32366L7136L458j09144k774k7363J32435J7509j15366
7262i0168q4865L6914J5432M3145J117N1259J3839N266J4979N3658n3272j3060
7250e756p9444K3006K0165p9504M9575n7999J6023N1910K9006j2957m8238J577
7238i2636N2357J08937M6979K1696r1489O5142r6473O369j6343j5361j42361O8419
7226h4764J9043k4292Q0967J00455M7089r5203j08126o4928R272Q6696J15245
$$ plain form
7310 -55617 -57023 -25455 -75341 -40519 -59677 -76132 -78932 -106745 -140137 -201859 -159673 -98075
7298 -98075 -99682 -173555 -294042 -174038 -30308 -38237 -29819 -56740 -104265 -122565 -43508 -27726
7286 -27726 3067 -83058 -113142 -138267 -119976 -121324 -97668 -52482 -3753 -74077 -36876 -15448
7274 -15448 -57954 -137705 -158425 -26059 11077 14535 -94609 -97383 -124746 7689 25198 -90168
7262 -90168 -175033 -138119 -122687 -79542 -78425 -27166 -13327 -8061 6918 60576 7304 -5756
7250 -5756 -85200 -62194 -42029 -121533 -71958 -129957 -113934 -62024 -33018 -45975 -94213 -92636
7238 -92636 -40279 68658 115637 137333 45844 110986 14513 20882 4539 -10822 -153183 -84764
7226 -84764 -65721 -90013 -9046 91409 138498 43295 -64831 -129759 -120487 -33791 81454
7215H1454L8085j60114K862K0262L6254K4110o1633j8783J8587k0428J142M678
7203c3524O3676J50803l8369l4688j47001m088j3879M6535j9726O1374k2602j907
7191F604l8228k3868M2240J46414J2004k1922j14690k74m1600N7142N9589J6011
7179I9422r4007L1446j03519L0534K6130N108m6512q8605j9657P147Q0042N3207
7167a9264J18463o5398K1883j7828n694M738k3392j11090K905O2356N8494l8410
7155a2237j12225J7610J6987K6313R8348m1891q3196l1065Q1154R0128j047O1955
7143A10834p5237N056q6244R0431m9067l8852j43002m757Q2866K7386J3192K0666
7131d6728L595k3403m7240l3758L037J14004l8105q5777L9899K0483P1350L6556
$$ plain form
7215 81454 119539 -40575 -37713 -17451 18803 42913 -18720 -37503 -18916 -39344 -38202 -33524
7203 -33524 30152 180955 142586 107898 -39103 -43191 -57070 -10535 -30261 31113 8511 6604
7191 6604 -31624 -55492 -13252 133162 145166 123244 8554 8280 -33320 23822 83411 99422
7179 99422 5415 36861 -66658 -36124 -9994 -4886 -51398 -140003 -159660 -152513 -72471 -19264
7167 -19264 99199 33801 55684 37856 32162 36900 13508 -97582 -94677 -32321 26173 -12237
7155 -12237 -124462 -106852 -89865 -63552 34796 -7095 -90291 -121356 -40202 49926 48879 110834
7143 110834 35597 40653 -45591 44840 -4227 -43079 -186081 -190838 -107972 -80586 -67394 -46728
7131 -46728 -43133 -66536 -113776 -147534 -144497 -30493 -68598 -154375 -114476 -93993 -22643 13913
7119A3913k6985n0995J1715n3200Q8299q5878L250k0944M6342K4390M0639p3924
7107h3378q345j7417J04584l9192o0950J2146K3652K6061M4076L0082o1266l7777
7095f7724n4310M6875n5582o0861L3775k5481l4670k2974k6897l347N9434M9104
7083a62658l7187O878L3711J17170k8207M16n153o3153P6059O9354L444m4550
7071c3876M6593j00776m9679N6484R556o446j35117R765R6493K3933M8087m8951
7059h3934l2162N8568R4871q9225j14268j1638N0339O6416n3619M6137l9584K2122
7047h5977P0501j3508r1301n9203L097M3667k0861M7187n094j2534M6711L8834
7035c8481J0502J6785r9251J7143N1296k1192J10629p9845N3809n2978J03457
$$ plain form
7119 13913 -13072 -64067 -52352 -105552 -17253 -103131 -99881 -120825 -74483 -50093 -9454 -83378
7107 -83378 -91723 -109140 -4556 -43748 -104698 -92552 -68900 -42839 1237 31319 -29947 -67724
7095 -67724 -122034 -75159 -130741 -191602 -157827 -183308 -217978 -240952 -267849 -271196 -211762 -162658
7083 -162658 -199845 -192967 -159256 -42086 -70293 -69877 -75030 -138183 -62124 7230 10674 -33876
7071 -33876 12717 -88059 -137738 -81254 -71698 -78144 -213261 -203496 -107003 -83070 -34983 -83934
7059 -83934 -116096 -57528 37343 -51882 -166150 -177788 -127449 -61033 -114652 -68515 -108099 -85977
7047 -85977 -15476 -28984 -120285 -179488 -176391 -132724 -153585 -106398 -111492 -124026 -77315 -38481
7035 -38481 -27979 -11194 -110445 -93302 -42006 -63198 47431 -32414 21395 -31583 71874
7024G1874j09261l798p8790r8802Q6980K2278R7020j5872m8200l0525n527Q003
7012a04620q937j771j35107J11597O0262L9531k8243k5338N3564p5336O3445j4351
7000f5304L8212k3902k7176m5798L6099r099N459N1324l0011j4017Q0423J4844
6988A1054o0691n5627K9449J19619J53727j58193j00808k6443K5038R1788m0523
6977a1610L458j40119o4802K2012J04766p072N4640M9442J3462o7153l2673K0825
6965e4824P03p746J21905J4961n9715j6542J2317J3397j843j7890J5432l0133
6953i978j22971M9350K070J28898K1459l8239J0967k1115j9158j9373k0805k0487
6941e9382o6378J10161l7082n9074n7947O6064R2356n5615m9077p171J3645l8907
$$ plain form
7024 71874 -37387 -41185 -119975 -218777 -131797 -109519 -12499 -28371 -76571 -107096 -112623 -104620
7012 -104620 -113557 -115328 -250435 -138838 -78576 -39045 -67288 -92626 -39062 -114398 -50953 -65304
7000 -65304 -27092 -50994 -78170 -123968 -87869 -96968 -91509 -40185 -70196 -84213 -3790 11054
6988 11054 -49637 -105264 -75815 43804 197531 39338 -61470 -87913 -62875 28913 -11610
6977 -11610 -8152 -148271 -213073 -191061 -86295 -93367 -38727 10715 24177 -42976 -75649 -54824
6965 -54824 -54121 -61867 60038 74999 15284 -1258 11059 24456 22613 4723 20155 -9978
6953 -9978 -132949 -83599 -81529 47369 68828 30589 41556 20441 1283 -18090 -38895 -59382
6941 -59382 -125760 -15599 -52681 -111755 -169702 -103638 -11282 -66897 -115974 -123145 -109500 -148407
6929a48407O292P5041o4107k1471L6445N5259K1748P8489l4837j6675l9317N079
6917d6461M8346P0482q6686K1417n0913Q5140K1027n195M4466q5318K6628q7172
6905d4239J0802j31447M8730J20164P904j942j25392K5739J3932J541K2037M5486
6893f685k622j07967q1617O8780P5952o6658K7532o607M8902l4652l0910L9377
6881g7175L3165n5313n418l5319M730j8243J48548L9337M8062k9010M728m5198
6869A2894l4166M8322N7184q5194l216k6428J4545j2948N2917O696q1494o519
6857e7407r0330J9417n497O7487m4296K6930N4424l633P5724o9483J5538l2065
6845d3191j7181J20192p5829o4014J8964J46632J8809k4635J1671q5380R616j1618
$$ plain form
6929 -148407 -142115 -67074 -131181 -152652 -116207 -60948 -39200 39289 4452 -12223 -51540 -46461
6917 -46461 1885 72367 -14319 7098 -43815 41325 62352 57157 101623 16305 42933 -44239
6905 -44239 -33437 -164884 -116154 4010 11914 9972 -115420 -89681 -75749 -74208 -52171 -6685
6893 -6685 -9307 -117274 -198891 -130111 -54159 -120817 -93285 -99892 -50990 -85642 -116552 -77175
6881 -77175 -44010 -99323 -104741 -140060 -135330 -153573 -5025 34312 82374 53364 58092 12894
6869 12894 -21272 27050 84234 -960 -4176 -30604 -16059 -29007 23910 30606 -50888 -57407
6857 -57407 -147737 -128320 -133817 -66330 -110626 -83696 -29272 -32905 42819 -26664 -11126 -43191
6845 -43191 -60372 59820 -16009 -80023 -61059 85573 104382 79747 91418 6038 15654 4036
6833D036r545l270p3940O5400J22324l1068m4421m5434Q4882J8475j2775k6184
6821D8480q9346K189K5522O1829l8632r034p7585P912Q4863k6538N272N3446o3371
6808a4993m451p3814J57354m8170n6917q931Q9440J7985J33547J21711j20478
6797A92283j46226P8965K111L3828q3115l4650p063L3506N3781O2304n799j21454
6785E8471r577o7738J81704q7531K7014r0959K3356N9551k6512M9253m9906n4385
6773A2741k3758P1209M6532j17184Q197l3507J77300J1209K1665R947l3033P5284
6761B26602P6767N6253j09096k5865l5175j24220O5074K3892R5534O098L6679
6750B92543O0136j28881N0549q2048M8513q9070n0718J4151k1853O5129n6858
$$ plain form
6833 4036 -5509 -8779 -82719 -17319 105005 73937 29516 -15918 68964 87439 74664 48480
6821 48480 -40866 -38677 -13155 48674 10042 1008 -76577 -68665 16198 -10340 -5068 48378 -14993
6808 -14993 -19444 -93258 64096 15926 -40991 -49922 39518 57503 191050 312761 192283
6797 192283 46057 125022 127133 160961 77846 43196 36133 69639 123420 185724 179925 58471
6785 58471 48894 -18844 162860 75329 102343 11384 34740 94291 67779 117032 67126 12741
6773 12741 -11017 60192 106724 -10460 -2263 -35770 141530 152739 174404 184351 151318 226602
6761 226602 303369 359622 250526 224661 189486 65266 130340 154232 249766 255864 292543
6750 292543 352679 223798 274347 192299 240812 151742 101024 115175 93322 158451 101593
6739A01593N2869J5611M0835J3076q2472k832n0575Q307L3298O3904O8865r5930
6727A66549L0395K9905J00793l1308K8434L5735o7690Q382n9374J3924L1803K8023
6715C15571K10062L4873n0763j50036l2368K2216r22M0031n6075l2690L6282Q0534
6703D16715q550n6685K0588k5053M3386j01919l7987R8525L5583R7439k9354O5382
6691E18070l2615M3920q3756o1874J7828M3034J6639K9291k4836l8790O0752M6815
6679E34478R3835O43n7638N2133m5017J8525N4524k6040K37O1126J08941K2172
6667H17919l4302p3327o3171n657N1286l5420j4627o3051L3263J28944J02982
6656H44839R2354p6259l9520p3009M9160O6470P2208N0949k1433N3386J6410M9996
$$ plain form
6739 101593 154462 170073 210908 223984 141512 138680 88105 96412 129710 193614 262479 166549
6727 166549 196944 226849 327642 296334 324768 360503 292813 301195 241821 255745 287548 315571
6715 315571 525633 560506 509743 359707 327339 349555 348633 388664 332589 299899 336181 416715
6703 416715 408165 351480 372068 347015 390401 288482 250495 349020 384603 482042 452688 518070
6691 518070 485455 529375 445619 383745 401573 444607 461246 490537 465701 426911 487663 534478
6679 534478 628313 628956 571318 623451 578434 596959 651483 625443 625680 686806 795747 817919
6667 817919 783617 710290 647119 641462 692748 657328 642701 579650 612913 741857 844839
6656 844839 937193 860934 821414 748405 797565 864035 936243 987192 965759 1019145 1035555 1085551
6644A085551R411j9256K5635J4872J00658q6501M3687n3240L3114P4849j1475
6633A217305K6194q4039P0126J56429O9022J10640j14149J7292K3636J16174P3286
6622A681916L2889R6887l0511j4741L048J06684j2215O769J7906m0181J16571
6611A965022m2805J52324P1799J17060J07252L8773J18435r4076J13341Q8041
6601B635166J48056J23752j20192P3088r106J77695J46150J20416M9447k6834
6591C317638n3136L2707K55419J51783J87663M9682J72144J01484J51042K11712
6581D578138R5115j3052J75969J29046K73632K43486K77178J62022K72980K60168
6571F454682J82108J43885J63644K70885L92445L06930L06128L28623L99879L54656
$$ plain form
6644 1085551 1094962 1075706 1101341 1116213 1216871 1130370 1174057 1120817 1153931 1228780 1217305
6633 1217305 1243499 1159460 1229586 1386015 1455037 1565677 1451528 1468820 1492456 1608630 1681916
6622 1681916 1714805 1811692 1781181 1766440 1769488 1876172 1863957 1870726 1888632 1848451 1965022
6611 1965022 1922217 2074541 2146340 2263400 2370652 2409425 2527860 2433784 2547125 2635166
6601 2635166 2783222 2906974 2786782 2859870 2850764 3028459 3174609 3295025 3344472 3317638
6591 3317638 3264502 3297209 3552628 3704411 3892074 3941756 4113900 4215384 4366426 4578138
6581 4578138 4673253 4660201 4836170 4965216 5238848 5482334 5759512 5921534 6194514 6454682
6571 6454682 6636790 6780675 6944319 7215204 7607649 7914579 8220707 8549330 8949209 9303865
6561I303865L35743M01332M27073L33589L58703L97568M59741N46868N03624L57561
6551A3425667K56448K85943M80415M03565K99929J54105K16037K12532K56236
6542A5990877J93335J68254J76940J61857K2461P4012Q9718j14220k2402j01606
6532A6639226L9080j9544j24167j26074k63402k12483k43384l00331k99111l85345
6522A4704465l78775m80107l81308m57966l54523m07138m76930n00237k97355
6513A0970126n12364l91929l81327m13904k74045m10817k63042m87829l14457
6504G520412k27463j89914k24418k35054k84293k91596k63679j50518j59682j67589
6494E326206k79943k04536j61543j734j20084j87622j65976j24728j47931k32657
$$ plain form
6561 9303865 9639608 10040940 10468013 10801602 11160305 11557873 12017614 12564482 13068106 13425667
6551 13425667 13682115 13968058 14448473 14852038 15151967 15306072 15522109 15734641 15990877
6542 15990877 16184212 16352466 16529406 16691263 16713724 16787736 16877454 16763234 16740832 16639226
6532 16639226 16678306 16658762 16534595 16408521 16145119 15932636 15689252 15388921 15089810 14704465
6522 14704465 14325690 13845583 13464275 13006309 12651786 12244648 11767718 11267481 10970126
6513 10970126 10457762 10065833 9684506 9270602 8996557 8585740 8322698 7834869 7520412
6504 7520412 7292949 7103035 6878617 6643563 6359270 6067674 5803995 5653477 5493795 5326206
6494 5326206 5046263 4841727 4680184 4678450 4558366 4370744 4204768 4080040 3932109 3699452
6484C699452j91833k5567k2169l0792j19627j87969r3975j40569L2604j72862
6474B746693j1926j94226j29634j04697m4390J9823j6214j9414q6392o0638j63796
6463A935189l9381m533p984M7298q7706L2491j08864M4271n4489j6570K500m2373
6451A699849o9140j65303j07623m2861l137P132K7841l47j93310j4536N0738P6986
6439A266289j60677j16065j66206M2791P7969N1438J1072L533O644o0100k47936
6428G08752M1454k0116r583Q5815k2807O342J2305M2932k4495l8491p9n1896m4631
6415F85502n3086L5895p71j1613M7918j210J108r3975K4244n4982J7074N3863
6403F49967O335o3972j20226L8316m8054J0750O994j11936N5207p2299J8066q5026
$$ plain form
6484 3699452 3507619 3482052 3459883 3429091 3309464 3121495 3027520 2886951 2919555 2746693
6474 2746693 2734767 2540541 2410907 2306210 2261820 2281643 2265429 2246015 2159623 2098985 1935189
6463 1935189 1895808 1891275 1883291 1930589 1842883 1875374 1766510 1810781 1756292 1739722 1742222 1699849
6451 1699849 1630709 1465406 1357783 1314922 1311785 1318917 1346758 1346411 1153101 1138565 1189303 1266289
6439 1266289 1105612 989547 823341 866132 944101 995539 1006611 1010144 1016788 956688 708752
6428 708752 750206 730090 720507 806322 783515 789857 802162 845094 820599 782108 782029 730133 685502
6415 685502 632416 668311 667540 655927 703845 702635 703743 609768 634012 579030 596104 649967
6403 649967 656302 592330 472104 510420 462366 473116 480110 368174 423381 351082 369148 284122
6391B84122j4109l6485k1284J4731K23481n29j8201n3606J907n1267J2064L799
6379C44623O2328j36814r717J0202J22248O6290j7616p9256l8363J955m444k8329
6367B93107M1865Q7130M3898j5407m6050n1047j08646o6514O4575k0253L4940
6356B57598J4205o6849R225n0670J0857P810l0612K4373m6801J9576m1556M1905
6344A49061n2689m8414P5168K8578L4621m1083J9920o0737K5002L1880m914K1023
6332A77416q270J07838q026k4844m7590R0024j9652l836N4266j31089j0503q1902
6320I3832R0243l9960L2780l3631J01158n8314j53070P000K6370K0192M9954J5047
6308A51601q314q5824J11366k455p9379q8970j51601M2305N8046N0116l2188m547
$$ plain form
6391 284122 270013 233528 212244 226975 450456 449927 431726 378120 380027 328760 340824 344623
6379 344623 406951 270137 260420 270622 392870 459160 441544 362288 323925 325880 321436 293107
6367 293107 334972 422102 466000 450593 404543 353496 244850 178336 242911 222658 257598
6356 257598 271803 204954 214179 163509 174366 182176 151564 175937 129136 148712 107156 149061
6344 149061 96372 47958 123126 151704 186325 145242 165162 104425 129427 161307 156393 177416
6332 177416 169146 276984 268958 244114 196524 286548 266896 263060 317326 186237 175734 93832
6320 93832 184075 144115 176895 143264 244422 186108 33038 40038 66408 86600 136554 151601
6308 151601 143287 57463 168829 166374 86995 -1975 -153576 -111271 -53225 -3109 -35297 -39844
6296c9844N4965m5286M3409J5094n0583K9769N688N2764Q1738N1815J7656o7157
6284A50028p3603q8057O2405L9907j7194o6445R9709j1609O50n8916j08364J963
6272f9526p624K1080L5931L9289k377R622k1396L6686k2684m8701p4503l1369
6260a35572M809O1241M7501k3757l3184K8716j8655J2300K0074p8048K0952l02
6248i3925M5759M5177n6612J4153L036P1440n857K2374O5738n4710N7320n5356
6236E8537j2153p9250k3080O3056o4126K5514r0885J1961P062o739j8068k6269
6224a54440J2099j303R3861m1483Q416L3027K7599K9839p8683j0622j4774K5699
6212g0765j0626j3957l596J44J2077L5877N9817M8977J7276k8940j02181J1498
$$ plain form
6296 -39844 15121 -30165 13244 28338 -22245 7524 13212 65976 147714 199529 217185 150028
6284 150028 76425 -11632 50773 90680 73486 7041 106750 95141 95791 36875 -71489 -69526
6272 -69526 -77150 -56070 -20139 19150 16773 26395 4999 41685 19001 -29700 -104203 -135572
6260 -135572 -130763 -69522 -22021 -45778 -78962 -50246 -68901 -56601 -36527 -114575 -93623 -93925
6248 -93925 -48166 -2989 -59601 -45448 -42412 29028 23171 45545 111283 56573 113893 58537
6236 58537 46384 -32866 -55946 7110 -57016 -31502 -122387 -110426 -103364 -110103 -128171 -154440
6224 -154440 -142341 -143644 -49783 -91266 -82850 -49823 -22224 7615 -71068 -81690 -96464 -70765
6212 -70765 -81391 -95348 -98944 -98800 -86723 -50846 8971 57948 75224 46284 -55897 -44399
6200d4399L365J01436L8467p0541j29104p570N3764l2240O1452m963p171q5679
6188a23183o5345Q3969N0181O320r38p659p549K8319M183L688k6345m3317J5762
6175h1914k0727M8780j4850Q2493R9799J2687j01465J04448o6845l456j02602
6164d3652Q0087q1402J2433K1768J4723N033J7510M2815l4724j13059j9980L2866
6152f5582J08171Q2924N890r564o2648j3794p8007Q7016m1209l6472o8084K2924
6140f8435q4881N5385J3210O9093k051K7954n5596J251K5926L7270Q376N7872
6128H5374p4560P8918j8338k017m7087O5277m8477l5458o7213n324N6154K453
6116a0298J01879k3650M4667n041q2050l5742j4711P3751l5677J7732q8343l4913
$$ plain form
6200 -44399 -41034 60402 98869 28328 -100776 -108346 -54582 -86822 -25370 -30333 -37504 -123183
6188 -123183 -188528 -104559 -54378 -48058 -48996 -56655 -64204 -35885 -31702 -28014 -54359 -97676 -81914
6175 -81914 -102641 -53861 -68711 13782 113581 126268 24803 129251 62406 58950 -43652
6164 -43652 36435 -44967 -32534 -10766 3957 8990 26500 69315 34591 -78468 -98448 -65582
6152 -65582 42589 125513 131403 121839 59191 45397 -32610 54406 13197 -23275 -91359 -68435
6140 -68435 -153316 -97931 -84721 -15628 -17679 10275 -45321 -44070 -18144 19126 27502 85374
6128 85374 10814 89732 71394 69377 22290 87567 39090 3632 -63581 -68905 -12751 -10298
6116 -10298 91581 67931 112598 107557 25507 -10235 -24946 48805 13128 30860 -57483 -92396
6104i2396P8419Q4127Q0915o2971k5734l1888p1272l6425P8771J05873J9368j1325
6092A15462o7887J6592j8474J2143M708k8006m4682n5035J4355n525P4286J7366
6080C5303M5414o519R604j01007j08283n4482J76228K8394O3701l1893m2166K1753
6068C6047P610K0952o9711r438p87k1431P8918N1032J08812p9409r6878k0542
6056E175L338J19753k1281k0557j00374j3170O0709K7798O9118l3574n3017p1423
6044b7505M1495j3858l4777J9620J1122J3494j2392k7034k3320o3965P4272J02691
6032E9843k8491j22135n5063k1956J22027J06026r829m6339k4611K4180o3334
6021e9682o83R6314P0436l2045n1389j3459j3580K6185J1113l3498q2571k6075
$$ plain form
6104 -92396 -13977 70150 151065 88094 62360 30472 -40800 -77225 1546 107419 126787 115462
6092 115462 47575 64167 45693 57836 62544 34538 -10144 -65179 -50824 -56349 17937 35303
6080 35303 80717 74198 83802 -17205 -125488 -179970 -3742 24652 88353 56460 14294 36047
6068 36047 43657 64609 -5102 -14540 -15327 -36758 42160 93192 202004 122595 25717 5175
6056 5175 8513 128266 106985 86428 -13946 -27116 33593 61391 130509 96935 43918 -27505
6044 -27505 13990 132 -34645 -15025 -3903 9591 -2801 -29835 -53155 -117120 -42848 59843
6032 59843 31352 -90783 -145846 -167802 -45775 60251 50422 4083 -20528 3652 -59682
6021 -59682 -60365 35949 106385 74340 22951 9492 -4088 22097 33210 -288 -82859 -108934
6009a08934M1573O4468N3555M9191p3851N5304k4863K5342j5134l6269Q237j0666
5997B7953k973m1366J2204J4221P723P2648j56026p5198j03819K1189M5597O0318
5985a17529R7547o3659J16877n9131K6156o9439K3295M0995j1807k5291k8071
5974g0057Q6381o5166J1076N9502J542k9908n608J08093m7376j250M858m5625
5962F462L2306P2403L4809j07426j24977q740k057l796j2775R3607J618L9098
5950B0532j1104J3373l4346O2789L1481n8656j13799p1220m1524Q0396L8573P7425
5938f080l5528J11880m58l7707q1803J1641n2658J20321J9440K0875n584r538
5926E4801L7000k4250R121p1901m7314r0102K4461K6902M5503K2558L1131p9044
$$ plain form
6009 -108934 -67361 -2893 50662 99853 26002 81306 56443 81785 66651 30382 38619 27953
5997 27953 24980 -16386 -4182 10039 17762 90410 -65616 -140814 -244633 -223444 -177847 -117529
5985 -117529 -19982 -83641 33236 -25895 261 -69178 -45883 -4888 -16695 -41986 -70057
5974 -70057 16324 -48842 -37766 21736 23278 -6630 -12238 95855 48479 47229 52087 6462
5962 6462 38768 111171 145980 38554 -86423 -95163 -97220 -101016 -113791 -20184 -18566 20532
5950 20532 9428 22801 -11545 51244 82725 24069 -89730 -160950 -202474 -122078 -83505 -6080
5938 -6080 -41608 70272 69814 32107 -49696 -38055 -90713 29608 49048 69923 64339 54801
5926 54801 91801 67551 76672 4771 -42543 -132645 -108184 -81282 -35779 -13221 17910 -61134
5914f1134j0137j21348L0007j4200K4899j1301Q3341k0669J25710n78n3923p6943
5902a06276m6911j15172P8400M8752K6135m6538O6170K19971N7533j9827Q16p0778
5890I2275n0701m0479O8017m6645j3252J03539Q5913j0493p2978o165q6148k0896
5878A987l0585J9425l9604k0301K7365J42707J0069j8213j61627q1021q1106o798
5866b37702n3469J04403Q3483q469K1280k1464Q5169N2360K710j1530j14966L6839
5854f1356J2033M6871K8640N5594O3981j7054k4130l3723l4068j3286J9151P8710
5842A21363k126p6141M6483R5520N8446K5n1400r5609p2684n2543j3114m4420
5830h6200P8613Q4617K6322m9026o0316M2255m5172K0094k8446m6289L9975M9720
$$ plain form
5914 -61134 -71271 -192619 -162612 -176812 -151913 -163214 -79873 -100542 25168 24590 -29333 -106276
5902 -106276 -153187 -268359 -189959 -141207 -115072 -161610 -95440 124531 182064 162237 163053 92275
5890 92275 41574 1095 69112 22467 9215 112754 198667 188174 115196 109031 22883 1987
5878 1987 -28598 -9173 -48777 -69078 -41713 100994 111063 92850 -68777 -149798 -230904 -237702
5866 -237702 -291171 -186768 -103285 -111754 -90474 -111938 -26769 25591 28301 16771 -98195 -61356
5854 -61356 -49323 -2452 26188 81782 145763 128709 104579 70856 36788 23502 42653 121363
5842 121363 119237 43096 89579 185099 243545 243570 192170 96561 23877 -28666 -41780 -86200
5830 -86200 -7587 77030 103352 54326 -5990 36265 -8907 11187 -17259 -63548 -23573 26147
5818B6147N5529l4085O3037m6902l2337n4896j5571P6793M4333l9845n3882M3183
5806C1504J19398L001n6061q0242N2036L0345P4311m9135o2186m5278M1319L3737
5794I2749J3730j07488k1629K9504k7242J3443J4063M8094p0686L1058L2693P6257
5782A24546j48744l0103m9463R4650L2394M4415J0611m4673J0431L9154r753O2859
5770A36324n682l2733m3160K9837R417N0070Q2034p5570j387L583M667n2553o2460
5757D2387o6599R5066K4379r001J6168n9511n9267O8330l6541M5100p2983L864
5745h608j9983M1977M4086k3268j8229O810l6456L6983l2067n1711l9241J09900
5733A0193J04487N0090n3714o4734k0414k0168O9162J08517n0246o0465N585P888
$$ plain form
5818 26147 81676 47591 110628 63726 31389 -23507 -39078 37715 82048 42203 -11679 31504
5806 31504 150902 153903 97842 17600 69636 99981 174292 125157 62971 17693 59012 92749
5794 92749 106479 -1009 -22638 6866 -20376 -6933 7130 55224 -15462 15596 48289 124546
5782 124546 -24198 -54301 -103764 -9114 23280 67695 78306 33633 44064 83218 73465 136324
5770 136324 130642 97909 54749 84586 94003 144073 226107 150537 149150 152733 157400 104847 42387
5757 42387 -24212 70854 95233 86232 102400 42889 -16378 51952 15411 60511 -12472 -8608
5745 -8608 -28591 13386 57472 34204 15975 22785 -13671 23312 -8755 -60466 -99707 10193
5733 10193 114680 164770 111056 46322 25908 5740 74902 183419 133173 72708 78293 86181
5721H6181P4385n7896k937p5961l0377K6694Q1258M7673k4853j6260k2184l0474
5709E5249j1351K411K9007o0422j3300q0097M7939M3361l9318j6411n4929N9539
5697c8322O1596l7848p1432j1481M13N2437J24418k204k326o8079K2837M5652
5685G5661l0447R293j41021K6253Q5883R9085k0714p4038R1136k3201O0472l6724
5673A21638K4954o5408q621m2247K8702k2125K9563M370j1039j2118K5797j24303
5661e0837O1394J0808M6118m0671p441R1748n9018n1759j9836L5310L5143K2282
5649G3241l1128r9056n6417k3015O9499N1628n1278J08028l1400J07770p4649
5638D3223K6599q7809O5328j483k9570J444Q213m2841k6292J15291J04518m6300
$$ plain form
5721 86181 160566 102670 99733 23772 -6605 20089 101347 149020 124167 107907 85723 55249
5709 55249 43898 46309 75316 14894 1594 -78503 -30564 12797 -26521 -42932 -97861 -38322
5697 -38322 23274 -14574 -86006 -97487 -97074 -44637 79781 77577 75251 7172 30009 75661
5685 75661 45214 54507 -86514 -60261 25622 124707 103993 29955 121091 97890 158362 121638
5673 121638 146592 81184 72563 30316 59018 36893 66456 70826 59787 47669 73466 -50837
5661 -50837 10557 21365 67483 26812 19371 111119 52101 342 -19494 15816 50959 73241
5649 73241 42113 -56943 -113360 -136375 -66876 -15248 -66526 41502 10102 117872 43223
5638 43223 69822 -17987 47341 45858 16288 17732 25945 -16896 -43188 72103 176621 130321
5626A30321j3243m6752m3679o2673J0044N0727L494J35476k4733m4865o2206K3417
5614E5328j5087K6434R2919m4595r858m2114M0810O5735O738L104r9468r5514
5602a5568l5026M7016J3194j5383K6217j3630J32517j12427N0401q6664O0297
5591E0944J60086P839k7493j00677M7685q0494L1340O5151m2175J8375j517l035
5579A26029j2034L8834O3894o0770m1080P138L8153l175o4668K867j2317M0140
5567A23011L9998M9867p0797l3311L2367l0249N8796p404m2589j25378Q7902N1013
5555A33226L7731k3813L0112r070k3779J8310M3016n1367m1866n4625J52376N3502
5543B63753L4486o049j06028n0002J4790j9169p268o4184O6896Q318O1764J4575
$$ plain form
5626 130321 117078 70326 26647 -36026 -25982 24745 28239 163715 138982 94117 31911 55328
5614 55328 40241 66675 159594 114999 105141 63027 103837 169572 176310 179414 79946 -15568
5602 -15568 -50594 -3578 9616 -5767 20450 6820 139337 26910 77311 -9353 50944
5591 50944 211030 218869 191376 90699 138384 57890 89230 154381 112206 130581 129064 126029
5579 126029 113995 152829 216723 155953 114873 122011 160164 156989 92321 95188 82871 123011
5567 123011 163009 212876 142079 108768 141135 110886 169682 162278 119689 -5689 82213 133226
5555 133226 170957 147144 177256 168186 144407 162717 205733 154366 112500 57875 210251 263753
5543 263753 298239 292190 186162 136160 150950 131781 124513 60329 127225 135543 197307 211882
5531B11882m454j30077J1827N3002L3402k7896q0615k7548J5638J40106m116o8750
5519A22401q2473R485N4034o4025M7187l1965K2538J10845n5887J4866r5179M0951
5507I2778N1690R7639l2161K4325m5983n0510R4742K9633p4848m5167j8640O294
5495A29792L8360P955j7115n95p4041Q2254n7237l2839q587J5559j22662R451
5483b9705k4135J66354O7179N7808k5131N0763n4875K1677k7053o9407n066Q5434
5471B13843O9058n2133p8856n8065R7873O9228p6199j19241m8399Q40J10372M2896
5459A71217n5974o4350O0357M6303N8032k2687r4282K1845J26924k5636K3949
5448B45698o8500n0253R8991m5834o1134o3892q177J53964M1925k1190k0204l8437
$$ plain form
5531 211882 207428 77351 89178 142180 175582 147686 67071 39523 55161 195267 191151 122401
5519 122401 39928 49413 103447 39422 86609 54644 77182 188027 132140 147006 51827 92778
5507 92778 144468 242107 209946 234271 188288 137778 232520 262153 187305 142138 123498 129792
5495 129792 168152 176107 158992 158397 84356 166610 109373 76534 67947 83506 -39156 -29705
5483 -29705 -53840 112514 179693 237501 212370 263133 208258 229935 202882 133475 128409 213843
5471 213843 282901 230768 151912 93847 191720 260948 184749 65508 17109 17949 128321 171217
5459 171217 115243 50893 111250 157553 215585 192898 98616 120461 247385 221749 245698
5448 245698 177198 126945 225936 180102 118968 55076 46899 200863 242788 221598 201394 162957
5436A62957N2261k2558o0311M3576M0657n145N6206M6781p271P9720j04571K0209
5424C02511r3592r6243M3174P4276j0177r99K5598l8452j2661k3584m0071M4816
5412A74596l6271L8139j270L5980J2155k8069R4839N8867q2654q4728j1386P7055
5400B47253Q711j1886N730k2694M6008J22787l4532j04262o6023J17752j856l791
5388C03197p9425R7658n963O4548P3627K0776j45621k69k3795N8928K1045M3317
5376D28023j53441L3872N5003j4673Q0581k7384k0412n8350m4076P8702m0140
5365C17705O8297P1083o8738N9884M84J11095j12333j2996l3753J10512j1126
5354E00114O0266m2644m5076J3130J07409N5803k9596j84314p257m3538R3839
$$ plain form
5436 162957 215218 192660 132349 175925 216582 211437 267643 314424 307153 386873 282302 302511
5424 302511 208919 112676 155850 230126 219949 218950 244548 206096 193435 169851 129780 174596
5412 174596 138325 176464 175194 211174 223329 195260 290099 348966 266312 181584 170198 247253
5400 247253 255964 244078 249808 227114 273122 395909 361377 257115 191092 308844 306988 303197
5388 303197 223772 321430 315467 380015 453642 474418 328797 328528 304733 363661 384706 428023
5376 428023 274582 308454 363457 348784 429365 401981 381569 323219 279143 357845 317705
5365 317705 386002 457085 388347 448231 448715 559810 447477 434481 400728 511240 500114
5354 500114 560380 517736 472660 485790 593199 649002 619406 435092 427835 384297 478136
5343D78136j6765Q3955n0270P8296J06317p7349m0304o5076M7836O958m9464O5216
5331E67486n2737j661P8907L3644K7744k8816n8574o8057l8543J23919J02088
5320F85400K114M0841j1412q4938J4438Q6263K1594j670M2598M3480k6592Q951
5308H21067L7835Q5097m1303L1445l2795o1777n100J31184J08302k0705J8848
5297A072098l6926K3687M8741p161O8105K6806L1158P358j51372n2502r01J71283
5285A200374Q3083J10702q7895J5779l9210M2643j353R02o480Q2080l2797K0820
5273A388648l6258O5944q594J22731M7834o6698M6226N796J23732p2729J95551
5262A812183J9201O7910O79m8413q8294m7504Q4482o7879K1257m5058N9436N4580
$$ plain form
5343 478136 461371 545326 495056 573352 679669 602320 562016 496940 544776 551734 502270 567486
5331 567486 514749 513088 591995 625639 653383 624567 565993 497936 459393 583312 685400
5320 685400 687514 728355 716943 632005 646443 732706 754300 752630 795228 838708 812116 821067
5308 821067 858902 943999 902696 934141 901346 839569 834469 965653 1073955 1053250 1072098
5297 1072098 1035172 1058859 1107600 1100439 1168544 1195350 1226508 1233866 1082494 1029992 1029091 1200374
5285 1200374 1283457 1394159 1306264 1322043 1282833 1325476 1324123 1325025 1318545 1400625 1367828 1388648
5273 1388648 1352390 1418334 1409740 1532471 1580305 1513607 1559833 1565629 1689361 1616632 1812183
5262 1812183 1831384 1899294 1899973 1851560 1763266 1715762 1800244 1732365 1753622 1708564 1768000 1822580
5250A822580l9799m8891p7789J194K1230O4479n5401j25156n7167p5216l029O7811
5238A494846l9779k5453q3255j2283o6714J6623L8145N7603o8621Q1013j0072
5227A382053l1620n1833q3298j8429O0995j4718j0462j27013O6701j3549N7673
5216A216500m8616m8594N2554m0629m1575l1370l6351R9790m454q8964j22500
5205I05791O0091k9373R472m3876j0642r069Q85r372O8006j30786m4473J2632
5193G79286J17944J7000J2835l7632n2417j0243O9971L7167M3128k8357j6704
5182I31978j596N5597J0995R423L9334L4254M7302l5467l9977j7697k2115N6887
5170A068918J2968m256o7639M92J44128j28685J09407o6310M4958p6381O2942
$$ plain form
5250 1822580 1782781 1733890 1656101 1657295 1678525 1743004 1687603 1562447 1505280 1430064 1427035 1494846
5238 1494846 1455067 1429614 1346359 1334076 1267362 1283985 1322130 1379733 1311112 1392125 1382053
5227 1382053 1350433 1298600 1215302 1196873 1257868 1243150 1232688 1105675 1172376 1158827 1216500
5216 1216500 1167884 1119290 1171844 1131215 1089640 1058270 1021919 1121709 1117255 1028291 905791
5205 905791 965882 936509 945981 902105 891463 882394 883279 873907 941913 811127 766654 779286
5193 779286 897230 914230 927065 889433 837016 826773 896744 933911 977039 948682 931978
5182 931978 930382 985979 996974 1006397 1045731 1079985 1127287 1091820 1051843 1034146 1012031 1068918
5170 1068918 1081886 1077630 1009991 1010483 1154611 1025926 1135333 1069023 1113981 1037600 1100542
5159A100542n8823J8806L5780J38190j06530K8338k5142L8448R938k0114n8276
5148A101157L3410P7028O4887j6066K7420j2406M5536R4497R5738r4845n3995
5137A362361O0905Q5734l2125O7450n3569P4169O5663O2925m7916o7260q5051
5126A493286M3673J01825N3662j5650j3214j4347Q6035j25956J81646L4350J21137
5115A946447l6029j4772K2397K9027J70856O387J53587q1115M4558O8637L8005
5104B347985J4309j1996N0006J21896Q0989R1643k6728K3319l5665J21009Q9217
5093B865984N1731j00969k6149N4282J94286J583J15458M0905J27262O2176J14077
5082C500626n1730K864K8451K20308Q0444J30068L4041J39728J73580K34009M7494
$$ plain form
5159 1100542 1041719 1060525 1096305 1234495 1127965 1156303 1131161 1169609 1179547 1159433 1101157
5148 1101157 1134567 1211595 1276482 1260416 1287836 1275430 1320966 1415463 1511201 1416356 1362361
5137 1362361 1423266 1509000 1476875 1544325 1490756 1564925 1630588 1693513 1645597 1578337 1493286
5126 1493286 1536959 1638784 1692446 1676796 1663582 1649235 1735270 1609314 1790960 1825310 1946447
5115 1946447 1910418 1895646 1918043 1947070 2117926 2124313 2277900 2196785 2241343 2309980 2347985
5104 2347985 2362294 2350298 2400304 2522200 2603189 2694832 2668104 2691423 2655758 2776767 2865984
5093 2865984 2917715 2816746 2790597 2844879 3039165 3040748 3156206 3197111 3324373 3386549 3500626
5082 3500626 3448896 3451760 3480211 3700519 3780963 3911031 3945072 4084800 4258380 4492389 4539883
5071D539883m905J22317K04496J45158J00729J36933K44704K39477K60298J35341
5061F124431K52839K84903J85075J75488J59945L25116K47166L20174J53599J50168
5051H378904Q5109K55719K23311L05848J35880J63237M3156J60631J35624O0870
5041I948289k3757R5238O4593j402p9535q3044j34322p0084m8161r1499j74072
5030I402244j94191j48635o3894k9734p5711O353j7849l4890q3837L4769M1235
5019H835860J35274O2687J96604L6100J01458N5325J56553K49523K71063K92500
5009A0392947J41891J63437K83017L30968L09823J92011L21454K72173L63014
5000A2770735M26560M23251M77584N04503M41874M39247L96890M41760L28459
$$ plain form
5071 4539883 4534978 4657295 4861791 5006949 5107678 5244611 5489315 5728792 5989090 6124431
5061 6124431 6377270 6662173 6847248 7022736 7182681 7507797 7754963 8075137 8228736 8378904
5051 8378904 8464013 8719732 8943043 9248891 9384771 9548008 9591164 9751795 9887419 9948289
5041 9948289 9924532 10019770 10084363 10082961 10003426 9920382 9786060 9715976 9667815 9576316 9402244
5030 9402244 9208053 9059418 8995524 8965790 8890079 8896432 8878583 8843693 8759856 8794625 8835860
5019 8835860 8971134 9033821 9230425 9266525 9367983 9423308 9579861 9829384 10100447 10392947
5009 10392947 10534838 10698275 10981292 11312260 11622083 11814094 12135548 12407721 12770735
5000 12770735 13197295 13620546 14098130 14602633 15044507 15483754 15880644 16322404 16650863
4991A6650863L91940L86783M79317N03226M20955M17679K71145L67575K14557
4982B0104040K03235O3472J50375J69725J97396J81318J08603K3866m8889r1942
4972B1061199L1083M0721q8604j20486j76316j00740O0541l7741k7286j66839
4962B0475532p9417j08263j01130n2011o8620l9773r1348j5181n0983l7899m8438
4951A9782469r15L450J952J7899J08657l257n8022n9632R2666K9393J7411n4115
4939A9877956L678K3845O6438J56790M2598N1815m2317J4314Q540Q7416L0696
4928B0321769M0101n7416R4306k8988O9017j7964J42696M2642R7673j9062O8523
4917B0753297m3826P813K9820L5320O6608P9893N5100m9018N5176M111R685j0038
$$ plain form
4991 16650863 17042803 17429586 17908903 18412129 18833084 19250763 19521908 19889483 20104040
4982 20104040 20307275 20370747 20521122 20690847 20888243 21069561 21178164 21202030 21153141 21061199
4972 21061199 21092282 21133003 21044399 20923913 20747597 20646857 20707398 20669657 20642371 20475532
4962 20475532 20396115 20287852 20186722 20134711 20066091 20026318 19934970 19919789 19868806 19830907 19782469
4951 19782469 19781554 19785004 19786956 19804855 19913512 19910255 19852233 19792601 19885267 19914660 19932071 19877956
4939 19877956 19881634 19905479 19971917 20128707 20171305 20223120 20180803 20195117 20203657 20291073 20321769
4928 20321769 20361870 20304454 20398760 20369772 20438789 20420825 20563521 20606163 20703836 20684774 20753297
4917 20753297 20709471 20717284 20747104 20782424 20849032 20928925 20984025 20935007 20990183 20994294 21003979 20993941
4905B0993941p7638k3463J1529o9507l4905j75946L0317k9776p9354k44637j54891
4894B0145670k16334j54213r9577j24654j74817j08478k17283k92028k64221l14566
4884A8179499l52038k32479l36577j94826l24376l65710l32300m15782m65077
4875A5160334l84527m34430l10328k55261k59547l20405l09716k19074l05880
4866A2361166k73373k93357j58276j17805k7773k09032j19973j60753j23862q89
4856A0876073j06300j27856k52576j07549Q10j18043m1837j68605p0408q4970
4846I798739n6872j79255j74828o9086m0911O644j0947j09268l1984n6682J15126
4835I190676N1768J52575K6598n9459k3758j7319o14J8976L4243m3667j18603
$$ plain form
4905 20993941 20916303 20892840 20904369 20834862 20799957 20624011 20654328 20624552 20545198 20300561 20145670
4894 20145670 19929336 19775123 19675546 19550892 19376075 19267597 19050314 18758286 18494065 18179499
4884 18179499 17827461 17594982 17258405 17063579 16739203 16373493 16041193 15625411 15160334
4875 15160334 14775807 14341377 14031049 13775788 13516241 13195836 12886120 12667046 12361166
4866 12361166 12087793 11794436 11636160 11518355 11490582 11281550 11161577 11000824 10876962 10876073
4856 10876073 10769773 10641917 10389341 10281792 10282602 10164559 10122722 9954117 9883709 9798739
4846 9798739 9741867 9562612 9387784 9318698 9277787 9284431 9273484 9164216 9132232 9075550 9190676
4835 9190676 9242444 9395019 9421617 9362158 9338400 9321081 9320467 9339443 9373686 9330019 9211416
4824I211416j97199j67611q2454k2031k76504k39400l17853j76480j39545j26713
4814G465626j54697k08854j40985k6624k04666r0838j51006r1712j97598j14489
4804F084157j00983q4177l1192j9995p6768l5933o0755p2100k02068r2307j15947
4793E191932K4057j08640K0156j01145l2039l8308j14386k2919j54579k40917
4783D423212j41071r1352K3670m251o6021o8979k00724r4958n6822J9672j77243
4772C565133q9248j91545N0406j9259K4687l4912j24757r9886j04293J3866k38698
4761B751494j52612m2672m0659O8567j12583J7762q3216J9682j0892q991q9244
4750B316636j40177n6958J5773P5132l4388N9780K7397l7221l7659j49127k499
$$ plain form
4824 9211416 9014217 8846606 8764152 8742121 8465617 8226217 7908364 7731884 7592339 7465626
4814 7465626 7310929 7102075 6961090 6934466 6729800 6638962 6487956 6396244 6198646 6084157
4804 6084157 5983174 5898997 5867805 5847810 5771042 5735109 5674354 5602254 5400186 5307879 5191932
4793 5191932 5215989 5107349 5127505 5026360 4994321 4956013 4841627 4818708 4664129 4423212
4783 4423212 4282141 4190789 4214459 4210208 4144187 4075208 3874484 3779526 3722704 3742376 3565133
4772 3565133 3475885 3284340 3334746 3315487 3340174 3305262 3180505 3080619 2976326 2990192 2751494
4761 2751494 2598882 2556210 2515551 2584118 2471535 2489297 2406081 2425763 2414871 2405880 2316636
4750 2316636 2176459 2119501 2135274 2210406 2176018 2235798 2263195 2225974 2188315 2039188 2036689
4739B036689n7049J6505n3093p5246j2791L6669M9844J45726j44836k6489k05009
4728A710920l9285o8905n8431K0247J28006M3521P7802n8761l9879j29j5714r9111
4716A600281j74184j38823Q5077J11696J36470N0396n9763j8996o1615J9466j15585
4705A434420j2496Q00J11134K0547N1937m5621L6945J9102M3080p5054j60549
4694A424245j82439o1638j4244J43983k4869J00366q4639J13796r3971l3837j17785
4683A168968K7681L877m6917J6606R7721p8985J3948k4827O3276k0830J0702m5648
4671A185572K46p0980k4991Q1921L8462J06828p6849N6797k2332p294K0899R392
4659A297671q5958P0798m2792J07833l9837J3046m6876k7489q2944l599k4294
$$ plain form
4739 2036689 1979640 1996145 1943052 1867806 1855015 1891684 1941528 2087254 1942418 1915929 1710920
4728 1710920 1671635 1602730 1544299 1564546 1692552 1736073 1813875 1755114 1715235 1715106 1699392 1600281
4716 1600281 1426097 1287274 1372351 1484047 1620517 1670913 1611150 1592154 1530539 1550005 1434420
4705 1434420 1421924 1422724 1533858 1554405 1606342 1560721 1597666 1616768 1659848 1584794 1424245
4694 1424245 1241806 1180168 1165924 1309907 1285038 1385404 1300765 1414561 1320590 1286753 1168968
4683 1168968 1196649 1200526 1153609 1170215 1267936 1188951 1202899 1178072 1241348 1220518 1231220 1185572
4671 1185572 1185818 1114838 1089847 1171768 1210230 1317058 1240209 1297006 1274674 1267380 1288279 1297671
4659 1297671 1211713 1282511 1239719 1347552 1307715 1320761 1273885 1246396 1163452 1159853 1135559
4648A135559L9061j7220j225n8204p5809J361J77313p3734m4988r8650Q7587k5819
4636A045232O0709J5018o551L6152q244L3435l3726K2112j19119N1540J2905O1289
4624A170752n1700O7326j6315R878L1471l4289L1310Q065j57599j4043M5190R1262
4612A181308K8989n3283m8340m2582K8556P2426J5848o7355l521K728l5137L7256
4600A116893N8194N5427l8562j4335K6230L0657l8338m192K1700k6103l0270P0379
4588A227680Q9305O0069n2081n1950K4518o238O3053n005q7069K4194r0484K8799
4576A224791N0234j38037Q3357J7422Q8023L8926k1030l5626q2003l2757J0919
4565A204219Q1014K9754L9678J328M3821M6085M9564m4912J829o5274P7661J06178
$$ plain form
4648 1135559 1174620 1157400 1156175 1097971 1022162 1023523 1200836 1127102 1082114 983464 1071051 1045232
4636 1045232 1105941 1120959 1114408 1150560 1142316 1175751 1142025 1164137 1045018 1096558 1109463 1170752
4624 1170752 1119052 1186378 1170063 1179941 1211412 1177123 1208433 1216498 1058899 1044856 1090046 1181308
4612 1181308 1210297 1157014 1108674 1066092 1094648 1167074 1182922 1115567 1112046 1114774 1079637 1116893
4600 1116893 1175087 1230514 1191952 1177617 1203847 1234504 1196166 1191974 1213674 1187571 1157301 1227680
4588 1227680 1316985 1377054 1324973 1273023 1297541 1291303 1354356 1349351 1262282 1286476 1195992 1224791
4576 1224791 1275025 1136988 1220345 1237767 1325790 1364716 1343686 1308060 1226057 1193300 1204219
4565 1204219 1285233 1314987 1354665 1355993 1399814 1445899 1495463 1450551 1452380 1387106 1464767 1570945
4553A570945K4558q5445N1455P7313P0407O8384L0898L3272j30123p6555R111
4542A644220J92798M7694m8999M0032o8424j01251M5252K9080R099M6025Q5889
4531A921415J9698O083q1193N1616Q9105N0975O3536Q5460j99l4703J2112N0410
4519B234315R8431L0095L226P1146n248J25374P6225L6794P5683m9876l3790O6866
4507B729241L8836N2177j7999O2360k4493N146J06203L7145j4346l1355J58462
4496C101377J10203M746J2886q084J17250K3495O1900n7893K3568m3673R0066
4485C435841J00217L4244M8278j4294P6075K8326O1786J47413O148L5950k2270
4474C937714M3997J25003k8367N3603J5911J5779k3701L9392N2976j5186J6890
$$ plain form
4553 1570945 1595503 1510058 1561513 1638826 1709233 1777617 1808515 1841787 1711664 1635109 1644220
4542 1644220 1837018 1884712 1835713 1875745 1807321 1706070 1751322 1780402 1789501 1835526 1921415
4531 1921415 1941113 1947196 1866003 1917619 2006724 2057699 2121235 2206695 2206496 2171793 2183905 2234315
4519 2234315 2332746 2362841 2366067 2437213 2431965 2557339 2633564 2670358 2746041 2696165 2662375 2729241
4507 2729241 2768077 2820254 2802255 2864615 2840122 2845268 2951471 2988616 2974270 2942915 3101377
4496 3101377 3211580 3216326 3229212 3221128 3338378 3361873 3423773 3365880 3389448 3345775 3435841
4485 3435841 3536058 3570302 3618580 3604286 3680361 3708687 3770473 3917886 3924034 3959984 3937714
4474 3937714 3981711 4106714 4078347 4131950 4147861 4163640 4139939 4179331 4232307 4217121 4234011
4463D234011k3151O3749R0313M6112N4220j5108O0498R6038J67379J03488n4981
4452D822568K7503J24053K01447Q6008J16758l668k2566R2747N0626P5322N004
4441E575802M2982Q4339J51564J5040J6857M7223J53608N4740N0520K745m4028
4430F151392q6316J47396J91000K47840O0991Q8504k2850n9569q2118J46916J38413
4419F921599J31051P6277J62026R5643J21757J81829K02230J11643Q2166J09023
4409H195244J66597J68987K47127K36384K99994K55275J66752Q4605J31373K45357
4399A0197695J15182K34031J98299K38155J16952K33969J61357K7452K16640J96673
4389A1936405K27747N7698J54837K88939K03653K99077L28292K54923K24438K92801
$$ plain form
4463 4234011 4210860 4274609 4364922 4411034 4465254 4450146 4510644 4606682 4774061 4877549 4822568
4452 4822568 4850071 4974124 5175571 5261579 5378337 5374669 5352103 5444850 5495476 5570798 5575802
4441 5575802 5618784 5703123 5854687 5869727 5886584 5933807 6087415 6142155 6192675 6195420 6151392
4430 6151392 6065076 6212472 6403472 6651312 6712303 6800807 6777957 6718388 6636270 6783186 6921599
4419 6921599 7052650 7128927 7290953 7386596 7508353 7690182 7892412 8004055 8086221 8195244
4409 8195244 8361841 8530828 8777955 9014339 9314333 9569608 9736360 9820965 9952338 10197695
4399 10197695 10312877 10546908 10745207 10983362 11100314 11334283 11495640 11523092 11739732 11936405
4389 11936405 12164152 12221850 12376687 12665626 12869279 13168356 13496648 13751571 13976009 14268810
4379A4268810K90731K90606L58450L09928L56539L22042L70382M04023L95702
4370A7367213N82433M50814M71966M53317N87100N31602M71682N04538M19523
4361B1840188N08717O13300O11533N99910N78020P02224O53048N36631M83983
4352B7127554O78094O06288P77204P17404Q51011Q05862J004562J023067J100796
4343C4691842J138071J293766J274720J368282J379804J602860J695164J791978
4335D6236487J938497K002801K141842K241172K467179K589428K662059K952926
4327F5232391K852194L154773L307929L516667L673435L948592M275660M572363
4319I4534004M972449N336179N883652O308576O909072P453006Q219691R034802
$$ plain form
4379 14268810 14559541 14850147 15208597 15518525 15875064 16197106 16567488 16971511 17367213
4370 17367213 17949646 18400460 18872426 19325743 19912843 20444445 20916127 21420665 21840188
4361 21840188 22348905 22962205 23573738 24173648 24751668 25453892 26106940 26643571 27127554
4352 27127554 27805648 28411936 29189140 29906544 30757555 31563417 32567979 33591046 34691842
4343 34691842 35829913 37123679 38398399 39766681 41146485 42749345 44444509 46236487
4335 46236487 48174984 50177785 52319627 54560799 57027978 59617406 62279465 65232391
4327 65232391 68084585 71239358 74547287 78063954 81737389 85685981 89961641 94534004
4319 94534004 99506453 104842632 110726284 117034860 123943932 131396938 139616629 148651431
4311A48651431R854624J0767264J1761487J2748920J3913694J4781500J5386813
4304B37865733J5743043J5785536J5244486J3956674J1234037P430987K607668
4297C19868164k319821o928972j0212633j2405378j3777262j4335656j4660841
4290B45227601j4493975j4347913j3682563j2918136j2213577j1223147j0564783
4283A55783507r673001q985460q176398p514131p005615o202035n684208n132322
4275I7410337m860654m492827m053263l805299l399922l384995k978165k911199
4267F7524013k650167k579629k528917k499537k257091k237462k134123j968396
4259D8668691j893374j742057j571934j418879j326338j288291j278024j057255
$$ plain form
4311 148651431 158506055 169273319 181034806 193783726 207697420 222478920 237865733
4304 237865733 253608776 269394312 284638798 298595472 309829509 317260496 319868164
4297 319868164 317548343 310619371 300406738 288001360 274224098 259888442 245227601
4290 245227601 230733626 216385713 202703150 189785014 177571437 166348290 155783507
4283 155783507 146110506 137125046 128948648 121434517 114428902 108226867 102542659 97410337
4275 97410337 92549683 88056856 84003593 80198294 76798372 73413377 70435212 67524013
4267 67524013 64873846 62294217 59765300 57265763 55008672 52771210 50637087 48668691
4259 48668691 46775317 45033260 43461326 42042447 40716109 39427818 38149794 37092539
4251C7092539j119595j053783q28122q09264p50370p05793o74046o17924o94419
4242B9839223o14911o16638o83776o39517o49638o24603n85655o72728o60319
4233B4091438o97602n88516n42231n76606n88410o55530o38715n72298m64568
4224A8766962n12823m43015m48767l77187l79195m59924m02240l49326k33269
4215A5161216l12909l52465l68937l94330k48668j54843j38398k11411k43559
4206A2735696k80535k76367k52813k32468k49140k41561q9575j31383j42215j97109
4196A0642530j92875k24823k18182k32279j59526l17375k05159j53396p8373j39125
4186H721417j24067j85405j78230j73452k10315k09994j85975j57304j12357n6737
$$ plain form
4251 37092539 35972944 34919161 34091039 33281775 32531405 31825612 31151566 30533642 29839223
4242 29839223 29224312 28607674 27923898 27284381 26634743 26010140 25424485 24751757 24091438
4233 24091438 23393836 22805320 22263089 21686483 21098073 20442543 19803828 19231530 18766962
4224 18766962 18254139 17811124 17362357 16985170 16605975 16146051 15743811 15394485 15161216
4215 15161216 14848307 14495842 14126905 13732575 13483907 13329064 13190666 12979255 12735696
4206 12735696 12455161 12178794 11925981 11693513 11444373 11202812 11113237 10981854 10839639 10642530
4196 10642530 10449655 10224832 10006650 9774371 9614845 9297470 9092311 8938915 8860542 8721417
4186 8721417 8597350 8411945 8233715 8060263 7849948 7639954 7453979 7296675 7184318 7127581
4176G127581l0772p9019j04293p0870p4276j18512q5599l9904n8707o7333n3535
4165F344761l0253r8882n0054j23612p1179j32332o4590j13196J5982n0708L1918
4154E657855j34339j19465o4466p1055j99639q5303p1413R96j07574o182j06277
4143D693138L473j3386J659p2321j96006l1231r8240k6976o8095o2508m6553q7058
4131C995896n1227J7476l3491m7417n2362J3802j06737R9452j69529J6936j12225
4120C570574J01671k3113n9961q1298p7825j22165o1354o6148O1902n0511O3562
4109C255334p8921J8844p9194n4400n6172l0001q9750k2567O2824N3748j9545
4098B960200J2978L694L1500j03708j23801p7495j04314p867m4550J17886r5380
$$ plain form
4176 7127581 7096809 7017790 6913497 6842627 6768351 6649839 6564240 6524336 6465629 6398296 6344761
4165 6344761 6314508 6215626 6165572 6041960 5970781 5838449 5773859 5660663 5676645 5625937 5657855
4154 5657855 5523516 5404051 5339585 5268530 5068891 4983588 4912175 4913171 4805597 4799415 4693138
4143 4693138 4696611 4683225 4684884 4612563 4416557 4385326 4287086 4260110 4192015 4129507 4082954 3995896
4131 3995896 3944669 3962145 3928654 3881237 3828875 3842677 3735940 3835392 3665863 3682799 3570574
4120 3570574 3672245 3649132 3589171 3507873 3430048 3307883 3246529 3180381 3242283 3191772 3255334
4109 3255334 3176413 3195257 3116063 3061663 3005491 2975490 2885740 2863173 2925997 2979745 2960200
4098 2960200 2973178 2976872 3008372 2904664 2780863 2703368 2599054 2591187 2546637 2664523 2569143
4087B569143l0915o0849j0134O651j2825o4500j2393r620O2342n124l7062j16539
4075B278175M9670p7214P1687j02112r602N772K0053k8973K5276m823R9714p2515
4063B255108O1938M7005k2980Q816r5737N2853M1504N3457N7836k1359k5022n8639
4051B354780M6371M8748n5425J9234k3591k6681j42583R5255J09794R224j04279
4040B330847l6545Q31N8795O0192p4990P839K8164R5633J48701J3654L9573M0246
4028B712940l8948n329k0324J02259J31255J16065l9762l7479O7573O0284M9291
4017C097825J17193P4328K8690N414R4569Q8600M7818L3006R5523Q3653J86551
4006C953170l5388J09648L1186P9337J34274P5794M9139l747O3565J65048R9398
$$ plain form
4087 2569143 2538228 2477379 2467245 2473896 2461071 2396571 2384178 2374558 2436900 2431776 2394714 2278175
4075 2278175 2327845 2250631 2322318 2220206 2210604 2216376 2236429 2207456 2232732 2227909 2327623 2255108
4063 2255108 2317046 2364051 2341071 2349887 2254150 2307003 2348507 2401964 2459800 2438441 2413419 2354780
4051 2354780 2401151 2449899 2394474 2413708 2390117 2363436 2220853 2316108 2425902 2435126 2330847
4040 2330847 2294302 2295133 2353928 2414120 2339130 2346969 2375133 2470766 2619467 2633121 2672694 2712940
4028 2712940 2673992 2668663 2648339 2750598 2881853 2997918 2958156 2920677 2988250 3048534 3097825
4017 3097825 3215018 3289346 3318036 3323450 3418019 3506619 3554437 3587443 3682966 3766619 3953170
4006 3953170 3917782 4027430 4058616 4137953 4272227 4348021 4397160 4393413 4456978 4622026 4721424
3995D721424J08311R2980R8007N6038J07983J16810K34266J17948J11230J98500
3985E963497R4700J88465R7786J18054J6163M7292J18199J47144J28220J81641
3975G101161J57842P5253j09170R8604K7886J36189J06142J09392P9154N4876
3965G837329N7337J99336J11454J16849K3772M141L8908J59123l5604R5496O8472
3954H676613J35606Q2042Q7713Q0937K4905J12021O0703J47686L8924k1699o064
3943I419387N3753J07069J75011K57774K1756L5902P2281O3414P5102O3672Q8170
3932A0433291P9821q778N5820J63418J00554L5845J21451J53330K2299P3323r3947
3921A1136427J4773R667Q2996O3260J26361Q7131M5181J07596O8559N2141P102
$$ plain form
3995 4721424 4829735 4922715 5020722 5076760 5184743 5301553 5535819 5653767 5764997 5963497
3985 5963497 6058197 6246662 6344448 6462502 6478665 6525957 6644156 6791300 6919520 7101161
3975 7101161 7259003 7334256 7225086 7323690 7351576 7487765 7593907 7703299 7782453 7837329
3965 7837329 7894666 8094002 8205456 8322305 8346077 8350218 8389126 8548249 8512645 8608141 8676613
3954 8676613 8812219 8894261 8981974 9062911 9087816 9199837 9260540 9408226 9447150 9425451 9419387
3943 9419387 9473140 9580209 9755220 10012994 10034750 10070652 10142933 10206347 10281449 10345121 10433291
3932 10433291 10513112 10504334 10560154 10723572 10824126 10859971 10981422 11134752 11157051 11230374 11136427
3921 11136427 11151200 11160867 11243863 11307123 11433484 11520615 11565796 11673392 11741951 11794092 11801194
3910A1801194m2654o7296j06140N3468l92O1589J13110n0492q7199j53422j24216
3899A1397550p6791R244r3903j620j24920l4512p0271j06148m2493j84945q3825
3888A0587366m7432j01931j85366j69097r7110o3956n6295j42210j89780j04830
3878I429359k12222j20518j13821j16462j52508k02670j78446p0035j63993l5675
3868H063009l9635j95410r8057q0246n3787r5338k08877k6155j19593l3989k2751
3857G089171p3035q1423j42428k5547m4410J9717j41102L6577O947J6731Q143
3846F669341n2405J9757j6232K1322o2757N5612O166J4612N8242j51J59897P6100
3834F949504N0059M3478o407Q2835p0515J10882J05637J40063J6804J08937R7426
$$ plain form
3910 11801194 11758540 11691244 11585104 11638572 11638180 11699769 11812879 11762387 11675188 11521766 11397550
3899 11397550 11320759 11330003 11236100 11234480 11109560 11075048 11004777 10898629 10856136 10671191 10587366
3888 10587366 10539934 10438003 10252637 10083540 9986430 9922474 9866179 9723969 9534189 9429359
3878 9429359 9217137 9096619 8982798 8866336 8713828 8511158 8332712 8262677 8098684 8063009
3868 8063009 8023374 7827964 7729907 7649661 7595874 7500536 7291659 7265504 7145911 7111922 7089171
3857 7089171 7016136 6934713 6792285 6766738 6722328 6742045 6600943 6637520 6644467 6661198 6669341
3846 6669341 6616936 6636693 6620461 6641783 6579026 6634638 6640804 6655416 6713658 6713507 6873404 6949504
3834 6949504 6999563 7043041 7036634 7119469 7048954 7159836 7265473 7405536 7422340 7531277 7628703
3823G628703M6691L8442r044J60287J27982J37531J07998N5353J24969J28074
3813H546986J03180J14090J5525O6657M5328J07185J01673J78278J00775J26452
3803I506129K05209K3429J0066M2863J21470J75237N0163N1750K5321Q492J26543
3792A0346672J43760J65259J49896K6907n8633Q7772N7461J1485N278N2109J05962
3781A1093928R3642Q2611J1294N1421J61504R9651p6115m5446m2052O1555J40180
3770A1632173J17552P9953n0161N4498K4062J1874l695q3710R9324m0714j8896
3759A1822260R5694R7792J31872K2338L3331J5709j03205m5488l7191Q2465Q4978
3748A2200555j3872p741P0960j0918J9189J18713L623q8781J9834q4888k6264
$$ plain form
3823 7628703 7675394 7713836 7704792 7865079 7993061 8130592 8238590 8293943 8418912 8546986
3813 8546986 8650166 8764256 8779781 8846438 8891766 8998951 9100624 9278902 9379677 9506129
3803 9506129 9711338 9734767 9744833 9787696 9909166 10084403 10134566 10186316 10211637 10220129 10346672
3792 10346672 10490432 10655691 10805587 10832494 10773861 10861633 10919094 10930579 10935857 10987966 11093928
3781 11093928 11187570 11270181 11281475 11332896 11494400 11594051 11517936 11472490 11430438 11491993 11632173
3770 11632173 11749725 11829678 11779517 11834015 11858077 11869951 11866256 11782546 11881870 11841156 11822260
3759 11822260 11917954 12015746 12147618 12169956 12203287 12218996 12115791 12070303 12033112 12115577 12200555
3748 12200555 12186683 12178942 12249902 12238984 12258173 12376886 12380509 12291728 12311562 12226674 12200410
3737A2200410o3182J61605R7571o1675j07591l2666n940J4769P0704l3286m0480
3726A2200239p8768p785P7298j5035J8754O2134r0748Q5767p0493m4662j8139
3715A2118562k9843N2676P400m6033p9268q0106M3459K797o7773j73630p6223
3704A1672018q6218n6168q5914k5317r1679j35136k8023r6895J0392l3772K8119
3693A1071407l4330k22953j03140r7370N829J8594P0892J4648p1650O0215q594
3682A0703548k5009N748p8779K6511R5759O9472p1929Q8191J16086J49585O6939
3671A1146122k9414O0530r7259J70342K64012J39863P6450J61440K00614R7451
3661A2190151R2809J66795O4837J58377J44598J94785N4044J05771J35017J03938
$$ plain form
3737 12200410 12137228 12298833 12396404 12334729 12227138 12194472 12188532 12203301 12274005 12240719 12200239
3726 12200239 12121471 12113686 12190984 12175949 12194703 12256837 12166089 12251856 12181363 12136701 12118562
3715 12118562 12088719 12141395 12148795 12102762 12023494 11943388 11986847 11989644 11921871 11748241 11672018
3704 11672018 11585800 11529632 11443718 11418401 11326722 11191586 11163563 11066668 11077060 11043288 11071407
3693 11071407 11037077 10814124 10710984 10613614 10619443 10638037 10708929 10723577 10651927 10712142 10703548
3682 10703548 10678539 10684287 10605508 10632019 10727778 10797250 10725321 10813512 10929598 11079183 11146122
3671 11146122 11116708 11177238 11079979 11250321 11514333 11654196 11730646 11892086 12092700 12190151
3661 12190151 12282960 12449755 12514592 12672969 12817567 13012352 13066396 13172167 13307184 13411122
3651A3411122K23903J18944J88206O3838R0409J87579J82308K84381J29279K47295
3641A5127264K25863J69369J77252J86231K23676J35837J28958O4756K43748J93154
3631A6876108Q8000K0974N1089P3313Q0771K7773m3898j51606r7098O0284L4598
3620A7020308l1332j44012l3383m4363P648j0764n3409j03725n0157M2285M7382
3609A6646478l611J14192M2312J65691M2687l5503N418Q4379M9749Q0218R0196
3598A7282206k1910L9104n6619l879Q187J8066K9454O8471L5585m1730j6948J6418
3586A7356405N2021Q01P7206L9625o3783q767N1056O4679O1822n744q9398j09340
3574A7426583n7243j13291r1557p0909r0442j00979k18261j66508k33719j36033
$$ plain form
3651 13411122 13635025 13753969 13942175 14006013 14096422 14284001 14466309 14750690 14879969 15127264
3641 15127264 15353127 15522496 15699748 15885979 16109655 16245492 16374450 16439206 16682954 16876108
3631 16876108 16964108 16985082 17036171 17109484 17190255 17218028 17174130 17022524 16925426 16985710 17020308
3620 17020308 16988976 16844964 16811581 16767218 16774866 16764102 16710693 16606968 16556811 16599096 16646478
3609 16646478 16642867 16757059 16799371 16965062 17007749 16972246 16977664 17062043 17111792 17192010 17282206
3598 17282206 17260296 17299400 17242781 17238902 17247089 17265155 17294609 17363080 17398665 17356935 17339987 17356405
3586 17356405 17408426 17409227 17486433 17526058 17462275 17453508 17504564 17569243 17631065 17625321 17535923 17426583
3574 17426583 17369340 17256049 17164492 17093583 17003141 16902162 16683901 16517393 16283674 16147641
3564A6147641j75077j80928k33745j2912l00459j39607j56808j73845j48048r1477
3554A4534735j06605j22501k43341j79277j08430r6492j00903k04382k18336j35047
3544A3019421j41823m3138j80720j27587j73522j06108l2575j06322j33204j87761
3534A1786661j44447j55138o4279o7992j12243j23558l67r4728n1107o3533L5011
3523A0944280m3294m8009l6402o202J471J37672K5360k0638N2281O7865Q3771
3512A1158155Q1065L3868J39016l2242J22616K00899K01682R4446J41158J75786
3502A2316449J17261J86686J62572J59705J92570J90643L37034K60096K14047
3493A4137063J92496J81126K11996L07859K48743K16645K85999K10322L50526
$$ plain form
3564 16147641 15972564 15791636 15557891 15544979 15244520 15104913 14948105 14774260 14626212 14534735
3554 14534735 14428130 14305629 14062288 13883011 13774581 13678089 13577186 13372804 13154468 13019421
3544 13019421 12877598 12834460 12653740 12526153 12352631 12246523 12213948 12107626 11974422 11786661
3534 11786661 11642214 11487076 11422797 11354805 11242562 11119004 11118637 11023909 10972802 10909269 10944280
3523 10944280 10900986 10852977 10816575 10810373 10811844 10949516 10974876 10954238 11006519 11074384 11158155
3512 11158155 11239220 11273088 11412104 11379862 11502478 11703377 11905059 11999505 12140663 12316449
3502 12316449 12433710 12620396 12782968 12942673 13135243 13325886 13662920 13923016 14137063
3493 14137063 14329559 14510685 14722681 15030540 15279283 15495928 15781927 15992249 16342775
3484A6342775L79361K79594L44026K61528L34398L68406L36742M33616M37816
3475A9518262L96414L67438N35888L96933M18436L10888M60110L79820L82311
3466B3166500M61068L64210L69525L69929L72373L90860L84368L30783L59873
3457B6569489L57657K47396L65763M73193M42012M48729K71798N07474M28870
3448C0112381M36790L25835K80327K71584K93574K39488K58521J31525K8813j2834
3438C2366004J48751n9015j64670j90353k86913k68270k61052k46758k48950m38303
3428C0350471l56589l48157l09286m60689l96422l77499l96056l88242m12063
3419B6905468l37027m93037l75891n13186l75037l72590l97698m25002m90258
$$ plain form
3484 16342775 16722136 17001730 17345756 17607284 17941682 18310088 18646830 19080446 19518262
3475 19518262 19914676 20282114 20818002 21214935 21633371 21944259 22404369 22784189 23166500
3466 23166500 23627568 23991778 24361303 24731232 25103605 25494465 25878833 26209616 26569489
3457 26569489 26927146 27174542 27540305 28013498 28455510 28904239 29176037 29683511 30112381
3448 30112381 30549171 30875006 31155333 31426917 31720491 31959979 32218500 32350025 32378838 32366004
3438 32366004 32514755 32455740 32291070 32100717 31813804 31545534 31284482 31037724 30788774 30350471
3428 30350471 29993882 29645725 29336439 28875750 28479328 28101829 27705773 27317531 26905468
3419 26905468 26568441 26075404 25699513 25186327 24811290 24438700 24041002 23616000 23125742
3410B3125742n27360l78105m32347m00009m80166m53886m64846l39271n00820
3401A9148932l40391l77982k87276m02128k76068k95461j51337k23163j92497
3392A6602629j29438n3869m4174J275n183J85001J07778J34965K51287K00689
3382A7250960L03320M37269M48700L91101L46606M68290M82507M70601N44406
3373B1143760N64256M90140M60555N12949M85618M70724L27622K42109J67926
3364B4865659K31544K33765L06999J64434J2331j20290k72977l58021l37099m45205
3354B4281140l02778m90929m02308n53323o77411p78409p80709p32641o89076
3345A8873556o96206o52154p29328p62551p34847o94307o36560o44599p07593
$$ plain form
3410 23125742 22598382 22220277 21787930 21387921 20907755 20453869 19989023 19649752 19148932
3401 19148932 18808541 18430559 18143283 17741155 17465087 17169626 17018289 16795126 16602629
3392 16602629 16473191 16419322 16375148 16376423 16371240 16556241 16664019 16798984 17050271 17250960
3382 17250960 17554280 17991549 18440249 18831350 19177956 19646246 20128753 20599354 21143760
3373 21143760 21708016 22198156 22658711 23171660 23657278 24128002 24455624 24697733 24865659
3364 24865659 25097203 25330968 25637967 25802401 25814732 25694442 25421465 25063444 24726345 24281140
3354 24281140 23978362 23487433 23085125 22531802 21854391 21075982 20295273 19562632 18873556
3345 18873556 18177350 17525196 16795868 16033317 15298470 14604163 13967603 13323004 12615411
3336A2615411n78996o21673m82307n02619k91155m29664m83976m82345l49993
3327H392683k48320k49400l05253k05731k68156k24732j27286k34506j46265k14393
3317F168641j85519j23150k05700j21795l0265j19964n246j38185j74788j29969
3307D934060j63739j31280l2565r1042p3195j27553j8585m7536l2264p152M9941
3296D259090j50697j42554K9307k7717k5103m2606q5346j43334r6732o4867p413
3285C502028k518l6033q0156j23061m0238J1793K7547l7211j36579l2978n1275
3274C001319N4533J5159p1476q1028j38884n8815q2893l0533k1774m5561N9585
3263B599632J3996l8534o5458m5653R8657q9648j24591k2486o0927J896Q3755
$$ plain form
3336 12615411 12036415 11414742 10932435 10429816 10138661 9708997 9225021 8742676 8392683
3327 8392683 8144363 7894963 7589710 7383979 7115823 6891091 6763805 6529299 6383034 6168641
3317 6168641 5983122 5859972 5654272 5532477 5502212 5382248 5377002 5238817 5064029 4934060
3307 4934060 4770321 4639041 4606476 4515434 4442239 4314686 4296101 4248565 4216301 4209149 4259090
3296 4259090 4108393 3965839 3995146 3967429 3942326 3899720 3814374 3671040 3574308 3509441 3502028
3285 3502028 3499510 3463477 3383321 3260260 3220022 3231815 3259362 3222151 3085572 3052594 3001319
3274 3001319 3055852 3071011 2999535 2918507 2779623 2720808 2637915 2607382 2585608 2540047 2599632
3263 2599632 2613628 2575094 2509636 2463983 2562640 2472992 2348401 2325915 2264988 2266884 2350639
3252B350639K7452o8307m3645k5501k5809j8122o1607P5113j7490Q4449o8412
3241B208760o2940p604L1935q927p8426j06116n5874p4325L8059J2003N0657l825
3229A943377N2016p2661j28944M6152J8208L3580j4117M5064J0339L0300L9900
3218B003214o0980j42853k8649J8311J3967o6698P0732J2567N9124R30J614O518
3206A887797l6100o153K3554J1224K1380L2106l5552j5064j2213Q1136j00389
3195A851726n0753L330o2904L6171Q82M292M3860k8783k7749o3192J01625N1389
3183A859894M7531k8799k7948K4568M0708k8630o493j7542k1703K5912N2257K4837
3171A944592J7326Q7127L6036J2995k0536O7127m6786M2833j0682K0883j7551
$$ plain form
3252 2350639 2378091 2309784 2266139 2240638 2214829 2196707 2135100 2210213 2192723 2277172 2208760
3241 2208760 2145820 2138216 2170151 2161224 2082798 1976682 1920808 1846483 1884542 1896545 1947202 1943377
3229 1943377 1995393 1922732 1793788 1839940 1858148 1891728 1877611 1922675 1933014 1963314 2003214
3218 2003214 1942234 1799381 1770732 1789043 1803010 1736312 1807044 1819611 1878735 1879665 1881279 1887797
3206 1887797 1851697 1845544 1869098 1880322 1901702 1933808 1898256 1883192 1870979 1952115 1851726
3195 1851726 1800973 1804303 1741399 1777570 1778452 1782744 1826604 1797821 1770072 1706880 1808505 1859894
3183 1859894 1907425 1878626 1850678 1875246 1915954 1887324 1880831 1863289 1841586 1867498 1919755 1944592
3171 1944592 1961918 2049045 2085081 2098076 2077540 2144667 2097881 2140714 2130032 2150915 2133364
3160B133364R9911M3434m8232q4049Q886p4001P3531K9609Q0010o2560M1767N124
3148B246794Q174l2438k1801J0475K2903O0553N1058k9011L9317o422K4578n3498
3136B320682Q8654N8021L4145j0701P295R8490K8638n6065j31708N2661Q434P4039
3124B572585M8693M0335m638O0858O5818O2276r685j7761j08555Q2366k6890J28526
3112B893928K2965J14779j05866P8508l1538l1547J1393O5654O7371L8176J5431
3101C139254N2917K0455R126J9905M8086O6944L2084P9584M3765m8941N2449Q1316
3089C596944j5577P198J3225J18757R2315Q3612p6095O8365j8658J42014L1517
3078D043617L1916P4679J2193Q2202L2665O7894J00863L9024J27124J159P8475
$$ plain form
3160 2133364 2233275 2276709 2228477 2144428 2153314 2079313 2152844 2182453 2262463 2199903 2241670 2246794
3148 2246794 2254968 2222530 2200729 2211204 2234107 2294660 2345718 2316707 2356024 2349602 2374180 2320682
3136 2320682 2409336 2467357 2501502 2490801 2498096 2596586 2625224 2569159 2437451 2490112 2498546 2572585
3124 2572585 2621278 2661613 2656975 2717833 2783651 2845927 2836242 2818481 2709926 2792292 2765402 2893928
3112 2893928 2916893 3031672 2925806 3004314 2972776 2941229 2952622 3018276 3085647 3123823 3139254
3101 3139254 3192171 3212626 3221752 3241657 3289743 3356687 3388771 3468355 3512120 3463179 3515628 3596944
3089 3596944 3581367 3588565 3601790 3720547 3812862 3896474 3820379 3888744 3870086 4012100 4043617
3078 4043617 4075533 4150212 4162405 4244607 4277272 4345166 4446029 4485053 4612177 4613336 4691811
3067D691811M0063J49211M1850J30742J22695J7027K2052N7378O1444Q7141N7981
3056E479395J46907Q8291J40781R5219R8161J1002O2635J23684J65533K37014
3046F648622O0937P1886R0381J48823K21439J75270L7700M0198O3388J49227K33502
3035G941373K57432J08813J85423K10524K69889J26700K02481J18344L98639K43109
3025A0062727L79900K26021K65178L37062L71827L26477M39886L47549L37207
3016A3093834L49547M86336N29180M99070N11363N85603N03086O60198O18125
3007A7836342O95060O39278O96760P66369P93771Q15020P84593Q21132Q38211
2998B4686536J048736Q97220R81077Q50163R65921J038896J139813J096151J005019
$$ plain form
3067 4691811 4731874 4881085 4922935 5053677 5176372 5193399 5215451 5272829 5334273 5421414 5479395
3056 5479395 5626302 5714593 5855374 5950593 6048754 6059756 6122391 6246075 6411608 6648622
3046 6648622 6709559 6781445 6871826 7020649 7242088 7417358 7455058 7495256 7558644 7707871 7941373
3035 7941373 8198805 8307618 8493041 8703565 8973454 9100154 9302635 9420979 9819618 10062727
3025 10062727 10442627 10668648 10933826 11270888 11642715 11969192 12409078 12756627 13093834
3016 13093834 13443381 13929717 14458897 14957967 15469330 16054933 16558019 17218217 17836342
3007 17836342 18531402 19170680 19867440 20633809 21427580 22242600 23027193 23848325 24686536
2998 24686536 25735272 26632492 27613569 28463732 29429653 30468549 31608362 32704513 33709532
2989C3709532R71242J013552J109531J178793J186195J114473Q41410J095223
2981D2219951R70757J027866R55366Q45285Q78386Q75619Q30559P80302O79159
2972E0063250O05664N34621N38353M56592J91909J49824J66673K31958P4577k2214
2962E2991207j40021k80851l25836m16713k35453m16314m69703o04855o84606
2953D9416855p36358q02581p06932q66882q96410r24963j140677q20801j086515
2944D1434736r25511r82083j011819r68590j024460j017527j074218j020317q95287
2935C2514924r35723r38914j032635q75168q57773p37017p90312p91019q08689
2926B4747674p78676o38003o97062p08301o81992n41850n63909l91968n78810
$$ plain form
2989 33709532 34680774 35694326 36803857 37982650 39168845 40283318 41124728 42219951
2981 42219951 43190708 44218574 45173940 46019225 46897611 47773230 48603789 49384091 50063250
2972 50063250 50668914 51203535 51741888 52198480 52390389 52540213 52706886 52938844 53013421 52991207
2962 52991207 52851186 52570335 52244499 51827786 51592333 51176019 50706316 50101461 49416855
2953 49416855 48680497 47877916 47170984 46304102 45407692 44482729 43342052 42521251 41434736
2944 41434736 40509225 39527142 38515323 37546733 36522273 35504746 34430528 33410211 32514924
2935 32514924 31579201 30640287 29607652 28732484 27874711 27137694 26347382 25556363 24747674
2926 24747674 23968998 23330995 22633933 21925632 21243640 20701790 20137881 19745913 19167103
2917A9167103n42053m72191m44514m29849l95917m08885l41335l53044k48154
2908A5531161k29478k60059l37977j78968k34571j90445k04954k18367k63281
2899A3413061k65829j13744n5839j06925j04149j18854j96378j23536n3800K4831
2889A2298838l4443q3578j45558k0541Q2190O104n0072p7305J9467l4991L752
2878A1963863R0513M3352P4919N5181O5521R5965j1125p31O8129L1374R9554K72587
2866A2849102J6302J02000J25463K05137K81499J40910j7556P7403K35986K40899
2856A4257145J58359K45156K70848K74134J60608L20583L06634L12109K52794
2847A6558370K53626L32203L87474M05289M12144M34227L89432M14808M02103
$$ plain form
2917 19167103 18625050 18152859 17708345 17278496 16882579 16473694 16132359 15779315 15531161
2908 15531161 15301683 15041624 14703647 14524679 14290108 14099663 13894709 13676342 13413061
2899 13413061 13147232 13033488 12977649 12870724 12766575 12647721 12451343 12327807 12274007 12298838
2889 12298838 12264395 12180817 12035259 12014718 12096908 12103012 12052940 11975635 11995102 11960111 11963863
2878 11963863 12054376 12097728 12172647 12227828 12293349 12389314 12378189 12377458 12445587 12476961 12576515 12849102
2866 12849102 12865404 12967404 13092867 13298004 13579503 13720413 13702857 13780260 14016246 14257145
2856 14257145 14415504 14660660 14931508 15205642 15366250 15686833 15993467 16305576 16558370
2847 16558370 16811996 17144199 17531673 17936962 18349106 18783333 19172765 19587573 19989676
2838A9989676L66172M10872M10653M20214M24874L69078M09900M44848L88358
2829B3634645M33694M65543M48259M20244K76354L71445L83840L96304L51729
2820B7182057L05969L60411K17415M02556M15981L51361L82961L63771M24738
2811C0407220L08655L39957L87661M87114O19408N78530P10311O28683N81422
2802C5048961N91938P32565Q25964Q88096R04444Q85148J017674J093816J246056
2793D3234662J300440J205820J426739J461979J475490J499799J565456J746724
2785E4917109J784271J959667J843277J904811J848696J919914K022112J977203
2777G0177060K052518J972935J990429J940682J721473J917413J769701J808213
$$ plain form
2838 19989676 20355848 20766720 21177373 21597587 22022461 22391539 22801439 23246287 23634645
2829 23634645 24068339 24533882 24982141 25402385 25678739 26050184 26434024 26830328 27182057
2820 27182057 27488026 27848437 28065852 28468408 28884389 29235750 29618711 29982482 30407220
2811 30407220 30715875 31055832 31443493 31930607 32550015 33128545 33838856 34467539 35048961
2802 35048961 35640899 36373464 37199428 38087524 38991968 39877116 40894790 41988606 43234662
2793 43234662 44535102 45740922 47167661 48629640 50105130 51604929 53170385 54917109
2785 54917109 56701380 58661047 60504324 62409135 64257831 66177745 68199857 70177060
2777 70177060 72229578 74202513 76192942 78133624 79855097 81772510 83542211 85350424
2769H5350424J551252J677223J530647J497188J355812J186784J142295J010200
2761I6301825J053737R21005P98990P10655M77690K88236K98185K48327n5248
2752A01043402q1306j93725k55768l68135m52950n24824o94236p11699o64988
2743I7095771q72818q95041r79454q98125j076584j044382j148953j166945j192838
2734H7820631j290431j211538j242373j282349j351630j359984j234083j313316
2726G7534927j209960j178452j131686j142331j156951r28682q93080p23091q39217
2717F8331477o27392o93477n89164n20098l53199l23747m00475k32082k62276
2708F4329567k77264j10975j63021r6830j39386L5942j51393k86836j76569m6034
$$ plain form
2769 85350424 86901676 88578899 90109546 91606734 92962546 94149330 95291625 96301825
2761 96301825 97355562 98276567 99075557 99786212 100263902 100552138 100850323 101098650 101043402
2752 101043402 100962096 100768371 100512603 100144468 99691518 99166694 98472458 97760759 97095771
2743 97095771 96222953 95327912 94348458 93450333 92373749 91329367 90180414 89013469 87820631
2734 87820631 86530200 85318662 84076289 82793940 81442310 80082326 78848243 77534927
2726 77534927 76324967 75146515 74014829 72872498 71715547 70786865 69893785 69170694 68331477
2717 68331477 67704085 67010608 66421444 65901346 65548147 65224400 64823925 64591843 64329567
2708 64329567 64052303 63941328 63778307 63681477 63542091 63578033 63426640 63139804 62963235 62917201
2698F2917201J9511m7004j02758j67128k42141j21648m2676j84090k01485k83442
2688F1544340l18214l63139k66598k64974l80083k50126k63504l14035m29152
2679E8694515m84406n11670n42254n18230l57493m43192n99418m72273m10558
2670E4355021m43365n16355n25576n31001o73580o43679o19090n20327n54448
2661D9327600n28392o76261n83401o90947o42984o57660o89538o25025o79148
2652D3554244o28508n54312n68557o35052n59661n08219m93216m30016l99313
2643C8777390m60399n54851l90826l92402l63706m66531m15718l88782l77064
2634C4967111l48387l76491k97273m07887k52686l09684m01588l95599m00999
$$ plain form
2698 62917201 62936712 62889708 62786950 62619822 62377681 62256033 62213357 62029267 61827782 61544340
2688 61544340 61226126 60862987 60596389 60331415 59951332 59701206 59437702 59123667 58694515
2679 58694515 58210109 57698439 57156185 56637955 56280462 55837270 55237852 54765579 54355021
2670 54355021 53911656 53395301 52869725 52338724 51665144 51021465 50402375 49882048 49327600
2661 49327600 48799208 48122947 47539546 46848599 46205615 45547955 44858417 44233392 43554244
2652 43554244 42925736 42371424 41802867 41167815 40608154 40099935 39606719 39176703 38777390
2643 38777390 38316991 37762140 37371314 36978912 36615206 36148675 35732957 35344175 34967111
2634 34967111 34618724 34242233 33944960 33537073 33284387 32974703 32573115 32177516 31776517
2625C1776517l84593l77824l12558l32185l01917k76053l48884l48293l89327
2616B8704883k65929k90343j82044k75005k34198l00525k80301j27728k46033
2607B6502777k46330j56924j13210j82613k02685q7467j85738r4672K6481k0505
2597B5239114o5599n3218Q7493L4586Q8980P7863M6916j7578m238O6008J27870
2586B5628197J12941J31210L9626J68421J41868J75227J40961R5782J38620j1561
2576B6761292J34887K28437K52071R7999J81211J40749O5011j5202R0659N6010
2566B7993124L6164l9362M3755L4848l6666R2332Q3020R8581Q2004K4243r401
2555B8402642N0827R4315J42388K49125J81674L05372K04620K14369L26711L65107
$$ plain form
2625 31776517 31391924 31014100 30701542 30369357 30067440 29791387 29442503 29094210 28704883
2616 28704883 28438954 28148611 27966567 27691562 27457364 27156839 26876538 26748810 26502777
2607 26502777 26256447 26099523 25986313 25803700 25601015 25513548 25327810 25233138 25259619 25239114
2597 25239114 25173515 25120297 25207790 25242376 25331356 25409219 25456135 25438557 25434319 25500327 25628197
2586 25628197 25741138 25872348 25911974 26080395 26222263 26397490 26538451 26634233 26772853 26761292
2576 26761292 26896179 27124616 27376687 27474686 27655897 27796646 27861657 27846455 27937114 27993124
2566 27993124 28029288 27989926 28033681 28068529 28031863 28124195 28207215 28305796 28387800 28412043 28402642
2555 28402642 28453469 28547784 28690172 28939297 29120971 29426343 29630963 29845332 30172043 30537150
2545C0537150M34716L28256L32704M43165N52050P49639P13837O92896O80306
2536C5464719Q22715P69897R51015J025259R87275J012497J206010J188537J164406
2527D4592330J175653J315082J417999J309900J314284J273168J218649J250997
2519E4868062J375618J315045J266376J082150J121959J047018J013500J130010
2511F4219738R53918Q33514Q56333P41977P19453O63737O75532N93615N63410
2502G0821227M36833M02451K34198L23057K62702M2097J41823Q5662K2187o1181
2492G2711056q6737m6761j63554j60070k29097k57011l00345k62494l64399l40634
2482G0499954l91249n30735o04543n99326o29838p69533q38020q46285q29796
$$ plain form
2545 30537150 30971866 31300122 31632826 32075991 32628041 33377680 34091517 34784413 35464719
2536 35464719 36287434 37057331 38008346 39033605 40020880 41033377 42239387 43427924 44592330
2527 44592330 45767983 47083065 48501064 49810964 51125248 52398416 53617065 54868062
2519 54868062 56243680 57558725 58825101 59907251 61029210 62076228 63089728 64219738
2511 64219738 65173656 66007170 66863503 67605480 68324933 68988670 69664202 70257817 70821227
2502 70821227 71258060 71660511 71894709 72217766 72480468 72522565 72664388 72750050 72772237 72711056
2492 72711056 72624319 72577558 72414004 72253934 72024837 71767826 71467481 71204987 70840588 70499954
2482 70499954 70108705 69577970 68973427 68374101 67744263 66974730 66136710 65290425 64460629
2473F4460629r77845j063432r57106r85599j112058j147310j222684j274263j225428
2464E4494904j316544j287518j334137j257213j248667j259498j200592j372917
2456D4217818j121632j242006j151335j234144j071449j090837j008579r44447
2448C5353389q48689q18473q81343q63056q12261o73230n74257o01481n97456
2439B8683143n10923l90091l47116k87945l58006l91162k09953l43675k07718
2430B5636554l08743j99399k26506j82992k36138k72542l08889k56363k34524
2421B3410458k17178k47527k57596k72722k96087k86037l19388l20856l43725
2412B0849342l84943l60336l55690k45753l30689l58524m53154m00404m29778
$$ plain form
2473 64460629 63482784 62419352 61462246 60476647 59364589 58217279 56994595 55720332 54494904
2464 54494904 53178360 51890842 50556705 49299492 48050825 46791327 45590735 44217818
2456 44217818 43096186 41854180 40702845 39468701 38397252 37306415 36297836 35353389
2448 35353389 34504700 33686227 32804884 31941828 31129567 30456337 29882080 29280599 28683143
2439 28683143 28172220 27782129 27435013 27147068 26789062 26397900 26187947 25844272 25636554
2430 25636554 25327811 25128412 24901906 24718914 24482776 24210234 23901345 23644982 23410458
2421 23410458 23193280 22945753 22688157 22415435 22119348 21833311 21513923 21193067 20849342
2412 20849342 20464399 20104063 19748373 19502620 19171931 18813407 18360253 17959849 17530071
2403A7530071m23867m01279m16271m97262l96177l50892l51432m75165l72664
2394A3845062l86316l35941l65027k84288l45932l39279k52188k69435k02561
2385A1064095l20521k80647l44141k19688j15455j63159j44151l22079k53245
2376H901009k85051k79587j16883j55716j98058j77246q8129j35400r543q8941
2366G366455k52518j73418j54848q969j28058r8252j09415j46567K3690r6716
2356F221384j09370k18949j37550j29748j23644J0798o8682j48772r5355m3713
2346E156399L9255q7064k3664o7817q5307j36399j9549p0449q2317j29825j10008
2335D383255q6916l1702o9759O292j69321O7328m8078j9203j59839j20511j14811
$$ plain form
2403 17530071 17106204 16704925 16288654 15791392 15395215 15044323 14692891 14217726 13845062
2394 13845062 13458746 13122805 12757778 12473490 12127558 11788279 11536091 11266656 11064095
2385 11064095 10743574 10462927 10118786 9899098 9783643 9620484 9476333 9154254 8901009
2376 8901009 8615958 8336371 8219488 8063772 7865714 7688468 7600339 7464939 7455396 7366455
2366 7366455 7113937 6940519 6785671 6776702 6648644 6550392 6440977 6294410 6318100 6221384
2356 6221384 6112014 5893065 5755515 5625767 5502123 5512921 5444239 5295467 5200112 5156399
2346 5156399 5195654 5108590 5084926 5017109 4931802 4795403 4775854 4705405 4623088 4493263 4383255
2335 4383255 4296339 4264637 4194878 4201170 4031849 4099177 4051099 4031896 3872057 3751546 3636735
2324C636735j6257R448K9016r7436L7874m8801m2115k0168l0001q2380m7103m8103
2312C280709j5701N1231o7053j1357o6497n0089j50705r1969n0486j09549J06469
2301B825003l6780N8626j23098p7841p930q5609R3332p2355o3971q3341k5496
2290B400540k3732k7702L3157N6377p3443n1003o7736j19684m4036R8302j9679
2279B161361L121p1523J5121j34676J26249J0969K4888L4639q6704r6139j52737
2268A834569J0252Q3723L009k8976j765j5555q8369k1969j9663M7909m2290N6136
2256A817011j49477m8422r0152Q6639P0326N3707q6972j15680p6568j5722j4831
2245A429859k8631r27L005l8088R0353K0725L0478K0381P0190j9990n3693j16858
$$ plain form
2324 3636735 3620478 3629926 3658942 3561506 3599380 3550579 3508464 3488296 3458295 3375915 3328812 3280709
2312 3280709 3265008 3316239 3249186 3237829 3171332 3121243 2970538 2878569 2828083 2718534 2825003
2301 2825003 2788223 2846849 2723751 2645910 2637980 2552371 2645703 2573348 2509377 2426036 2400540
2290 2400540 2376808 2349106 2382263 2438640 2365197 2314194 2246458 2126774 2082738 2181040 2161361
2279 2161361 2164482 2092959 2108080 1973404 2099653 2110622 2135510 2170149 2083445 1987306 1834569
2268 1834569 1844821 1928544 1931553 1902577 1900812 1885257 1796888 1774919 1755256 1803165 1760875 1817011
2256 1817011 1667534 1619112 1528960 1615599 1685925 1739632 1652660 1536980 1460412 1444690 1429859
2245 1429859 1401228 1400301 1403306 1365218 1455571 1476296 1506774 1527155 1597345 1577355 1523662 1406804
2233A406804q6669L7507R7970Q2575P7927j11172p6962n6383k0663O421n734K4511
2221A376132o9018L476M7129J38766p701j4451j39650j69888q342j444O3781K749
2209A221539o9438K5092Q7668J67566j03514p1757p3827Q949J718Q5053J6800
2198A295849j02393J5874J7244N2258J8582r9583p962l7286j1204N9698M154l7534
2186A167697J21152p815J21081o9484j8814q4751Q5091j09821J6428k6445J7183
2175A211502p7434n0178J8876m0491K1081O0437L633J8950j4878p9574p0553P8635
2163A080006R97m0935l3681j06496n7932J9968J33788M5948N5806j23756K4318
2152I98031Q144j5645M2616m4591p9111L5919O0248J47210j27691N6216k1429
$$ plain form
2233 1406804 1320135 1357642 1455612 1538187 1616114 1504942 1427980 1371597 1350934 1357355 1351621 1376132
2221 1376132 1307114 1310590 1357719 1496485 1488784 1474333 1334683 1164795 1156453 1155009 1218790 1221539
2209 1221539 1152101 1177193 1264861 1432427 1328913 1257156 1183329 1192278 1193996 1279049 1295849
2198 1295849 1193456 1209330 1226574 1278832 1297414 1197831 1189869 1152583 1141379 1201077 1205231 1167697
2186 1167697 1288849 1281034 1402115 1332631 1313817 1229066 1314157 1204336 1220764 1194319 1211502
2175 1211502 1134068 1083890 1102766 1062275 1083356 1143793 1147426 1166376 1151498 1071924 1001371 1080006
2163 1080006 1081003 1040068 1006387 899891 841959 861927 995715 1041663 1097469 973713 998031
2152 998031 1006175 990530 1033146 988555 909444 945363 1005611 1152821 1025130 1081346 1059917
2141A059917j3743L4582k4551N138m8505J3279N1334j7403r2431J4486N689M0072
2129A027864J04808L7775o0867j9104J7388r8058J8354O0063O704j8154o1794
2118A014979O5681K9701K1411P0694n5373r7779o7487r8147J743J661M3300Q1946
2106A012330J862M2739j17289j05572Q2558k8299p993k1587k2216J01067J7378
2095I54978l1186o7647J8076l9097l2322l5949j00714j9857Q2500M3760J43004
2084I15546l5609J2017r3778k1327n2683k1370K4602J4845j5742N438Q7974k1062
2072G98851o145o718q0865k5095j7852J07845K5804j09200M6011L145K00130o3522
2060H72389k2839m4698n2495K9110l2569L0068r5733O0304P9202j4062P46m5744
$$ plain form
2141 1059917 1046174 1080756 1056205 1061343 1012838 1026117 1077451 1060048 967617 982103 987792 1027864
2129 1027864 1132672 1170447 1109580 1090476 1107864 1009806 1028160 1088223 1094927 1076773 1014979
2118 1014979 1080660 1110361 1131772 1202466 1147093 1049314 981827 883680 885423 887084 930384 1012330
2106 1012330 1014192 1056931 939642 834070 916628 888329 880336 858749 836533 937600 954978
2095 954978 923792 856145 874221 835124 802802 766853 666139 646282 728782 772542 915546
2084 915546 879937 891954 798176 776849 724166 702796 727398 742243 726501 731939 819913 798851
2072 798851 792706 785988 705123 680028 662176 770021 795825 686625 732636 735781 935911 872389
2060 872389 849550 804852 752357 781467 748898 778966 683233 743537 822739 808677 809423 763679
2048G63679N3144l3759M5577j10060l7061l5516o797O9979O2034O6558k347O2214
2036H97645J32046p3995p0975m6798Q571M6157R536O3924M0740N1029O9927o9280
2024A058527j25814p0530P0723P1107N1078M417P4921L7575J5717O3191J26386
2013A377298j168K6215M3418j9466L8385J19384K00352Q6387N5647J07407R8192
2002B132051N9106J45868J53491J94674L9649P3396q9432M350j21671p5269j68871
1991B347342K6598n8055j94847n2487J36993o7127m2572j24726R6791r686Q7311
1980B145535L0792L4244K7458K2534J06734J0939J59239J57674K90990J91186
1970C177325J78280J67186K59300K69014K63856K54236J40749p0279j98825k37690
$$ plain form
2048 763679 816823 783064 828641 718581 681520 646004 639207 709186 771220 837778 835431 897645
2036 897645 1029691 955696 884721 837923 846494 892651 902187 966111 1006851 1057880 1127807 1058527
2024 1058527 932713 862183 932906 1004013 1055091 1059508 1134429 1172004 1187721 1250912 1377298
2013 1377298 1376130 1402345 1445763 1426297 1464682 1584066 1784418 1870805 1926452 2033859 2132051
2002 2132051 2191157 2337025 2490516 2685190 2724839 2798235 2708803 2713153 2591482 2516213 2347342
1991 2347342 2373940 2315885 2121038 2068551 2205544 2138417 2095845 1971119 2067910 2058224 2145535
1980 2145535 2176327 2210571 2238029 2260563 2367297 2378236 2537475 2695149 2986139 3177325
1970 3177325 3355605 3522791 3782091 4051105 4314961 4569197 4709946 4639667 4440842 4203152
1960D203152j17584l09149j93324l00724j67439k07852j72604k11630r7277j25558
1950B300011r9479j2781m0820o4935q5763j21391j1374l1092J55590M3531r945
1939B021552l9225K8559Q2985J12490P0819P4193Q7930P9877J63471J0196j52315
1928B540532j10738q2598j33501j04994j50645k33598j24551j0272o1172k4668
1918A503795j27051p2552o9183K9567r885j34116j27640r7015k4116p0779P389
1907H08414O7116j22066r600K6211N1308o4481p8509m1773p6265k3079K9374m3607
1895E23043q353K238N6696l8169J8391j68322o3053m5030J05961Q0038j36276
1884C27164L3479l0093Q704Q9815J5108r0503j06435N5955K7078N7825J9321P1532
$$ plain form
1960 4203152 4085568 3776419 3583095 3282371 3114932 2907080 2734476 2522846 2425569 2300011
1950 2300011 2200532 2187751 2146931 2081996 1996233 1874842 1863468 1832376 1987966 2031497 2021552
1939 2021552 1982327 2010886 2093871 2206361 2277180 2351373 2439303 2519180 2682651 2692847 2540532
1928 2540532 2429794 2347196 2213695 2108701 1958056 1724458 1599907 1589635 1528463 1503795
1918 1503795 1376744 1304192 1235009 1264576 1254691 1120575 992935 895920 871804 801025 808414
1907 808414 875530 753464 743864 770075 821383 756902 678393 636620 560355 537276 566650 523043
1895 523043 514690 516928 573624 535455 553846 385524 322471 277441 383402 463440 327164
1884 327164 360643 330550 339254 429069 444177 353674 247239 303194 330272 388097 407418 478950
1872D78950k5143n3484K466J932n1620q1721O069J989O9125q7441j5605j555m2350
1859B01612R6150J7827q3057m7006k9911N6586M0194Q1115l7931m1147j06436
1848A47996L6415N4095P6151p3252m6763k3608l5011N9397J0251l8936K7555k529
1836A91761N7532M1652N7609r0124m9118K4976l6634M7523l0494j4438l5455k0137
1824A44653J24206p20o0750m8172n3355Q606N9281k7732j1301o9068p95R0470
1812A55323J5144k487j3162L5974R665L2109K267m7680o6486K3311L615J01465
1800B49058J0888N4065j01170M2119n7594j7406K2174l2794q8406n2872N8861
1789H6923Q8710J11751Q7173n9746m1409q6413K03026j00453j06170J342q0052
$$ plain form
1872 478950 453807 400323 402789 404721 353101 271380 277449 279438 348563 261122 245517 243962 201612
1859 201612 297762 315589 232532 185526 155615 212201 252395 333510 295579 254432 147996
1848 147996 184411 238506 314657 241405 194642 171034 136023 195420 205671 166735 194290 191761
1836 191761 249293 290945 348554 258430 209312 234288 197654 245177 214683 200245 164790 144653
1824 144653 268859 268139 207389 159217 105862 114468 173749 146017 134716 65648 64853 155323
1812 155323 170467 167980 154818 190792 200457 232566 234833 187153 120667 143978 147593 249058
1800 249058 259946 314011 212841 254960 197366 179960 202134 169340 80934 28062 86923
1789 86923 175633 287384 374557 314811 273402 186989 390015 289562 183392 184734 104682
1778A04682J26651p905L0375l3507o55q138n4613l3362L320N1218K5392J5934
1766B19392p296J8442n882o6303K7845J0042L6637r820J9146p3266K5370K8844
1754B23151O1508O655n9829p6366q004M2733J02691L8914K3716j24482k2296n3872
1742A54519J4202L0545P736l969k1867P6395L4384L8923o6242l7597M9570l5468
1730B41131k4690r3079K8376J02930R2506n5033k10619m8504J0449R115O4355
1719A16937L7764p705m5490m1820n489L9012Q0203P8791J5591j37471n6322L0904
1707A04905N6951j4827R221q4637p703P5750r1532M8765P8562O9730K5696j4810
1695B56071j16953n7535K311M3235R8855k1674L6208r1716J9620o2153o5864N2557
$$ plain form
1778 104682 231333 223428 253803 220296 219641 211503 156890 123528 126848 178066 203458 219392
1766 219392 212096 230538 224656 158353 186198 196240 232877 223057 242203 168937 194307 223151
1754 223151 284659 291314 231485 155119 147115 189848 292539 331453 355169 230687 208391 154519
1742 154519 168721 199266 207002 203033 181166 257561 291945 330868 264626 227029 276599 241131
1730 241131 216441 123362 151738 254668 347174 292141 81522 33018 43467 52582 116937
1719 116937 154701 146996 101506 59686 54197 93209 173412 252203 267794 130323 74001 104905
1707 104905 161856 147029 156250 71613 63910 139660 48128 96893 175455 245185 270881 256071
1695 256071 139118 81583 83894 127129 225984 204310 240518 148802 168422 106269 40405 92962
1683I2962j884o7352n5446Q6290R3056p3117K9032n2360k2654M7576m9789m8020
1671b1706o0884N3934Q7102J0974j4283j5875L2735L9874K3600p7103j38436l4275
1659a14343j1677J08937K2351J64692n4075k0961Q9359l9625R8101j39032k8044
1648G5683r9119l7054J0719P1095P9550K0905L0805m8408n0952p570n937p6979
1636c7262j6054L8930J5755n075m3488M3422R365O8895K1901j01918j08998j8085
1624a32612O9602L0514k0053L6141K364j8326m835K5059O4776K6359J7563j08315
1612a1763p6481L4482R8602k8685M0608K5636k3172p7462K3429L9684l9586r773
1600d481j0028M1534o1187Q9224J16904L1693q1964m3399q6612j38410P946l3715
$$ plain form
1683 92962 91078 23726 -31720 54570 147626 74509 103541 51181 28527 76103 26314 -21706
1671 -21706 -82590 -28656 58446 69420 55137 39262 71997 111871 135471 58368 -80068 -114343
1659 -114343 -126020 -17083 5268 169960 115885 94924 184283 144658 242759 103727 75683
1648 75683 -23436 -60490 -49771 21324 100874 121779 152584 104176 53224 45654 39717 -37262
1636 -37262 -53316 -14386 1369 -3706 -47194 -3772 5593 74488 96389 -5529 -114527 -132612
1624 -132612 -63010 -32496 -52549 -16408 -14044 -32370 -37205 -12146 52630 78989 96552 -11763
1612 -11763 -88244 -53762 44840 16155 56763 82399 59227 -18235 5194 44878 5292 -4481
1600 -4481 -14509 27025 -34162 55062 171966 203659 121695 78296 -8316 -146726 -138780 -172495
1588a72495J01747N5970L6661K9919p2207R4515L809n3115N7706j0121j13810
1577d1421n6134N7614P2889M1134j16382j11499j05104Q2867J77447N5685m5798
1566A1298l5429l1240P6797M6382J2553M4305j06120M673p9078L6579M496J01494
1554H6710j5977j00736K0946j08420M6809J5328N3965J08464Q4649j04992m5941
1543D0805m4369Q2035j1402l1203n1173P846m0645j392l2041J24838M0977o121
1531G8155p516J0135q4162r2153K36m903O57Q7221K8034L9217k7604L3564K2569
1518H3450o5456O7938r4171o5931k3537R0141M7771N5467M2600J2014l6491N269
1506A19064k6743r3514q3533L0119o9Q3732L0197N9357P1979p054j8615r9181
$$ plain form
1588 -172495 -70748 -14778 21883 51802 -20405 74110 77919 24804 82510 72389 -41421
1577 -41421 -97555 -39941 32948 74082 -42300 -153799 -258903 -176036 1411 57096 11298
1566 11298 -24131 -55371 21426 67808 80361 124666 18546 23219 -55859 -19280 -14784 86710
1554 86710 70733 -30003 -9057 -117477 -70668 -55340 -1375 107089 191738 86746 40805
1543 40805 -3564 78471 67069 35866 -15307 -7461 -48106 -49498 -81539 43299 84276 78155
1531 78155 70639 80774 -3388 -95541 -95305 -100208 -99551 -12330 15704 54921 27317 60881 83450
1518 83450 17994 85932 -8239 -74170 -97707 -7566 40205 95672 138272 150286 113795 119064
1506 119064 92321 -1193 -84726 -54607 -54676 29056 59253 118610 190589 183535 164920 65739
1494F5739j9481K6846O044K7769L3955k3677o9266j0723L7785M9463p3032J2198
1482F3620j31162m8774j2969J03572J9929K4366L6697J9635j0403P5494o4714
1471G5291Q9653n223J52j26234o1578P3885R2054k2409N1885r214r6691j13669
1459e2098L4555O7150N0875m2057l1199p1537l7003R3390m4317R1466k6410J5631
1447D8446l9242n5485j8430R6565N4730n0881p406O9459q7366J5239J9970N6254
1435A01853m7273j7955p7377o9356j10043J71197P2874J21257o9876q5877n3185
1424f3761L7013Q0922m4931N0294K1769q3165j6536M2073p4404J316L6212r647
1412b2845m9070r888j0820K3893R4395j4983J7885l7886n1537N5594J6465P7882
$$ plain form
1494 65739 46258 73104 79148 106917 140872 117195 47929 37206 74991 124454 51422 63620
1482 63620 -67542 -116316 -129285 -25713 -5784 18582 55279 74914 64511 140005 75291
1471 75291 164944 159721 159873 33639 -27939 45946 138000 115591 167476 158262 61571 -52098
1459 -52098 -17543 49607 100482 58425 27226 -44311 -81314 12076 -32241 59225 32815 48446
1447 48446 9204 -46281 -64711 31854 86584 35703 28297 97756 10390 25629 45599 101853
1435 101853 54580 36625 -40752 -110108 -220151 -48954 23920 145177 75301 -10576 -63761
1424 -63761 -26748 54174 9243 59537 81306 -1859 -18395 23678 -50726 -49410 -13198 -22845
1412 -22845 -71915 -81803 -92623 -68730 25665 10682 28567 -9319 -60856 -5262 11203 89085
1400H9085k3394J4947k2173l861O4891P3456q8414j06353j5099o6088K1757Q022
1388e3224R2191p209L2115k3999n3752o7369M9386n4371m6630j5686K8026O3426
1376e7096R1315q3964k4011M8452M9000n8645m927l9231m804J6070n0228J19199
1364A130R198O1528k2353k5709j17792K0067p8382J40783L0555N9562k0311n4760
1352C516m8258L5133N167O0792L41K4268l6683p3583k6270J6626J7262n233p0825
1339i7747j1262j1260P322n2739l060J21293M6456r178j07700r1074k4831R6724
$$ plain form
1400 89085 65691 80638 58465 54604 119495 192951 104537 -1816 -16915 -83003 -61246 -53224
1388 -53224 38967 31758 63873 39874 -13878 -81247 -31861 -86232 -132862 -148548 -120522 -57096
1376 -57096 34219 -49745 -73756 -25304 23696 -34949 -39876 -79107 -83911 -67841 -118069 1130
1364 1130 10328 71856 49503 23794 -93998 -73931 -152313 -11530 19025 78587 58276 3516
1352 3516 -44742 -9609 -4442 56350 56691 80959 44276 -29307 -55577 -38951 -21689 -26922 -97747
1339 -97747 -109009 -120269 -112947 -165686 -168746 -47453 -997 -10175 -117875 -208949 -233780 -137056
$$ [...]
##END NTUPLES=NMR SPECTRUM
##END=
