##TITLE=1H_CA-8821-1
 CDCl3,8 sc, 
 10.02.2021
##JCAMPDX= 6.0         $$ Bruker NMR JCAMP-DX V2.0
##DATA TYPE= NMR SPECTRUM
##DATA CLASS= NTUPLES
##ORIGIN= UXNMR, Bruker Analytische Messtechnik GmbH
##OWNER= root
$$ XWIN-NMR		Version 3.5
$$ Wed Feb 10 10:15:26 2021 Russian Standard Time (UT+4h)  she@DPX200
##.OBSERVE FREQUENCY= 200.1315066352
##.OBSERVE NUCLEUS= ^1H
##.ACQUISITION MODE= SIMULTANEOUS
##.ACQUISITION SCHEME= undefined
##.AVERAGES= 8
##.DIGITISER RES= 18
##SPECTROMETER/DATA SYSTEM= spect
##.PULSE SEQUENCE= zg30
##.SOLVENT NAME= CD3CN
##.SHIFT REFERENCE= (INTERNAL, CD3CN, 0, 16.0445)
##AUDIT TRAIL= $$ (NUMBER, WHEN, WHO, WHERE, WHAT)
$$ ##TITLE= Audit trail, XWIN-NMR		Version 3.5
$$ ##JCAMPDX= 5.01
$$ ##ORIGIN= Bruker BioSpin GmbH
$$ ##OWNER= she
$$ F:/spectra/data/she/nmr/H-F/1/pdata/1/auditp.txt
$$ ##AUDIT TRAIL=  $$ (NUMBER, WHEN, WHO, WHERE, WHAT)
(   1,<2021-02-10 10:14:02.03 +0400>,<she>,<DPX200>,
      <created by zg, POWCHK disabled, PULCHK disabled
       configuration hash MD5:
       00 E9 B6 7A A2 85 ED C7 34 08 36 98 17 FE 4E 26
       data hash MD5: 16K
       74 65 F9 92 49 E3 4A 9C 48 66 93 6E 30 13 48 CC>)
(   2,<2021-02-10 10:14:05.75 +0400>,<she>,<DPX200>,
      <Start of raw data processing
       efp BC_mod = 2 LB = 0.24 FT_mod = 6 PKNL = 1 PHC0 = -10760.5 PHC1 = 16.20094 SI = 16K 
       data hash MD5: 16K
       6B 02 2E 9E 31 06 CC 15 B9 2C 9D 15 BF 91 8C E7>)
(   3,<2021-02-10 10:14:08.73 +0400>,<she>,<DPX200>,
      <abs ABSG = 5 
       data hash MD5: 16K
       0B 55 7C E2 13 A5 C8 A4 B9 FB D7 5D 7D 84 A3 CD>)
(   4,<2021-02-10 10:14:25.42 +0400>,<she>,<DPX200>,
      <pk PHC0 = -3.201709 PHC1 = 4.200001 
       data hash MD5: 16K
       D8 74 90 6C 70 4E 6F 01 AF 7D 27 79 DF 9F C4 35>)
(   5,<2021-02-10 10:14:28.85 +0400>,<she>,<DPX200>,
      <abs ABSG = 5 
       data hash MD5: 16K
       2F 06 71 DA 64 9E 84 FC DA 21 63 5A A0 D1 14 DD>)
$$ ##END=
$$ 
$$ hash MD5
$$ F8 B1 4D 94 E6 A0 A3 20 69 17 37 FB CB EB E9 47
##$RELAX= 
##$RELAX= 
##$RELAX= 
##$RELAX= 
##$RELAX= 
##$RELAX= 
$$ Bruker specific parameters
$$ --------------------------
##$DU= <F:/spectra>
##$EXPNO= 1
##$NAME= <H-F>
##$PROCNO= 1
##$TYPE= <nmr>
##$USER= <she>
##$AMP= (0..31)
100 100 100 100 100 100 100 100 100 100 100 100 100 100 100 100 100 100 
100 100 100 100 100 100 100 100 100 100 100 100 100 100 
##$AQSEQ= 0
##$AQ_mod= 1
##$AUNM= <au_zg>
##$AUTOPOS= <>
##$BF1= 200.13
##$BF2= 200.13
##$BF3= 200.13
##$BF4= 200.13
##$BF5= 200.13
##$BF6= 200.13
##$BF7= 200.13
##$BF8= 200.13
##$BYTORDA= 1
##$CFDGTYP= 0
##$CFRGTYP= 5
##$CHEMSTR= <none>
##$CNST= (0..31)
1 1 145 1 1 1 1 1 1 1 1 1 1 1 1 1 1 1 1 1 1 1 1 1 1 1 1 1 1 1 1 1 
##$CPDPRG= <>
##$CPDPRG1= <>
##$CPDPRG2= <>
##$CPDPRG3= <>
##$CPDPRG4= <mlev>
##$CPDPRG5= <mlev>
##$CPDPRG6= <mlev>
##$CPDPRG7= <mlev>
##$CPDPRG8= <mlev>
##$CPDPRGB= <>
##$CPDPRGT= <>
##$D= (0..31)
0 1.2 0 0 0 0 0 0 0 0.06 0 0.03 0 0 0 0 0.0002 0 0 0 0 0 0 0 0 0 0 0 0 
0 0 0 
##$DATE= 1612937641
##$DBL= (0..7)
$$ [...]
##$SUBNAM3= <"">
##$SUBNAM4= <"">
##$SUBNAM5= <"">
##$SUBNAM6= <"">
##$SUBNAM7= <"">
##$SUBNAM8= <"">
##$SUBNAM9= <"">
##$SW= 16.9725356469052
##$SWIBOX= (0..15)
0 0 2 0 0 0 0 0 0 0 0 0 0 0 0 0 
##$SW_h= 3396.73913043478
##$TD= 16384
##$TD0= 1
##$TE= 0
##$TE2= 300
##$TE3= 300
##$TEG= 300
##$TL= (0..7)
0 120 120 120 120 120 120 120 
##$TP= (0..7)
150 150 150 150 150 150 150 150 
##$TP07= 0
##$TPNAME0= <>
##$TPNAME1= <>
##$TPNAME2= <>
##$TPNAME3= <>
##$TPNAME4= <>
##$TPNAME5= <>
##$TPNAME6= <>
##$TPNAME7= <>
##$TPOAL= (0..7)
0.5 0.5 0.5 0.5 0.5 0.5 0.5 0.5 
##$TPOFFS= (0..7)
0 0 0 0 0 0 0 0 
##$TUNHIN= 0
##$TUNHOUT= 0
##$TUNXOUT= 0
##$USERA1= <user>
##$USERA2= <user>
##$USERA3= <user>
##$USERA4= <user>
##$USERA5= <user>
##$V9= 5
##$VALIST= <valist>
##$VCLIST= <CCCCCCCCCCCCCCC>
##$VD= 0
##$VDLIST= <DDDDDDDDDDDDDDD>
##$VPLIST= <PPPPPPPPPPPPPPP>
##$VTLIST= <TTTTTTTTTTTTTTT>
##$WBST= 1024
##$WBSW= 4
##$XGAIN= (0..3)
0 0 0 0 
##$XL= 0
##$YL= 0
##$YMAX_a= 909147
##$YMIN_a= -647686
##$ZGOPTNS= <>
##$ZL1= 120
##$ZL2= 120
##$ZL3= 120
##$ZL4= 120
##$ABSF1= 15.98128
##$ABSF2= -0.9913816
##$ABSG= 5
##$ABSL= 3
##$ALPHA= 0
##$AQORDER= 0
##$ASSFAC= 0
##$ASSFACI= 0
##$ASSFACX= 0
##$ASSWID= 0
##$AUNMP= <proc_1d>
##$AZFE= 0.1
##$AZFW= 0.1
##$BCFW= 0
##$BC_mod= 2
##$BYTORDP= 0
##$COROFFS= 0
##$CY= -3
##$DATMOD= 1
##$DC= 0
##$DFILT= <>
##$DTYPP= 0
##$F1P= 0
##$F2P= 0
##$FCOR= 1
##$FTSIZE= 16384
##$FT_mod= 6
##$GAMMA= 0
##$GB= 0
##$INTBC= 1
##$INTSCL= 2.992141e-10
##$ISEN= 128
##$LB= 0.24
##$LEV0= 0
##$LPBIN= 0
##$MAXI= 10000
##$MC2= 0
##$MEAN= 0
##$ME_mod= 0
##$MI= 1.114404
##$NCOEF= 0
##$NC_proc= -6
##$NLEV= 6
##$NOISF1= 3.799351
##$NOISF2= 2.8
##$NSP= 0
##$NTH_PI= 0
##$NZP= 0
##$OFFSET= 16.04447
##$PC= 1
##$PHC0= -10763.7
##$PHC1= 20.40094
##$PH_mod= 1
##$PKNL= yes
##$PPARMOD= 0
##$PSCAL= 0
##$PSIGN= 0
##$REVERSE= no
##$SF= 200.12999402449
##$SI= 16384
##$SIGF1= 3
##$SIGF2= 2
##$SINO= 5.538805
##$SIOLD= 16384
##$SREGLST= <1H.CDCl3>
##$SSB= 0
##$STSI= 16384
##$STSR= 0
##$SW_p= 3396.73913043478
##$SYMM= 0
##$S_DEV= 0
##$TDeff= 16384
##$TDoff= 0
##$TI= <>
##$TILT= no
##$TM1= 0
##$TM2= 0
##$TOPLEV= 0
##$USERP1= <user>
##$USERP2= <user>
##$USERP3= <user>
##$USERP4= <user>
##$USERP5= <user>
##$WDW= 1
##$XDIM= 16384
##$YMAX_p= 518458432
##$YMIN_p= -667346
$$ End of Bruker specific parameters
$$ ---------------------------------
##NTUPLES= NMR SPECTRUM
##VAR_NAME=  FREQUENCY,     SPECTRUM/REAL,   SPECTRUM/IMAG
##SYMBOL=    X,             R,               I
##VAR_TYPE=  INDEPENDENT,   DEPENDENT,       DEPENDENT
##VAR_FORM=  AFFN,          ASDF,            ASDF
##VAR_DIM=   16384,         16384,           16384
##UNITS=     HZ,            ARBITRARY UNITS, ARBITRARY UNITS
##FACTOR=    0.207333158178281, 1,           1
##FIRST=     3210.97965187925, 0,            0
##LAST=      -185.759478555527, 0,           0
##MIN=       -185.759478555527, -667346,     0
##MAX=       3210.97965187925, 518458432,    0
$$ Real data points
##PAGE= N=1
##DATA TABLE= (X++(R..R)), XYDATA
$$ [...]
6708C05999M1891P0123l5810j30645L6532q8949O2908J80825q0176j49640J3876
6697B26934P9667o6748Q3628J47377K8510r0805M669R2926j32548J04955o2442
6686D16123M8370k9143L0085Q0206J28236j65263j6936m6738P761n0117L3212
6675D35796P1459n4220j00327N0918M8113N788L8042l5423j27001L8354J7537
6664C89036L5206k2293M405j0886O8840k899j41232j596Q4702Q0898k21737N9030
6652C21474j1106P9621K5680M4707j68642p012Q337k680J26968j5080j05129j47085
6640A50053P8864j41470L7968N4329j4394Q2227J40270j18232M3157J33239l1663
6629D14348L843m582N8021R381m19M3188r1844N8481P583k12643J2927N6262K4318
$$ y = [305999, 347890, 418013, 382203, 251558, 288090, 199141, 262049, 442874, 362698, 213058, 226934, 306601, 239853, 323481, 470858, 499368, 408563, 413232, 506158, 373610, 478565, 416123, 464493, 435350, 465435, 545641, 673877, 508614, 491678, 444940, 452701, 402584, 435796, 507255, 453035, 352708, 403626, 451739, 457527, 495569, 460146, 333145, 371499, 389036, 424242, 401949, 406354, 395468, 464308, 461409, 320177, 318581, 403283, 484181, 262444, 321474, 310368, 389989, 415669, 460376, 291734, 284722, 293059, 290379, 417347, 402267, 297138, 150053, 228917, 87447, 125415, 179744, 165350, 247577, 387847, 269615, 312772, 446011, 414348, 418191, 413609, 471630, 481011, 480592, 523780, 431936, 490417, 498000, 285357, 298284, 354546, 378864]
6616C78864O4166r3024m5839K0037O502Q7518j46364K7934J01843J3674j25371
6605B89940Q4188J50320O0576j15593j00044j05042L2653K4846k9339J9370K0415
6594C32290J24982N9662j22916M729J1110M1539l4382J5548K3900O951J33929
6583E97342m1582k7924j3156Q6706r5773N5597j27245o2506K880J13328J22465
6572F10132P3316J9534J6425J71232J0040J55257L5454N2503J05720m9249n6270
6561A144094J38320J03594N3057p3858M3436m9438j88711N7592J1200n897j02598
6550A130791P0101n59Q7316M861k5408q498r2889j73924J3544k0277o5812K2705
6538I41951L8737M2808L3296j35588J27512J35568m0432N2748Q0697Q9433J8180
$$ y = [378864, 443030, 350006, 304167, 324204, 330706, 418224, 271860, 299794, 401637, 415311, 289940, 374128, 524448, 585024, 469431, 369387, 264345, 296998, 321844, 292505, 311875, 332290, 457272, 516934, 394018, 398747, 409857, 451396, 417014, 432562, 456462, 463413, 597342, 555760, 527836, 514680, 601386, 505613, 561210, 433965, 371459, 374339, 487667, 610132, 683448, 702982, 719407, 890639, 900679, 1055936, 1091390, 1143893, 1249613, 1200364, 1144094, 1282414, 1386008, 1439065, 1365207, 1408643, 1359205, 1170494, 1228086, 1239286, 1233389, 1130791, 1200892, 1200333, 1287649, 1292510, 1267102, 1258604, 1165715, 991791, 1005335, 985058, 919246, 941951, 980688, 1023496, 1056792, 921204, 1048716, 1184284, 1143852, 1196600, 1277297, 1366730, 1384910]
6527A384910N6670P1679P235j95243J13090M6575j21522j45806J19990J20901
6517A458479m8833O0212Q5090M8457n4035l4315L3118j30356Q1001r8504l8171
6506A362143j03377o4875P3891n6115j11450j00430J39634q6204j07611o3006
6496H82600Q4901p1735j12697p7609l004M2323o7173K8664j5146n1771K1088P8802
6484G39243K3051J6342L9529L7796k9311M5004o583J65887O2926j04233m4275
6473I45376J47655k11451O3175q4165n6098N995m5418j86566j80822K3700R7135
6462E18516J1936j48072m1596k276n7856Q2304O81j32691J31567O9515o2689j33997
6450B35342N7508j3954p5614K0548p161j67089Q1951N9327j18318J10135O492
$$ y = [1384910, 1441580, 1513259, 1520494, 1325251, 1438341, 1484916, 1363394, 1217588, 1337578, 1458479, 1409646, 1469858, 1554948, 1603405, 1549370, 1515055, 1548173, 1417817, 1498818, 1400314, 1362143, 1258766, 1193891, 1267782, 1211667, 1100217, 999787, 1139421, 1053217, 945606, 882600, 967501, 895766, 783069, 705460, 702456, 744779, 677606, 706270, 691124, 639353, 660441, 739243, 762294, 778636, 818165, 855961, 826650, 871654, 865071, 1030958, 1093884, 989651, 945376, 1093031, 881580, 944755, 860590, 804492, 810487, 765069, 578503, 397681, 421381, 518516, 530452, 382380, 340784, 338508, 280652, 362956, 363637, 230946, 362513, 432028, 369339, 235342, 292850, 278896, 203282, 223830, 216669, 49580, 131531, 190858, 72540, 182675, 189167]
6439A89167o1268K2043J07192L7028j49942l9940K1751L0537j9448J08033q759
6428B36394o2833o6612M8273j09097R8052j5714j08818j6162M7259k6974Q2176
6417A05944J60666P6270j74776k9280p329n8126M1228J13852N1702K4133M863
6406C09147J14510o1919k2133J8812P444j23288M0720k2453p5006J12459N1682
6395C49975o7510O7385N2320J1992J19469m1543Q9130Q4175R5157m4628N5835
6384G71757p0412O0694N9164Q8247P0010L9300J61855q967j2949J75816J01214
6373A435729K56650L6362J47930K77176J04311k4223m4040M7883m4975J19421
6363B312224k2957K9507n4468p7254N8576k49588j38535j02364J847j40942o097
$$ y = [189167, 127899, 149942, 257134, 294162, 144220, 104280, 126031, 156568, 137120, 245153, 236394, 173561, 106949, 155222, 46125, 144177, 128463, 19645, 3483, 50742, 23768, 105944, 266610, 342880, 168104, 138824, 131495, 73369, 114597, 228449, 280151, 304284, 309147, 423657, 361738, 339605, 358417, 365861, 242573, 283293, 260840, 185834, 298293, 349975, 282465, 349850, 402170, 414162, 533631, 492088, 581218, 665393, 760550, 715922, 771757, 701345, 762039, 821203, 909450, 979460, 1018760, 1180615, 1171648, 1158699, 1334515, 1435729, 1692379, 1728741, 1876671, 2153847, 2258158, 2233935, 2189895, 2237778, 2192803, 2312224, 2289267, 2318774, 2264306, 2187052, 2245628, 1996040, 1857505, 1755141, 1756988, 1616046, 1609949]
6352A609949m4424J12129j7672R278K17545M2684n5354J80523J11676N4745j8162
6341B202917K3443J6329o6190j46467j752r9425q8425N9764q6300J9689r9890
6330A733693j53392k23660k7379k29211j56580J1643r7191j08061o2921J4935
6320G01876o8232j57198O6528n8996k3973m6870N3179q6050K6276q8924Q2745
6309D00361j5672k72425q21k4923L0415j18780q7034J14212J3373m6576M4779
6298C6909P2978J5352j0048q150l8091J223l0131m3415j18098j0848J16266k052
6286a8105j81911L4229K6085q0546j68238J4906K4094l7492Q6562R3995J44274
6275f2147R8662L7873k9291K4503m7965j85610l449j3862j4690o187l8688j02365
$$ y = [1609949, 1565525, 1677654, 1659982, 1669260, 1886805, 1929489, 1874135, 2054658, 2166334, 2221079, 2202917, 2226360, 2242689, 2176499, 2030032, 2028280, 1928855, 1840430, 1900194, 1813894, 1833583, 1733693, 1580301, 1356641, 1329262, 1100051, 943471, 955114, 857923, 749862, 686941, 701876, 633644, 476446, 542974, 483978, 460005, 413135, 466314, 380264, 406540, 317616, 400361, 384689, 112264, 111443, 86520, 116935, -1845, -88879, 25333, 38706, -7870, 36909, 109887, 125239, 115191, 107041, 68950, 70173, 40042, -3373, -121471, -132319, -16053, -18105, -200016, -165787, -139702, -220248, -388486, -373580, -349486, -386978, -300416, -206421, -62147, 36515, 74388, 45097, 69600, 21635, -163975, -167424, -181286, -195976, -202163, -240851, -343216]
6263c43216j8901l6841q6986p1008N9185J48065j9475O3273j41225Q7124M2519
6252c17486J91331j53322J2119J6681m2182O4091J44576j56299p9891O3216M8436
6241b08730m3443q3795j6562K0589j06239l9545J22260Q1515P1826r5895r4212
6230c92231Q6814N1136j10466L2745q4701M5679j7207l1211r1374K19312J16954
6219a74550k9139j55424J06288r653J7980m1633l0268j91705J12484j04280m3598
6208e43498J72724J35986j10089m5695J8275K10274N8413j26545J4341n6423J2959
6197b59278P3866J11407Q1903R7261j77180j06047k6571K0203R262M4985l2179
6186a62368j50677l4909O2250o7444q9708M7565n5702K1509O4607M7958O7140
$$ y = [-343216, -362117, -398958, -485944, -556952, -497767, -349702, -369177, -305904, -447129, -360005, -317486, -126155, -279477, -267358, -250677, -292859, -228768, -84192, -240491, -320382, -257166, -208730, -252173, -335968, -352530, -331941, -438180, -477725, -355465, -273950, -202124, -298019, -392231, -305417, -254281, -364747, -332002, -416703, -371024, -388231, -419442, -510816, -291504, -174550, -203689, -359113, -252825, -262478, -244498, -286131, -316399, -508104, -395620, -499900, -543498, -370774, -234788, -344877, -390572, -372297, -162023, -103610, -230155, -215814, -272237, -259278, -185412, -74005, 7898, 105159, -72021, -178068, -204639, -184436, -175174, -130189, -162368, -313045, -347954, -285704, -353148, -442856, -395291, -450993, -429484, -364877, -316919, -249779]
6175b49779M6803k28508o9061O4067L3724P7824K5338J09739n8861o6308p8537
6164c93559l4709r6908P9654l7474o6519j3261O2176J12666N1419j2997j09988
6153d59500n2743Q3197L3177P6845Q9239O8705k7020p5392m8021j3337K6608J7218
6141b81024m8091J8316m3508o6089k2496J07612Q7168j5489p9719L1702Q5502
6130b26116j28461O4381O7569r3818M1173J11964q2198p0847R4l3080R9634m1034
6118b90739l4671J2185J26728j66532j93005r6424J87212j18911Q1143k071O20
6107d94465j04979Q6733M1347j5324q3242J87154j03903j3610J54077j8573K0275
6096c44510j2278q1668j345R8850j06548O9064J2106J12728k23595J13298O1172
$$ y = [-249779, -202976, -431484, -500545, -436478, -402754, -324930, -299592, -189853, -248714, -315022, -393559, -428268, -525176, -445522, -482996, -549515, -562776, -500600, -387934, -336515, -349512, -459500, -512243, -429046, -395869, -319024, -229785, -161080, -188100, -263492, -311513, -324850, -298242, -281024, -329115, -310799, -354307, -420396, -442892, -335280, -248112, -263601, -343320, -311618, -226116, -354577, -290196, -222627, -316445, -275272, -163308, -245506, -316353, -316259, -349339, -249705, -290739, -325410, -313225, -186497, -353029, -546034, -642458, -455246, -574157, -493014, -495085, -494465, -599444, -512711, -471364, -486688, -569930, -382776, -486679, -500289, -346212, -364785, -344510, -356788, -438456, -439801, -340951, -447499, -378435, -366329, -253601, -477196, -363898, -302726]
6085c02726l431j76145J5161r4695L7451J21779J1906k03835M5298k0503L892
6074e65848Q0312l084j62581J40343J94080q7239R741N1598N5404q3718J22760
6063b48232m3794k19986O790J78445K9614m1495K7583j16336o9605K15365j12945
6052c94596j27745M6414R429j68288J24263Q7086j21111J04706J18261r9248o942
6041d27771J95783j52438p1727R3880q8850k16223K27734J16376j02118N7919
6031c67435K0756q3181m4495R7415k315q2648J41444n9604m1875J64747J20168
6020a37023j10501k4158K2757j18304n8763k2911P4420m3205k674J558n9546J27018
6008c51332O0186l4077q8465M8753j13561J539J56758M0955l7048N8032Q5940
$$ y = [-302726, -306157, -482302, -467141, -561836, -524385, -402606, -390700, -594535, -549237, -569740, -565848, -485536, -488620, -651201, -510858, -316778, -404017, -394276, -342678, -287274, -370992, -248232, -292026, -512012, -505222, -326777, -297163, -338658, -311075, -427411, -497016, -281651, -394596, -522341, -475927, -466498, -634786, -510523, -423437, -544548, -439842, -321581, -420829, -427771, -231988, -384426, -456153, -362273, -451123, -667346, -439612, -323236, -425354, -367435, -346679, -429860, -474355, -376940, -379255, -461903, -320459, -380063, -421938, -257191, -137023, -247524, -271682, -248925, -367229, -425992, -448903, -374483, -417688, -420362, -418804, -478350, -351332, -291146, -325223, -413688, -364935, -478496, -476957, -320199, -279244, -316292, -258260, -172320]
5997a72320j05213k4790R0580N018n5542m2463L7910m35l9623j5879N0639n8071
5985c30189J5188j30526m785R3521l4945M3505p3267N7503Q375N2064O7042m3211
5973b79725o306q451j4535q6713J13942O9001J7848n3146m0236L2475o0503P509
5961c08840j00539O1278K6786K0786J05348L710l1299k13726J94937J07436j23176
5950b57299J2396l9071N3154l9767j03488Q3936J08706o7599j14020Q7694O3965
5939b11393J537L4201M2198j62106M71R9385j27628P8095o3496L4084j0960k1905
5927c07517o0845N1861J59974o1646j47495O9062N421p7266R1435J35072m4108
5916a86052l6632j07705N5291J22599P0004r4003j16027k9177J08346m9716R3640
$$ y = [-172320, -277533, -302323, -211743, -206725, -262267, -304730, -266820, -267255, -306878, -322757, -272118, -330189, -315001, -445527, -450312, -356791, -391736, -348231, -421498, -363995, -355620, -303556, -236514, -279725, -286031, -294482, -309017, -395730, -281788, -212787, -194939, -248085, -288321, -255846, -316349, -308840, -409379, -348101, -321315, -300529, -195181, -191471, -222770, -436496, -241559, -134123, -257299, -244903, -283974, -230820, -270587, -374075, -290139, -181433, -249032, -363052, -275358, -211393, -209856, -175655, -133457, -295563, -295092, -195707, -323335, -245240, -308736, -274652, -285612, -307517, -368362, -316501, -156527, -218173, -365668, -296606, -291185, -368451, -277016, -141944, -186052, -222684, -330389, -275098, -152499, -82495, -176498, -292525, -321702, -213356, -263072, -169432]
5905a69432n1977n8966j71323l024p7231Q7775J28363m2518P3558J42599j3733
5894a55909j38823P8614J48482l3931J1957m6559l3350J9223J14971j64903L1054
5883a69174l5020k8539k6661r5050r897j336Q2383o3843j18751O3343J23595n6532
5871c35482J3090J58639o5103m8526J14220N2050j28136p1261R5782m7353J12923
5860a49157q0698l0043q3199P6206l4174Q145p6545j03541M9844J7791k1474K4776
5848d02069R2980J84313l1123j6389m2844L8833j09150M0490N6650m6654m327
5837b39290j87257P353m5325m8486L748M3686N4140r1492O4295k8736O7661Q4606
5825c15097P0962j15061Q4452K27513m231o6586K3169l5405q2385j3964l2615
$$ y = [-169432, -221409, -280375, -451698, -454722, -531953, -444178, -315815, -358333, -284775, -142176, -155909, -294732, -216118, -67636, -101567, -89610, -136169, -169519, -150296, -35325, -200228, -169174, -204194, -232733, -259394, -354444, -364341, -365677, -283294, -347137, -465888, -402545, -278950, -335482, -322392, -163753, -228856, -277382, -163162, -111112, -239248, -310509, -214727, -262080, -149157, -229855, -259898, -343097, -266891, -301065, -292920, -369465, -473006, -423162, -405371, -426845, -402069, -309089, -124776, -155899, -172288, -215132, -176299, -285449, -244959, -188309, -234963, -239290, -426547, -419194, -464519, -513005, -509257, -465571, -411431, -502923, -438628, -467364, -399703, -315097, -244135, -359196, -274744, -47231, -51462, -118048, -94879, -130284, -212669, -226633, -259248]
5814b59248k7079Q7319j90846j64322K27694k594p0696J09374j1737p0020j13422
5803d85577P7822J6525J05200K9310O3340j48871P9413K2247L6130p7561l5119
5792c17141j05550J10194K1939j8811J34407K5667j7030j27326o5895o3649O6900
5781c56295k4544m3577R0390O6766J99631p7824K8708q657k43363N9902k1541
5770c30404J10991p3361o0219j08400J86368J55716n3405J1111M0300j03105o2926
5759b87334O8015J12436L1886L1266o9556k318k0521j6160o9233J81867q4311
5748a23963l13897J26103J00603j269N8548J06675j60430K5005J20878Q4612j66459
5737a43594J8903Q4593o6080J1897q0707O0528J16056n936j28878L0845j42532
$$ y = [-259248, -286327, -199008, -389854, -554176, -326482, -329076, -399772, -290398, -302135, -372155, -485577, -407755, -391230, -286030, -256720, -193380, -342251, -262838, -240591, -204461, -282022, -317141, -422691, -312497, -290558, -309369, -174962, -149295, -166325, -293651, -359546, -423195, -356295, -380839, -424416, -334026, -267260, -67629, -145453, -116745, -125402, -368765, -308863, -330404, -219413, -292774, -352993, -461393, -275025, -119309, -172714, -161603, -121303, -224408, -287334, -219319, -106883, -74997, -43731, -113287, -115605, -136126, -152286, -221519, -39652, -123963, -437860, -311757, -211154, -212423, -153875, -47200, -207630, -182625, -61747, 22865, -143594, -124691, -40098, -106178, -94281, -174988, -114460, 1596, -4340, -133218, -102373, -244905]
5726b44905J08883R3178Q7349K1523j34200j8120N7052j1485q989K9020k4506
5715d5200J00988K48469j68306k1925n5276J29613l1323q2691n3015J92958K886
5704B17178K0733n9927P393p8353k0872J24044K6784j12618O7573K4092N126J84566
5692D05719q4234o9484Q0791N8834O6978m3722j59789j7629M8891N2042j60588
5681A77809r4135K01410O1225o6278P8917q3966q8688J4483J13224Q593j8339
5670C04255J21509J40783r0768L4038j17173n4532M9886k9120L8365P7680J7082
5659D92005L0290L7849p5650M6762J98P8262m1446n2147P2189p0995L3083K59759
5647H10159L2315R125j752r0369K5269J6332j22533l8912R6940k4399J58802m0729
$$ y = [-244905, -136022, -42844, 44505, 66028, -68172, -86292, -29240, -40725, -49714, -20694, -45200, 55788, 304257, 135951, 114026, 58750, 188363, 157040, 74349, 21334, 214292, 217178, 237911, 177984, 185377, 107024, 86152, 210196, 236980, 124362, 191935, 216027, 221153, 405719, 321485, 252001, 332792, 391626, 458604, 414882, 255093, 237464, 286355, 338397, 177809, 83674, 285084, 346309, 280031, 358948, 274982, 186294, 200777, 314001, 322594, 304255, 425764, 566547, 475779, 509817, 392644, 338112, 387998, 358878, 397243, 474923, 492005, 522295, 560144, 484494, 531256, 531454, 609716, 568270, 516123, 588312, 517317, 550400, 810159, 842474, 851599, 849847, 759478, 784747, 801079, 678546, 639634, 736574, 712175, 870977, 830248]
5635H30248P9756j03851J02211J4158k03530k49230L06693R6411j7711N2475K417
5624I10047N7852L2895k9596Q9341l9487m9891P4935P4611J42038j07922j61800
5613I93023J50684k0028j10584Q2146l0726m3911j3232L9065p8351k8700J39480
5602A078866J37755n5821n9312L8707l5904K25218l960j37916J15804P6029J29632
5591A509098N6875o472q4471N1028m8962J09110M5389Q025K02423o0542N1117
5580A832618L4709J10576l6099Q8762j0177j06548M6032j19096J89465N0304Q0519
5569B161065M2504K4641Q032J16481J85408p0336q982N0350K37431j2384j6870
5558B717340J50734r9037l7189J3858J9726o7867l1820J52908L2065R3825k73
$$ y = [830248, 910004, 806153, 908364, 922522, 718992, 469762, 776455, 872866, 855155, 907630, 910047, 967899, 1000794, 971198, 1060539, 1021052, 971161, 1046096, 1120707, 1262745, 1154823, 993023, 1143707, 1123679, 1013095, 1095241, 1064515, 1020604, 1007372, 1046437, 968086, 939386, 1078866, 1216621, 1160800, 1101488, 1140195, 1104291, 1329509, 1325549, 1187633, 1303437, 1379466, 1509098, 1565973, 1559501, 1475030, 1526058, 1477096, 1586206, 1631595, 1639620, 1842043, 1781501, 1832618, 1867327, 1977903, 1941804, 2030566, 2020389, 1913841, 1959873, 1840777, 2030242, 2080546, 2161065, 2203569, 2228210, 2236242, 2352723, 2538131, 2467795, 2458813, 2509163, 2746594, 2734210, 2717340, 2868074, 2769037, 2731848, 2745706, 2765432, 2697565, 2665745, 2818653, 2850718, 2944543, 2944270]
5547B944270P3411k1132M35m5666J19721R9341Q3333J23773P2456O0993o7819
5536C443116N2287R221K2659j03867J38666N8704L6491L9368L336k1907N8200
5525C736274J33632l6759J24671J37204P7812J06169J38360N8815n4105M2062
5515D464135J18224N9155K1938P4091q4729K27365Q5482k006J7800R7601O4739
5504E143795Q0346J21870P1335l8841J9540J77365J0287K0931Q9840K44644k3836
5493E917276j672O2775N582J84743J82882m5679q1049N6130J9742J87590l852
5482F484468q1633R3006J58364M3845o3774r0979P8739Q0686N4083P8195M2373
5471F877373j26667J73034J28637M994j65970j40843k465J20072R7255M9109M5952
$$ y = [2944270, 3017681, 2996549, 2996984, 2951318, 3071039, 3170380, 3253713, 3377486, 3449942, 3510935, 3443116, 3495403, 3504624, 3527283, 3423416, 3562082, 3620786, 3657277, 3696645, 3699981, 3678074, 3736274, 3869906, 3833147, 3957818, 4095022, 4172834, 4279003, 4417363, 4476178, 4422073, 4464135, 4582359, 4641514, 4663452, 4737543, 4652814, 4880179, 4965661, 4963655, 4981455, 5079056, 5143795, 5224141, 5346011, 5417346, 5378505, 5398045, 5575410, 5585697, 5606628, 5696468, 5941112, 5917276, 5915604, 5978379, 5983961, 6168704, 6351586, 6305907, 6224858, 6280988, 6300730, 6488320, 6484468, 6402835, 6495841, 6654205, 6698050, 6634276, 6543297, 6622036, 6702722, 6756805, 6835000, 6877373, 6750706, 6923740, 7052377, 7057371, 6891401, 6750558, 6748093, 6868165, 6965420, 7014529, 7060481]
5460G060481l6097l6351r133K02320j243j59607J08699J84519M8930j81296M3562
5449G224784j90360L6611o7122m2836j94814K9976J35082l9396K2033m5934o209
5438F861815L8407O6340j88904K5750j7919n1996M8365o3728k6952j15684l8753
5427F536741j459l54239k01951m936P1484N3128P0658l06725l3902j2053R100
5416E825846m0086j66897j20301j01928N9766L1214o4558m1502j74359J1610k21245
5405D997560p4310j34885o8456p9228L7431j51056q0551L9689j21620o2723j22384
5394D179467q5172l5162N6235J55009j13639q5022n4803j0276q1896j12624k5144
5383C786973K9824n593n4941k1041k03663p8928m2022o4063O7085k10826J5915
$$ y = [7060481, 7024384, 6988033, 6978900, 7181220, 7179977, 7020370, 7129069, 7313588, 7362518, 7181222, 7224784, 7034424, 7071035, 7003913, 6961077, 6766263, 6796239, 6931321, 6891925, 6913958, 6868024, 6861815, 6900222, 6966562, 6777658, 6803408, 6785489, 6733493, 6781858, 6718130, 6691178, 6575494, 6536741, 6535282, 6181043, 5979092, 5974156, 6045640, 6098768, 6169426, 5862701, 5828799, 5816746, 5825846, 5785760, 5618863, 5498562, 5396634, 5456400, 5487614, 5423056, 5381554, 5207195, 5218805, 4997560, 4923250, 4788365, 4719909, 4640681, 4678112, 4527056, 4446505, 4486194, 4364574, 4301851, 4179467, 4094295, 4059133, 4115368, 4270377, 4156738, 4071716, 4016913, 4006637, 3924741, 3812117, 3786973, 3816797, 3811204, 3756263, 3735222, 3531559, 3452631, 3410609, 3346546, 3413631, 3202805, 3218720]
5372C218720P9480r4335o1580l6998j24100n9011O7246j04309J27435j08489K8798
5361B932857o3103j46764l367p573n2127j63428l9325k1721M1925j48940O0224
5350B388658n649k13620k6876K1978r2085J69158M5877j05150K0292O7727j20148
5339B150162j2027j94083o2268R1760Q7835n2314n7684J06463l352j10683m5396
5328A898413m8591l2114Q64N5870j05769K881P3663P9865o2827q9507j793k48497
5316A522458J71028O1548O7538p5070R6075p1251N7771O4672j2082j23942n2966
5305A705779J9697N476m8974K2029o7207L5981j17321P9115r6949K4307k9927
5294A532006J82724p6495k0077M5065l5531K37173L1151q7774j12218Q284J9253
$$ y = [3218720, 3298200, 3203865, 3142285, 3105287, 2981187, 2922176, 2989422, 2885113, 3012548, 2904059, 2932857, 2869754, 2722990, 2719623, 2712050, 2659923, 2496495, 2457170, 2435449, 2477374, 2328434, 2388658, 2383009, 2169389, 2142513, 2164491, 2072406, 2241564, 2287441, 2182291, 2202583, 2270310, 2150162, 2138135, 1944052, 1881784, 1973544, 2061379, 2009065, 1951381, 2057844, 2054492, 1943809, 1898413, 1849822, 1817708, 1818572, 1874442, 1768673, 1771554, 1845217, 1925082, 1862255, 1772748, 1770955, 1522458, 1693486, 1755034, 1822572, 1747502, 1843577, 1772326, 1830097, 1894769, 1882687, 1758745, 1705779, 1725476, 1730952, 1681978, 1704007, 1636800, 1672781, 1555460, 1634575, 1537626, 1561933, 1532006, 1714730, 1638235, 1618158, 1663223, 1627692, 1864865, 1896016, 1808242, 1696024, 1704308, 1723561]
5283A723561q8688K5009p2407l9064j10640N9784j5207J03979M4097j35335J34360
5272A629449m3671l7088j1722J57505J28681n0162m5946O3345r0012j6289n6314
5261A627776m0949m2600L7141j24969K06730k9860j25531K11234M5920j44918
5251A619974K9816J01026J2313k6403K9913Q2576Q410L8597m0006j2870J39590
5240A982936j44987j71109P7548M4774m0437L3423K56558j23778N0899N9910j50841
5229A874896j21281J39120Q4146j64079N222J05823l9312K4153L8950j81652L7973
5218A803959q23J08482O1254k9062P9771O1647M1208j5757j22388j5046J14461
5207B087706j1042o3994R3215j28509J5745L4073J16477j5598p3834m1411k3887
$$ y = [1723561, 1634873, 1659882, 1587475, 1548411, 1437771, 1497555, 1482348, 1586327, 1630424, 1495089, 1629449, 1585778, 1548690, 1536968, 1694473, 1823154, 1772992, 1727046, 1790391, 1700379, 1684090, 1627776, 1586827, 1544227, 1581368, 1456399, 1663129, 1633269, 1507738, 1718972, 1764892, 1619974, 1649790, 1750816, 1763129, 1736726, 1766639, 1849215, 1857625, 1896222, 1856216, 1843346, 1982936, 1837949, 1666840, 1744388, 1789162, 1748725, 1782148, 2038706, 1914928, 1965827, 2025737, 1874896, 1753615, 1892735, 1976881, 1812802, 1818024, 1923847, 1884535, 1908688, 1947638, 1765986, 1803959, 1803136, 1911618, 1972872, 1943810, 2023581, 2085228, 2126436, 2110679, 1988291, 1973245, 2087706, 2076664, 2012670, 2105885, 1977376, 1993121, 2027194, 2143671, 2128073, 2054239, 2012828, 1988941]
5196A988941p6458J45658M2769j7154l0010M4809Q2911q189J0406O8946N2778
5185B305407j65044M6816R6985O927O7950J0276O524J4871Q1104j6729n5995p9448
5173B319644k3202J492k2959L0580j75254K08192m5056j49374o7815Q5916N0748
5162B212912J9812J41499L0356o0428Q7554J04126J4526m0086p6358p7182J13720
5151B470451M8818j24984n1897K2460J0031j07890L148m6762n1987J20533J39621
5140B431542j54700Q4793J04296L6991j29704J01087q9905P0383L9139J0660q59
5129B503723P0610P86n1475R3990K1412o8499J7451L8779j06494K5351m24j78499
5117B366711K2227K23452J3199o9543l759L3278j34495J1796n4517l7056M4939
$$ y = [1988941, 1912483, 2058141, 2100910, 2083756, 2053746, 2098555, 2181466, 2173277, 2183683, 2252629, 2305407, 2140363, 2187179, 2284164, 2291091, 2359041, 2369317, 2375841, 2390712, 2471816, 2455087, 2399092, 2319644, 2296442, 2297934, 2274975, 2305555, 2130301, 2338493, 2293437, 2144063, 2076248, 2162164, 2212912, 2232724, 2374223, 2404579, 2344151, 2431705, 2535831, 2550357, 2510271, 2433913, 2356731, 2470451, 2519269, 2394285, 2342388, 2364848, 2374879, 2266989, 2270137, 2223375, 2171388, 2291921, 2431542, 2276842, 2361635, 2465931, 2502922, 2373218, 2474305, 2384400, 2454783, 2493922, 2504582, 2503723, 2574333, 2575119, 2523644, 2617634, 2639046, 2570547, 2587998, 2626777, 2520283, 2545634, 2545210, 2366711, 2388938, 2612390, 2625589, 2556046, 2552287, 2585565, 2451070, 2462866, 2408349, 2371293, 2416232]
5106B416232R3207n6403K7375o7937n7702P5136O9306o4809q6697o167J00738
5095B442279n9529N1274Q303j23447r2076J2681K8189K0741Q2447q28r8307j09641
5083B162086m7538J41371n5481k2163J48478Q3113l5920O0393n2170K4823L2623
5072B439615p7775K870M9420j47219J0222p3924K8890j3766P5333k2911k21790
5061B048965K3652J10385m9303j906O6695l947R5015J65125K2759R222N5671l6530
5049B505803j6185j66990Q6834j17567q714j14387j03959l8386J29664K3938J52070
5038B332121k0579q3978m4657J69841Q7829K0926p0160J86097j8406n0920J3822
5027B521936L533j3577l3210J3358r0310J11803j23006J71915l0238N8077j4206
$$ y = [2416232, 2509439, 2453036, 2480411, 2412474, 2354772, 2429908, 2499214, 2434405, 2347708, 2341541, 2442279, 2382750, 2434024, 2442327, 2318880, 2226804, 2239485, 2267674, 2288415, 2370862, 2370034, 2271727, 2162086, 2114548, 2255919, 2200438, 2178275, 2326753, 2409866, 2373946, 2434339, 2382169, 2406992, 2439615, 2361840, 2364710, 2414130, 2266911, 2277133, 2203209, 2232099, 2218333, 2293666, 2270755, 2048965, 2072617, 2183002, 2133699, 2131793, 2198488, 2194541, 2289556, 2454681, 2477440, 2486662, 2542333, 2505803, 2489618, 2322628, 2409462, 2291895, 2283181, 2168794, 2064835, 2026449, 2156113, 2180051, 2332121, 2311542, 2227564, 2182907, 2352748, 2440577, 2461503, 2391343, 2577440, 2559034, 2508114, 2521936, 2525469, 2511892, 2478682, 2492040, 2401730, 2513533, 2390527, 2562442, 2532204, 2590281, 2576075]
5016B576075N547J07306N0763n0987N689k328j16962Q9935J91072n1038J2694
5005B817766j13360J37027q9598k8744K9253N1319J24154q3958J12576j18424
4995B838011N3121p558n459r9401N2385O4067o609O2583o9472J12144j24180J7619
4983B887251K05069M4518j1607k3326K34412L2252P4345l2744n7423K5974j6471
4972C362250K5500j39748N9060m320q398J17213J820k4914K9434M1055N4441k3149
4960C490244M3560j0460J15885M8374J8328j8286k5579O1343K0519J02394o949
4949C839373N2778L4946N4758J6605R4376J2197N3935O5555J1825N0581J3393
4938D300322J49263l2386j53238N9282j937J07336J86335O2232l2171L278J8666
$$ y = [2576075, 2581622, 2688928, 2739691, 2688704, 2694393, 2692065, 2575103, 2665038, 2856110, 2805072, 2817766, 2704406, 2841433, 2751835, 2723091, 2752344, 2803663, 2927817, 2843859, 2956435, 2838011, 2891132, 2883574, 2878115, 2778714, 2831099, 2895166, 2888557, 2951140, 2881668, 2993812, 2869632, 2887251, 3092320, 3136838, 3125231, 3101905, 3336317, 3368569, 3442914, 3410170, 3352747, 3378721, 3362250, 3387750, 3248002, 3307062, 3302742, 3294344, 3411557, 3413377, 3388463, 3417897, 3458952, 3513393, 3490244, 3533804, 3523344, 3639229, 3687603, 3705931, 3687645, 3662066, 3723409, 3743928, 3846322, 3839373, 3892151, 3927097, 3981855, 3998460, 4092836, 4105033, 4158968, 4224523, 4236348, 4286929, 4300322, 4449585, 4417199, 4263961, 4323243, 4321306, 4428642, 4614977, 4677209, 4645038, 4648316, 4666982]
4927D666982J00402J20145J37030K726r133J63088Q4771K4652J16028J26861k3148
4916E510404j54173R6817j8778Q569J19328J61744L2454q300K22123j665J67333
4905F135856J42486m3439r2246K50956J59320R8635J01504l4936O7835J22724
4895F908695K96705r8635O0365J63063J31424J37746J78913K4234J07926J68087
4885H078523J15181J03203Q4452K14563J05644K71369J60281R1587Q9708J60856
4875I475367J48258J32202J58430K21060J77291K59525N0367R5848J02072K41904
4865A1062324J53253J83576J91458N7536K62521K65952J99324K04992K19959J64222
4855A2965117J24697J66733K52190J24941K74729J56235R1757J92580K31845J26588
$$ y = [4666982, 4767384, 4887529, 5024559, 5027285, 5018152, 5181240, 5266011, 5290663, 5406691, 5533552, 5510404, 5356231, 5453048, 5434270, 5442839, 5562167, 5723911, 5756365, 5748065, 5970188, 5968523, 6135856, 6278342, 6234903, 6142657, 6393613, 6552933, 6651568, 6753072, 6718136, 6785971, 6908695, 7205400, 7106765, 7167130, 7330193, 7461617, 7599363, 7778276, 7802510, 7910436, 8078523, 8193704, 8296907, 8381359, 8595922, 8701566, 8972935, 9133216, 9224803, 9314511, 9475367, 9623625, 9755827, 9914257, 10135317, 10312608, 10572133, 10622500, 10718348, 10820420, 11062324, 11215577, 11399153, 11590611, 11648147, 11910668, 12176620, 12375944, 12580936, 12800895, 12965117, 13089814, 13256547, 13508737, 13633678, 13908407, 14064642, 14156399, 14348979, 14580824, 14707412]
4845A4707412K27989K19621O1999J28906K30801J98527K16635R4222J17949K87848
4835A6491909J71262K61352J98029P5945K19356J50270K40487M0508J85953Q4197
4825A8119268L10524J50159J6602J98537J90715K04309j60858K08952j8394q8844
4815A9130970P4038J86342q3755J9667K68586M4755J20060m2630M2796M4367R2723
4804A9897919n0189j25601K36463l2932j09773R406P4106k02467j1229P3994j04830
4793A9654867j64855k67719j12669l7222n7366o0473p9717k4763l9134q2278k78381
4782A8450290l6289k27520m6184j18170k39278j23300J3374j69154j33641p6129
4772A7293999k64733p9321j43574n3937j44617k71409K1541j12661j96131j24052
$$ y = [14707412, 14935401, 15155022, 15217021, 15345927, 15576728, 15775255, 15991890, 16086112, 16204061, 16491909, 16663171, 16924523, 17122552, 17198497, 17417853, 17568123, 17808610, 17849118, 18035071, 18119268, 18429792, 18579951, 18596553, 18795090, 18985805, 19190114, 19029256, 19238208, 19219814, 19130970, 19205008, 19391350, 19307595, 19327262, 19595848, 19640603, 19760663, 19718033, 19760829, 19805196, 19897919, 19847730, 19722129, 19958592, 19925660, 19815887, 19825293, 19899399, 19696932, 19685703, 19759697, 19654867, 19490012, 19222293, 19109624, 19072402, 19015036, 18954563, 18874846, 18850083, 18810949, 18728671, 18450290, 18414001, 18186481, 18140297, 18022127, 17782849, 17659549, 17672923, 17503769, 17370128, 17293999, 17029266, 16949945, 16806371, 16752434, 16607817, 16336408, 16357949, 16245288, 16049157, 15925105]
4762A5925105j11334k02115j92551j05282l63161j79367l15275j01236j262j58211
4752A4195311j49821j72367j29266m4657j67148j82462k83465j22790j28753n828
4742A2808754k82237j192j71387j92478n4068j92240l21138k27280n6976j93876
4732A1115882m0762j31632l7421j63340m0815m9581r2715j27518p4741k8673j18682
4721A0210002j31833j10701j94270n5479J43796m3821j09553o701r7278o239n7364
4710I540559k16671j26912L182o4670K6380J2648k9291M1912N8222n9813k24980
4699H960566K6930J25875j4951k3678L6552N326L2802J51151J60656q3204l0564
4688I347461l4188J50935k9873m4407L8273l9240M7289Q3332J15153K4876Q7823
$$ y = [15925105, 15813771, 15611656, 15419105, 15313823, 14950662, 14771295, 14456020, 14354784, 14353522, 14195311, 14045490, 13873123, 13743857, 13699200, 13532052, 13349590, 13066125, 12943335, 12814582, 12808754, 12526517, 12525325, 12353938, 12161460, 12107392, 11915152, 11594014, 11366734, 11309758, 11115882, 11075120, 10943488, 10906067, 10742727, 10701912, 10652331, 10559616, 10432098, 10357357, 10328684, 10210002, 10078169, 9967468, 9773198, 9717719, 9861515, 9817694, 9708141, 9701440, 9604162, 9597923, 9540559, 9323888, 9196976, 9200158, 9135488, 9161868, 9174516, 9145225, 9187137, 9245359, 9185546, 8960566, 8987496, 9113371, 9098420, 9074742, 9111294, 9116620, 9149422, 9300573, 9461229, 9378025, 9347461, 9313273, 9464208, 9434335, 9389928, 9428201, 9388961, 9436250, 9519582, 9634735, 9659611, 9747434]
4677I747434J71392J97183l0308j40384J81963R6111J9483L7868J76399J09193
4667A0566334J01522J84712P0541J96847o6475J30953J25678J09766p380J05717
4657A1518215L72352J42984K03474R7990J3456N7708K11654J77010Q214K51524
4647A3054581J52211K70479J35495J19461K69700J75528K49528P5517M1373K00574
4637A4744447K62316J58634K57136K75993o683J46903R4872O3520J76911J73788
4627A6347837J56401P3209L91380J59663J97933K1952K16674O9306J59501K57670
4617A8051526M2190J74509O5368L2057J40326J29463m6858J51930K50769r4643
4607A8896637k6931J44495J05527n5289r0836Q6187n1986J15959J07209N4472
$$ y = [9747434, 9918826, 10116009, 10085701, 9945317, 10127280, 10223391, 10242874, 10280742, 10457141, 10566334, 10667856, 10852568, 10923109, 11119956, 11053481, 11184434, 11310112, 11419878, 11412498, 11518215, 11890567, 12033551, 12237025, 12335015, 12348471, 12406179, 12617833, 12794843, 12803057, 13054581, 13206792, 13477271, 13612766, 13732227, 14001927, 14177455, 14426983, 14502500, 14543873, 14744447, 15006763, 15165397, 15422533, 15698526, 15691843, 15838746, 15933618, 15997138, 16174049, 16347837, 16504238, 16577447, 16968827, 17128490, 17326423, 17348375, 17565049, 17634355, 17793856, 18051526, 18093716, 18268225, 18333593, 18365650, 18505976, 18635439, 18588581, 18740511, 18991280, 18896637, 18869706, 19014201, 19119728, 19064439, 18973603, 19059790, 19007804, 19123763, 19230972, 19285444]
4597A9285444k63268O9718J04079n3374N0525j59798Q4952J8898m0203j41191
4587A8955782l9633N0415j77874l2005j7409j12189k18901k862l9868k58842o7946
4576A8038668j12266j22436j30623n6573j14556R225n9262j65241j05543k22114
4566A6959279j79227k40673r5744j54946j82790j79856r7844k37584o4721j70770
4556A5355124k28322k29163j28063m9112l07103k07661l8528k93373k08243k15951
4546A3449605k04075k71104j00782j54999k40342l71415l54220r5030p3325j74354
4536A1409959k59277j39146q7272k60312n0515J6101k50962j50710j32138k03735
4526I891993j78748q8152j88560j69657k12561j00919j65696j87045j09372j27843
$$ y = [19285444, 19022176, 19091894, 19195973, 19142599, 19193124, 19033326, 19118278, 19137176, 19096973, 18955782, 18916149, 18966564, 18788690, 18756685, 18739276, 18627087, 18408186, 18405324, 18365456, 18106614, 18038668, 17926402, 17803966, 17673343, 17616770, 17502214, 17511439, 17452177, 17286936, 17181393, 16959279, 16780052, 16539379, 16443635, 16288689, 16105899, 15926043, 15828199, 15590615, 15525894, 15355124, 15126802, 14897639, 14769576, 14720464, 14413361, 14205700, 14167172, 13873799, 13665556, 13449605, 13245530, 12974426, 12873644, 12718645, 12478303, 12106888, 11752668, 11657638, 11584313, 11409959, 11150682, 11011536, 10924264, 10663952, 10613437, 10629538, 10378576, 10227866, 10095728, 9891993, 9713245, 9625093, 9436533, 9266876, 9054315, 8953396, 8787700, 8600655, 8491283, 8363440]
4516H363440j16235j41808j56684j39967J1543j00384k11223P6424j81062r7677
4506G306367n0972J24077k18601k06629j445q9801l1851j54958N9983k53302j1330
4495F471538l4759n7284N3765j44233M6533o5659o6309j98533O95M9300j23203
4484E931851P4241L2692p4220j47049r8429m8417o6814j50365p9150O490n5119
4473E325711Q5563M1360r7155l0088n9342j07130k5786j06206J47992O5983r1670
4462E149232p151J36293l9752p7159j60902j7017l0636l0818J32264J71279n9844
4451E165789L5718J49531l3863j64470J9732N6779j18402p1778O1734j11682Q999
4440D998087J14307j5501Q0376J2708m9884N5514J05534L4915Q453l9953l080
$$ y = [8363440, 8247205, 8105397, 7948713, 7808746, 7820289, 7719905, 7508682, 7585106, 7404044, 7306367, 7255395, 7379472, 7160871, 6954242, 6952797, 6862996, 6831145, 6676187, 6736170, 6482868, 6471538, 6436779, 6379495, 6433260, 6289027, 6335560, 6269901, 6203592, 6005059, 6005754, 6055054, 5931851, 6006092, 6038784, 5964564, 5817515, 5719086, 5670669, 5603855, 5453490, 5374340, 5380830, 5325711, 5411274, 5452634, 5355479, 5325391, 5266049, 5158919, 5133133, 5026927, 5174919, 5240902, 5149232, 5142081, 5278374, 5238622, 5161463, 5000561, 4983544, 4952908, 4922090, 5054354, 5225633, 5165789, 5201507, 5351038, 5317175, 5152705, 5172437, 5229216, 5110814, 5039036, 5100770, 4989088, 4998087, 5112394, 5096893, 5177269, 5189977, 5140093, 5195607, 5301141, 5336056, 5344509, 5304556, 5301476]
4429E301476q6101M7842L17235k7663m0062J09727k9465n646j25569l8352o2121
4418E361301J48889M0585M8089O3617J18604j03104O0118N9503j10883p2165m2347
4407E572207j05764K3500k2387j02269j13418N9234j07732k27567j23064j9414
4397D833326O7068K7878P0707j67124K6587k02536j9251K0069m4703j3623j255
4386D597143P8582j13794j40250l0396j33732j71811N268Q8883j59980J2041O6566
4375D098520l3491j85685p6294K5554q1482j00378L8279n274o7019r2710r109
4364C510911n6830M1721o7089o0197J5984r8240p9487l6290R6759j98244K7887
4353C096885k0036n5689j87701J49127p3166m6975O5040j09027q7074O7683o4225
$$ y = [5301476, 5215375, 5263217, 5580452, 5552789, 5512727, 5622454, 5592989, 5587343, 5461774, 5423422, 5361301, 5510190, 5550775, 5598864, 5662481, 5781085, 5677981, 5738099, 5797602, 5686719, 5614554, 5572207, 5466443, 5489943, 5467556, 5365287, 5251869, 5311103, 5203371, 4975804, 4852740, 4833326, 4900394, 4928272, 4998979, 4831855, 4858442, 4655906, 4636655, 4656724, 4612021, 4598398, 4597143, 4675725, 4561931, 4421681, 4391285, 4257553, 4085742, 4091010, 4179893, 4019913, 4031954, 4098520, 4065029, 3879344, 3803050, 3828604, 3747122, 3646744, 3685023, 3679749, 3612730, 3520020, 3510911, 3454081, 3495802, 3428713, 3368516, 3384500, 3286260, 3206773, 3170483, 3267242, 3068998, 3096885, 3076849, 3021160, 2833459, 2982586, 2909420, 2862445, 2927485, 2818458, 2731384, 2799067, 2734842]
4342B734842O695j7075m2050r9321L3958J9966l4109n1406Q3482j03422j26408
4331B405152l8861J13283O5304M6909L6740j30948o6395J11223j3086j24102j50289
4320B254930J74963R956J481M4962O0K5385q4007m2260k08361K10713l9958M6456
4308B394320o3797J6528Q590N6093l643k1903O1670k06990K1860k8319r4479J8020
4296B157950j07026L0900j69334J54428p7640p6720J13575o5284j39292j58726
4286A662831p4527p0955K9370M8909K3514O8420n4857J00117K454q8569J19204
4275A765911j86050j68513M8154l7282p1682Q7682k5078j4488R3030l5123l738
4264A452823l2151n595q0946r960R9018J00532k0464K16254P6513j00919Q1119
$$ y = [2734842, 2741537, 2724462, 2682412, 2583091, 2617049, 2637015, 2602906, 2551500, 2634982, 2531560, 2405152, 2366291, 2479574, 2544878, 2591787, 2628527, 2497579, 2431184, 2542407, 2529321, 2405219, 2254930, 2429893, 2439849, 2441330, 2486292, 2486352, 2511737, 2427730, 2385470, 2177109, 2387822, 2347864, 2394320, 2330523, 2347051, 2355641, 2411734, 2408091, 2386188, 2447858, 2240868, 2262728, 2234409, 2139930, 2157950, 2050924, 2081824, 1912490, 2066918, 1989278, 1912558, 2026133, 1960849, 1821557, 1662831, 1588304, 1517349, 1546719, 1595628, 1619142, 1687562, 1632705, 1732822, 1735276, 1646707, 1765911, 1579861, 1411348, 1459502, 1422220, 1350538, 1438220, 1413142, 1398654, 1491684, 1456561, 1452823, 1420672, 1415077, 1334131, 1324171, 1423189, 1523721, 1503257, 1719511, 1796024, 1695105, 1776224]
4253A776224J1350r0147j9514l7483M0922L010O4415m7192n2106K6635M0651j56815
4241A559950O8356K1163j50225N8936o2835j37533L4710J31732o2098k5550O1352
4230A497958j24465l039k2428j01060j29615J77204K6899j57481K4808n2311j19158
4219A017312K7907j22850j41364P8596j2234j54790R0722J78459l9204j44233
4209G78321l2338R2385p3940J43414j30261O082J26177J16480r4204P7449o1658
4198I47907m9894J77474J31320l9533q015L3790J32667j91375J6069J2218n3740
4187A108888J7011J17680o4799j00n4158j66579M8590J57146j56943L0954N6713
4176A094403o522J07006J5205L1929p763Q4505k08491R75L7976m5203j85891R7963
$$ y = [1776224, 1787574, 1697427, 1677913, 1640430, 1681352, 1684362, 1748777, 1701585, 1649479, 1676114, 1716765, 1559950, 1628306, 1649469, 1499244, 1558180, 1495345, 1357812, 1392522, 1524254, 1462156, 1436606, 1497958, 1373493, 1370454, 1348026, 1246966, 1117351, 1294555, 1321454, 1163973, 1188781, 1136470, 1017312, 1045219, 922369, 781005, 859601, 847367, 692577, 783299, 961758, 922554, 778321, 745983, 838368, 764428, 907842, 777581, 783663, 909840, 1026320, 932116, 1009565, 947907, 898013, 1075487, 1206807, 1167274, 1159259, 1193049, 1325716, 1134341, 1150410, 1162628, 1108888, 1125899, 1243579, 1178780, 1178680, 1124522, 957943, 1006533, 1163679, 1006736, 1037690, 1094403, 1087881, 1194887, 1210092, 1242021, 1234258, 1318763, 1110272, 1111247, 1149223, 1104020, 918129, 1016092]
4164A016092p8931q4940l2283j1778N9292n2244m4121l5269K5616l3120l3069
4153F95245j2129N6989j7514P2393J12096m8666L2324R6575j22620j8180l9606
4142H06907M6910L2519l8217j19604K9702Q9365R6323L3067J0736K09373j64388
4131A032693j12348j5224j16468Q1964J83265J50306K7949J00050P9667l9485
4121A372369J93301P0304j147m9109J27003o7820J90003J69875k67068j0771j11087
4110A615853j26688o0978Q218n1054J54230m9319K015J0111k22938J23355N2332
4099A455137m431L8148l9127Q0027J24812o3268m5236K8904k12742j4983O9155
4088A416396L976j8718m082N9900j94201J5053P9997o3885j22132K47767o159
$$ y = [1016092, 937161, 852221, 819938, 808160, 867452, 815208, 771087, 735818, 761434, 728314, 695245, 683116, 740105, 722591, 794984, 907080, 858414, 890738, 987313, 864693, 846513, 806907, 853817, 886336, 848119, 728515, 758217, 847582, 943905, 976972, 987708, 1197081, 1032693, 920345, 905121, 788653, 870617, 1053882, 1204188, 1232137, 1332187, 1411854, 1372369, 1565670, 1635974, 1634827, 1585718, 1712721, 1644901, 1834904, 2004779, 1737711, 1726940, 1615853, 1489165, 1428187, 1436405, 1385351, 1539581, 1490262, 1492277, 1502388, 1279450, 1402805, 1455137, 1450706, 1488854, 1449727, 1529754, 1654566, 1591298, 1546062, 1574966, 1362224, 1347241, 1416396, 1420372, 1401654, 1397572, 1457472, 1263271, 1278324, 1358321, 1294436, 1172304, 1420071, 1413912]
4077A413912K1985J24180K00498r3076n8560R9029J26686M1941J46845N7722P5532
4066B156694P5824O7423j256M7305p4571L9019K0014m1719R9549m1741O5350j912
4054B409979J6756M1147J47199N7540J33493J58905P01Q1226l434J04711J05365
4043C253588j9233R4365n9875J54779K7191K11510O8805M600k7096P9877Q0471
4032C868982K4929K65102J85070K42780K95961J55234J87033J8834q4824j70944
4022D988157p0890l16838j68928j60802j56648j06810k34212j87726k61299K46367
4012C570371k7769j13420l4479j1361J06872O7788j14416j42444J87655p3809
4002C414988K00061P1473M8541O8798M4238J63883N9160N2068R6820Q4192N9400
$$ y = [1413912, 1435897, 1560077, 1760575, 1667499, 1608939, 1707968, 1834654, 1876595, 2023440, 2081162, 2156694, 2232518, 2299941, 2298685, 2345990, 2271419, 2310438, 2330452, 2288733, 2388282, 2346541, 2411891, 2409979, 2426735, 2467882, 2615081, 2672621, 2806114, 2965019, 2965720, 3046946, 3043512, 3148223, 3253588, 3234355, 3328720, 3268845, 3423624, 3450815, 3662325, 3731130, 3735730, 3708634, 3788511, 3868982, 3893911, 4159013, 4344083, 4586863, 4882824, 5038058, 5225091, 5243925, 5159101, 4988157, 4917267, 4600429, 4431501, 4270699, 4114051, 4007241, 3773029, 3585303, 3324004, 3570371, 3542602, 3429182, 3394703, 3383342, 3490214, 3558002, 3443586, 3301142, 3488797, 3414988, 3615049, 3686522, 3735063, 3803861, 3848099, 4011982, 4071142, 4123210, 4220030, 4304222, 4363622]
3991D363622O1478o3644J2870J21123p4661Q8612j47053j01054l3296J57443J47211
3980D532651k0655n7537J3921Q7011p4196m736Q0155L1471M5580O8729l0250j92910
3968D479234J61391K66361J9655j02115k07539L02909J85306K68692O3750J18897
3958E556541L6426J19031J93734R4213K65410Q5919K08100K04508q783j61336
3948F593763k41270j39048m08972j6715j90186L4456o410J72800L1672j68932
3938E661158k26294j28744J81476M9477L3347j00323O2731J801K39337R4553j66800
3927E701719J35648j8756R7686J54244J28598Q0860J41015K03317j55569J8481
3917F487243j01006J01865J19489M4440j15011L9242q6680q4483k8236j30357
$$ y = [4363622, 4425100, 4361456, 4374326, 4495449, 4420788, 4509400, 4362347, 4261293, 4227997, 4385440, 4532651, 4511996, 4454459, 4468380, 4555391, 4481195, 4476459, 4556614, 4588085, 4633665, 4702394, 4672144, 4479234, 4640625, 4906986, 4926641, 4824526, 4616987, 4919896, 5105202, 5373894, 5437644, 5556541, 5592967, 5711998, 5905732, 5999945, 6265355, 6351274, 6559374, 6763882, 6755099, 6593763, 6352493, 6213445, 5804473, 5787758, 5597572, 5632028, 5625618, 5798418, 5830090, 5661158, 5434864, 5306120, 5487596, 5537073, 5570420, 5470097, 5532828, 5534629, 5773966, 5868519, 5701719, 5837367, 5818611, 5916297, 6070541, 6199139, 6279999, 6421014, 6624331, 6468762, 6487243, 6386237, 6488102, 6607591, 6652031, 6537020, 6576262, 6489582, 6405099, 6376863, 6246506]
3907F246506n3203l9055J30378J28871L3301k36365J4294Q0423K486o8620j54023
3896F084993P4867J72352Q5544o6006j72060K3109J30622J53782l0211n548J56770
3885F608214K05176L4770J27142Q1404j20713O5377P7176l2925j12025K4433O1267
3874G019296J24273L8671Q1556r389J41566J72355J09706Q1696K11012K58624
3864H229366K58468K74928J61391K2680J52393Q2622J48046P6878J10860J48679
3854I666311J87275K52196K3969j17971q576l2878J12875J98374N7152J37583
3844A0476310J40821J32745j32462N3105J32614J41624J45103L52610N81P1307
3834A1514358Q5285K36451K91306J53035J09316J29404J47617L4497K05867J29284
$$ y = [6246506, 6193303, 6154248, 6284626, 6413497, 6446798, 6210433, 6224727, 6305150, 6307636, 6239016, 6084993, 6159860, 6332212, 6417756, 6351750, 6179690, 6202799, 6333421, 6487203, 6456992, 6451444, 6608214, 6813390, 6848160, 6975302, 7056706, 6935993, 7001370, 7078546, 7045621, 6933596, 6958029, 7019296, 7143569, 7182240, 7263796, 7254407, 7395973, 7568328, 7678034, 7759730, 7970742, 8229366, 8487834, 8762762, 8924153, 8946833, 9099226, 9181848, 9329894, 9406772, 9517632, 9666311, 9853586, 10105782, 10129751, 10011780, 10003204, 9970326, 10083201, 10281575, 10338727, 10476310, 10617131, 10749876, 10617414, 10670519, 10803133, 10944757, 11089860, 11442470, 11443051, 11514358, 11599643, 11836094, 12127400, 12280435, 12389751, 12519155, 12666772, 12701269, 12907136, 13036420]
3824A3036420J10934J18957J92645J48105J16783K77410K34192J62738J81086
3815A4579270M4753M01850M20915L85062J89410K60846J86061K94650L46072J79478
3805A7288367K72769L8710J76562J91582J18139K59745K73807K50390J09443K32904
3795A9212418J36132J83954K91220M17478L50147M27247M61775N32447N92261
3786B2605079N52913L20005L43223M92360N00439N43418L64681L38066M17335
3777B6477519K35126J37024K99247K39793M72637K83920J41660K83138N17080
3768B9087144M05279M37065M23705N25516M27732M30784M91641O28238N79132
3759C3436236N32041N90537O24235O42345O96756O88484M88603O85441O97351
$$ y = [13036420, 13147354, 13266311, 13458956, 13607061, 13723844, 14001254, 14235446, 14398184, 14579270, 14624023, 15025873, 15446788, 15831850, 16021260, 16282106, 16468167, 16762817, 17108889, 17288367, 17561136, 17599846, 17776408, 17967990, 18086129, 18345874, 18619681, 18870071, 18979514, 19212418, 19348550, 19532504, 19823724, 20241202, 20591349, 21018596, 21480371, 22012818, 22605079, 23157992, 23477997, 23821220, 24313580, 24814019, 25357437, 25722118, 26060184, 26477519, 26712645, 26849669, 27148916, 27388709, 27861346, 28145266, 28286926, 28570064, 29087144, 29492423, 29929488, 30353193, 30878709, 31306441, 31737225, 32228866, 32857104, 33436236, 33968277, 34558814, 35183049, 35825394, 36522150, 37210634, 37699237, 38384678, 39082029]
3750C9082029O16531P59350P50350P17354Q76821P94193Q35351J205226J379855
3741D7017060J230297J210202J422870J472636J291914J456079J462383J382141
3733E7945582J668140J818983J736829J882610K243379K374034K479015K746063
3725G4894635K927107L230375L537471L683559L784091L794668M284662M579856
3717A04716424N012037N535230O002509O577427P308636P855206Q715075R939654
3709A61662198J1248782J2596418J4320030J6317349J8394344K1055550K3742095
3702B79336766K6814131L0234298L3901936L6940878L8406263L5750052K6138013
3695E07522337R479599j1610336l1165804m3861392m7791493m5310920l9422742
$$ y = [39082029, 39698560, 40457910, 41208260, 41925614, 42802435, 43596628, 44431979, 45637205, 47017060, 48247357, 49457559, 50880429, 52353065, 53644979, 55101058, 56563441, 57945582, 59613722, 61432705, 63169534, 65052144, 67295523, 69669557, 72148572, 74894635, 77821742, 81052117, 84589588, 88273147, 92057238, 95851906, 100136568, 104716424, 109728461, 115263691, 121266200, 127843627, 135152263, 143007469, 151722544, 161662198, 172910980, 185507398, 199827428, 216144777, 234539121, 255594671, 279336766, 306150897, 336385195, 370287131, 407228009, 445634272, 481384324, 507522337, 517001936, 505391600, 474225796, 430364404, 382572911, 337261991, 297839249]
3688B97839249l2945854k7095948k2378923j8442245j5339956j2840757j0738701
3681A58056865r323008q219313o944755o009213n321002m561579l940924l520509
3673A10216562l119350k639761k287241j897386j470353j149005j135675p93154
3665I5724637n76780m84042m29418l98730m38286k68061l28926k51566K2928K58315
3655I2830071L78195L58282P22872J168837J252246J583581J802886K065327K343854
3646A04506151K752767K933551L243943L509196L733059M104215M573201M980995
3638A34337078N670001O200760O914433P777330Q988440J0120464J1855193J3845976
3630B05709675J5651927J8099497K0714187K4052246K7393012L1098010L4970827
$$ y = [297839249, 264893395, 237797447, 215418524, 196976279, 181636323, 168795566, 158056865, 148733857, 140514544, 133569789, 127560576, 122239574, 117677995, 113737071, 110216562, 107097212, 104457451, 102170210, 100272824, 98802471, 97653466, 96517791, 95724637, 95147857, 94663815, 94234397, 93835667, 93397381, 93129320, 92800394, 92548828, 92571756, 92830071, 93208266, 93566548, 94289420, 95458257, 96710503, 98294084, 100096970, 102162297, 104506151, 107258918, 110192469, 113436412, 116945608, 120678667, 124782882, 129356083, 134337078, 140007079, 146207839, 153122272, 160899602, 169888042, 180008506, 191863699, 205709675, 221361602, 239461099, 260175286, 284227532, 311620544, 342718554, 377689381]
3623C77689381L8105277L8741046L4239464K3226036O457228j2558609k9840152
3616D76059671m2324646m7957844m6724032m1176520l4736815k8721348k3816865
3609B10601601j9689124j6326883j3729477j1562647r785138q484081p747796
3602A23276455o655426n844204n220002m626444m305724l614046l412636k950064
3594H6647909k718978k451322k376906k162849k003321j905647j687610j708497
3586F9632779j527204j624553j602804j607851j583444j456219j382208j159919
3578E7688577j096963j223244j178376q25036q14612p83167o46925o55012n82740
3569D9882502k96744j44193j52133j89636j6923P0500o1212J5759M8204J09778
$$ y = [377689381, 415794658, 454535704, 488775168, 512001204, 518458432, 505899823, 476059671, 433735025, 385777181, 339053149, 297876629, 263139814, 234418466, 210601601, 190912477, 174585594, 160856117, 149293470, 139508332, 131024251, 123276455, 116621029, 110776825, 105556823, 100930379, 96624655, 93010609, 89597973, 86647909, 83928931, 81477609, 79100703, 76937854, 74934533, 73028886, 71341276, 69632779, 68105575, 66481022, 64878218, 63270367, 61686923, 60230704, 58848496, 57688577, 56591614, 55368370, 54189994, 53364958, 52550346, 51767179, 51120254, 50465242, 49882502, 49585758, 49441565, 49289432, 49099796, 49082873, 49153373, 49092161, 49107920, 49156124, 49265902]
3559D9265902J68047K34405K554J81806J25036J20556p3248Q5711L6969k2955
3549E0124783K48508L68060K69253L44121M47187N30771M84091O59115P05438
3540E4181327P23786O54687N80329N15773N34835N64558M23352N54237M06905
3531E9139789M43171N07495N77832M22779M27691N36307M41787K76719L41475
3522F3115045L76509J80811J52316L32510N1817J85004L27115K26641K33447L73251
3512F5554466K30530K94790L34557L58764K14190L98960J32927l3938J7273J50816
3502F7653335L2147Q9876j43745k31989j05615p7703k78813k94226k37227m56138
3492F5949902j73913j15892o5292l13231j21637j61814k63655j34263N5857j36066
$$ y = [49265902, 49433949, 49668354, 49670908, 49852714, 49977750, 50098306, 50025058, 50110769, 50147738, 50124783, 50373291, 50741351, 51010604, 51354725, 51801912, 52332683, 52816774, 53475889, 54181327, 54905113, 55559800, 56140129, 56655902, 57190737, 57755295, 58178647, 58732884, 59139789, 59582960, 60090455, 60668287, 61091066, 61518757, 62055064, 62496851, 62773570, 63115045, 63491554, 63672365, 63824681, 64157191, 64209008, 64394012, 64721127, 64947768, 65181215, 65554466, 65784996, 66079786, 66414343, 66773107, 66987297, 67386257, 67519184, 67485246, 67502519, 67653335, 67685482, 67775358, 67631613, 67399624, 67294009, 67216306, 66937493, 66643267, 66406040, 65949902, 65775989, 65660097, 65594805, 65281574, 65159937, 64998123, 64734468, 64600205, 64656062, 64519996]
3482F4519996j11701K11971K07427J6320L19525K51997K48821M71712M46561L07320
3472F6889949N88461P61404M34110P30457P26242M33984M35659M55520K33398
3463G1689184J00099J09422l6059p2250J09943j40011k00242N6927O0531j18471
3453G1559073j34795K07564J60673Q2600N37749M17870L08736O23554O62783N61205
3443G4987012O47136M97151M18745N29493O33049K59229p7708k0168o4798n62965
3433G7246176o17004q19150j112939r99260j063578j352346j417227j246794j230256
3424F7387622j226003j177917j240289j305456r99334r74098j136492r67010q36196
3415E7524827r50051q46033q52562j008772j216801r87830j135261j077790j231531
$$ y = [64519996, 64408295, 64620266, 64827693, 64844013, 65163538, 65415535, 65664356, 66136068, 66582629, 66889949, 67478410, 68239814, 68673924, 69404381, 70130623, 70564607, 71000266, 71455786, 71689184, 71789283, 71898705, 71862646, 71790396, 71900339, 71760328, 71560086, 71617013, 71677544, 71559073, 71424278, 71631842, 71792515, 71875115, 72412864, 72830734, 73139470, 73763024, 74425807, 74987012, 75634148, 76131299, 76550044, 77079537, 77712586, 77971815, 77894107, 77873939, 77809141, 77246176, 76629172, 75810022, 74697083, 73697823, 72634245, 71281899, 69864672, 68617878, 67387622, 66161619, 64983702, 63743413, 62437957, 61438623, 60464525, 59328033, 58361023, 57524827, 56574776, 55728743, 54876181, 53867409, 52650608, 51662778, 50527517, 49449727, 48218196]
3406D8218196j120039j368283j179951j035517j288615j158911j007534r68681
3398C9090665r43367q75865q87238q60652o41246o35378n81679p37934n61350
3389C2365956o49286o05746l16379n71052m42948l54358l81880m00968j60885
3380B8482454k92117k93529j00586k13962j49782j41818J6539k3374L1212q6595
3370B7228442q6572J28590J08952L4271J44770J54560Q4588J08223K30425K40458
3360B8376707R5826j51260j12172k57738j94026l00193m17978l03380j91487j21469
3350B6422830k26506l678O0710o1775o6194k10474k03334l7029q7242j67259k66973
3339B5153076r0456k60653k97616k73012k02994m14471l39151m81147l06725l17591
$$ y = [48218196, 47098157, 45729874, 44549923, 43514406, 42225791, 41066880, 40059346, 39090665, 38147298, 37271433, 36384195, 35523543, 34882297, 34246919, 33665240, 32927306, 32365956, 31716670, 31110924, 30794545, 30223493, 29780545, 29426187, 29044307, 28643339, 28482454, 28190337, 27896808, 27796222, 27582260, 27432478, 27290660, 27307199, 27283825, 27315037, 27228442, 27141870, 27270460, 27379412, 27413683, 27558453, 27713013, 27797601, 27905824, 28136249, 28376707, 28472533, 28321273, 28209101, 27951363, 27757337, 27457144, 27039166, 26735786, 26544299, 26422830, 26196324, 26192646, 26253356, 26191581, 26125387, 25914913, 25711579, 25674550, 25587308, 25420049, 25153076, 25062620, 24801967, 24504351, 24231339, 24028345, 23613874, 23274723, 22793576, 22486851, 22169260]
3329B2169260k31451k48354l12537k52801j89656l58151j65300k72007l51258
3320A9787745k95429k82898l04377j34838r6847j80498k19420Q641m9171r8443
3310A8134465J42946R7515J10075J13278P0849K27876K52203L24746K51367J30111
3300A9855431J65632L26520J81606K89287K65643J25544K62127R3271J50906L56761
3290B2072728M88289J90123L50816L13997L82624K31340R6203K35034q4982p6322
3280B4199850j27290k08112j06093k24333j97143j66645l18410l70754o0367k98723
3270B2121980l23410m00712m17722k97160l64359l18158l51112m18693m73181
3261A8757473l10696m11099k37216m44353l04615k34294l18788k45186k32383
$$ y = [22169260, 21937809, 21689455, 21376918, 21124117, 20934461, 20576310, 20411010, 20139003, 19787745, 19492316, 19209418, 18905041, 18770203, 18673356, 18492858, 18273438, 18282079, 18232908, 18134465, 18277411, 18374926, 18485001, 18598279, 18669128, 18897004, 19149207, 19473953, 19725320, 19855431, 20021063, 20347583, 20529189, 20818476, 21084119, 21209663, 21471790, 21565061, 21715967, 22072728, 22561017, 22751140, 23101956, 23415953, 23798577, 24029917, 24126120, 24361154, 24276172, 24199850, 24072560, 23864448, 23758355, 23534022, 23336879, 23170234, 22851824, 22481070, 22420703, 22121980, 21798570, 21397858, 20980136, 20682976, 20318617, 20000459, 19649347, 19230654, 18757473, 18446777, 18035678, 17798462, 17354109, 17049494, 16815200, 16496412, 16251226, 16018843]
3252A6018843k83732k43807k15062k68944k06407k84258k34460l99708j90929
3243A3691536j40177j02958k07572j18029p6049r5466p1957j32857J6850N326
3233A2768647j23763n3020L0439J83602m3601l7846j58303j05260J9065k1284
3223A2458676j58150j49895J14175m5450R3631n2478K8284K7899m0273M3037j80404
3212A2139052N3071k5182o406J11116J60336o0430L9953J07148J00083M8629L0182
3201A2697552Q4523J9887L6407J31019p4121n485Q2852J63066J16484j11701m8702
3190A3091781J13385r7786m1869O0578J31720m9959o7803P369K55416j15637J8542
3179A3305737J43161j23762J2288j40359L5758Q9573J58718Q3511R1034j6266
$$ y = [16018843, 15735111, 15491304, 15276242, 15007298, 14800891, 14516633, 14282173, 13882465, 13691536, 13551359, 13448401, 13240829, 13122800, 13046751, 12951285, 12879328, 12746471, 12763321, 12768647, 12644884, 12591864, 12622303, 12805905, 12762304, 12724458, 12566155, 12460895, 12479960, 12458676, 12300526, 12150631, 12264806, 12219356, 12312987, 12260509, 12288793, 12316692, 12276419, 12319456, 12139052, 12192123, 12166941, 12160535, 12271651, 12431987, 12371557, 12411510, 12518658, 12618741, 12667370, 12697552, 12782075, 12801962, 12838369, 12969388, 12895267, 12889782, 12972634, 13135700, 13252184, 13140483, 13091781, 13205166, 13107380, 13065511, 13126089, 13257809, 13207850, 13140047, 13147416, 13402832, 13287195, 13305737, 13448898, 13325136, 13337424, 13197065, 13232823, 13322396, 13481114, 13564625, 13655659, 13639393]
3169A3639393M5664J21687J69684j53575l9958J87332K34518k3282J75559J32473
3159A4489495r148L8591J5137l1018J10373J7226J13149K16790O3793l9512J90448
3148A5175324J37251J81670M1447K11763J28332L7851J56922J43001m7282m5651
3138A6120628K37488K45611L2650J60960J18631M9157K52292J58876J25429K35373
3128A7737095J62140J53058K47651R3717J14699J19627J25821p8335n7400m3598
3118A8574475J55814P1993K24315N7920l9752K63972J89369J58359J33406N1706
3108A9841577K50835N7748R8056J73590J81862J87317J71768J72813J81173K0611
3098B1337350L6388L29843J10173K33056R6149j3186J38878J06692R6116J74280
$$ y = [13639393, 13685057, 13806744, 13976428, 13822853, 13782895, 13970227, 14204745, 14181463, 14357022, 14489495, 14480347, 14518938, 14534075, 14503057, 14613430, 14630656, 14743805, 14960595, 15024388, 14984876, 15175324, 15312575, 15494245, 15535692, 15747455, 15875787, 15913638, 16070560, 16213561, 16166279, 16120628, 16358116, 16603727, 16636377, 16797337, 16915968, 16965125, 17217417, 17376293, 17501722, 17737095, 17899235, 18052293, 18299944, 18393661, 18508360, 18627987, 18753808, 18675473, 18618073, 18574475, 18730289, 18802282, 19026597, 19084517, 19044765, 19308737, 19498106, 19656465, 19789871, 19841577, 20092412, 20150160, 20248216, 20421806, 20603668, 20790985, 20962753, 21135566, 21316739, 21337350, 21373738, 21703581, 21813754, 22046810, 22142959, 22129773, 22268651, 22375343, 22471459, 22645739]
3088B2645739K6601J66049K41629J69212J20181K31463J08306K11375R6840J74700
3078B4192095J63153J73412M48213K82175L23902K55913M45544K53834L99319
3069B6937560K20199L84440K81338M08234L77031L28174K74085L23722M44678
3060B9979461M65338K49613K45228M58499M88135L18693N72192N02572O14430
3051C3894161O05872N15447O75557L81515N31711O46748P31175N82977P12220
3042C9277383P67076Q36587O90092P56300Q62608Q81310P13264R58700Q47482
3033D6590802R99461R21459J206052J032035J173830J132446J147169J220036
3025E5423290J314366J186797J230265J294655J267597J418441J516011J268275
$$ y = [22645739, 22672340, 22838389, 23080018, 23249230, 23369411, 23600874, 23709180, 23920555, 24017395, 24192095, 24355248, 24528660, 24976873, 25259048, 25582950, 25838863, 26284407, 26538241, 26937560, 27157759, 27542199, 27823537, 28231771, 28608802, 28936976, 29211061, 29534783, 29979461, 30444799, 30694412, 30939640, 31398139, 31886274, 32204967, 32777159, 33279731, 33894161, 34500033, 35015480, 35691037, 36072552, 36604263, 37251011, 37982186, 38565163, 39277383, 40044459, 40881046, 41571138, 42327438, 43190046, 44071356, 44784620, 45743320, 46590802, 47590263, 48511722, 49717774, 50749809, 51923639, 53056085, 54203254, 55423290, 56737656, 57924453, 59154718, 60449373, 61716970, 63135411, 64651422, 65919697]
3017F5919697J323266J475748J423810J214913J274391J603053J244755J325079
3009G6804712J434101J302495J428420J455607J267753J512235J323593J227479
3001H7756395J163345J307348J256814J061833R65270J054977R23887Q62402Q32250
2992I7184521O95437N46118N72598M64929L47440K55879L46034J85824o1372J04882
2982A00642290R6831j70751k13350l28332m51579n66574m85847o04138n05650
2973I7412900o35483q69809r64244r01894r93772j100425r64741j055249j132224
2964H8795059j017454j124573j092493j168673j064478j099358j039745j129077
2956H0059208r44245j080631r42977q38959j094366j049204r86769q32108r05509
$$ y = [65919697, 67242963, 68718711, 70142521, 71357434, 72631825, 74234878, 75479633, 76804712, 78238813, 79541308, 80969728, 82425335, 83693088, 85205323, 86528916, 87756395, 88919740, 90227088, 91483902, 92545735, 93511005, 94565982, 95489869, 96352271, 97184521, 97879958, 98426076, 98998674, 99463603, 99811043, 100066922, 100412956, 100598780, 100537408, 100642290, 100739121, 100568370, 100355020, 100026688, 99575109, 99008535, 98522688, 97918550, 97412900, 96777417, 95907608, 94943364, 94041470, 93047698, 91947273, 90982532, 89927283, 88795059, 87777605, 86653032, 85560539, 84391866, 83327388, 82228030, 81188285, 80059208, 79114963, 78034332, 77091355, 76252396, 75158030, 74108826, 73122057, 72289949, 71384440]
2947G1384440p38128q33252p52715p63317o27089n85362n85961p19771n78011
2938F5200834m88987n97529o30679o25105m42966l73490n63156m96480m24136
2929F0558306l23914n84389m23145k88243m47502m61175l72366k87436l11134
2920E7059002l90983l06620l70208k32437k82487m77086j88721k58159k93614
2911E4258687l22077k19289k53419q9113k00336k09883j71507q7566j68547j27432
2901E2409518m8933l0637m5742P1762J08533K4128Q2638j2806n2632Q290R3055
2890E2607174o557P3449J6424Q2262Q5336L1350r3905P6403J61379J35939j92320
2879E2976934N3648J82497j0950K24999K39187M2506Q1333N7326m484K7526L5401
$$ y = [71384440, 70646312, 69813060, 69060345, 68297028, 67669939, 67084577, 66498616, 65778845, 65200834, 64711847, 64114318, 63483639, 62858534, 62415568, 62042078, 61478922, 60982442, 60558306, 60234392, 59650003, 59226858, 58938615, 58491113, 58029938, 57657572, 57370136, 57059002, 56668019, 56361399, 55991191, 55758754, 55476267, 54999181, 54810460, 54552301, 54258687, 53936610, 53717321, 53463902, 53374789, 53174453, 52964570, 52793063, 52705497, 52536950, 52409518, 52360585, 52329948, 52284206, 52355968, 52464501, 52488629, 52571267, 52558461, 52505829, 52514119, 52607174, 52600617, 52674066, 52690490, 52772752, 52858088, 52889438, 52795533, 52871936, 53033315, 53169254, 52976934, 53030582, 53213079, 53202129, 53427128, 53666315, 53708821, 53790154, 53847480, 53842996, 53870522, 53905923]
2868E3905923j18388L8178J5449o6425j09237J6690O6432j96366K6418m1705j26634
2857E3410335n0607J44934k4346j86642j22491N4519M7871k32270p946J7139j52057
2846E2898439j61917n7833Q0642K0942k88559j15072J12151N4857k15243N4083
2836E2382490p7400L0485M8290M3959J0957P4301O7414N4432j76450K5106J08047
2825E2591631J6403q7621n9703O5553j22104j72979k09421K6185j37390J05144
2815E2015698k31550J67604j1390M0911k7922k699j04246n1931p6478j05094k25971
2804E1386932j22896k11175k48067j60143j10285j57865n8588k60001j81984o4789
2794D9811139j95404j03912Q7553P3480j94397k0901m6901n0605j81159m8989
$$ y = [53905923, 53787535, 53825713, 53841162, 53774737, 53665500, 53682190, 53748622, 53552256, 53578674, 53536969, 53410335, 53359728, 53504662, 53480316, 53293674, 53171183, 53225702, 53273573, 53041303, 53033357, 53050496, 52898439, 52736522, 52678689, 52759331, 52780273, 52491714, 52376642, 52488793, 52543650, 52328407, 52382490, 52305090, 52335575, 52383865, 52427824, 52438781, 52513082, 52580496, 52634928, 52458478, 52483584, 52591631, 52608034, 52520413, 52460710, 52526263, 52404159, 52231180, 52021759, 52047944, 51910554, 52015698, 51784148, 51951752, 51940362, 51981273, 51953351, 51950652, 51846406, 51794475, 51717997, 51612903, 51386932, 51264036, 51052861, 50804794, 50644651, 50534366, 50376501, 50317913, 50057912, 49875928, 49811139, 49615735, 49511823, 49599376, 49672856, 49478459, 49457558, 49410657, 49360052, 49178893, 49129904]
2784D9129904j92552p4382j41430O4574p2851J66692m5996J78869J16760N9879
2774D9189467L1346K04604K97228J50709J89760L61738L74920L8912M84911K87698
2764E1611293J64901L46546L38437L37709M52110L85876L14504L76813N53848
2755E4882037L67202N90287M44876M87655K40430M97800M19661M26685O59391
2746E9016024M09945N56340M64859M05501L31177N09214M99816O51031M81332
2737F3325239N54314P09342O50187Q97311P94797P43054Q57334J024181Q48671
2728G0404430R94451J057972J143917J262218J239629J350192J265251J287321
2720H0005381J389855J319908J472793J636683J284986J442991J688906J648427
$$ y = [49129904, 48937352, 48862970, 48721540, 48786114, 48713263, 48879955, 48833959, 49012828, 49129588, 49189467, 49220813, 49425417, 49722645, 49873354, 50063114, 50424852, 50799772, 50838684, 51323595, 51611293, 51776194, 52122740, 52461177, 52798886, 53250996, 53636872, 53951376, 54328189, 54882037, 55249239, 55839526, 56284402, 56772057, 57012487, 57510287, 57929948, 58356633, 59016024, 59425969, 59982309, 60447168, 60852669, 61183846, 61693060, 62192876, 62843907, 63325239, 63879553, 64588895, 65239082, 66136393, 66931190, 67674244, 68531578, 69555759, 70404430, 71398881, 72456853, 73600770, 74862988, 76102617, 77452809, 78718060, 80005381, 81395236, 82715144, 84187937, 85824620, 87109606, 88552597, 90241503, 91889930]
2712I1889930J575201J623479J782024J756499K013393J881935J917814J868761
2704A06309036K093286K220728J984420K112100J966144J893336J878816J585102
2696A22042968J410369J432863J243463J217870J291610J220457R11863J094179
2688A31865642J161371J032850P44426P82552P09821M69784K83197J98556j14570
2679A37133629o1490j82450k69153n54955n05898p20502p28244q25154j014661
2670A32271122r69877j110818j105641j312233j299315j283701j347516j281651
2662A22560370r81625j053997j172448r04092q96804n51222q19249p69628n70100
2653A14841205o25863m16766m55377n23735m86627l28899m28543n13741n89681
$$ y = [91889930, 93465131, 95088610, 96870634, 98627133, 100640526, 102522461, 104440275, 106309036, 108402322, 110623050, 112607470, 114719570, 116685714, 118579050, 120457866, 122042968, 123453337, 124886200, 126129663, 127347533, 128639143, 129859600, 130771463, 131865642, 133027013, 134059863, 134804289, 135586841, 136296662, 136766446, 137049643, 137248199, 137133629, 137072139, 136889689, 136620536, 136065581, 135559683, 134839181, 134110937, 133285783, 132271122, 131301245, 130190427, 129084786, 127772553, 126473238, 125189537, 123842021, 122560370, 121578745, 120524748, 119352300, 118448208, 117551404, 117000182, 116180933, 115411305, 114841205, 114215342, 113798576, 113343199, 112819464, 112332837, 112003938, 111575395, 111061654, 110471973]
2644A10471973m97519l48643k82164l21700j33884j29546K2685j887O4939J94758
2634A09039012J14946K17062N89000O32821N47824P40926Q76809P93002P77820
2625A14329222Q59406R48797Q75847R83258J043228J120729R76906J035295R87269
2616A23159957J087700R05795R25804Q60818P50600P83304R92458O88397M74726
2607A30629559N55236N14733N12014L42143J83396J05955J02896n4175l9930j84751
2597A32667076k79962l40278n78842o47604n63009p14314p17251p61222q67756
2588A27196838r35481j079828j002430r16549r23256j161984j120369j178473
2580A18878468j074960r80250j023275j009389j061106r04939r24660r53467q81736
$$ y = [110471973, 109974454, 109625811, 109343647, 109021947, 108888063, 108758517, 108781202, 108779315, 108844254, 109039012, 109153958, 109371020, 109960020, 110592841, 111140665, 111881591, 112758400, 113551402, 114329222, 115188628, 116137425, 117013272, 117996530, 119039758, 120160487, 121137393, 122172688, 123159957, 124247657, 125153452, 126079256, 126940074, 127690674, 128473978, 129466436, 130154833, 130629559, 131184795, 131699528, 132211542, 132553685, 132737081, 132843036, 132945932, 132891757, 132851827, 132667076, 132387114, 132046836, 131467994, 130820390, 130257381, 129543067, 128825816, 128064594, 127196838, 126261357, 125181529, 124179099, 123262550, 122339294, 121177310, 120056941, 118878468, 117803508, 116823258, 115799983, 114790594, 113729488, 112824549, 111899889, 110946422, 110064686]
2571A10064686p86041r51102p05092p44983o72701n38047n75038m82605m73407
2562A04135670n32575m33237l70536l38323k91867l45694l15918k58764k94351
2553A00954405j46346k62596j61194j74381j91266j29832K4297r5038R8318K04412
2543A00120779J64337K36418J81166L35076L32354M54712M61397M49821N74522
2534A03310582N77330N30502P80465P69913Q19097P64259P72465Q13153Q95231
2525A10032997J091601J247982J057451J047148J289464J264953J246205J290137
2517A19567938J291579J222672J390765J402209J389199J361505J305619J227131
2509A30158617J315656J324670J149546J124168J090108J175119J030472J027516
$$ y = [110064686, 109278645, 108327543, 107622451, 106877468, 106204767, 105666720, 105091682, 104609077, 104135670, 103603095, 103169858, 102799322, 102460999, 102169132, 101823438, 101507520, 101248756, 100954405, 100808059, 100545463, 100384269, 100209888, 100018622, 99888790, 99913087, 99818049, 99916367, 100120779, 100285116, 100521534, 100702700, 101037776, 101370130, 101824842, 102286239, 102736060, 103310582, 103887912, 104418414, 105198879, 105968792, 106787889, 107552148, 108324613, 109137766, 110032997, 111124598, 112372580, 113430031, 114477179, 115766643, 117031596, 118277801, 119567938, 120859517, 122082189, 123472954, 124875163, 126264362, 127625867, 128931486, 130158617, 131474273, 132798943, 133948489, 135072657, 136162765, 137337884, 138368356, 139395872]
2501A39395872Q71648Q84030O50753O80718N26342L29026L91248L14970K04061
2492A44248668J3577K0592j76773l08648l25237l60281m83070o72868n57914n88538
2482A40809508q21075p33793q43625p47459j035838r41223j045101q75616r26799
2473A32838979r31200q47889r72017r68623r16962q42938q56803j062070q10993
2464A24629484p16933r88638r73654p36246q51131q60653o79250p47957q48782
2455A17226240j002506q46560r60795r60243r44931r63644j040532q57457j282544
2446A08367028j008950j102835j311171j314648j147269j171479j248266j195432
2438I8866978j177685j196488j312915j211093j339376j371705j252810j303474
$$ y = [139395872, 140267520, 141151550, 141802303, 142483021, 143009363, 143338389, 143729637, 144044607, 144248668, 144262245, 144282837, 144106064, 143797416, 143472179, 143111898, 142628828, 141955960, 141398046, 140809508, 139988433, 139254640, 138411015, 137663556, 136627718, 135686495, 134641394, 133765778, 132838979, 131907779, 131059890, 130087873, 129119250, 128202288, 127359350, 126502547, 125440477, 124629484, 123912551, 122923913, 121950259, 121214013, 120362882, 119502229, 118822979, 118075022, 117226240, 116223734, 115377174, 114416379, 113456136, 112511205, 111547561, 110507029, 109649572, 108367028, 107358078, 106255243, 104944072, 103629424, 102482155, 101310676, 100062410, 98866978, 97689293, 96492805, 95179890, 93968797, 92629421, 91257716, 90004906, 88701432]
2430H8701432j291395j089738j230186j292408j095382j087623j151898r86152
2422G9476650j020229r32248j037609r34569r79271r21926p31295q23990p48539
2413G1346974p54725p29265o89319p11219o24752p56709o21202n89792p00017
2404F5169974n50845o37292o25609p28664n24383n12155o23961n51746m72516
2395E9942803n87182n91805n14363n49790n11868o49897n27407n42740o31165
2386E4836586o19038o12870o10673p32430n11381n81242p89180p48939n34989
2377D9095844o09032n68459l73862p06076o67026n06179l74265m62235m93602
2368D4335108n09328m71227m73505n31805m61673o30600k71202l30606m33385
$$ y = [88701432, 87410037, 86320299, 85090113, 83797705, 82702323, 81614700, 80462802, 79476650, 78456421, 77524173, 76486564, 75551995, 74572724, 73650798, 72919503, 72095513, 71346974, 70592249, 69862984, 69173665, 68462446, 67837694, 67080985, 66459783, 65869991, 65169974, 64619129, 63981837, 63356228, 62627564, 62103181, 61591026, 60967065, 60415319, 59942803, 59355621, 58763816, 58249453, 57699663, 57187795, 56537898, 56010491, 55467751, 54836586, 54217548, 53604678, 52994005, 52261575, 51750194, 51168952, 50379772, 49630833, 49095844, 48486812, 47918353, 47544491, 46838415, 46171389, 45665210, 45290945, 44828710, 44335108, 43825780, 43354553, 42881048, 42349243, 41887570, 41256970, 40985768, 40655162, 40221777]
2359D0221777m43343m21192l88657m29584l35953l82032k64933k96486k74706
2350C6984891l06217k36458k35394l18138k03610j98541k95528k33860q8300j56891
2340C4711954j85920j38675k11298j29370j00907j31627k83888k10352k25133
2331C3094784p5548q6042o3317j4348m3948j77612K53o283j53827R687j21699
2320C2362100m0786R9914N7583J2916K8826J17369m7099l4969l6259Q1161k3347
2309C2577409M4880K8253M1028k4833p4752r514j35835j11101k1408r4772m0754
2298C2178601l0497j42050m8431j40910Q7339j00594j22736j83026P2691j29310
2288C1441077j29784j00879j25406m4548k7240n8471k77806n7387k02888n6618
$$ y = [40221777, 39778434, 39357242, 38968585, 38539001, 38203048, 37821016, 37556083, 37259597, 36984891, 36678674, 36442216, 36206822, 35888684, 35685074, 35486533, 35191005, 34957145, 34868845, 34711954, 34526034, 34387359, 34176061, 34046691, 33945784, 33814157, 33530269, 33319917, 33094784, 33019236, 32933194, 32869877, 32855529, 32811581, 32633969, 32634222, 32627939, 32474112, 32483799, 32362100, 32321314, 32421228, 32478811, 32491727, 32520553, 32637922, 32590823, 32555854, 32519595, 32600756, 32577409, 32622289, 32650542, 32691570, 32666737, 32591985, 32582471, 32446636, 32335535, 32314127, 32219355, 32178601, 32148104, 32006054, 31957623, 31816713, 31904052, 31803458, 31680722, 31497696, 31570387, 31441077, 31311293, 31210414, 31085008, 31040460, 31013220, 30954749, 30676943, 30619556, 30416668, 30360050]
2278C0360050n4430j76096k47324l43647R2028k21813j57354p273j61177k43615
2268B8839349p1162J1201j23222J45055r8453j26129J5377n070p4626m6547J59027
2257B8624800j3766J16944J10021j2298J00498P9379J6067j15485J41318J02454
2247B9149932K6915J9194K9397j5467j10769O8129j99403m2329j12386j5663j40240
2236B8657310p8253m9721o616o134R457n705k2025n3495j03287q3833q6797l84206
2224B7786695k05009j97046k86323o0898k70922j95479l15796r3256k92912j33673
2214B5735381j44520j33570j88745P525J1860k80920Q1502l3206j99911j41351
2204B4714045k80374j69700k14321O9840k31478l1411j16067l371j73988j283
$$ y = [30360050, 30305620, 30129524, 29882200, 29538553, 29630581, 29408768, 29251414, 29244141, 29082964, 28839349, 28768187, 28779388, 28656166, 28801221, 28702768, 28576639, 28592016, 28586946, 28512320, 28465773, 28624800, 28611034, 28727978, 28837999, 28825701, 28926199, 29005578, 29021645, 28906160, 29047478, 29149932, 29176847, 29196041, 29225438, 29209971, 29099202, 29167331, 28967928, 28925599, 28813213, 28797550, 28657310, 28579057, 28529336, 28522720, 28516586, 28526043, 28520338, 28498313, 28444818, 28341531, 28257698, 28170901, 27786695, 27581686, 27384640, 27098317, 27037419, 26766497, 26571018, 26255222, 26161966, 25869054, 25735381, 25590861, 25457291, 25268546, 25276071, 25287931, 25007011, 25088513, 25055307, 24855396, 24714045, 24433671, 24263971, 24049650, 24119490, 23888012, 23856601, 23740534, 23737163, 23563175, 23561892]
2194B3561892J46847p8707P8456M753M9706l4747K9033O365j10164P7180o2998
2183B3667616J14986j13106j89723j14912j00222K5260j04843O8640o8841M8187
2173B3233042q60l3192M2443K2878M9737j48913L130o2177j32716k04690k1542
2162B2747140j85275j59687Q6639l10098k23805k56397j94533k27730k8744j76030
2152B1071480k28764k37394n8822j01476p708k62245j95240k70684O6960k36118
2142A9539989j49015j23882p5963j52942j9076M8641k17185l5039j78701j41456
2132A8495371k30276L1649M0692o7047l3847j11498o6538p9452q650J04981J2401
2121A8087786j06020k30259k3619M1957R1135o7994j2806j21350k7697K25891
$$ y = [23561892, 23708739, 23630032, 23708488, 23713241, 23762947, 23728200, 23757233, 23763598, 23653434, 23730614, 23667616, 23782602, 23669496, 23479773, 23364861, 23264639, 23289899, 23185056, 23253696, 23184855, 23233042, 23232182, 23198990, 23241433, 23264311, 23314048, 23165135, 23168265, 23106088, 22973372, 22768682, 22747140, 22561865, 22402178, 22488817, 22178719, 21954914, 21698517, 21503984, 21276254, 21247510, 21071480, 20842716, 20605322, 20546500, 20445024, 20437316, 20175071, 19979831, 19709147, 19776107, 19539989, 19390974, 19267092, 19191129, 19038187, 19019111, 19067752, 18850567, 18815528, 18636827, 18495371, 18265095, 18296744, 18337436, 18270389, 18236542, 18125044, 18058506, 17979054, 17970404, 18075385, 18087786, 17981766, 17751507, 17727888, 17769845, 17860980, 17792986, 17780180, 17658830, 17631133, 17857024]
2111A7857024l1947K9908p1578r9315m9128R8910j16952p3093J48609j03910M9219
2100A7637747l0958j26205K5839J6073N4175m0848K583K5269K70571N8547J61548
2089A8054341K50238Q0317K88599J73927K20067Q3026J71335J36291J82972O9739
2079A9710852p4359j57236j52985L5822j05359j00575j3320k31507J38826q0105
2069A8970054n5180j66842O0812r4046q239M0550n1626j0942j30288j69410l41581
2058A8043262k02199j83107j45191k62741k58785j63621k23181q2347o1321j84562
2048A6276207n5007j71750j19415j3789K3568j30870o6648L6019m2056j9886K253
2037A5718626J18490R7514K96408P8202L5837L12107J55011J90554J63786M26269
$$ y = [17857024, 17825077, 17854985, 17783407, 17684092, 17634964, 17733874, 17616922, 17543829, 17692438, 17588528, 17637747, 17606789, 17480584, 17506423, 17522496, 17576671, 17535823, 17538406, 17563675, 17834246, 17892793, 18054341, 18304579, 18384896, 18673495, 18847422, 19067489, 19150515, 19321850, 19458141, 19641113, 19710852, 19636493, 19479257, 19326272, 19362094, 19256735, 19156160, 19142840, 18911333, 19050159, 18970054, 18914874, 18748032, 18808844, 18714798, 18706559, 18747109, 18695483, 18684541, 18554253, 18384843, 18043262, 17841063, 17657956, 17512765, 17250024, 16991239, 16827618, 16604437, 16522090, 16460769, 16276207, 16221200, 16049450, 15930035, 15916246, 15939814, 15808944, 15742296, 15778315, 15736259, 15716373, 15718626, 15837116, 15934630, 16231038, 16309240, 16345077, 16657184, 16812195, 17002749, 17166535, 17592804]
2027A7592804J95808K80470M10882L19433L79785M00038M14980J71866L88117
2018B0554183M14170K09206K99848L54339J18095m1425O6620n6960j59003j22424
2008B1636649k87312k34450k60227l2580k17622j06939q1975k47102m9255J22417
1998B0241604N0185o4144O6331k20922j74078k08877l02981n27904l50574k85560
1988A8223080m65176m22399l62810k55351l27925j97405j99720l35366k94244
1979A5362684m0138l07415j16476m5460p7529p5607m494j96044l44728K3138j71479
1968A4006452j53779j24586Q907k55129m67J33509n5195r7969o5303m902j6194
1957A3375344O6355L0136K7190J04037R6799j06613L9395K3674j03191j2667m8461
$$ y = [17592804, 17788612, 18069082, 18479964, 18799397, 19179182, 19579220, 19994200, 20166066, 20554183, 20968353, 21177559, 21477407, 21831746, 21949841, 21908416, 21975036, 21918076, 21759073, 21636649, 21349337, 21114887, 20854660, 20822080, 20604458, 20497519, 20415544, 20168442, 20119187, 20241604, 20291789, 20227645, 20293976, 20073054, 19898976, 19690099, 19387118, 18859214, 18508640, 18223080, 17757904, 17335505, 16972695, 16717344, 16389419, 16192014, 15992294, 15656928, 15362684, 15322546, 15015131, 14898655, 14853195, 14775666, 14700059, 14695565, 14499521, 14154793, 14177931, 14006452, 13852673, 13728087, 13736994, 13481865, 13481398, 13614907, 13559712, 13461743, 13396440, 13391538, 13375344, 13441699, 13471835, 13499025, 13603062, 13699861, 13593248, 13632643, 13656317, 13553126, 13540459, 13491998]
1946A3491998k30199k12637j47923j53523k95912k24767q685k59984r0177l4085
1936A1834106j06940k99486m4592j55685m7526J4418j91579k83239n5009q2756
1926A0581712k65782j87938j25240k92925j12119k01468k65524j05744r8224j56560
1916H770188k58875j08496j12269j98927r3486j98351k29511k50084j50434j40080
1906G029675q8478r7156k34777k70591l6559J02259k44388q8207j04742j94037
1896E772999j46367k5675k15272q0799o6717n0863k49428j07786j13453R7p4654
1885D642082m6169j39452k30737m7875K8660J312J2227L0792k50402m3129o0730
1874C896579n519j21938q7254j01713m2505N2609m4966M0803p0411j29665p3316
$$ y = [13491998, 13261799, 13049162, 12901239, 12747716, 12451804, 12227037, 12218352, 11958368, 11868191, 11834106, 11727166, 11427680, 11383088, 11227403, 11179877, 11194295, 11002716, 10719477, 10664468, 10581712, 10315930, 10127992, 10002752, 9709827, 9597708, 9396240, 9130716, 9024972, 8926748, 8770188, 8511313, 8402817, 8290548, 8091621, 7998135, 7799784, 7570273, 7320189, 7169755, 7029675, 6941197, 6844041, 6609264, 6338673, 6302114, 6404373, 6159985, 6071778, 5967036, 5772999, 5626632, 5600957, 5385685, 5304886, 5238169, 5187306, 4937878, 4830092, 4716639, 4716736, 4642082, 4595913, 4456461, 4225724, 4177849, 4206509, 4207821, 4220048, 4250840, 4000438, 3957309, 3896579, 3891060, 3769122, 3681868, 3580155, 3537650, 3590259, 3545293, 3586096, 3515685, 3386020, 3312704]
1863C312704l5285j33547j6273k7638m8991l928j45178L5952o6263O7628J3003
1852B952184k47729k3770K1122L635o5630N6681o0634O7556L7048q6048j01519
1841B552896L6281J1037j01952j59137J15232j69375P793l9143J58903L7261n8776
1830B391020j88400O1823M7008k9179o2956j04310M109r9516l0209J95379N4573
1819B239342j34442M5566j18765l4888L1229Q8195j76493J3170r1770Q2051L0370
1808A973565P6717j988j11188p8016j15117m0816J39577k9924k1581N2637O7721
1797A911587j16788j2726j45978p5748p028p4960N0085P3121k9808k2518n2002
1786A497237j33914m5009j6809N3934M8561N4320j7603l3445k5116J69549j15710
$$ y = [3312704, 3277419, 3143872, 3127599, 3099961, 3050970, 3047042, 2901864, 2937816, 2871553, 2939181, 2952184, 2704455, 2680685, 2701807, 2705442, 2639812, 2696493, 2635859, 2703415, 2740463, 2654415, 2552896, 2589177, 2600214, 2498262, 2339125, 2454357, 2284982, 2292775, 2253632, 2412535, 2449796, 2391020, 2202620, 2264443, 2311451, 2282272, 2219316, 2115006, 2119115, 2019599, 1989390, 2184769, 2239342, 2104900, 2150466, 2031701, 1996813, 2028042, 2116237, 1939744, 1952914, 1861144, 1943195, 1973565, 2050282, 2048294, 1937106, 1859090, 1743973, 1703157, 1842734, 1812810, 1791229, 1843866, 1911587, 1794799, 1782073, 1636095, 1560347, 1553319, 1478359, 1528444, 1601565, 1571757, 1549239, 1497237, 1363323, 1318314, 1301505, 1355439, 1404000, 1458320, 1440717, 1407272, 1382156, 1551705, 1435995]
1775A435995M2018j22556K1587j9268P9316M3411j44750K3512l9388q8767j6939
1764A214171J04791o7272J30332J06654j18460p2970J53785L7081j8131j20421
1754A349560N1363j6804J40625m2207m912j07728N505j77286M5455P7651j5313
1743A305909L2497j01422j338j08269Q7738L9518j5085j4654p7710j07004m720
1732A035460K38885n2169j95382M974o0815j82n5192Q6387l8472k1622K9962L5909
1720A007743Q1335o0178k2877j69699P4628m9553l1869J4784p7640K39602j71426
1709H34850J5438m7201q6545L468P6944J2879j5611K20191M929Q0248j66927J6427
1697I49090l2211j0560M2463j44301r542R3366J40769l4376j06851M3554n5131
$$ y = [1435995, 1478013, 1355457, 1377044, 1357776, 1437092, 1480503, 1335753, 1359265, 1319877, 1231110, 1214171, 1318962, 1251690, 1382022, 1488676, 1370216, 1297246, 1451031, 1488112, 1469981, 1349560, 1400923, 1384119, 1524744, 1482537, 1477625, 1369897, 1375402, 1198116, 1243571, 1321222, 1305909, 1338406, 1236984, 1235646, 1127377, 1215115, 1254633, 1239548, 1224894, 1147184, 1040180, 1035460, 1274345, 1222176, 1026794, 1031768, 970953, 970771, 915579, 1001966, 963494, 941872, 971834, 1007743, 1089078, 1028900, 1006023, 836324, 910952, 861399, 829530, 844314, 766674, 1006276, 834850, 850288, 803087, 716542, 720010, 796954, 809833, 794222, 1014413, 1019342, 1099590, 932663, 949090, 916879, 906319, 948782, 804481, 794939, 888305, 1029074, 994698, 887847, 931401, 876270]
1686H76270k9891n139k9899j53603o5466J97646r1672n5754J0112p0951r9943
1675D81710J21239L9856j72684m1004J20225J4328n6155M4643l1509j18848K71474
1664F73275n4898j7566j4093j51430j2490J76698k8568k05884M3879L8017j12390
1653C34550p4644l0838j811j15775P2651P5404N5687M7489R3030o9657r8894n8695
1641B28497O40J33390n50o758p9027K7729M1691L8829l3747n3163j71887O1229
1629A86873J39106M6209N0020j3517q9448J17628K1299p3325o9517L021m7741
1618B70608N6984j12000P259J0864M3918J6961n0008n410j7254J32968P7077o1553
1606C70414j26367j95416L4118J54977R0823r1556r3113p116j48741J13969j6632
$$ y = [876270, 846379, 841240, 811341, 657738, 592272, 789918, 698246, 642492, 652604, 581653, 481710, 602949, 642805, 470121, 429117, 549342, 563670, 507515, 552158, 520649, 401801, 673275, 618377, 600811, 586718, 435288, 422798, 599496, 570928, 365044, 408923, 446940, 334550, 259906, 229068, 227257, 111482, 184133, 259537, 315224, 362713, 455743, 386086, 287192, 228497, 229137, 362527, 361977, 355219, 276192, 303921, 345612, 384441, 350694, 297531, 125644, 186873, 325979, 372188, 422208, 408691, 319243, 436871, 458170, 384845, 315328, 318349, 270608, 327592, 215592, 222851, 233715, 277633, 294594, 244586, 239176, 221922, 354890, 431967, 370414, 244047, 48631, 82749, 237726, 328549, 236993, 143880, 136764, -11977, 101992, 85360]
1595H5360l7468n3178K3726o7473P6773J92871p2419p238K6461j43244l690q8634
1583f8153R2687r9096J16708p0056R531Q0736Q5085k9906j71460p0740q0688J7472
1571a87880J42289O0726p8207K1679R9587j42498M5981N0693k0358L4488J69330
1560A95830j07218p4341P3447M8548L8667n7036Q9703m1764J26134J7518j52364
1549A57124j32373m2974m3877r2950k0509n0537o4244J76885O2690L5902j79614
1538a94477R3306j30879J08076j2588M581N4479k8744J49501J09974K37n9266
1527I4200m6682q6451j77165m1994l2444J29810j39725L6153j362j398J15688
1516a51370P1932K3997p1990L9630L085q1175q2696N8654J03129p1608j5427K6725
$$ y = [85360, 47892, -5286, 18440, -49033, 27740, 220611, 148192, 140954, 167415, 24171, 20481, -68153, 24534, -74562, 42146, -27910, -18379, 62357, 147442, 117536, -53924, -124664, -205352, -187880, -45591, 15135, -63072, -41393, 58194, -84304, -38323, 12370, -7988, 26500, 195830, 88612, 14271, 87718, 136266, 174933, 117897, 207600, 165836, 291970, 309488, 157124, 24751, -18223, -62100, -155050, -175559, -226096, -290340, -113455, -50765, -14863, -194477, -101171, -232050, -123974, -136562, -131981, -77502, -106246, 43255, 153229, 153466, 94200, 47518, -38933, -216098, -258092, -290536, -160726, -300451, -264298, -265660, -267058, -151370, -79438, -55441, -127431, -87801, -84716, -165891, -248587, -189933, -86804, -158412, -173839, -147114]
1504a47114M3924N9277J07971K5163j13994k5187j5342J2474R5116o3466P7507
1493E6329l3144k7321o109o6974k3162j3522k5318k6210P8571P2791O2031j9023
1481B8939P697P9602r7017m6121j14575l6341N6533Q3929q8598r8187P5384k9489
1469a78244J14077r0625M4402k2054p3876l7422Q9539k74N1465L2668L6872k9446
1457f2918N1737n3950L2391M7338o7478M2771q3073j09498n2611J22800p784j27541
1445b67816J94104q4405L4522M2218J69045r8977J4346p8362m6059j7187K16484
1434G7913J0748p9890N0356j10665O5169K4411j8490n1878m5633m1593J2010J78879
1422G1337J00780l5996m0025l781o6341j65757Q8839K4706J4269O1550N7909k03233
$$ y = [-147114, -103190, -43913, 64058, 89221, -24773, -49960, -65302, -52828, 42288, -21178, 56329, 23185, -4136, -10245, -77219, -100381, -113903, -139221, -165431, -86860, -14069, 47962, 28939, 36636, 116238, 19221, -26900, -141475, -177816, -121283, -37354, -125952, -224139, -148755, -178244, -64167, -154792, -110390, -132444, -206320, -243742, -154203, -154477, -103012, -70344, -33472, -62918, -11181, -65131, -32740, 14598, -52880, -10109, -93182, -202680, -255291, -132491, -140275, -267816, -73712, -158117, -123595, -81377, 87668, -11309, 3037, -75325, -121384, -138571, 77913, 88661, 8771, 59127, -51538, 13631, 38042, 19552, -32326, -77959, -119552, -107542, 71337, 172117, 136121, 96096, 92315, 25974, -139783, -50944, -26238, -11969, 49581, 107490, -95743]
1410i5743Q8726N7111o6798p4683L5715J039q3956R9277q5596o5903P1503J9929
1398i9379k1905q245L6475j568k7159Q2530k2885j9498J3511N1973k0636K8371
1386h415R9726J02672m3231n0161l5745j4399q0106j27401P5767M8775j1370Q570
1374c5318M3428j17099J4364k2908l0254m8382J78092p3414L0431J6712m232N0225
1362A645J7496p0903L3722O4979p3452r6918J12210J56433r8149K2884o4831j5489
1350a0373o6258J4282p5788J56939m8189q9368J15756p8110j17909P5529L5652
1339h7837j56674p5647R4447K4616n0200L9036J14080j21767R5318N633k2643
1328a41638J20018P085L2188R642k0551q1349k8110L8086k0387J8908r563K5499
$$ y = [-95743, -7017, 50094, -16704, -91387, -55672, -54633, -138589, -39312, -124908, -190811, -119308, -99379, -121284, -129529, -93054, -94622, -121781, -39251, -62136, -81634, -68123, -16150, -36786, -8415, 91311, 193983, 150752, 100591, 64846, 50447, -29659, -157060, -81293, -32518, -43888, -35318, 8110, -108989, -94625, -117533, -147787, -196169, -18077, -91491, -61060, -44348, -48580, 1645, 19141, -51762, -18040, 46939, -26513, -123431, -11221, 145212, 47063, 69947, 5116, -10373, -76631, -62349, -138137, 18802, -29387, -118755, -2999, -81109, -199018, -123489, -87837, -244511, -320158, -225711, -201095, -251295, -212259, -98179, -219946, -124628, -118995, -141638, -21620, -14535, 17653, 27295, 6744, -74605, -102715, -64629, -85016, -66108, -75671, -50172]
1316e0172o8968n821K8748q8248J30598j0664R599P838J5540j0618N1194p5836
1304f6810o2021M5169j13552o4542R9429N2665K347l4048Q0013J582K0796P1267
1292C2295j19619j6644R4295Q9870p5792J0375L26j28604J3307j52530K4220O967
1280b21534Q9115N5966l6217J12693j11788q541J08996N9428n5327k31287N250
1269b33246l1680R3387q6336l922J24547j6229K2670m7494J4929P1410J5029j9906
1257i6841j12305J63254n6777K09308q1286L428k8668o9162m1340P3732J18477
1246H1820j79164l7526L6840M2647o0669J1840Q6823o2866R5552o7988j53463
1235b06154m0583O0293Q809J406O958p5638K8052J26336N3371j30154P1143n8082
$$ y = [-50172, -119140, -124961, -96213, -184461, -53863, -64527, -54928, -47090, -31550, -42168, 9026, -66810, -128831, -83662, -197214, -261756, -162327, -109662, -107315, -141363, -61350, -59768, -38972, 32295, -87324, -103968, -9673, 80197, 4405, 14780, 15106, -113498, -100191, -252721, -228501, -221534, -132419, -76453, -112670, 23, -111765, -120306, -11310, 48118, -7209, -238496, -233246, -264926, -171539, -257875, -261797, -137250, -153479, -130809, -178303, -163374, -91964, -76935, -96841, -209146, -45892, -102669, 106639, 25353, 28781, 113, -69049, -110389, -36657, 81820, -97344, -134870, -98030, -55383, -116052, -104212, -17389, -80255, 15297, -52691, -206154, -246737, -186444, -177635, -176229, -169271, -244909, -216857, -90521, -37150, -167304, -96161, -154243]
1223a54243p1117K12764L6820n9616O2278r8196n5755q1082n1405j07064Q9522
1212b77094k2359J03803j39675J11983j6535l4433J30501M0374r6517J66685J51838
1201A18571N147Q2907J9951k11788m9487n0104L2778p8606K51902j9213K4545
1190A26603j9791j36161K5315M0090r6802l9911P2002l0725L9661J45006O1412
1179A86699m4296j33760k7245k2251o221J49080o3540N9103P6915J2352q9882
1168I6954j2303q7819n6349m7588r9435K7126L1607Q0694p1596p6882l748q3897
1156c03236r350K04931Q5508n8490Q821J32219R7466n9251j37445J147j15021
1145a52701J23492M8898K6936l952j1004p2908j48949L5985P3262R742n2258K11185
$$ y = [-154243, -225360, -12596, 24224, -35392, 26886, -71310, -127065, -208147, -259552, -366616, -277094, -299453, -195650, -335325, -223342, -239877, -274310, -143809, -103435, -199952, -33267, 118571, 123718, 206625, 226576, 14788, -34699, -84803, -52025, -130631, 121271, 102058, 126603, 106812, -29349, -4034, 36056, -60746, -100657, -28655, -59380, -19719, 125287, 186699, 142403, 8643, -18602, -40853, -47074, 102006, 38466, 97569, 174484, 186836, 96954, 84651, -3168, -59517, -107105, -206540, -179414, -147807, -67113, -138709, -215591, -219339, -303236, -312586, -107655, -22147, -80637, -71816, 60403, 157869, 98618, -38827, -37680, -152701, -29209, 19689, 46625, 42673, 31669, -41239, -190188, -154203, -80941, -71199, -123457, 87728]
1133H7728n6389M1736r088J4335P5684m3308j52410J16937J63698K3190j13443
1122A48670l6732Q434M0944j50381J09392r4058J762o1155l1566Q4815P6757j36289
1110c9407M446J06343j26894K6801N6503k1106M1236R254j23659M734j3054K07680
1098A32877q0786M2268L6660l650o754Q6468j29276n2034L8578j57096j57034
1087b49779o0349N7028O4635J44099n949j32765L7305P4691K8304J67841r0248
1076C4813J17786k0109J47246n7796k9611j58486j04375q6747N1074j09267P5838
1065a39634N4694J04660j7352r2658o5561P2164k5141Q7128M8828j21574K973
1054i1473l391N8970P6556j8090N0011Q4508j7422M452j21111o2837J9080J23802
$$ y = [87728, 31339, 73075, 63987, 78322, 154006, 110698, -41712, 75225, 238923, 262113, 148670, 111938, 120372, 161316, 10935, 120327, 26269, 28031, -33124, -64690, 20125, 96882, -39407, -34961, 71382, -55512, -28711, 27792, 6686, 47922, 57176, -66483, -61749, -74803, 132877, 52091, 94359, 131019, 127369, 120615, 207083, 77807, 25773, 64351, -92745, -249779, -310128, -253100, -188465, -44366, -50315, -183080, -145775, -71084, -42780, 125061, 34813, 152599, 132490, 279736, 221940, 192329, 33843, -70532, -157279, -106205, -215472, -139634, -84940, 19720, 2368, -90290, -155851, -83687, -108828, -21700, 27128, -94446, -91473, -94864, -35894, 40662, 22572, 72583, 157091, 139669, 144121, 23010, -39827, -20747, 103055]
1042A03055j72747j3567j0650l2464O370K6745j16628j08377J78102P4195m9623
1031a15589J02731J51113q9930J46251J0551k2990J2024k7820M7171j29598o0777
1020B3137n2244M839J2029L8184m9973j65816l890J50214J56836O7930j21410
1009E9836p4413J0243K32062r818R1376P567j8056n5778J23256J7707r1838k0963
997B71181J10877k23739j27273N8153R2514j7937J04341j41848p2528P0672N6535
986A80948r725K7240P2322j42020O1061J38522k5515j25221O4083O6013o1987
975B45721J669K8836m9730j1244N4345o4685J4202J9999l0201K5409K675P9557
963C16553l7465J09248J55219p3046L285j42970p1878L2835J50347Q9104J83576
$$ y = [103055, -69692, -83259, -93909, -126373, -120003, -93258, -209886, -318263, -140161, -65966, -115589, -12858, 138255, 48325, 194576, 205127, 182137, 194161, 166341, 213512, 83914, 23137, -29107, -24268, -12239, 25945, -24028, -189844, -193734, -43520, 113316, 181246, 59836, -14577, -4334, 227728, 217910, 309286, 316853, 298797, 243019, 366275, 383982, 292144, 271181, 382058, 158319, 31046, 89199, 181713, 163776, 268117, 126269, 53741, 124413, 180948, 171223, 198463, 270785, 128765, 189826, 328348, 302833, 177612, 241695, 307708, 245721, 247390, 276226, 226496, 215252, 269597, 204912, 219114, 239113, 208912, 234321, 236996, 316553, 279088, 388336, 543555, 470509, 473794, 330824, 258946, 291781, 442128, 531232, 714808]
952G14808L7459l0255R2660n3707K2216L6856O0712J07283r6845m3055q3071J99105
940I64166L5184P6717j82265L4327L7588N1304K7353J76894R0818M0895K20532
929A573513K16326k02593k9107J55969J19518K36086M6818J74648J06854K38349
919B636381P8972J39541J32685J59499K77150M23385L33641J61014K81035M77097
909E100400K03668M29783L73783O14477O26959J110032J153210J171792J408907
900A2193011J783741J879703K171234K002728J194185n26131k208121k944614
892A5545736k502368j987788j524172j342582j020499q98866o05836m26065l77708
$$ y = [714808, 752267, 722012, 814672, 760965, 783181, 820037, 880749, 988032, 891187, 848132, 765061, 964166, 999350, 1076067, 893802, 928129, 965717, 1017021, 1044374, 1221268, 1312086, 1352981, 1573513, 1789839, 1587246, 1558139, 1714108, 1833626, 2069712, 2116530, 2291178, 2398032, 2636381, 2715353, 2854894, 2987579, 3147078, 3424228, 3847613, 4181254, 4342268, 4623303, 5100400, 5304068, 5733851, 6107634, 6722111, 7349070, 8459102, 9612312, 10784104, 12193011, 13976752, 15856455, 18027689, 20030417, 21224602, 20698471, 18490350, 15545736, 13043368, 11055580, 9531408, 8188826, 7168327, 6269461, 5663625, 5237560, 4859852]
$$ [...]
##END NTUPLES=NMR SPECTRUM
##END=
