##TITLE=1H_CA-8820
 CDCl3,8 sc, 
 9.02.2021
##JCAMPDX= 6.0         $$ Bruker NMR JCAMP-DX V2.0
##DATA TYPE= NMR SPECTRUM
##DATA CLASS= NTUPLES
##ORIGIN= UXNMR, Bruker Analytische Messtechnik GmbH
##OWNER= root
$$ XWIN-NMR		Version 3.5
$$ Tue Feb  9 10:24:19 2021 Russian Standard Time (UT+4h)  she@DPX200
##.OBSERVE FREQUENCY= 200.1315066352
##.OBSERVE NUCLEUS= ^1H
##.ACQUISITION MODE= SIMULTANEOUS
##.ACQUISITION SCHEME= undefined
##.AVERAGES= 8
##.DIGITISER RES= 18
##SPECTROMETER/DATA SYSTEM= spect
##.PULSE SEQUENCE= zg30
##.SOLVENT NAME= CDCl3
##.SHIFT REFERENCE= (INTERNAL, CDCl3, 0, 15.9626)
##AUDIT TRAIL= $$ (NUMBER, WHEN, WHO, WHERE, WHAT)
$$ ##TITLE= Audit trail, XWIN-NMR		Version 3.5
$$ ##JCAMPDX= 5.01
$$ ##ORIGIN= Bruker BioSpin GmbH
$$ ##OWNER= she
$$ F:/spectra/data/she/nmr/H-F/1/pdata/1/auditp.txt
$$ ##AUDIT TRAIL=  $$ (NUMBER, WHEN, WHO, WHERE, WHAT)
(   1,<2021-02-09 10:23:01.75 +0400>,<she>,<DPX200>,
      <created by zg, POWCHK disabled, PULCHK disabled
       configuration hash MD5:
       00 E9 B6 7A A2 85 ED C7 34 08 36 98 17 FE 4E 26
       data hash MD5: 16K
       26 7A F5 47 D7 20 7B 1E A0 76 C0 A9 DB C5 E3 C1>)
(   2,<2021-02-09 10:23:05.18 +0400>,<she>,<DPX200>,
      <Start of raw data processing
       efp BC_mod = 2 LB = 0.24 FT_mod = 6 PKNL = 1 PHC0 = -10750.62 PHC1 = 4.800936 SI = 16K 
       data hash MD5: 16K
       5F B0 27 2D 76 7C 58 AA 13 57 87 C3 F9 77 4A B9>)
(   3,<2021-02-09 10:23:30.37 +0400>,<she>,<DPX200>,
      <pk PHC0 = -0.550045 PHC1 = 2.8 
       data hash MD5: 16K
       F1 74 5E 9D F2 B8 04 96 E2 AE 05 B9 D3 E5 8A 7E>)
(   4,<2021-02-09 10:23:33.73 +0400>,<she>,<DPX200>,
      <abs ABSG = 5 
       data hash MD5: 16K
       E2 FB 35 25 45 9F 51 8A 47 15 02 AE 1E DE 89 65>)
$$ ##END=
$$ 
$$ hash MD5
$$ CD E5 D9 43 24 5A 40 58 A4 DD F0 08 91 79 E9 83
##$RELAX= 
##$RELAX= 
##$RELAX= 
##$RELAX= 
##$RELAX= 
##$RELAX= 
$$ Bruker specific parameters
$$ --------------------------
##$DU= <F:/spectra>
##$EXPNO= 1
##$NAME= <H-F>
##$PROCNO= 1
##$TYPE= <nmr>
##$USER= <she>
##$AMP= (0..31)
100 100 100 100 100 100 100 100 100 100 100 100 100 100 100 100 100 100 
100 100 100 100 100 100 100 100 100 100 100 100 100 100 
##$AQSEQ= 0
##$AQ_mod= 1
##$AUNM= <au_zg>
##$AUTOPOS= <>
##$BF1= 200.13
##$BF2= 200.13
##$BF3= 200.13
##$BF4= 200.13
##$BF5= 200.13
##$BF6= 200.13
##$BF7= 200.13
##$BF8= 200.13
##$BYTORDA= 1
##$CFDGTYP= 0
##$CFRGTYP= 5
##$CHEMSTR= <none>
##$CNST= (0..31)
1 1 145 1 1 1 1 1 1 1 1 1 1 1 1 1 1 1 1 1 1 1 1 1 1 1 1 1 1 1 1 1 
##$CPDPRG= <>
##$CPDPRG1= <>
##$CPDPRG2= <>
##$CPDPRG3= <>
##$CPDPRG4= <mlev>
##$CPDPRG5= <mlev>
##$CPDPRG6= <mlev>
##$CPDPRG7= <mlev>
##$CPDPRG8= <mlev>
##$CPDPRGB= <>
##$CPDPRGT= <>
##$D= (0..31)
0 1.2 0 0 0 0 0 0 0 0.06 0 0.03 0 0 0 0 0.0002 0 0 0 0 0 0 0 0 0 0 0 0 
0 0 0 
##$DATE= 1612851781
##$DBL= (0..7)
120 120 120 120 120 120 120 120 
##$DBP= (0..7)
150 150 150 150 150 150 150 150 
##$DBP07= 0
##$DBPNAM0= <>
##$DBPNAM1= <>
##$DBPNAM2= <>
##$DBPNAM3= <>
##$DBPNAM4= <>
$$ [...]
##$SUBNAM3= <"">
##$SUBNAM4= <"">
##$SUBNAM5= <"">
##$SUBNAM6= <"">
##$SUBNAM7= <"">
##$SUBNAM8= <"">
##$SUBNAM9= <"">
##$SW= 16.9725356469052
##$SWIBOX= (0..15)
0 0 2 0 0 0 0 0 0 0 0 0 0 0 0 0 
##$SW_h= 3396.73913043478
##$TD= 16384
##$TD0= 1
##$TE= 0
##$TE2= 300
##$TE3= 300
##$TEG= 300
##$TL= (0..7)
0 120 120 120 120 120 120 120 
##$TP= (0..7)
150 150 150 150 150 150 150 150 
##$TP07= 0
##$TPNAME0= <>
##$TPNAME1= <>
##$TPNAME2= <>
##$TPNAME3= <>
##$TPNAME4= <>
##$TPNAME5= <>
##$TPNAME6= <>
##$TPNAME7= <>
##$TPOAL= (0..7)
0.5 0.5 0.5 0.5 0.5 0.5 0.5 0.5 
##$TPOFFS= (0..7)
0 0 0 0 0 0 0 0 
##$TUNHIN= 0
##$TUNHOUT= 0
##$TUNXOUT= 0
##$USERA1= <user>
##$USERA2= <user>
##$USERA3= <user>
##$USERA4= <user>
##$USERA5= <user>
##$V9= 5
##$VALIST= <valist>
##$VCLIST= <CCCCCCCCCCCCCCC>
##$VD= 0
##$VDLIST= <DDDDDDDDDDDDDDD>
##$VPLIST= <PPPPPPPPPPPPPPP>
##$VTLIST= <TTTTTTTTTTTTTTT>
##$WBST= 1024
##$WBSW= 4
##$XGAIN= (0..3)
0 0 0 0 
##$XL= 0
##$YL= 0
##$YMAX_a= 260534
##$YMIN_a= -214019
##$ZGOPTNS= <>
##$ZL1= 120
##$ZL2= 120
##$ZL3= 120
##$ZL4= 120
##$ABSF1= 15.98128
##$ABSF2= -0.9913816
##$ABSG= 5
##$ABSL= 3
##$ALPHA= 0
##$AQORDER= 0
##$ASSFAC= 0
##$ASSFACI= 0
##$ASSFACX= 0
##$ASSWID= 0
##$AUNMP= <proc_1d>
##$AZFE= 0.1
##$AZFW= 0.1
##$BCFW= 0
##$BC_mod= 2
##$BYTORDP= 0
##$COROFFS= 0
##$CY= -3
##$DATMOD= 1
##$DC= 0
##$DFILT= <>
##$DTYPP= 0
##$F1P= 0
##$F2P= 0
##$FCOR= 1
##$FTSIZE= 16384
##$FT_mod= 6
##$GAMMA= 0
##$GB= 0
##$INTBC= 1
##$INTSCL= 2.992141e-10
##$ISEN= 128
##$LB= 0.24
##$LEV0= 0
##$LPBIN= 0
##$MAXI= 10000
##$MC2= 0
##$MEAN= 0
##$ME_mod= 0
##$MI= 1.114404
##$NCOEF= 0
##$NC_proc= -7
##$NLEV= 6
##$NOISF1= 3.799351
##$NOISF2= 2.8
##$NSP= 0
##$NTH_PI= 0
##$NZP= 0
##$OFFSET= 15.96263
##$PC= 1
##$PHC0= -10751.17
##$PHC1= 7.600936
##$PH_mod= 1
##$PKNL= yes
##$PPARMOD= 0
##$PSCAL= 0
##$PSIGN= 0
##$REVERSE= no
##$SF= 200.130010402757
##$SI= 16384
##$SIGF1= 3
##$SIGF2= 2
##$SINO= 5.538805
##$SIOLD= 16384
##$SREGLST= <1H.CDCl3>
##$SSB= 0
##$STSI= 16384
##$STSR= 0
##$SW_p= 3396.73913043478
##$SYMM= 0
##$S_DEV= 0
##$TDeff= 16384
##$TDoff= 0
##$TI= <>
##$TILT= no
##$TM1= 0
##$TM2= 0
##$TOPLEV= 0
##$USERP1= <user>
##$USERP2= <user>
##$USERP3= <user>
##$USERP4= <user>
##$USERP5= <user>
##$WDW= 1
##$XDIM= 16384
##$YMAX_p= 312882135
##$YMIN_p= -851698
$$ End of Bruker specific parameters
$$ ---------------------------------
##NTUPLES= NMR SPECTRUM
##VAR_NAME=  FREQUENCY,     SPECTRUM/REAL,   SPECTRUM/IMAG
##SYMBOL=    X,             R,               I
##VAR_TYPE=  INDEPENDENT,   DEPENDENT,       DEPENDENT
##VAR_FORM=  AFFN,          ASDF,            ASDF
##VAR_DIM=   16384,         16384,           16384
##UNITS=     HZ,            ARBITRARY UNITS, ARBITRARY UNITS
##FACTOR=    0.207333158178281, 1,           1
##FIRST=     3194.60136237304, 0,            0
##LAST=      -202.137768061743, 0,           0
##MIN=       -202.137768061743, -851698,     0
##MAX=       3194.60136237304, 312882135,    0
$$ Real data points
##PAGE= N=1
##DATA TABLE= (X++(R..R)), XYDATA
$$ [...]
5369A0021877j12873q286p4906L6360n3124j36271J71707Q3040K64070m2125R3901
5358A0243370m6280J64901r1473J52507L35864P9111J9093o99105l67096k7849
5348I763043M1000O2446L74220o2155J9263K49849o0204j63190P6721k61512k35501
5337I803980r162k28862J54932k4045j88731m25065K45695J74929n833m7842j65444
5326I284552o9371k2483J36989l44156j58762P5128j15887o248m0017J01912j93200
5315H648457j56288O4017n7923M326j57568k40254j82613k24918j21159J93187
5305G769264j74647k73332M59350L30515r1500j84542j51004P8810l93915Q8383
5295G457382k26079k3445m44364o6619K70982k57713J5331m1580k19849m2302
$$ y = [10021877, 9909004, 9900718, 9825812, 9862172, 9809048, 9672777, 9844484, 9927524, 10191594, 10149469, 10243370, 10197090, 10361991, 10270518, 10423025, 10758889, 10838000, 10857093, 10157988, 9790892, 9763043, 9804043, 9866489, 10240709, 10178554, 10197817, 10447666, 10387462, 10224272, 10300993, 10039481, 9803980, 9794818, 9565956, 9720888, 9696843, 9508112, 9083047, 9328742, 9503671, 9497838, 9449996, 9284552, 9215181, 9192698, 9329687, 8985531, 8826769, 8901897, 8786010, 8779762, 8739745, 8841657, 8648457, 8492169, 8556186, 8498263, 8502589, 8345021, 8104767, 7922154, 7697236, 7576077, 7769264, 7594617, 7321285, 7780635, 8111150, 8019650, 7835108, 7684104, 7762914, 7368999, 7457382, 7231303, 7207858, 6763494, 6696875, 6967857, 6710144, 6725475, 6683895, 6464046, 6421744]
5285F421744L6555P6165R7389n7435R2029M2783J10377J16241j86837m88494K0291
5274F280808J0661O6421k00219N6833K13504p276j06986l5250l7669j9599n9588
5263F161640n6811j78550J66303Q2852K30271n5762n7605j29852J51714k84045
5253F030155k20774n9226j8994m8130j50516j43335J23051J23469N9586M52636
5243F147922j70746K30688N35376m6236l89339k74822m7725k0755m6269K10200
5233F128294r5321k06570J5802O7987K72175K86279q705k337l2524K60045k28580
5222F456545n3288j70561j36585K17988M1549o0658K65627Q3726O0195J75000
5212F879538L9661M6698M0161m1657L1908k6997k39442p7200j8417j51739n7880
$$ y = [6421744, 6458299, 6534464, 6631853, 6574418, 6666447, 6709230, 6819607, 6935848, 6749011, 6260517, 6280808, 6291469, 6357890, 6157671, 6214504, 6428008, 6420732, 6313746, 6278496, 6240827, 6221228, 6161640, 6104829, 5926279, 6092582, 6175434, 6405705, 6349943, 6292338, 6162486, 6314200, 6030155, 5809381, 5750155, 5731161, 5683031, 5532515, 5389180, 5512231, 5635700, 5695286, 6147922, 5977176, 6207864, 6743240, 6697004, 6307665, 6032843, 5985118, 5964363, 5918094, 6128294, 6032973, 5826403, 5842205, 5910192, 6182367, 6468646, 6459941, 6457604, 6425080, 6685125, 6456545, 6403257, 6232696, 6096111, 6314099, 6355648, 6294990, 6560617, 6644343, 6704538, 6879538, 6919199, 6965897, 7006058, 6964401, 6996309, 6969312, 6729870, 6652670, 6634253, 6482514, 6424634]
5201F424634L36291L90276N2036l0655K40944P2448j2315p4868j68372Q6211k464
5190G314166K63179P1561k27449k17720k8842J34161M0552K11397M06836m1366
5180G926475o0795K51361j63318J47853j14601P2462K21432n9986k4046K82885
5170H479722K37346L3327J10854j30680q3053j56516k36249J13789O8289J30672
5160H567501J73708R642R8633P2392M5826K88102k37814K38692K10740j04840
5150I362582J22360q6826m5364j25050j16333Q5607O2952J1056K07503R9709J43437
5139I721633J44804J81840O1155l2195J5201k7208p5079J90253j77478K43850
5129A0246776q7402Q241o4879R0203K71341K84309O0385j35971q8692J42698L18538
$$ y = [6424634, 6760925, 7151201, 7203237, 7172582, 7413526, 7485974, 7473659, 7398791, 7230419, 7316630, 7314166, 7577345, 7648906, 7421457, 7203737, 7174895, 7309056, 7349608, 7561005, 7967841, 7926475, 7865680, 8117041, 7953723, 8101576, 7986975, 8059437, 8280869, 8220883, 8196837, 8479722, 8717068, 8750395, 8861249, 8730569, 8647516, 8491000, 8254751, 8368540, 8436829, 8567501, 8741209, 8750851, 8849484, 8921876, 8967702, 9255804, 9017990, 9256682, 9467422, 9362582, 9484942, 9398116, 9352752, 9227702, 9111369, 9196976, 9259928, 9270984, 9478487, 9578196, 9721633, 9866437, 10048277, 10109432, 10077237, 10092438, 10065230, 9990151, 10180404, 10002926, 10246776, 10159374, 10167615, 10102736, 10192939, 10464280, 10748589, 10808974, 10673003, 10584311, 10727009, 11045547]
5118A1045547m8489j73067K95039j84304p5551K02411L2901L1478k17550J58574
5108A1066989j46185j5858J02657K14866J28878J33474J79153n0100l78686o6164
5098A1169024R2468N1841k7085M0040j30945O0542m6192K60186K03867m15601
5088A1258145j24388K33988j6279N8830N6955q6598j43063j02023l5132K42429
5078A1342864K06575j05722o1610k91929j17524K15010j26906j85171J73676K98301
5068A1347564P8188R1658j15112M09620k35340j57473L28113k55328k40918l11914
5058A0939058k86077j50279R8823j17406q123J11610p7410L60107K59844j45953
5048A0984194M0926j29019k22739L4763p8262k43978J7606l27347j14679K07021
$$ y = [11045547, 10997058, 10823991, 11119030, 10934726, 10859175, 11061586, 11094487, 11125965, 10908415, 11066989, 10920804, 10904946, 11007603, 11222469, 11351347, 11484821, 11663974, 11613874, 11235188, 11169024, 11261492, 11313333, 11286248, 11326288, 11195343, 11255885, 11209693, 11469879, 11673746, 11258145, 11133757, 11367745, 11351466, 11410296, 11467251, 11380653, 11237590, 11135567, 11100435, 11342864, 11549439, 11443717, 11382107, 11090178, 10972654, 11187664, 11060758, 10875587, 11049263, 11347564, 11425752, 11517410, 11402298, 11811918, 11576578, 11419105, 11747218, 11491890, 11250972, 10939058, 10652981, 10502702, 10601525, 10484119, 10475996, 10587606, 10510196, 10870303, 11130147, 10984194, 11025120, 10896101, 10673362, 10708125, 10629863, 10385885, 10403491, 10076144, 9961465, 10168486]
5038A0168486k31402k9141Q2537q6651K51955J3837j20514q9655L7806j35123
5028I862135J64987r9859k32022O0001l20543m2445o0473K26631r7922k29036
5018I231454j83553j42662J05579j75679J9734J17197j4024m4622K2301j04692
5008H831033O6621k43075k15529P7710l03386K11916K99180m12741Q4520l14078
4998H082171l79117j6733P5249K87071k06931N9123l4434M5557j07893o3203Q1852
4987G822712l25012N8709R6880p8631o6110l75806j38618K59595l2511j12275
4977G108933j3649J6126J06808J87446j71414j25980k47211j11168r3J01368j82383
4966F668783J6810J4189m04167Q3485j83168J38412l509m22996L50099j00453
$$ y = [10168486, 9937084, 9907943, 9990480, 9903829, 10155784, 10169621, 10049107, 9959452, 9997258, 9862135, 10027122, 9927263, 9695241, 9755242, 9434699, 9392254, 9331781, 9558412, 9460490, 9231454, 9047901, 8905239, 9010818, 8835139, 8854873, 8972070, 8958046, 8913424, 8935725, 8831033, 8897654, 8654579, 8439050, 8516760, 8213374, 8425290, 8724470, 8311729, 8396249, 8082171, 7703054, 7686321, 7761570, 8048641, 7841710, 7900833, 7866399, 7911956, 7804063, 7740860, 7822712, 7497700, 7556409, 7653289, 7574658, 7508548, 7132742, 6994124, 7253719, 7221208, 7108933, 7095284, 7111410, 7218218, 7405664, 7234250, 7108270, 6861059, 6749891, 6749798, 6851166, 6668783, 6685593, 6699782, 6295615, 6379100, 6195932, 6334344, 6330835, 5907839, 6257938, 6157485]
4956F157485n6620r621j32531p1586r3828j13634K1796n8526n2597J58721K8030
4945E777089k61127m6240J5320j13222J13699j9136j10151l7354K49147j63706
4935E404319l1658r385P9370K9980k18926j29085k42134j16100j52480k9096J13290
4924D698095J71036R7675j4688J5491k89549R353N6660k2794j35789j5342Q4539
4913D654687l9753k51685J37777j45525r5285J66225j7940J7236J34556o7003
4903D493290J05557l03701j70370L56944k16332k5256j51543R9161P5275j5036
4893D247989k5583k48826n7628O5287J62163j11243r9477O5877q0697j52446j24326
4882C641090J27378Q4301l8108l47367j03292J59063j22192K02839M1361k50596
$$ y = [6157485, 6100865, 6091244, 5958713, 5887127, 5793299, 5679665, 5701461, 5642935, 5590338, 5749059, 5777089, 5515962, 5469722, 5485042, 5371820, 5485519, 5466383, 5356232, 5318878, 5568025, 5404319, 5372661, 5363276, 5442646, 5472626, 5253700, 5124615, 4882481, 4766381, 4613901, 4584805, 4698095, 4869131, 4966806, 4952118, 4967609, 4678060, 4687413, 4744073, 4721279, 4585490, 4570148, 4654687, 4614934, 4363249, 4501026, 4355501, 4260216, 4426441, 4408501, 4425737, 4560293, 4493290, 4598847, 4295146, 4124776, 4481720, 4265388, 4240132, 4088589, 4187750, 4263025, 4247989, 4222406, 3973580, 3915952, 3981239, 4143402, 4032159, 3932682, 3998559, 3917862, 3765416, 3641090, 3768468, 3852769, 3814661, 3467294, 3364002, 3523065, 3400873, 3603712, 3645073, 3394477]
4872C394477J06205k35871P0941K06064o354j84097J14873J13938j7980L95773
4862C957969k95745J95979p6177l54144o969j66377p7931p8056L1867K21440P5307
4851C427163p6659n8976r5327L8286K05198J12664j21623l1180j55086j59665
4841C084795j90225j13390P7741p2045k49338J55388M26767m58381N5402L8019
4831B754733P805K63941k8122j7186M2629k6220k93166J71452k16291k01066K8592
4820B487101l6887J08523L3159J32001K14568o1041m1441Q7715K9919j8083L15168
4809C250702l30804k50732M6253j04114p9744k02149M5540J55025J93931K21630
4799B945538J00006R041n08478J87874J29980m38843j2532R924J99252n4560P4022
$$ y = [3394477, 3500682, 3264811, 3335752, 3541816, 3535462, 3351365, 3466238, 3580176, 3562196, 3957969, 3662224, 3858203, 3782026, 3427882, 3420913, 3254536, 3176605, 3098549, 3130416, 3351856, 3427163, 3350504, 3291528, 3196201, 3234487, 3439685, 3552349, 3430726, 3399546, 3244460, 3084795, 2894570, 2781180, 2858921, 2786876, 2537538, 2692926, 3119693, 2661312, 2716714, 2754733, 2762538, 3026479, 2998357, 2981171, 3023800, 2997580, 2704414, 2875866, 2659575, 2458509, 2487101, 2450214, 2558737, 2591896, 2723897, 2938465, 2877424, 2835983, 2923698, 2953617, 2935534, 3250702, 2919898, 2669166, 2715419, 2611305, 2531561, 2329412, 2374952, 2529977, 2723908, 2945538, 3045544, 3054585, 2546107, 2733981, 2863961, 2425118, 2412586, 2422510, 2621762, 2567202, 2641224]
4788B641224L5254k4268o1674J99549J45989j88024K53230o2341l83795J08920
4778B664064k84119k0095J2400j08971J78574L68207R07l8538m0749k02062Q4000
4767B613618k416M4565p4271K8709J68652r5865j04323j44835J56024m419j8763
4756B566676L14654m37776L61302J41636l60473L06211R2338j40708q4817j8842
4746B740201N773m5481o5856N3664K49452k07492J71579p5314j94611J97974J10656
4735B940545J59025J18536N6715j99579J4486r800j83962J26475k02086p2404
4725B747951J88707J38475q9136K77872k6889j45597K28950m3800J25500j65953
4715C236080M1634J54815r4697J8320q705n3546J17096j36854m4122K19346P2311
$$ y = [2641224, 2676478, 2652210, 2590536, 2790085, 2936074, 2748050, 3001280, 2938939, 2555144, 2664064, 2379945, 2359850, 2372250, 2263279, 2441853, 2810060, 2810967, 2772429, 2731680, 2529618, 2613618, 2611202, 2655767, 2581496, 2610205, 2778857, 2682992, 2578669, 2433834, 2589858, 2585439, 2566676, 2881330, 2443554, 2804856, 2946492, 2586019, 2892230, 2984568, 2843860, 2759043, 2740201, 2745974, 2700493, 2634637, 2688301, 2937753, 2730261, 2901840, 2826526, 2631915, 2829889, 2940545, 3099570, 3218106, 3274821, 3075242, 3089728, 3079928, 2895966, 3022441, 2820355, 2747951, 2936658, 3075133, 2985997, 3263869, 3236980, 3091383, 3320333, 3276533, 3402033, 3236080, 3277714, 3432529, 3337832, 3356152, 3347447, 3293901, 3410997, 3274143, 3230021, 3449367, 3521678]
4704C521678r8021M44558Q1711k7983j12951J40896O3145k4305K63002J28567
4694D380297J82284J26521j91651J25446l8494k53504L48289k1254J22880P9826
4684D860640O2233N9900K4069J89146J79072K31910K26044J39261l48323R6822
4674E720774K94110K08135L9931k197K60018J43150P2435J66940K93841j40660
4664G056477j48261M40260K52519J92909K22885K58156p575P8447L60119Q5416
4654H791352R0094j19239J86265L38630j81586J80379j42446L2390J81995l5300
4644I322534K34221k0982P4601J89833K79045J1105L21739n9168J54308l7938
4634A0469298K9197L01155m8412j84262J60774J91317K62245K41622J26728j93613
$$ y = [3521678, 3423657, 3868215, 3949926, 3921943, 3808992, 3949888, 4013033, 3988728, 4251730, 4380297, 4562581, 4689102, 4497451, 4622897, 4584403, 4330899, 4679188, 4657934, 4780814, 4860640, 4922873, 4982773, 5006842, 5195988, 5375060, 5606970, 5833014, 5972275, 5623952, 5720774, 6014884, 6223019, 6262950, 6260753, 6520771, 6663921, 6736356, 6903296, 7197137, 7056477, 6908216, 7348476, 7600995, 7793904, 8016789, 8274945, 8267370, 8345817, 8705936, 8791352, 8881446, 8762207, 8948472, 9287102, 9105516, 9285895, 9143449, 9175839, 9357834, 9322534, 9556755, 9535773, 9610374, 9800207, 10079252, 10090357, 10412096, 10352928, 10507236, 10469298, 10498495, 10799650, 10751238, 10566976, 10727750, 10919067, 11181312, 11422934, 11549662, 11356049]
4624A1356049j60600L1277r1463n1868p9581L12518K64581P2050o4626O9846j51939
4613A1506244k83818N1043p4350k0006p8761L38639M99546k49088J3648l17807
4603A1385290j15258l94758J15617J77309O5731j93328J32446K16529j92487J54254
4593A1351345L864k03833N172j07813j9250j99655p455O1076k78704j948p195
4582A0595604O5807j36704j21364J3962J77390L5244Q5586K93270j29470l26902
4572A0552423n367j29767K3276o3081M97333J51311j65352m111L75262J53758
4562A1385685q5531j21607j302k2790k0742L19202L24920K25769L64047J59107
4552A2526758N9720j96425K11541M07358J98901n2337K03269O89368P6923J06458
$$ y = [11356049, 11195449, 11226726, 11135263, 11083395, 11003814, 11316332, 11580913, 11652963, 11588337, 11658183, 11506244, 11222426, 11273469, 11199119, 11179113, 11100352, 11438991, 11938537, 11689449, 11703097, 11385290, 11270032, 10875274, 10990891, 11168200, 11233931, 11040603, 11173049, 11389578, 11197091, 11351345, 11355209, 11151376, 11156548, 11048735, 11029485, 10829830, 10822375, 10883451, 10604747, 10602799, 10595604, 10661411, 10524707, 10403343, 10417305, 10594695, 10629939, 10715525, 11008795, 10879325, 10552423, 10547056, 10417289, 10440565, 10377484, 10874817, 11026128, 10860776, 10856665, 11231927, 11385685, 11300154, 11178547, 11177245, 11154455, 11133713, 11452915, 11777835, 12003604, 12367651, 12526758, 12586478, 12390053, 12601594, 13008952, 13207853, 13155516, 13358785, 14048153, 14125076, 14231534]
4542A4231534L00007M08523L29628L60917L44457J17211K58276J14147K93681
4533A6758381L79493K36695N60537L23867J47582L66591L37069K79232K96796
4524A9686243L67143J72003L4029L33442Q1951J78771o393K35967K59466N44176
4514B1886798K11757M38433O23488K08327L01113K06322j17584j04531P9079J26923
4504B3860125J50702K26157J38334J34616J29141K06218K57319m678N5571Q4717
4494B5238222J54820m8481k4843j04003K3723j33452m22420j2569J04868j74696
4484B4601169N0211m32717m571J13634l04569p3927j51623m15775j11988j43193
4474B3126651j15338K8503r5592k09378j16385k15888m30417m58210m38699m81607
$$ y = [14231534, 14531541, 14940064, 15269692, 15630609, 15975066, 16092277, 16350553, 16464700, 16758381, 17137874, 17374569, 17935106, 18258973, 18406555, 18773146, 19110215, 19389447, 19686243, 20053386, 20225389, 20259418, 20592860, 20674811, 20853582, 20847189, 21083156, 21342622, 21886798, 22098555, 22536988, 23160476, 23368803, 23669916, 23876238, 23758654, 23654123, 23733202, 23860125, 24010827, 24236984, 24375318, 24509934, 24639075, 24845293, 25102612, 25097934, 25153505, 25238222, 25393042, 25344561, 25319718, 25215715, 25239438, 25105986, 24683566, 24670997, 24775865, 24601169, 24651380, 24218663, 24214092, 24327726, 24023157, 23949230, 23797607, 23381832, 23269844, 23126651, 23011313, 23039816, 22944224, 22734846, 22618461, 22402573, 21972156, 21513946, 21075247, 20593640]
4464B0593640l31876j79331k88013l43121L4834k69360l20784k7822j51541O4678
4454A8781304j93819m31031j15125m909R5110j90717j25589l59321k43661n8824
4444A7153418l77851L9469K21420K52595J05214J46096j43764M9764O6946L66736
4434A7880043M0312J78354K59455J97908L17907K93733J17830O01602O88126O34333
4424B1209603O27998P36693O62144P92316O65900J215049J328739R67381J030652
4415B9236475J093544P23075Q47859N47750q2581J50648k11130j25193l7061l00407
4405C1842979o05930l66036o44476l87111n06825o60439l12897l19195o2033L31964
4395B8310001l6936J26747j33649l73954J79047P4257l95752l17963l08399o23018
$$ y = [20593640, 20261764, 20082433, 19794420, 19451299, 19486133, 19216773, 18895989, 18868167, 18716626, 18781304, 18587485, 18156454, 18041329, 18036420, 18131530, 17940813, 17815224, 17455903, 17212242, 17153418, 16775567, 16815036, 17036456, 17289051, 17394265, 17540361, 17396597, 17446361, 17513307, 17880043, 17920355, 18098709, 18358164, 18556072, 18873979, 19167712, 19285542, 19887144, 20575270, 21209603, 21837601, 22574294, 23236438, 24028754, 24694654, 25909703, 27238442, 28205823, 29236475, 30330019, 31053094, 31900953, 32448703, 32366122, 32516770, 32305640, 32180447, 32143386, 31842979, 31237049, 30871013, 30226537, 29839426, 29332601, 28672162, 28359265, 28040070, 27978037, 28310001, 28273065, 28399812, 28266163, 27892209, 28071256, 28145513, 27749761, 27431798, 27123399, 26500381]
4385B6500381l96615n60990r64161r28801j447826j138375o21677j190325q93276
4376A8358335o76900j097847p15032k22077q17357o73530o43584m87139k96507
4367A2728362m51093l36857j19955m61484j82895q8641p11323l65352m28619m69660
4357I112483l893r760r7600Q4562l33444k43775J49098K0775m26406j07089k31119
4346G913832m0116K83276j67852k02842l60967l96355J94415m4093j46152O8265
4336G101411Q706j84971K07080k71982j5258K39242j02505J44001Q6308k83068
4326F928964r4340l06346l68014J07587P0765o6494j23804j67518o7765R3753
4316F006788m0234K02011J0792j30356J04626L76651m2340K0915K1530r9036K44974
$$ y = [26500381, 26103766, 25542776, 24578615, 23649814, 22201988, 21063613, 20441936, 19251611, 18358335, 17681435, 16583588, 15868556, 15646479, 14829122, 14155592, 13512008, 13024869, 12728362, 12277269, 11940412, 11820457, 11358973, 11176078, 11087437, 10376114, 10010762, 9582143, 9112483, 9108590, 9098830, 9001230, 9085792, 8752348, 8508573, 8657671, 8678446, 8252040, 8144951, 7913832, 7873716, 8156992, 7989140, 7786298, 7425331, 7028976, 7223391, 7179298, 7033146, 7101411, 7110117, 6925146, 7132226, 6860244, 6844986, 7084228, 6981723, 7125724, 7212032, 6928964, 6834624, 6528278, 6160264, 6267851, 6338616, 6272122, 6148318, 5980800, 5913035, 6006788, 5966554, 6168565, 6179357, 6049001, 6153627, 6530278, 6487938, 6508853, 6530383, 6431347, 6676321]
4305F676321l95278k20032M52979n6904m4169N90568K473l9836J95650Q17K87479
4294G450068Q3941q2980L04387l51793m8398K48708j88213K9547K35730M1327
4284G722324n0979L08448Q1604K65727J61331R782K83104K91057j51999J98485
4274I118884j41167k25209K88233J22388K85719L95129J81978O06835K89071l7590
4264A0884271n5397O1152L24616M33432n5197J76770N40211K6848M26828N30831
4254A3294365k29578K30703N52840J06500L57734K98168L97595K82268J62546
4245A5453141L49942K91140O2142J87858M44575L40559L17108M16763K83847K33151
4235A8380226L53635K17489K45957J37473r6536L19503N7396J98829M26413N398
$$ y = [6676321, 6281043, 6061011, 6513990, 6457086, 6412917, 7003485, 7005958, 6966122, 7161772, 7162589, 7450068, 7534009, 7451029, 7755416, 7403623, 7355225, 7603933, 7415720, 7445267, 7680997, 7722324, 7671345, 7979793, 8061397, 8327124, 8488455, 8498237, 8781341, 9072398, 8920399, 9118884, 8977717, 8752508, 9040741, 9163129, 9448848, 9843977, 10025955, 10632790, 10921861, 10884271, 10828874, 10890026, 11214642, 11648074, 11592877, 11769647, 12309858, 12336706, 12763534, 13294365, 13064787, 13295490, 13848330, 13954830, 14312564, 14610732, 15008327, 15290595, 15453141, 15803083, 16094223, 16156365, 16344223, 16788798, 17129357, 17446465, 17863228, 18147075, 18380226, 18733861, 18951350, 19197307, 19334780, 19238244, 19557747, 19615143, 19813972, 20240385, 20245783]
4225B0245783L75553L08201K72951l8338J1232K48927K96083j7475Q9359J39196
4215B1931472j37945J46401J9086r4567j17844o0454j47064J13023J20818J11057
4205B1883983J1623l13254j74005J9890K0534j80891k29701j24739l36917J6932
4195B0593455J15566k64826N4076m30169k21948k75151m16251l95192k92212k71820
4185A8195528m19543k02329m2226K4024k43087l28707l76008l22618n58825k61314
4175A5464895l52732l18744n9074j488l83520n26296m39721l29419l39313k57558
4165A2457030j82709j39119j20795k18951j50816l51461l42807n12239l68780
4156A0069353r6394j05706N8829n28101l02227p7304j25545l19646m64579l24143
$$ y = [20245783, 20621336, 20929537, 21202488, 21164150, 21175382, 21424309, 21720392, 21702917, 21792276, 21931472, 21793527, 21939928, 21959014, 21864447, 21746603, 21686149, 21539085, 21652108, 21772926, 21883983, 21895606, 21582352, 21408347, 21428237, 21448771, 21267880, 21038179, 20913440, 20576523, 20593455, 20709021, 20444195, 20498271, 20068102, 19846154, 19571003, 19154752, 18759560, 18467348, 18195528, 17775985, 17573656, 17531430, 17555454, 17312367, 16983660, 16607652, 16285034, 15726209, 15464895, 15112163, 14793419, 14734345, 14732857, 14349337, 13823041, 13383320, 13053901, 12714588, 12457030, 12274321, 12135202, 12014407, 11795456, 11644640, 11293179, 10950372, 10438133, 10069353, 9972959, 9867253, 9926082, 9397981, 9095754, 9018450, 8892905, 8573259, 8108680, 7784537]
4146G784537l10565J29537j14458k0949j45876k54164P4344q0077k81074j99068
4136F582187l24417k33438l12969Q2844p0192j01238q9189L9640j59451m24875
4126D988902j02242j38468m4066R3366Q9067j42651r6569l30986l7035Q3527j50053
4115D212792k08282l01981j50783M22490R6738J01226j1213m57519j87147r0835
4105C425486M0842p380o2285r1418J80938J11206j26218J34753m28968m84504
4095B692452J8113J17979K5624j3150l09401n2078L51928R3107j29903j72968
4085B621703L0424J50952k66231J15993j35100j58938M2947M6957L9968k22972
4075B265703N3924k36735j34385L2326M7947L04281k39252r2204m609K45885J10842
$$ y = [7784537, 7473972, 7603509, 7489051, 7468102, 7322226, 7068062, 7142406, 7062329, 6781255, 6582187, 6257770, 6024332, 5711363, 5794207, 5724015, 5622777, 5533588, 5573228, 5413777, 4988902, 4886660, 4748192, 4704126, 4797492, 4886559, 4743908, 4647339, 4316353, 4279318, 4362845, 4212792, 4004510, 3702529, 3551746, 3974236, 4070974, 4172200, 4160987, 3703468, 3516321, 3425486, 3466328, 3458948, 3396663, 3305245, 3486183, 3597389, 3471171, 3605924, 3176956, 2692452, 2710565, 2828544, 2854168, 2841018, 2531617, 2479539, 2831467, 2924574, 2794671, 2621703, 2652127, 2803079, 2536848, 2652841, 2517741, 2358803, 2401750, 2448707, 2488675, 2265703, 2319627, 2082892, 1948507, 1980833, 2028780, 2333061, 2093809, 2001605, 1996996, 2242881, 2353723]
4064B353723k16851j61426j08621L9688J72293L00091j89311r1311J15739j67218
4054B046796p0232k13136j69285l1661q8633K72019J876k7177l9802J20472l8980
4043A762257J70003M0605j69532J5135R8422J68127j58480l28681j92887l26158
4033A078811J36595p8205l8840k5736p2378M26877M52977K37301j76594k6477
4023A914331O1875j84607k7719q3473k44156J8163j8578N9924P4122j77469J24968
4012A517381J11644j69508Q7519J56071j09634k91862J06605J63580k09030j65907
4002A196859p6788p0147J20961J22656q2030J24855M4997n3839M4097J31595q5817
3991A417399K99141j57988p1367j4012r6239j31730l37176q20J60179J58715J3567
$$ y = [2353723, 2136872, 1975446, 1866825, 1906513, 2078806, 2378897, 2189586, 2098275, 2214014, 2046796, 1976564, 1763428, 1594143, 1562482, 1473849, 1745868, 1747744, 1720567, 1680765, 1801237, 1762257, 1932260, 1972865, 1803333, 1818468, 1916890, 2085017, 1926537, 1597856, 1404969, 1078811, 1215406, 1137201, 1098361, 1072625, 1000247, 1427124, 1880101, 2117402, 1940808, 1914331, 1976206, 1791599, 1763880, 1680407, 1436251, 1454414, 1435836, 1495760, 1569882, 1392413, 1517381, 1629025, 1459517, 1547036, 1703107, 1593473, 1301611, 1408216, 1571796, 1362766, 1196859, 1120071, 1049924, 1170885, 1293541, 1211511, 1336366, 1381363, 1327524, 1371621, 1503216, 1417399, 1716540, 1558552, 1487185, 1473173, 1376934, 1245204, 908028, 907208, 1067387, 1226102, 1239669]
3980A239669J06583j89095j57509J26207Q9574n6699o4178J94180P3448P8921
3970A441101P0365J17981J0004j63559j32896q8961j41972N2232L44250j26926
3960A381619n2820M9139K8644j30692j96919q081J49690k1778J9419K03354q2333
3949A339242M0071P6055k17598k0609k55401m5581O3240J03617J59002J84031
3939A426069o7395j12497K01122k50856j79936K1101J58517J36305m0797P5547
3929A367180p0578J0964j85348K09297O6340j23593N6436K15398J77804J66411
3919A890311J62105n4534k42029N9439r4897m31675L6127J11772J51756o315N6049
3908A638109L02170k05041n5226n790N2706J25097J19799j0839J49942l0611k6344
$$ y = [1239669, 1346252, 1157157, 999648, 1125855, 1215429, 1158730, 1094552, 1288732, 1362180, 1441101, 1511466, 1629447, 1639451, 1475892, 1342996, 1254035, 1112063, 1164295, 1508545, 1381619, 1328799, 1377938, 1406582, 1275890, 1078971, 1070890, 1220580, 1198802, 1218221, 1421575, 1339242, 1379313, 1455368, 1237770, 1217161, 961760, 916179, 979419, 1083036, 1242038, 1426069, 1358674, 1246177, 1447299, 1196443, 1016507, 1037608, 1196125, 1332430, 1291633, 1367180, 1296602, 1307566, 1122218, 1331515, 1397855, 1274262, 1330698, 1546096, 1723900, 1890311, 2052416, 1997882, 1755853, 1815292, 1720395, 1288720, 1324847, 1436619, 1588375, 1582060, 1638109, 1940279, 1735238, 1680012, 1674222, 1726928, 1852025, 1971824, 1960985, 2110927, 2080316, 2053972]
3897B053972K42389k61164q9954j84369j48149l12271K75480j20127J70953L66423
3887A993183j87098L11744J33122j22665j31655n2475l24819K21752L03294O9444
3877B213827p79k72209p264K5426k6022k17012O5351M4188r690M8781j46828K56767
3865A974536K40464O6736J65988j02734n4207K09756j21042J22906q4501k27393
3855B190509J40307k13434k08625l6524k1673J29424J37541n8490K05197K70293
3845B534525k84942J48418J62408k41548J56423R824J8151R4252J4372q8040n0255
3834B473588N1505j0550j48743L1163J03888J18563J94223k114P5447j47274j9701
3823B719995J43211R7873m0674l06190K48273J75174j40617K03876M5465k27296
$$ y = [2053972, 2296361, 2035197, 1945243, 1760874, 1612725, 1300454, 1575934, 1455807, 1626760, 1993183, 1806085, 2117829, 2250951, 2128286, 1996631, 1944156, 1619337, 1841089, 2144383, 2213827, 2213048, 1940839, 1933575, 1959001, 1932979, 1715967, 1781318, 1825506, 1815816, 1864597, 1717769, 1974536, 2215000, 2281736, 2447724, 2344990, 2290783, 2500539, 2379497, 2502403, 2417902, 2190509, 2330816, 2117382, 1908757, 1872233, 1850560, 1979984, 2117525, 2059035, 2264232, 2534525, 2249583, 2398001, 2560409, 2318861, 2475284, 2485108, 2503259, 2597511, 2611883, 2523843, 2473588, 2525093, 2514543, 2365800, 2396963, 2500851, 2619414, 2813637, 2811523, 2886970, 2739696, 2719995, 2863206, 2961079, 2920405, 2614215, 2862488, 3037662, 2897045, 3100921, 3146386, 2919090]
3813B919090J53555j22707O6612J7947m1226k1143J04079J74999K57530J09741
3803C618477l33476Q7745J80666k01153m2327k4274j31410J07616J6563m1611
3793C236816L9793j58247L48644K21332r157K34305R3825R7924J24524j10949
3783D118810r9197J35888j29870J29109p196r8611M1211K28789J86054K09311
3773D714298k6141n5919J45188J08282M8872N33665J36620J31686J24740o8626
3763E792665K10227M46839K45716L54667O42769J72826N10231M15690J07695K05230
3753I104555K06290J9163J64069J07365J72516J98784m56511J31037m4277q4001
3743I518990P185P8677K18626k4146K52377O367J10858p6213J7634J2950R3269
$$ y = [2919090, 3072645, 2949938, 3016550, 3034497, 2993271, 2972128, 3076207, 3251206, 3508736, 3618477, 3285001, 3372746, 3553412, 3352259, 3309932, 3285658, 3154248, 3261864, 3278427, 3236816, 3276609, 3118362, 3467006, 3688338, 3679181, 3913486, 4007311, 4105235, 4229759, 4118810, 4019613, 4155501, 4025631, 4154740, 4147544, 4048933, 4090144, 4318933, 4504987, 4714298, 4688157, 4632238, 4777426, 4885708, 4934580, 5468245, 5604865, 5736551, 5861291, 5792665, 6002892, 6449731, 6695447, 7050114, 7692883, 7865709, 8375940, 8791630, 8899325, 9104555, 9310845, 9330008, 9494077, 9601442, 9773958, 9972742, 9516231, 9647268, 9602991, 9518990, 9526175, 9604852, 9823478, 9799332, 10051709, 10058076, 10168934, 10092721, 10110355, 10123305, 10216574]
3732A0216574L0884j79251l70715o22927j7417M3479j87233m2843K0744M2725
3722H934020J38335N3475M8321M4944j90720K61459J71967O2583m1690K028q7961
3711I396761K91427K39746J86524L89136L84411L18195N66353N48010M11505L84554
3701A3116622N75443K05740L28935M53442M06901M10719L00100J70151L27392
3692A6295445K41072J91826K27933o8261L77719K90385Q4027k39026O1856J99827
3682A7662803j09135N3929J2683m1892J89933K45010j5335k06035j44329j68834
3672A7478798r0370j10344J11719j16167j76686j78417k16074n4590j72693k2711
3662A6452465L59524j16759K21711K42137k7599k06394J45249P2143J34654L38259
$$ y = [10216574, 10247458, 10068207, 9697492, 9074565, 9057148, 9100627, 8913394, 8870551, 8891295, 8934020, 9072355, 9125830, 9174151, 9219095, 9028375, 9289834, 9461801, 9524384, 9482694, 9484722, 9396761, 9688188, 9927934, 10114458, 10503594, 10888005, 11206200, 11772553, 12320563, 12732068, 13116622, 13692065, 13897805, 14226740, 14680182, 15087083, 15497802, 15797902, 15968053, 16295445, 16536517, 16728343, 16956276, 16888015, 17265734, 17556119, 17640146, 17401120, 17462976, 17662803, 17553668, 17607597, 17620280, 17578388, 17768321, 18013331, 17997996, 17791961, 17647632, 17478798, 17388428, 17278084, 17389803, 17273636, 17096950, 16918533, 16702459, 16647869, 16475176, 16452465, 16811989, 16695230, 16916941, 17159078, 17131479, 16925085, 17070334, 17142477, 17277131, 17615390]
3652A7615390K91302L25099L13232L53091O81816J31650L12913K87635M06304
3643B0718432N05492M65362L79833N30572P18914N81810P25908O26475P36929
3634B5989727J086701J093170J224040J290103J188180J412304J852174J513213
3626C6649612J689240J721206J722347K031331K181570K591287K690763K579512
3618E3856868K594405K538878K237696K300876J952188J956006J785044J612607
3610G0834568Q82698J049561O78438K52618J83101L34895Q44668J126765J334262
3601G7521574J821345J966167K518268K346222K280067K393027K337346K140820
3593I5324836K097421K392651K221403K386277J951364J599812P81437L97388
$$ y = [17615390, 17906692, 18231791, 18545023, 18898114, 19579930, 19711580, 20024493, 20312128, 20718432, 21223924, 21689286, 22069119, 22599691, 23318605, 23900415, 24626323, 25252798, 25989727, 27076428, 28169598, 29393638, 30683741, 31871921, 33284225, 35136399, 36649612, 38338852, 40060058, 41782405, 43813736, 45995306, 48586593, 51277356, 53856868, 56451273, 58990151, 61227847, 63528723, 65480911, 67436917, 69221961, 70834568, 71717266, 72766827, 73445265, 73697883, 73880984, 74215879, 75060547, 76187312, 77521574, 79342919, 81309086, 83827354, 86173576, 88453643, 90846670, 93184016, 95324836, 97422257, 99814908, 102036311, 104422588, 106373952, 107973764, 108755201, 109152589]
3585A09152589o3177o39048o39779j325173j546368k351517k373002l110427k862710
3576I4241388k287041j734533j060991p4512M93644R16687J389061J800042K472403
3567I6156148K879528K976651L476564K850130K532579K624656J630647J173989
3559A16300892M86537j90348r52110j613739k437614k937293l275605k952492
3551A02428228k839718k847445k556146k074983j460622o95359J26536J259892
3543I1340383J428997K172836K933196L234540L381537L280019L480732K585480
3535A13837720J651885J249893M48622P4631J59466j0047q32058k086728k909377
3526A11584007k955098k834880k902646k451146k425726k829573k872429k847846
$$ y = [109152589, 109089412, 108450364, 107810585, 106485412, 104939044, 102587527, 100214525, 97104098, 94241388, 91954347, 90219814, 89158823, 89084311, 89577955, 90494642, 91883703, 93683745, 96156148, 99035676, 102012327, 105488891, 108339021, 110871600, 113496256, 115126903, 116300892, 116787429, 116597081, 115644971, 114031232, 111593618, 108656325, 105380720, 102428228, 99588510, 96741065, 94184919, 92109936, 90649314, 89953955, 90080491, 91340383, 92769380, 94942216, 97875412, 101109952, 104491489, 107771508, 111252240, 113837720, 115489605, 116739498, 117188120, 117262751, 117422217, 117412170, 116580112, 114493384, 111584007, 108628909, 105794029, 102891383, 100440237, 98014511, 95184938, 92312509, 89464663]
3518H9464663k526975k288259j889565j291360n13366j07337L739L69439N7247
3509H1278226l50906o94933j425871j778617k199342k358488k920900l186064
3501F6363105k988433l257062l581103l276721l298578k997610k360239k416119
3493D2187240k377142k245205k233023j836602j571435j241200j434548j247668
3485B8000417j044890j100900n88311p75564p71490r62512o40294m75826l76228
3476B1264402n47209n28804l29332n06205k7425m98342n10006m81524o29858k2704
3466A7182993k58694k58534l31791p62886p88341l28775l54008m18595k62359
3457A3419010n83587k11350k28458k05626k78971m18082n34210m89047l49128
$$ y = [89464663, 86937688, 84649429, 82759864, 81468504, 80955138, 80847801, 80851540, 81220979, 81278226, 80927320, 80232387, 78806516, 77027899, 74828557, 72470069, 69549169, 66363105, 63374672, 60117610, 56536507, 53259786, 49961208, 46963598, 44603359, 42187240, 39810098, 37564893, 35331870, 33495268, 31923833, 30682633, 29248085, 28000417, 26955527, 25854627, 25266316, 24490752, 23719262, 22756750, 22116456, 21640630, 21264402, 20717193, 20188389, 19859057, 19352852, 19325427, 18827085, 18317079, 17835555, 17205697, 17182993, 16924299, 16665765, 16333974, 15571088, 14782747, 14453972, 14099964, 13681369, 13419010, 12835423, 12624073, 12395615, 12189989, 11911018, 11492936, 10958726, 10469679, 10120551]
3448A0120551k19164l30917j78810j64337j87186j86117m50728l61242l14300
3439G727750l833Q1148j94063j60515q9400k09396k47071Q7773k00357j87869
3429F604167m61941L9055j01933n21913j031j51975k61828m9803R808k6735j8764
3418E057107k42560K90770M6301n4620m2308l46751j14894K6228j81009j38957
3408D299307j94895L5233l07440m0760k6064j59909R4056K35200P853o5162j9487
3397C857932p7846l39015L5166M8258l2140J13200j01293j09767j73033q4213
3387C137249p7133O051p1558p0822K72932N8231k79727j0543k69891j84858K37937
3376B747868k11740P5309J60274j6566K48318k24875n3064J04617n0825n1033
$$ y = [10120551, 9901387, 9570470, 9391660, 9227323, 9040137, 8854020, 8403292, 8042050, 7727750, 7723917, 7805065, 7611002, 7450487, 7361087, 7151691, 6904620, 6992393, 6792036, 6604167, 6142226, 6181281, 6079348, 5557435, 5556404, 5404429, 5142601, 5092798, 5102606, 5075871, 5057107, 4814547, 5105317, 5151618, 5096998, 5054690, 4707939, 4593045, 4619273, 4438264, 4299307, 4104412, 4139645, 3832205, 3791445, 3765381, 3605472, 3699528, 3934728, 3942581, 3877419, 3857932, 3780086, 3441071, 3476237, 3524495, 3492355, 3605555, 3504262, 3394495, 3221462, 3137249, 3060116, 3066167, 2994609, 2923787, 3196719, 3254950, 2975223, 2964680, 2694789, 2509931, 2747868, 2536128, 2611437, 2771711, 2755145, 3003463, 2778588, 2725524, 2830141, 2779316, 2728283]
3366B728283o1993O6923R2990P334j49509m726K2676j07275m1887j1722R7520
3355B638614j5560k1545M0723J19764j93114p8313j292k28401P566p8532k67143
3344A922767L6193P5896L9577K27863k1360j269j03677j66716O1335N382N9597
3333B135588L06116J06400J18583j42439j25016J01370p2165j55776r7971n8306
3323B116384o9077k8369R0548J21450R2542l2779J27733O6093J78915P7225j14523
3312B626142O0433j97754m2369L311j45571k13819j09650N8780n0277Q4090L0496
3301B103812j77859L33849N8882J01301n1604R0946j2960L527N507K4275M0337
3290B520013j46080K1319k42068Q6514j00908j82602R7707j0366n5543K66329
$$ y = [2728283, 2666290, 2733213, 2826203, 2833537, 2684028, 2679302, 2701978, 2594703, 2552816, 2541094, 2638614, 2623054, 2601509, 2642232, 2761996, 2568882, 2490569, 2489277, 2260876, 2268442, 2189910, 1922767, 1958960, 2034856, 2074433, 2302296, 2280936, 2279667, 2175990, 2009274, 2070609, 2075991, 2135588, 2441704, 2548104, 2666687, 2524248, 2399232, 2500602, 2428437, 2272661, 2174690, 2116384, 2047307, 2018938, 2109486, 2230936, 2323478, 2290699, 2418432, 2484525, 2663440, 2740665, 2626142, 2686575, 2488821, 2446452, 2449763, 2304192, 2090373, 1980723, 2039503, 1989226, 2073316, 2103812, 1925953, 2259802, 2318684, 2419985, 2368381, 2459327, 2446367, 2449894, 2455401, 2479676, 2520013, 2373933, 2395252, 2153184, 2239698, 2138790, 1956188, 2053895, 2043529, 1987986, 2254315]
3280B254315L57786r6453J31153J56647j53259M028j73571j62194K09079j81778
3270B345753K12831O3983j3918R5427J25625J1851p0958J04248o0784j6056l73159
3259B424843Q1967M7743P1156J10825J0597r3762J35995K35744J01957o0384K7632
3248C094313k28265K42281k11073k69566K20496j60046r969O4158j08037N0034
3238B684326K39867M6039K09903J60425j01712K57112p6920k93778J50431j60713
3228C114980o3236r5328N7600q4139K7008n3464J27599J21528R3629p8286q143
3217C159748l0814j66467L4835p5763j08314J58853n8989K1553l8873J08336J82832
3206C186937J74512M9954l4146Q9298k505o1461J67303K77567L7567k49348j33404
$$ y = [2254315, 2612101, 2515648, 2646801, 2803448, 2650189, 2654217, 2480646, 2318452, 2527531, 2345753, 2558584, 2622567, 2608649, 2704076, 2829701, 2841552, 2770594, 2874842, 2814058, 2798002, 2424843, 2506810, 2554553, 2625709, 2736534, 2747131, 2653369, 2789364, 3025108, 3127065, 3066681, 3094313, 2866048, 3108329, 2897256, 2627690, 2848186, 2688140, 2678171, 2742329, 2634292, 2684326, 2924193, 2970232, 3180135, 3340560, 3238848, 3495960, 3419040, 3125262, 3275693, 3114980, 3051744, 2956416, 3014016, 2929877, 2956885, 2903421, 3031020, 3152548, 3246177, 3167891, 3159748, 3128934, 2962467, 2997302, 2921539, 2813225, 2972078, 2913089, 2934642, 2895769, 3004105, 3186937, 3361449, 3411403, 3377257, 3466555, 3464050, 3402589, 3569892, 3847459, 3885026, 3635678, 3502274]
3195C502274k07382j52680j35625J8041j4596j27835J08177k85025k3372j9646
3185B662331J03037j28149j56268M0947J32883j22290K7041N27969J22720r444
3175C200777k6288k03826J93483q7247q4711l1579N7417j71182j87918J11133
3165B770059J64444J27614K60211M8342P7785J8002j13686J74387J54024J73505
3155C854687R9250k17454Q2458O0340q3183k34818k17611j52763R6107J10745
3145C397758J09274K23028J03142J64153J04100R6443R8664k3345l10977n1798
3135C910442J71510P5012J80250k38530J2321J50506j43865k0532K6697K56457
3125D380268J86377K11702N7862K86732m7378j04417J55943L8877o107J59867
$$ y = [3502274, 3294892, 3142212, 3006587, 3024628, 3010032, 2882197, 2990374, 2705349, 2681977, 2662331, 2765368, 2637219, 2480951, 2521898, 2654781, 2532491, 2559532, 3087501, 3210221, 3200777, 3174489, 2970663, 3164146, 3076899, 2992188, 2960609, 3018026, 2846844, 2658926, 2770059, 2934503, 3062117, 3322328, 3370670, 3448455, 3466457, 3352771, 3527158, 3681182, 3854687, 3953937, 3736483, 3818941, 3879281, 3796098, 3561280, 3343669, 3190906, 3287013, 3397758, 3507032, 3730060, 3833202, 3997355, 4101455, 4197898, 4296562, 4273217, 3962240, 3910442, 4081952, 4156964, 4337214, 4098684, 4111005, 4261511, 4117646, 4097114, 4123811, 4380268, 4566645, 4778347, 4836209, 5122941, 5075563, 4971146, 5127089, 5165966, 5159859, 5319726]
3115E319726O2081L11545q1989J88653M15840O4692k76437J56956J93587p9627
3105F275027J08935M14041L69941J74393O9596J9299R4225P1784Q2314M43818
3095H123373j05416L7480K09811j66120J96215J4723K68411J34915P3225M7089
3085H833706K81047K31311L38121J97500K78900J52334J89145J18036J03341M0383
3075A0763824K52126M51299K89079J80278M08309M77574K47687N12113M94233
3066A4076522L26801M52711N50426N33253L66394N10108N40985L20667J94570
3057A7872437P17887P59413N89858R06741R27489J004989R12157R47878R26161
3048B5565010J095775Q65140P92659J502916R57894J222432J511235J296859J363892
$$ y = [5319726, 5381807, 5693352, 5611363, 5800016, 6215856, 6280548, 6004111, 6161067, 6354654, 6275027, 6383962, 6798003, 7167944, 7342337, 7411933, 7431232, 7525457, 7597241, 7679555, 8123373, 8017957, 8055437, 8265248, 8099128, 8295343, 8310066, 8578477, 8713392, 8786617, 8833706, 9114753, 9346064, 9684185, 9881685, 10160585, 10312919, 10502064, 10620100, 10723441, 10763824, 11015950, 11467249, 11756328, 11936606, 12344915, 12822489, 13070176, 13582289, 14076522, 14403323, 14856034, 15406460, 15939713, 16306107, 16816215, 17357200, 17677867, 17872437, 18590324, 19349737, 19939595, 20846336, 21773825, 22778814, 23690971, 24638849, 25565010, 26660785, 27525925, 28318584, 29821500, 30779394, 32001826, 33513061, 34809920, 36173812]
3039C6173812J331837J263792J484848J465175J502998J733276J562149J385322
3031D7903209J468676J685713J584059J788572J421812J360065J461290J361703
3023F0035099J581659J677085J510601J531024R11381J015298J088223P74348
3015G0124718R20175P82652P78057Q53650P42349O33600M31237M45864M30556
3006G6142858M82239N3864j0900n744j84373K0283K42452q8778j71854m11715
2996G6068332l57405n91100m33916l02528m40171m79446l93315l52658n95361
2987G2122432p15551q49143o71199n81754m47802p03960o18322p04097n33127
2978F6297477j90452r00666q67549r85027j028645r78494r89486r68941j150975
$$ y = [36173812, 37505649, 38769441, 40254289, 41719464, 43222462, 44955738, 46517887, 47903209, 49371885, 51057598, 52641657, 54430229, 55852041, 57212106, 58673396, 60035099, 61616758, 63293843, 64804444, 66335468, 67246849, 68262147, 69350370, 70124718, 71044893, 71827545, 72605602, 73459252, 74201601, 74835201, 75266438, 75712302, 76142858, 76625097, 76678961, 76668061, 76662317, 76477944, 76498227, 76740679, 76651901, 76480047, 76068332, 75710927, 75119827, 74685911, 74383383, 73943212, 73463766, 73070451, 72717793, 72122432, 71406881, 70557738, 69886539, 69304785, 68856983, 68153023, 67534701, 66830604, 66297477, 66107025, 65206359, 64338810, 63353783, 62325138, 61346644, 60357158, 59388217, 58237242]
2969E8237242p12387q30080q44821j095418j281732j061352j013921j106680j014157
2960D9276694p98683j142934j373971j587142j158535r80690j329547j088402
2952C9816790j327026j412587j222719j021489q97972r07694j078732j139794
2944C0808777r75152r26016p87264p57884q86468p40131p95726p37421n69354
2935B3633361p42396p16049q05454p80191m96466l74215m29823m99459k08763
2926A8580545m24660k53592l05229m38137j35986k31470k31691l53049j67885
2917A6038846k22461l89419l0957j59552K6474k82694k00946J47756J3225K02688
2907A5142960m2315j84189J80737k1757j45063M3228m423N3465k872J23074M80235
$$ y = [58237242, 57524855, 56694775, 55849954, 54754536, 53472804, 52411452, 51397531, 50290851, 49276694, 48478011, 47335077, 45961106, 44373964, 43215429, 42234739, 40905192, 39816790, 38489764, 37077177, 35854458, 34832969, 33934997, 33027303, 31948571, 30808777, 29833625, 28907609, 28120345, 27362461, 26475993, 25735862, 24940136, 24202715, 23633361, 22890965, 22174916, 21369462, 20589271, 20092805, 19718590, 19288767, 18789308, 18580545, 18155885, 17902293, 17597064, 17158927, 17022941, 16791471, 16559780, 16206731, 16038846, 15816385, 15426966, 15396009, 15236457, 15262931, 14980237, 14779291, 14927047, 14940272, 15142960, 15100645, 14916456, 15097193, 15075436, 14930373, 14973601, 14969178, 15022643, 15019771, 15142845, 15623080]
2896A5623080R8126K01987M40644K58913J24577K2911N6821J46270K43623M38565
2886A7655517M29457L68952L17995N19876K77877L47697Q70962Q06912N17528
2877B2112773O41027N83506Q60443N39841M35471K90879K63445L10332N34767
2868B6572484N58249Q06670R57707L79330L99728O70967N42144R94890P77011
2859C2659180M26835J274599R73372Q10020P67385M37394J82377M90977L10630
2850C8332769O41053R46063N91473N93791P39860N79106P84342J070617J112481
2841D5391555J123479J177931J501641J780266J296429J343960J365040J387428
2833E6367729J278124J516170J917299K399098K566083K807221K912215K414895
$$ y = [15623080, 15721206, 15923193, 16363837, 16622750, 16747327, 16770238, 16827059, 16973329, 17216952, 17655517, 18084974, 18453926, 18771921, 19291797, 19569674, 19917371, 20788333, 21595245, 22112773, 22753800, 23337306, 24197749, 24737590, 25173061, 25463940, 25727385, 26037717, 26572484, 27130733, 27937403, 28895110, 29274440, 29674168, 30345135, 30887279, 31882169, 32659180, 33086015, 34360614, 35333986, 36144006, 36911391, 37348785, 37531162, 38022139, 38332769, 38973822, 39919885, 40511358, 41105149, 41845009, 42424115, 43208457, 44279074, 45391555, 46515034, 47692965, 49194606, 50974872, 52271301, 53615261, 54980301, 56367729, 57645853, 59162023, 61079322, 63478420, 66044503, 68851724, 71763939, 74178834]
2825G4178834J743029J783422J371408J231728J506512J385081J422870J608909
2817H6231793J585074J961436J897394K068815K630413K742343K857325L221607
2809A05196200L351072L586458M351764M964824N746571O159918O484970N632028
2801A45473805M328176K250343P5902n39106j020209j078798m33367l10474M71546
2792A49217818R53458J251667J357069R23609M96232J79208l58890k15408J03780
2783A53908543m18280q02351j576564j776757j480219j145363q50275l99389n78464
2774A44880881p10364k26508r27727k798145m091028o398055o990346o183694
2766A16555014n730562m628341m046723l875951k911913k554924k311789j870139
$$ y = [74178834, 75921863, 77705285, 79076693, 80308421, 81814933, 83200014, 84622884, 86231793, 87816867, 89778303, 91675697, 93744512, 96374925, 99117268, 101974593, 105196200, 108547272, 112133730, 116485494, 121450318, 127196889, 133356807, 139841777, 145473805, 149801981, 152052324, 152128226, 151589120, 150568911, 149490113, 149056746, 148746272, 149217818, 150171276, 151422943, 152780012, 153703621, 154199853, 154379061, 154020171, 153804763, 153908543, 153490263, 152687912, 151111348, 149334591, 147854372, 146709009, 145858734, 145459345, 144880881, 144170517, 143944009, 143016282, 140218137, 136127109, 129729054, 122738708, 116555014, 110824452, 106196111, 102149388, 98273437, 95361524, 92806600, 90494811, 88624672]
2758H8624672j904290k232909j712088j810171k077057j561187j746252j617770
2750G3962948j300325j429332j037598j194041j970469k364557k918371l096770
2742E8651485k550594k272851j819421j204365j301442r14748p84433j146310
2734D6657321j466878j335966j953221j235316q93053j058774p26747o65917q95654
2725C6425795k25091q68933n75461m2161l42543j65161L17872k86312l69574l25916
2715C3542515j072033j259197q32517q61066m38371p66084m56194k60636m80715
2706B7115702n96617m46499n06245n64723l52455m23052k31655l01713j63192
2697B3529551j40875l59777l34363m59193j62167n05343j76416j08118j10863
$$ y = [88624672, 86720382, 84487473, 82775385, 80965214, 78888157, 77326970, 75580718, 73962948, 72662623, 71233291, 70195693, 69001652, 67031183, 64666626, 61748255, 58651485, 56100891, 53828040, 52008619, 50804254, 49502812, 48588064, 47803631, 46657321, 45190443, 43854477, 41901256, 40665940, 39772887, 38714113, 37987366, 37321449, 36425795, 36200704, 35331771, 34756310, 34714149, 34371606, 34206445, 34524317, 34238005, 33868431, 33542515, 32470482, 31211285, 30378768, 29517702, 29079331, 28313247, 27857053, 27596417, 27115702, 26519085, 26072586, 25566341, 25001618, 24649163, 24226111, 23994456, 23692743, 23529551, 23388676, 23028899, 22694536, 22235343, 22073176, 21567833, 21391417, 21283299, 21172436]
2688B1172436K40534m22124m2259k35059m39356k34312k99531l22792L41472M24629
2678B0183638K02662K21901J29597K58154M57620m78422K14610K00326J8988N0217
2668B1459291L85547l0487M02583L73499N34666L47832M70575M53774N19676L03658
2658B5220614O76038N07845M15170N43310O37997K85213O79381Q30620L08064
2649C0104252J249365R62880J036899J471092R47399J041596J406660J131783
2641C9351926J052880J129472R10311P64922J384043R67836J102137R10119Q86430
2632D8460076J026483Q40430R46590J182829J000933J047481R61619N54716O83475
2623E6704632O54060j10495K05836J45764K42126N00228N17213M3129L29047L53253
$$ y = [21172436, 21412970, 20990846, 20948587, 20713528, 20274172, 20039860, 19740329, 19417537, 19759009, 20183638, 20386300, 20608201, 20737798, 20995952, 21453572, 20975150, 21189760, 21390086, 21409074, 21459291, 21844838, 21814351, 22216934, 22590433, 23125099, 23472931, 23943506, 24397280, 24916956, 25220614, 25896652, 26404497, 26819667, 27362977, 28000974, 28286187, 28965568, 29796188, 30104252, 31353617, 32316497, 33353396, 34824488, 35771887, 36813483, 38220143, 39351926, 40404806, 41534278, 42444589, 43209511, 44593554, 45561390, 46663527, 47573646, 48460076, 49486559, 50326989, 51273579, 52456408, 53457341, 54504822, 55466441, 56021157, 56704632, 57358692, 57248197, 57454033, 57599797, 57841923, 58342151, 58859364, 58902493, 59231540, 59584793]
2613E9584793K86535L29302k9720J38320P33893J83678N54008L85693O67981Q15956
2603F3650439O52971R97924R14718R47013J268022J406149J645732J650123J625246
2594G4758337J847899K280341K293476K382785K677066K789144K809813L116620
2586I4955481L758686L502838L790150L551697L892626L961896L874362M141734
2578A25429470L930093L731967L906488M146128M642611M143422M287826L918937
2570A58136942L906151L986158M077144L766080L507750L175127L434345L201758
2562A87191455L041429L086410K970313K842338L522348L367525L442532L606675
2554B13071025L691570M132245M318143M382942M592723M383641M372474M647287
$$ y = [59584793, 59871328, 60200630, 60170910, 60309230, 61043123, 61226801, 61780809, 62166502, 62834483, 63650439, 64303410, 65301334, 66216052, 67163065, 68431087, 69837236, 71482968, 73133091, 74758337, 76606236, 78886577, 81180053, 83562838, 86239904, 89029048, 91838861, 94955481, 98714167, 102217005, 106007155, 109558852, 113451478, 117413374, 121287736, 125429470, 129359563, 133091530, 136998018, 141144146, 145786757, 149930179, 154218005, 158136942, 162043093, 166029251, 170106395, 173872475, 177380225, 180555352, 183989697, 187191455, 190232884, 193319294, 196289607, 199131945, 202654293, 206021818, 209464350, 213071025, 216762595, 220894840, 225212983, 229595925, 234188648, 238572289, 242944763, 247592050]
2546B47592050M756769M677568M683047M581144M976129M872336M586469M514717
2538B85240229M248045M014912L582235L886774L413552K860019K136496J740954
2530C11123216J303436M55483o74933j114550j756219k569905l211321l786628
2522B99768579m429519m890328n759717n633347o215591o585208p011353p406893
2514B51836623p815767p428985q159926q182598q311277q296910q183903q073726
2506A87383531p769097p514580p360504p012495o730112o335941o222917n948441
2498A32489444n442264n384570m771683m292161m080509l690995l944954l348366
2490I7533942k846668k879959k471228k705393k395698k034662j986329j725033
$$ y = [247592050, 252348819, 257026387, 261709434, 266290578, 271266707, 276139043, 280725512, 285240229, 289488274, 293503186, 297085421, 300972195, 304385747, 307245766, 309382262, 311123216, 312426652, 312882135, 312207202, 311092652, 309336433, 306766528, 303555207, 299768579, 295339060, 290448732, 284689015, 279055668, 272840077, 266254869, 259243516, 251836623, 244020856, 236591871, 228431945, 220249347, 211938070, 203641160, 195457257, 187383531, 179614434, 172099854, 164739350, 157726855, 150996743, 144660802, 138437885, 132489444, 127047180, 121662610, 116890927, 112598766, 108518257, 104827262, 100882308, 97533942, 94687274, 91807315, 89336087, 86630694, 84234996, 82200334, 80214005, 78488972]
2482G8488972j634196j708202j353585j582136j120860j162554q73676q35612
2474F8218151j061685j114116q47709r21252r54300o53184j022502j215760r32699
2465E9494944j038710j003596j083461p94580n50546j161772r48306r29405j538042
2456E0446526r85169j154059j333853j312514j127600j300508j312740j499966
2448D0420117j169827r50234j179659j159998q90570j219794j249772o94553j097538
2439C0808172j016533q80482r79493q06373r45891j179039q92312p04506p83999
2430B2619544m76256m47520m93588o81623m52468l35341o34454o46306o52352
2421A7799636n17067n89074n9478n33408j46791k77951n34421k00965n34881m36175
$$ y = [78488972, 76854776, 75146574, 73792989, 72210853, 71089993, 69927439, 69053763, 68218151, 67156466, 66042350, 65194641, 64273389, 63319089, 62665905, 61643403, 60427643, 59494944, 58456234, 57452638, 56369177, 55574597, 55024051, 53862279, 52913973, 51984568, 50446526, 49461357, 48307298, 46973445, 45660931, 44533331, 43232823, 41920083, 40420117, 39250290, 38300056, 37120397, 35960399, 35069829, 33850035, 32600263, 31905710, 30808172, 29791639, 28911157, 27931664, 27125291, 26179400, 25000361, 24108049, 23403543, 22619544, 22143288, 21695768, 21202180, 20520557, 20068089, 19732748, 19098294, 18451988, 17799636, 17282569, 16693495, 16634017, 16100609, 15953818, 15675867, 15141446, 14940481, 14405600, 13969425]
2411A3969425j28968k24912l88168l69762M5610l72907l26362l89821n93853k98381
2401A0921901n8709q5237j62342l7294m8406J65724n0561l91783k58468l44822
2391I650003m11042k20609j20212l64558j55756J25999j75881j38936k8424k39606
2381G920978l42257j82462L6803L74638j08584r6829q483k78923q063P8688l84006
2370G001500j75478k49200R6350L2383j34210k31083j23003m6933R192j86504
2360E993014l99412k29675K45777J02162K74990m9274m23684j64812k00966j01515
2350E046605L24332k49618l40653k4907l6067M4085m1344l49870j07524K18745
2340D483784K3516j05673k71607m42138j9996L80567L2277K32397l1568l5409
$$ y = [13969425, 13840457, 13615545, 13227377, 12857615, 12903225, 12530318, 12203956, 11814135, 11220282, 10921901, 10863192, 10777955, 10615613, 10578319, 10529913, 10695637, 10645076, 10253293, 9994825, 9650003, 9238961, 9018352, 8898140, 8533582, 8377826, 8503825, 8327944, 8189008, 8160584, 7920978, 7578721, 7396259, 7433062, 7807700, 7699116, 7602287, 7593804, 7314881, 7306818, 7385506, 7001500, 6826022, 6576822, 6673172, 6705555, 6571345, 6340262, 6217259, 6170326, 6179518, 5993014, 5593602, 5363927, 5609704, 5711866, 5986856, 5937582, 5513898, 5349086, 5148120, 5046605, 5370937, 5121319, 4780666, 4755759, 4719692, 4763777, 4722433, 4372563, 4265039, 4483784, 4507300, 4401627, 4130020, 3687882, 3667886, 4048453, 4080730, 4313127, 4281559, 4246150]
2330D246150k43828k04184o432m5709q4217j3850P7102J32233Q1300j0303j81420
2319C746842J13437k49556k32474j80694K755q7153K27862K80636Q9803q2330
2309C629128l34232j28585n6739k6300n8060j132j93934j72419J1011j6705Q2016
2298B734049r1531p0501P6655J75274r8672J75194k35304m0721M07764M0716k64238
2287B808685k24389k81541P4041R3420q0598J81871Q4674M3727K43539j80611
2277B762818l09928j21363j37504J50088J12381k9097K77630K74529k88363J56700
2267B847891L0071l4847K29166k03551K3790j7535j33291N9924k42229k47786
2257B311603J220J77462j97434L61526R9752O2007L49324j36490j44544J69885
$$ y = [4246150, 4002322, 3798138, 3791706, 3745997, 3661780, 3647930, 3725032, 3857265, 3938565, 3928262, 3746842, 3860279, 3610723, 3378249, 3197555, 3200310, 3113157, 3341019, 3621655, 3711458, 3629128, 3294896, 3166311, 3109572, 3083272, 3025212, 3024080, 2830146, 2657727, 2668738, 2652033, 2734049, 2642518, 2572017, 2648672, 2823946, 2725274, 2900468, 2665164, 2624443, 3032207, 3072923, 2808685, 2584296, 2302755, 2376796, 2470216, 2389618, 2571489, 2656163, 2699890, 2943429, 2762818, 2452890, 2331527, 2194023, 2344111, 2456492, 2427395, 2705025, 2979554, 2691191, 2847891, 2877962, 2843115, 3072281, 2868730, 2892520, 2874985, 2741694, 2801618, 2559389, 2311603, 2312823, 2490285, 2292851, 2654377, 2754129, 2816136, 3165460, 3028970, 2884426, 3054311]
2247C054311l88096m0171L3795j42868J18732q0728J1107J05426N2243K13370
2237B937121K57198j66416j28349j8601k1157n2509J18369k34691j6860K65047
2227B939152l36513L3705K04700o9551L56390J17733k0105K85609k0373J6282
2217C507029p5099J2813k51957l60665k17588j55223J04541J27227K01810J07591
2207C000479l74650J62984M6525k68991m8222j93167J8505K29383o2510O515L1664
2196B548515p0736P6474P6403j07721N312K1240j52034n9253K20055J5829j85910
2185B388174J57382j76989m7661k4115k47736j84222K95781J80258P1844n0728
2175B361988n51789J541k21571J76399j21748k74687N6002K39986M366k60211
$$ y = [3054311, 2666215, 2626044, 2659839, 2516971, 2635703, 2554975, 2566082, 2671508, 2723751, 2937121, 3194319, 3027903, 2899554, 2880953, 2859796, 2807287, 2925656, 2690965, 2674105, 2939152, 2602639, 2636344, 2841044, 2771493, 3127883, 3245616, 3225511, 3511120, 3490747, 3507029, 3431930, 3444743, 3192786, 2832121, 2614533, 2459310, 2563851, 2691078, 2892888, 3000479, 2625829, 2788813, 2835338, 2566347, 2518125, 2324958, 2343463, 2572846, 2510336, 2516851, 2548515, 2477779, 2554253, 2630656, 2522935, 2528247, 2549487, 2397453, 2338200, 2558255, 2574084, 2388174, 2545556, 2368567, 2320906, 2296791, 2049055, 1864833, 2160614, 2340872, 2412716, 2361988, 1810199, 1811740, 1590169, 1766568, 1644820, 1370133, 1426135, 1666121, 1670487, 1410276]
2165A410276L9819m46121N0719j00500J04933J45889q6316K32827R7552k31236
2155A217842j13440J81451j36261l70495j3192j42964Q4044Q5566k16439J26875
2145G02987J63050R5682Q5781k42986q4996J69740Q1723j80056J67762j18808
2135H39879K8272p9727k96669j17782l080J51536k6278O3496J38648J65594k0213
2124H43676o2593k87910j98205l978K26918L0923o4896J49489J65990k38265k21118
2113C40031l15225K69473L02092j03620K17277q9791K8248J1943m7567j82241
2103D30620O4143j14566k33629J78346q8110L34039J33895j15049N0914J36008
2093G76611O2271j57935l9634l39693J82980j6185l1724n8702j27649j88270n7056
$$ y = [1410276, 1450095, 1003974, 1054693, 954193, 1059126, 1205015, 1118699, 1351526, 1449078, 1217842, 1104402, 1285853, 1149592, 779097, 765905, 622941, 706985, 792551, 576112, 702987, 866037, 961719, 1047500, 804514, 719518, 889258, 970981, 790925, 958687, 839879, 868151, 788424, 491755, 373973, 370893, 522429, 496151, 559647, 698295, 863889, 843676, 781083, 493173, 294968, 290990, 517908, 548831, 483935, 633424, 799414, 561149, 340031, 24806, 294279, 596371, 492751, 710028, 620237, 648485, 660428, 612861, 430620, 494763, 380197, 146568, 324914, 236804, 570843, 704738, 589689, 640603, 776611, 838882, 680947, 641313, 301620, 484600, 468415, 436691, 377989, 250340, 62070, 5014]
2082E014j02757n4593O1151O6911O6823M9837q9492L7271M66395l3714n1367m09405
2070A2074N6488L63846j99590j63070p2349q8876J90627J6568j39527l5633J09995
2059E0553k9662J15228J88305j16557K60255k90990K23568K74664j71900M7206
2049E50670j30178k17497J37791q7895k23273J89435k52719J30775J05121n4324
2039A47906j47684J80256J41972n3559J06570M291o5895L7560j74934K38529K8367
2028D43379j411j33689k58262k5294P8369o3050j51282K55645J34154J34028M0908
2017D53495k83362J96204j87964k97396J03078j97622j46625J63540o595l6475
2007b39722K96359j30247J74268j22606j3542J69573N1019j22764p4142j5098
$$ y = [5014, -97743, -152336, -91185, -24274, 42549, 92386, 2894, 40165, 506560, 472846, 421479, 12074, 68562, 432408, 232818, 69748, -2601, -91477, 99150, 115718, -23809, -59442, 50553, 20891, 136119, 324424, 207867, 468122, 177132, 400700, 675364, 503464, 550670, 420492, 202995, 340786, 252891, 29618, 219053, -33666, 97109, 202230, 147906, 222, 180478, 322450, 268891, 375461, 379752, 313857, 351417, 176483, 415012, 443379, 441968, 308279, 50017, 24723, 103092, 40042, -111240, 144405, 278559, 412587, 453495, 170133, 366337, 178373, -119023, -15945, -213567, -360192, -196652, -203247, -239722, 56637, -73610, 100658, -21948, -35490, 134083, 185102, 62338, -11804, -26902]
1997b6902j01780r7837J7160J25495M6175j89912j3637K06251p529n644K79051
1986B30891J90206j63296j91753J8877p6840n1330J62122k05287k22065L44020
1976C5545Q6195n2243K05051L2847P7587J35251k20947n2816N1668P1541r6285
1965B73394j24361L7816j83463Q5125Q0398J15737k49519q2236j04354j13429
1955b64892J91059O3165j77995K40693j21644N7045J24978n8626L3636O845l5998
1944E8266J72685L0422m810m12140l40502o5940m016J54075r4042K57640J49090
1933i9272J44346J48681K06869l61323o5188J87451L7882j42499l4841J6490k17126
1922a78530j91803J63191J20904Q8684P3406J54677J74589J02103K16409j19792
$$ y = [-26902, -128682, -226519, -209359, -83864, -37689, -227601, -241238, -34987, -42516, -48160, 230891, 421097, 257801, 66048, 84925, 8085, -43245, 118877, -86410, -308475, 35545, 121740, 69497, 274548, 307395, 384982, 520233, 299286, 246470, 298138, 369679, 273394, 149033, 186849, 3386, 88511, 168909, 284646, 35127, -47109, -151463, -264892, -73833, -10668, -188663, 52030, -69614, -12569, 112409, 53783, 87419, 94264, 58266, 230951, 261373, 256563, -155577, -496079, -562019, -566035, -411960, -506002, -248362, -99272, 45074, 193755, 400624, 39301, -25887, 161564, 199446, 56947, 22106, 38596, -178530, -370333, -207142, -86238, 2446, 75852, 230529, 405118, 507221, 723630, 603838]
1912F03838l85077q652k059k3277j87083R0822j92303j00372K0829J71013o2788
1901g5109J11550R9831j67535p450J71631O3968l8040k40613J46359J74756j44899
1890I4449q0330j08798k22419J13734R3510j96808J31791j27636O9606J46653
1880h6248J85206k48501M798M0644J08190j80762K68479k0490m0457m3275J46847
1869A34431p2634L0065J291k05460j37999J76006L03922J8624j96236J6248m0170
1858B8088J17246L8634m589P3078j04166N9402j37528j65700k7783J40315j15078
1847i8081O1187J47984P351J24486l57216j08607J2892k12558L24873J53571J39153
1836A95035J2589K36698j50983j15098j28075Q1569K87698J87532p4081J44155
$$ y = [603838, 218761, 210109, 208050, 184773, -2310, 88512, -103791, -204163, -183334, -12321, -75109, 36441, 136272, -31263, -38713, 132918, 196886, 158846, -81767, 64592, 239348, 94449, 14119, -94679, -317098, -203364, -109854, -306662, -174871, -302507, -232901, -86248, 98958, -149543, -144745, -104101, 4089, -176673, 91806, 71316, 30859, -12416, 134431, 61797, 91862, 93153, -112307, -250306, -74300, 229622, 248246, 52010, 68258, 28088, 145334, 183968, 179379, 252457, 148291, 207693, 70165, -95535, -123318, 16997, -98081, -36894, 111090, 118441, 242927, -114289, -222896, -210004, -422562, -97689, 55882, 195035, 207624, 444322, 293339, 178241, 50166, 131735, 419433, 606965, 532884, 677039]
1826F77039j57284k40676j93405n5344k4105K25861J62919j72225N8667J49110
1816D30557J10438l15596k50967J4579O6986P2527r4389K4594R0923Q849o8625
1805H9876l4606r004q4066K11364j63293j98156J41152K28053o1272J2335J19680
1794B52063Q9049j0477j0899k4254k09960k61470K99626K17529j70395j20046
1784E0766M04319R2994m81013j87924N4701K80262Q1045P0307M3890k65928k6760
1773A16659r4244J36866m5279j96081J01721K72624j12002K21443L6337j88584
1763B49460k0399k18765l8512L0848q7980O5749J61674K4479j4507k57928j09157
1752b15038j49602N67545k99839j43172L0819l4799K32130q8453J55373P1643
$$ y = [677039, 519755, 279079, 85674, 30330, 6225, 232086, 395005, 222780, 281447, 430557, 540995, 225399, -25568, -10989, 55997, 128524, 34135, 58729, 149652, 158501, 89876, 55270, 46266, -37800, 173564, 10271, -187885, -46733, 181320, 120048, 132383, 252063, 341112, 330635, 319736, 295482, 85522, -175948, 123678, 341207, 170812, 50766, 455085, 548079, 67066, -120858, -66157, 214105, 295150, 365457, 409347, 143419, 116659, 22415, 159281, 114002, -82079, 19642, 292266, 180264, 401707, 438044, 249460, 229061, 10296, -28216, 2632, -85348, -19599, 142075, 166554, 152047, -105881, -215038, -364640, 202905, -96934, -240106, -209287, -244086, -11956, -100409, 54964, 126607]
1742A26607n0981J94333k18902j57013j8013N0802p7488j67786J5899Q8122j92837
1731d07257j63231J79669L37644K37970J81927j64018r8274J08393K19331k37011
1721A95143J16p4819j69723J89508l58580q5137J57301L77274n4864L2769L5333
1710B44321q7983J53000p049j98724n8599j5532M16616J18005q7496p5214k98797
1699A02548K23943j09604k49057J80702j14324J6461q1463n4493K608j76701k01674
1688d61054O3786N9491L82306q8521M9312j69635R4085J53442j18386J15154k00640
1677a20660k32157K08614J6122j0519j29458J5261J17910j27161O7028j20736
1667c15756J99610J25865K98066L75243j96388j17948o7399l8023k44855J818
$$ y = [126607, 75626, 269959, 51057, -105956, -123969, -73167, -150655, -318441, -302542, -214420, -407257, -570488, -390819, -53175, 184795, 366722, 202704, 104430, 212823, 432154, 195143, 195259, 120440, -49283, 140225, -218355, -303492, -146191, 231083, 176219, 208988, 244321, 156338, 309338, 302289, 103565, 44966, 29434, 446050, 564055, 476559, 401345, 102548, 326491, 216887, -32170, 148532, 34208, 50669, -30794, -85287, -82679, -259380, -461054, -397268, -337777, 44529, -43992, 5320, -164315, -70230, 83212, -35174, 79980, -120660, -352817, -144203, -128081, -138600, -268058, -252797, -134887, -262048, -195020, -315756, -116146, 9719, 307785, 683028, 486640, 368692, 301293, 263270, 18415, 20233]
1657B0233R3518l48625n9424J50917K48095r5200k0948r4636K57737o1304O418
1646I6781n7244k56619J18322K5779J10376m1312n6056o5061j96419K3788J10231
1635a87434K19881o7705k34332l4272L2320P98P1407j4896o4305K0019K40595
1624a7924j18357o8787k58476L2182L52437K8550J995J4380J23393q3209J18081
1613A24265J9985k32579M678r1130J0273J95820J04841K70036j60970P675J7975
1602B70869k11934K080j0872m5225J00789J66117o3215l12641m965j0727K31861
1591A12137J84915k12491q6313Q585k33951Q5830k8210j19116j38609r5462J79463
1580c43222r9548P7325M4365J77100o2196R0069L20094k47166Q8693J03011j93636
$$ y = [20233, 113751, -234874, -294298, -143381, 104714, 9514, -11434, -106070, 151667, 90363, 96781, 39537, -217082, -98760, -72981, 37395, -3917, -59973, -125034, -321453, -297665, -187434, 32447, -35258, -269590, -303862, -271542, -270744, -199337, -214233, -278538, -258519, -17924, -136281, -205068, -463544, -431362, -78925, -50375, -48380, -34000, 89393, 6184, 124265, 144250, -88329, -83651, -174781, -164508, 31312, 136153, 406189, 245219, 252894, 270869, 58935, 61015, 50143, 4918, 105707, 271824, 208609, -104032, -108997, -119724, 112137, 297052, 84561, -1752, 6833, -227118, -141288, -169498, -288614, -427223, -522685, -343222, -442770, -365445, -321080, -143980, -206176, -116107, 203987, -43179, 45514, 148525, -45111]
1569d5111J69889k91060M3542O1743k09622L42891q2092o2419K30872r0918j49932
1558h2217N6869J29508j16681J628j28500P1428L16285L5277m01615P8063L1226
1547h729L55449R0883k06709j03133k11721J5171J05805j62195n6148n7307J03049
1536a35585j70870j70967j4734j0995L48714k57009J71485J19561j51536K04575
1526f7361n8479L3493K31045j57053j33309k48156R8370K01569R2352k6772J2468
1515b1833N40K93135m2268p7774J13662j81548j94548K06572L06580l21337j82972
1504a01791K08996n4815n7631P0479q1047l23320L19306m1219K77460J40503k91708
1493F5213M1710R329n0639O9331l67279J3569j08155L842J66293j74974n5692
$$ y = [-45111, 124778, -166282, -122740, -60997, -270619, 72272, -9820, -72239, 158633, 67715, -82217, -25348, 104160, -12521, -10893, -139393, -67965, 248320, 283597, -118018, -39955, -8729, 346720, 437603, 230894, 127761, -83960, -68789, 37016, -125179, -181327, -238634, -135585, -306455, -477422, -492156, -503151, -154437, -411446, -239961, -120400, -271936, -67361, -125840, -92347, 138698, -18355, -151664, -399820, -301450, -99881, -7529, -34301, -21833, -21293, 271842, 229574, 151800, 265462, 83914, -110634, 95938, 402518, 81181, -101791, 107205, 52390, -5241, 65238, -15809, -339129, -19823, -61042, 216418, 356921, 65213, 106923, 116252, 65613, 134944, -232335, -218766, -326921, -323079, -156786, -331760, -387452]
1482c87452j16586K64488K54983j1249m4578j78N4728J78064j37984k4532j27816
1471i8112m1228j46527j16380J4111J15584p6497L23182L79142K47137r7441j19879
1460C83092k26669k28333m5621J02219L7308j59572K5837J04393m6790K26705
1450A72569K8255k14018j09288M3687p6114j73121N2666j05673j5922M9109O0653
1439b87197J2173j46562m4290K2140L18799M04377j41410k10152n0060p8668p7694
1428b78544K37379o8969j65228J0880J1136L8485R6489M5507J69850P219j7867
1417H6337n669j27249l1746j2663M030J57175k2801j4162k9451j21046J57886
1406D0641j79414J34193L3470K6753K01520l98518j89061M6107O5203J23160J17803
$$ y = [-387452, -504038, -239550, 15433, 4184, -40394, -40572, 14156, 192220, 54236, 29704, -98112, -139340, -285867, -402247, -388136, -272552, -349049, -25867, 353275, 600412, 502971, 383092, 156423, -71910, -117531, -15312, 21996, -137576, -111739, -7346, -54136, 172569, 200824, -13194, -122482, -78795, -154909, -328030, -275364, -381037, -396959, -347850, -287197, -275024, -421586, -465876, -443736, -124937, 279440, 138030, -72122, -122182, -200850, -278544, -41165, -110134, -275362, -264482, -253346, -214861, -118372, -72865, 96985, 104204, 86337, 80668, -46581, -78327, -90990, -86960, 70215, 47414, 33252, 3801, -117245, 40641, -138773, -4580, 28890, 55643, 257163, -141355, -330416, -284309, -219106, -95946, 21857]
1395B1857n5557J12087k7941J50947J586j40329j75763J84754J03604l35051k8724
1384a88530j27084P1088k32427L103J99068J89198M1719p141O3343J39883j09735
1373D2485q8019l47581j86181K91126o5638J61216J40677j03318J27690j51178
1363a78721J83486K76912r8696J66373l8184j05391J0378m1770n2603k26366j36537
1352b41119J00943J49914Q5037Q5254N6418R9256J9875k3437j41625j87862J7008
1341A9662j77062J09181j92743m11750J05994n7768J25536K19425J03449J9522
1331a36554Q5101p5622K2925R1175k24369K2125Q0286J97m8683r3466k32223R8815
1319d10293P8456J54916k567k10744N5277L49433J46687k48448k15933K06543
$$ y = [21857, -33700, 78387, 50446, 201393, 202979, 62650, -113113, 71641, 175245, -159806, -188530, -315614, -244526, -476953, -473850, -274782, -85584, -43865, -51006, 12337, 152220, 42485, -45534, -393115, -579296, -288170, -353808, -192592, -51915, -155233, -27543, -178721, 4765, 281677, 182981, 349354, 311170, 205779, 216157, 174387, 121784, -104582, -241119, -140176, 9738, 94775, 180029, 236447, 335703, 355578, 332141, 190516, 2654, 19662, -157400, -48219, -240962, -652712, -546718, -604486, -478950, -259525, -156076, -136554, -51453, -127075, -104150, -12975, -237344, -215219, -134933, -134736, -183419, -276885, -509108, -410293, -331837, -176921, -179488, -390232, -334955, 14478, 161165, -87283, -303216, -96673]
1309i6673J11885o8762K51227j7815J53121k0961K1065l5243n3493j4486k98452
1298f8587j42630l6649k5816J23402o2269k18350J97620L55865K59973j43768
1288B38791j91527q8512m5715n7681q0608l10931j34961J36499N5245J24531N5365
1277b99504J13654J90401J23650P6530L2588q6001k24363r0786k42936K366L0661
1266c73740m5755Q7857L96490K21897O7775k01248j9053K01473R3456q5654q9711
1255B53787n967K6617Q0636l05630k3824m2485o1996l6846N9678J12192n4541
1244A621n4256K9627j57578K3712L68965j43767Q371J32117J68930q822l03105
1233F5815O185j78747j19435J56715J6483j68126O6990K55831K73297j17625j74965
$$ y = [-96673, 15212, -53550, 197677, 179862, 332983, 312022, 333087, 297844, 244351, 229865, -68587, -211217, -247866, -273682, -150280, -212549, -430899, -233279, 122586, 382559, 238791, 47264, -41248, -86963, -144644, -225252, -536183, -671144, -534645, -479400, -354869, -299504, -185850, 4551, 128201, 204731, 237319, 151318, -73045, -163831, -406767, -404401, -373740, -419495, -331638, 64852, 286749, 354524, 153276, 134223, 335696, 429152, 343498, 253787, 247820, 274437, 355073, 49443, 25619, -16866, -78862, -115708, -56030, 56162, 1621, -52635, -23008, -180586, -156874, 212091, 68324, 76695, 208812, 377742, 368920, 65815, 72000, -106747, -226182, -69467, -52984, -221110, -154120, 101711, 375008, 257383, 82418]
1222H2418M9527j88041j61576J35883j40864k66577J47413r3243R2596P2874O6739
1211b02851K19095m3929q2459K47144J78018j11865j51998j80927J62558L3165
1201F5951l340k45752k07605j82544L16351K78772J6600m9655j31928J14466J30836
1190A02152n7461J87619J89440l13793q6220J94688n3086n8398k70562j65930
1180c31551L55647K44655j51769J2777l32137L97553K47380j73959k83423j53399
1170a68226o1321P7000J88888L3592L26772k74863J06367K21573j74958m23274
1160a48450J20290j30719Q5774K26525L2413l5168j40856k42290J83495J62559
1150A13573q8765R7530q1689j9045M63264j23033l2304j5195m02742O3631J23258
$$ y = [82418, 131945, -56096, -217672, -81789, -222653, -489230, -341817, -435060, -342464, -269590, -202851, 16244, -27685, -110144, 137000, 315018, 203153, 51155, -129772, 32786, 65951, 62611, -183141, -390746, -573290, -256939, 21833, 38433, -11222, -143150, -28684, 102152, 44691, 232310, 421750, 107957, 21737, 216425, 163339, 104941, -165621, -331551, 24096, 268751, 116982, 129759, -202378, 195175, 442555, 268596, -14827, -168226, -229547, -152547, 36341, 69933, 396705, 121842, 228209, 449782, 274824, -148450, -28160, -158879, -73105, 153420, 185833, 150665, 9809, -232481, -48986, 113573, 24808, 122338, 40649, 21604, 484868, 361835, 329531, 314336, -88406, -24775, 98483]
1139I8483k88528O2942J27284K51388R0712j02103K39321j00331j51900j60345
1129F6923N6490J30649P9738J14989j03543o0302K78576j59144Q0155p3120J89087
1118F00498K34424j81184k13810n693K3191n1778j50581L7712P1432R8295Q0813
1107E43319j52545j60200K05444J64275k82372M2856J99129k75724o200J60495
1097D38477j10385Q192j43600j64690l0054J11406L49040J72576J70869j48062
1087F53769J0924K19881j09199q3417l5277N2840p3073l45678P6816L31145l9923
1076F58808J26563L38555m9568P481j28388l2588J16368m3157L72203O730Q0005
1065A453012j35452J15677J6308J44820j83955k37419J25052J33095M8456P2902
$$ y = [98483, -190045, -127103, 181, 251569, 342281, 240178, 479499, 379168, 227268, 66923, 123413, 254062, 333800, 448789, 345246, 284944, 563520, 404376, 484531, 411411, 600498, 834922, 653738, 439928, 434235, 457426, 405648, 255067, 292779, 364211, 462506, 543319, 390774, 230574, 436018, 600293, 317921, 360777, 559906, 284182, 277982, 438477, 328092, 336284, 192684, 27994, -2060, 109346, 458386, 630962, 801831, 653769, 664693, 884574, 775375, 691958, 656681, 709521, 636448, 290770, 367586, 698731, 658808, 785371, 1123926, 1074358, 1081839, 953451, 920863, 1037231, 994074, 1366277, 1373007, 1453012, 1317560, 1433237, 1449545, 1594365, 1410410, 1172991, 1298043, 1431138, 1479594, 1552496]
1055A552496j83187j48465K80323J83763j45897J14023J61960J70905J9511K3758
1045B029190J85504j9810k7204q7473J01182O5227j04730k46085l04957L9932
1035A630776L54028J00057o6528j08523J31690L13102J56104j01524k2537Q3641
1025B470286K06366J18397K7578j30833O4486l3267J64965J91696J13625m9238
1015C144061q6023R4559N45974K43704K73830K64012L8668L14920N66172M22627
1005E822504J28733J98825K86077N36937N99110M28014L12355L29920L92137N14173
995I548785M90543O41320R92457J231772J145050M26149Q01593J242242J124111
986A7644022J870597J930991K288468K649565L914048M842468O251082P427214
$$ y = [1552496, 1369309, 1220844, 1501167, 1684930, 1539033, 1653056, 1815016, 1985921, 2005432, 2029190, 2214694, 2194884, 2167680, 2080207, 2181389, 2246616, 2141886, 1895801, 1590844, 1630776, 1984804, 2084861, 2018333, 1909810, 2041500, 2354602, 2510706, 2409182, 2386645, 2470286, 2676652, 2795049, 2822627, 2691794, 2756280, 2723013, 2887978, 3079674, 3193299, 3144061, 3058038, 3152597, 3698571, 3942275, 4216105, 4480117, 4518785, 4833705, 5399877, 5822504, 5951237, 6150062, 6436139, 6973076, 7572186, 8000200, 8312555, 8642475, 9034612, 9548785, 10039328, 10680648, 11673105, 12904877, 14049927, 14476076, 15277669, 16519911, 17644022, 19514619, 21445610, 23734078, 26383643, 30297691, 35140159, 41391241, 48818455]
978D8818455R601949J2975522J6307233K149849j8015931j8357050j2145864p979268
970C3354895n392586l680770l113686k743484j759288j630936j292060o82809
962A3059276o67617m36593m35629r19037r83058p89939n15138n85262n88050o67107
952F471846m69004k76914k72172L2898l84914j72636L0597j83695j79340m64226
942D132440j96220q3891j86370k62826j49202O169m12381q5679k03486j57462
932B401092j87000J52025o7760m7247q7208k58934r2266k02313P405J59160L0934
921A807888k16871l02665P8718N3037J62231l12125K7317J30180K6101k91096
911A162715j13970p4321j39879M615m4490l1764J23514j9709M8894Q3329j76573
$$ y = [48818455, 58420404, 71395926, 87703159, 89853008, 71837077, 53480027, 41334163, 33354895, 27962309, 24281539, 21167853, 18424369, 16665081, 15034145, 13742085, 13059276, 12391659, 11955066, 11519437, 10600400, 9617342, 8827403, 8312265, 7727003, 7138953, 6471846, 6002842, 5725928, 5453756, 5486654, 5101740, 4929104, 4959701, 4776006, 4596666, 4132440, 3936220, 3852329, 3665959, 3403133, 3253931, 3260100, 2847719, 2762040, 2558554, 2401092, 2214092, 2366117, 2298357, 2251110, 2163902, 1904968, 1812702, 1610389, 1617794, 1776954, 1807888, 1591017, 1288352, 1367070, 1420107, 1582338, 1270213, 1297530, 1427710, 1453811, 1162715, 1048745, 974424, 834545, 839160, 794670, 762906, 886420, 866711, 915605, 998934, 822361]
900H22361M0512p3807p0845n1262J66126K63118J13594k75290k39644j19999p8987
889D95877J4112R8548J40096K39232K99788m854k45363k51115j05857K04J06732
878G87400J08524j54720J24296j17585k0111p2533J77312j03094r625l32986q5057
867C01821l3953j02683q1244j78472J71275k09510K0866J02803j38519J17429
857c0187R7782J36723o9346j14929M2184j95323Q9090J60266R6079Q3997k83570
846A2766k27335K89633J33395m0466J79484j41196j10710Q1304J29151K03901
836E09927j17408p0089j89577J06951J13906r9638m5820p3337l7697R5121K42174
825D34513J80033j05949m76769l27092J50310M7005j88344j19105j7069K29347
$$ y = [822361, 862873, 789066, 718221, 666959, 833085, 1096203, 1209797, 934507, 694863, 574864, 495877, 509989, 608537, 748633, 987865, 1287653, 1282799, 1037436, 786321, 680464, 680668, 787400, 895924, 741204, 865500, 747915, 727804, 655271, 832583, 729489, 719864, 386878, 301821, 267868, 165185, 83941, -94531, 76744, -132766, -111900, -9097, -147616, -30187, 67595, 204318, 134972, 20043, 62227, -133096, -44006, 116260, 212339, 296336, 12766, -214569, 75064, 208459, 167993, 347477, 206281, 95571, 176875, 306026, 509927, 392519, 322430, 132853, 239804, 353710, 254072, 208252, 134915, 97218, 192339, 434513, 614546, 508597, 31828, -295264, -144954, -97949, -286293, -405398, -422467, -193120]
815a93120J28383L85637r4268k05655K58957M1177Q5201M2300n668q1344j51462
804B10138j49813o6847j87017k6921L41118r0256J29444J71626L5428k79694j61246
793g4040n8356K27304J60263j01193k78669j08438P8848R5500k9508j44936j74215
782d07440J03300O710l1273r3772o3033K09006l5986J2268M7620k9175p7901l5864
770c95540J42003M0157J36680J47073m6703j02138J29041K65923k5232j84306
760A06958J07106J44116O7368M3483k26709K172p9609L9236j93426j55592j82807
749c27704K31707M7249K63268R8316J14703k6799k43382j47196L5570J12992k42287
738h3563l69378K1966P232J08782k54249R4455j7370r7807K96547q6860P2068
$$ y = [-193120, -64737, 320900, 226632, 20977, 279934, 321111, 406312, 448612, 442944, 361600, 210138, 60325, -6522, -193539, -220460, 120658, 30402, 159846, 331472, 366900, 87206, -74040, -132396, 94908, 255171, 153978, -124691, -233129, -154281, -58781, -88289, -233225, -407440, -304140, -297430, -328703, -422475, -485508, -276502, -312488, -300220, -252600, -281775, -359676, -395540, -253537, -213380, -76700, 70373, 23670, -78468, 50573, 316496, 291264, 106958, 214064, 358180, 425548, 469031, 242322, 244494, 164885, 204121, 10695, -144897, -327704, -95997, -48748, 214520, 312836, 427539, 400740, 157358, 10162, 45732, 158724, -83563, -452941, -430975, -423743, -314961, -569210, -474755, -492125, -589932, -293385, -380245, -308177]
727c08177K06504l932L7575r9760K55063l426N5696j54380j6692j70015p8102
716b79646J16628J53956j0672M16O503q1576L7408p9939K72493L46518N86j79877
704C02798j35193p5749M0930k26942J23669k49022j22841Q3204P7897J24442K55900
693A99093R1617J09704P0579m1145j46716J48411n9487p8370O8165k01907j58263
682A681J94369j61018j92742l9340K61954j30495k810K55458j3668j44944n0097
671b1652j60994J54141J20542k9705k07532P9515J41963Q577n0911j4223j27712
660a07991K6232J0260j57544J71417Q0935R9335j77202J31k6460p3739j7060q9556
648b61242j550K00646J08677j57166j64349J07963R5278M9172L4598N7607j89761
$$ y = [-308177, -101673, -105605, -68030, -167790, 87273, 83847, 139543, -14837, -31529, -201544, -279646, -163018, -9062, -19734, -19318, -12815, -94391, -56983, -136922, 135571, 482089, 482675, 302798, 167605, 91856, 132786, -94156, 29513, -219509, -342350, -259146, -181249, -56807, 199093, 290710, 400414, 470993, 429848, 283132, 431543, 372056, 293686, 361851, 159944, 1681, 196050, 35032, -157710, -197050, 64904, -65591, -68401, 187057, 173389, 28445, -21652, -182646, -28505, 92037, 62332, -145200, -65685, 76278, 84855, 33944, 19721, -107991, -81759, -71499, -229043, -57626, 23309, 122644, -54558, -54427, -80887, -154626, -171686, -261242, -262792, -62146, 46531, -110635, -274984, -167021, -71743, -22571, 12027, 69634, -120127]
637a20127L67952j27730J39987O5006j63466J63137j45985o0468k49029N3397
627g7326k47581j06095J51182M3517K38036r5590j23398R9267J7777J62128r1454
616b9537k41584j94199K6352j44J11630J4008j19668K06830m1363n093j0366n8297
604c41431j23199J57143J72302K317J08096k12462K64915Q4548j09284K51019
594B53964J0242k90872J61529o6999m2227Q116q7779j00742J65564K3607k46318
583b11915K57041Q2509J2511N6541j65100j16961m1759k3249j73825j11387k39918
572f75512K7717J08705J26093J16640m3453N16177J35869K6539M238j61475k8423
561A53115J8189k66425j5854k8891q0354K04375k0823l67877K20939J4588j41870
$$ y = [-120127, 247825, 120095, 260082, 325088, 161622, 324759, 178774, 118306, -130723, -77326, -324907, -431002, -279820, -236303, 1733, -93857, -217255, -117988, -100211, 61917, -29537, -271121, -465320, -438968, -439112, -327482, -313474, -433142, -226312, -267675, -272768, -283134, -341431, -464630, -307487, -135185, -132868, -24772, -237234, 27681, 112229, 2945, 253964, 264206, -26666, 134863, 67864, 25637, 33753, -54026, -154768, 10796, 34403, -211915, 45126, 127635, 140146, 196687, 31587, -85374, -127133, -150382, -324207, -435594, -675512, -647795, -539090, -412997, -296357, -339810, 176367, 312236, 338775, 343013, 181538, 153115, 171304, -95121, -110975, -139866, -220220, -15845, -36668, -404545, -183606, -169018, -310888]
550c10888K81901K47652K94822J17766k01571k32217O289M8849k09134l03380
540b59911o2049l7943j8133N2931M7073J94534J93808l8917j6443J1189J4892
529H1031J60955j551j5358j70312j29498k34943l0041l3951J82953K58802k19050
518a50963q7599j95285J70108L04378j4324K29206j91597J40959j76808q9184
508f1109m9143J73637R7100j31048J38284o8031p3618o6458j58191j41791K1727
497c18641L0395K62010K3783j17687j4079J55623J1915j09801j42600J59526L7724
486b1832J9262o1970r4187k064j25754J40019n1245o9284m0187k33280K16596
475c23926J46808K2004o443K54121J83865K42627n0621l17424K0690j31923j2540
$$ y = [-310888, -28987, 218665, 513487, 631253, 429682, 197465, 203754, 252603, 43469, -259911, -321960, -359903, -378036, -325105, -278032, -83498, 110310, 71393, 54950, 66139, 81031, 241986, 240435, 225077, 54765, -74733, -309676, -339717, -373668, -190715, 68087, -150963, -238562, -433847, -263739, 40639, 26315, 255521, 63924, 204883, 28075, -61109, -110252, 63385, 160485, 29437, 167721, 99690, 26072, -40386, -198577, -340368, -318641, -288246, -26236, -2453, -120140, -134219, 21404, 33319, -76482, -219082, -59556, -21832, -2570, -64540, -158727, -160791, -286545, -146526, -197771, -267055, -307242, -540522, -323926, -177118, -155114, -161557, 92564, 276429, 519056, 468435, 151011, 171701, 39778, 27238]
464B7238j25883j06517P1582N2328L5614Q5078j22605o1615J52780J26228R0038
453B24266N1997P986j7792m7262k32379j66928j42208j29905L1596K96789L1756
442i2084K1768K89515L8869n1442p2695k1859k14944l09467l5443O9363L03113
431g5306k05836j879J19704J9855J39434R9548j09902o3550J67381J82167k19603
420E2013k11509J11637J15591O5821J04514n2295m08396P8922L3635J98493J66047
409B54473n9358J54550j17363j59926P8683k71895j91497L87952l1025K40108
399B84702K56883j27850K09003L9901n42672J31628j97030k48867J75193M942
389a4167j92153K07533k971n6699J13586N5779J26653m7241J73322J22920j05978
$$ y = [27238, -98645, -205162, -133580, -81252, -45638, 39440, -83165, -144780, 8000, 134228, 224266, 276263, 284249, 266457, 219195, -13184, -180112, -322320, -452225, -420629, -123840, -92084, -70316, 219199, 258068, 206626, 133931, 112072, -102872, -412339, -447782, -378419, -75306, -281142, -283021, -163317, -143462, -4028, 95520, -14382, -77932, 89449, 271616, 52013, -159496, -47859, 67732, 133553, 238067, 185772, -222624, -143702, -110067, 88426, 254473, 195115, 349665, 232302, 72376, 151059, -120836, -312333, 75619, 44594, 284702, 541585, 413735, 622738, 662639, 119967, 251595, 54565, -194302, -19109, -14167, -206320, 1213, -1758, -58457, 55129, 110908, 237561, 190320, 363642, 486562, 380584]
378C80584k79375j61901m3881l12114Q7543O6633j84065K54655r2190J08729M99923
367C24541P6972q7511K93062L9964r0633k41383k85409j65834n9209J81237K04913
356A90710k53401l259K27909Q299k31234K20970j97048L8990L29888j23243o514
345B02067J59568j39417P7961L9093j90507J87551k4547l32791q5640P9976j93167
334b19853l740L07861l3006J51078j59593J13246P7706Q2079J88742p1701n9719
323C73100k34771k21138J50615l8994p7150J5513l2633j13701J45935J66834o1954
312G1656M4869q2879j05130J01436J13090k3859J06733R8809j60503L431M7961
301B15614k75232Q9220P3703k6477M1962p1061k56560J12032L759J00418j4228
$$ y = [380584, 101209, -60692, -104573, -416687, -329144, -262511, -446576, -191921, -284111, -175382, 324541, 401513, 314002, 607064, 647028, 556395, 315012, 29603, -136231, -195440, -14203, 190710, -62691, -65950, 161959, 170258, -60976, 159994, -37054, 1936, 331824, 208581, 202067, 361635, 222218, 300179, 339272, 148765, 336316, 311769, -21022, -106662, -26686, -219853, -223593, 84268, 51262, 202340, 42747, 155993, 233699, 315778, 504520, 432819, 373100, 138329, -82809, 67806, 28812, -48338, -32825, -65458, -179159, -33224, 133610, 71656, 116525, 33646, -71484, 29952, 143042, 119183, 225916, 324725, 164222, 167653, 215614, -59618, 29602, 103305, 76828, 118790, 47729, -208831, -96799, -93040, 7378, -6850]
290f850j13767J29438J54198j26805J13999K3608K01121j59936k1345Q6510r1916
279A88255N8503J31919J89538j4979n3747r6634J8140j66824j40677j97837J03897
268A9554Q8641P5400J86828k42399Q2656R379j89749n5548Q4210j42104K09862
257A26730J01326j20181J45207j61774k20917J13593j29430k43650K05732k11581
247c94945j9610K96912N7996J43320Q2017O3926M334j89955j15347K61523J21513
236C11684Q1204r8766j77063J87590K4663Q6189o0132P9220j11058M0247O79l34210
224C0247L1099k0214J93988R4127k15741j32583o8273J57877J64168K57280j96075
213B95900k6562j29542j30406J01331q0926r8572O2966j7015K72934R6695r7440
$$ y = [-6850, -120617, 8821, 163019, 36214, 150213, 173821, 374942, 215006, 193661, 280171, 188255, 246758, 378677, 568215, 553236, 499489, 402855, 420995, 254171, 113494, -84343, 19554, 108195, 183595, 370423, 128024, 210680, 220059, 30310, -25238, 58972, -83132, 126730, 228056, 107875, 253082, 91308, -129609, -16016, -145446, -389096, -183364, -394945, -414555, -117643, -59647, 83673, 165690, 229616, 233950, 43995, -71352, 190171, 311684, 392888, 294122, 117059, 304649, 329312, 415501, 355369, 434589, 323531, 363778, 364457, 30247, 61346, 41132, 235120, 329247, 113506, -19077, -87350, 70527, 234695, 491975, 295900, 269338, 139796, 9390, 110721, 29795, -68777, -5811, -22826, 250108, 346803, 249363]
202B49363r3819j48239K3809J05634k5713l40467K04280l6205O476l4664J85600
191I6055j12706l16519L60744l295O1124P935p4222K1228j33589J44568j46018
180i4695J03932q4212J14046P7210J54968R8380j80936k3097j131Q6677J78001
169D29143m7205j90442j93072M6090J12566j77258M6643j16447K08802L8395k01010
158d3795J70281j93614K9536J14158j91603K98777K46694k57756r2522j91967
148a11811j13268K61040k14994K5325R1293J33498J53028N3228l1055j72418k316
137G1550k4773M6819J48147K4776L12846k92471o5074j43968k99357L571P1590
126a46344M2563K58435K60968k69981m3382J0342O6248Q4777k99970J3077J02368
$$ y = [249363, 155544, 7305, 31114, 136748, 111035, -229432, -25152, -61357, -54881, -89545, 96055, -16651, -333170, 27574, 24279, 85403, 93338, 19116, 40344, -93245, 51323, -94695, 9237, -74975, 39071, 116281, 271249, 369629, 188693, 165596, 164465, 251142, 429143, 381938, 191496, -1576, 44514, 157080, -20178, 26465, -89982, 118820, 157215, -43795, 126486, -67128, -37592, 76566, -115037, 183740, 430434, 172678, 80156, -111811, -225079, 35961, -179033, -153708, -62415, 71083, 224111, 277339, 246284, 73866, 71550, 46777, 93596, 241743, 266519, 579365, 286894, 221820, 77852, -221505, -217934, -146344, -103781, 154654, 415622, 145641, 102259, 112601, 178849, 263626, -36344, -23267, 79101]
115G9101q5500n1069J05789L4138k431J87053k0656r8402J26396l22511O4857
104A6765J22830o7781J92567l1686M729k18012J83572J38450k4095j36831j5087
93A65421J1543M7843J58606N3668n4772q1855j31295q7961j04517k8402n9814
82a11535K04491r1537J34508m573j37294K23505J5848J7396K1442j35142K4565
71A61674q4131p0971j81585l4547q2151l1998J94874N6686P5893R1874N0855J8142
59A64615M8100M1130l8178j96124Q4332P5177J26508j52045N6587J14961p4088
48B50975o7992j5282j18465J02971L2844q7954J26417l8868j0268J37708j9140
37B92946j06259M0003j10918j27690R714m5279J20211o9323R3761Q7334j52200
$$ y = [79101, -6399, -57468, 48321, 82459, 80028, 267081, 246425, 148023, 274419, -48092, 16765, 139595, 71814, 264381, 232695, 237424, 19412, 202984, 341434, 317339, 180508, 165421, 176964, 224807, 383413, 437081, 382309, 300454, 169159, 81198, -23319, -51721, -111535, 92956, 1419, 135927, 131354, -5940, 217565, 233413, 250809, 272251, 137109, 161674, 77543, 6572, -175013, -209560, -291711, -323709, -128835, -72149, 3744, 95618, 146473, 164615, 212715, 253845, 215667, 19543, 103875, 179052, 305560, 153515, 210102, 325063, 250975, 182983, 167701, 49236, 152207, 185051, 97097, 223514, 184646, 174378, 312086, 292946, 186687, 226690, 115772, -11918, -2204, -47483, 72728, 3405, 97166, 184500, 32300]
26C2300J7701l9303j17056J9325q6212K02624J40884o0719k9865j9570Q1608j27576
14A4141M7246J60430k25452O6392j4406l4058J52830j9168o7139q6171K2873K30821
2B48339M9521Q487
0C06347
$$ y = [32300, 50001, 10698, -106358, -87033, -173245, 29379, 170263, 109544, 79679, 60109, 141717, 14141, 61387, 221817, -3635, 62757, 48351, 14293, 167123, 147955, 80816, -5355, 17518, 248339, 297860, 306347]
$$ Imaginary data points
##PAGE= N=2
##DATA TABLE= (X++(I..I)), XYDATA
16383c292458r8128K5348O0553j57058J3980J53623J89933m3345N0571r7465p1229
16372c265675J84913P1895j09102J36817l4023O7215J70833J92123J03770j79785
16362b661019q7188M0036P1614J92042P4913L3412N9857K0449J62071n1786K4542
16351b121057K3884O182j7702J90920K3486q69j34948J09759J41894J77624l3151
16340a633978j5112r1529J86229j09820m5893J88358m8550J22483J73976L5708
16330a238128o8059m6947J9086o4305J9609J09977N8182L9835K04948p4957J71973
16319h68786j71734o7631N2645j7623J58517Q7038K53978m5339q810n4160J46112
16308e35793m5892p8072K4272M3893j40384J75800M4647Q4016K27356Q8804L3871
$$ y = [-3292458, -3390586, -3365238, -3304685, -3461743, -3447763, -3294140, -3104207, -3147552, -3096981, -3194446, -3265675, -3080762, -3008867, -3117969, -2981152, -3015175, -2947960, -2777127, -2585004, -2481234, -2661019, -2748207, -2708171, -2636557, -2444515, -2369602, -2336190, -2276333, -2255884, -2093813, -2145599, -2121057, -2097173, -2090991, -2108693, -1917773, -1894287, -1895156, -2030104, -1920345, -1778451, -1600827, -1633978, -1649090, -1740619, -1554390, -1664210, -1710103, -1521745, -1570295, -1447812, -1273836, -1238128, -1306187, -1353134, -1334048, -1398353, -1378744, -1268767, -1210585, -1170750, -965802, -1040759, -868786, -1040520, -1108151, -1055506, -1073129, -914612, -827574, -573596, -618935, -627745, -681905, -535793, -581685, -659757, -635485, -591592, -731976, -556176, -511529, -427513, -200157, -111353, -77482]
16297g7482K29081k2306k07907j47320P5525r0740N2860j05276N2730K56042j4968
16286B39J96871K13231o7180J74190j54278N0460J06088p4243j54063m7215k9014
16275B15086j1276L0323J43494J22137R8928L8986k34J59833j14228R5866m6120
16264G32795P276k6328N8818j76155J29104j00065L5297Q5017P6793K3938P922
16253H54412O3928J2005K1645J06819n9486J5668j67601J70284O148Q6089N9414
16242A169325k8011q1561K9987L6429p8961M207J82272R3587L6622j08599J10502
16231A365799J56841j7393K82049N3294m8558o1990Q093j54340j23259j69614
16221A290922m1532n478P5074K55423p0445K59473J25194l06278K38094P1431
$$ y = [-77482, 151599, 129293, -78614, -225934, -150409, -241149, -188289, -293565, -240835, 15207, 239, 197110, 410341, 343161, 517351, 363073, 413533, 519621, 445378, 291315, 244100, 215086, 203810, 234133, 377627, 499764, 598692, 637678, 637444, 797277, 683049, 778915, 732795, 740071, 713743, 772561, 596406, 725510, 625445, 660742, 745759, 822552, 846490, 854412, 918340, 930345, 951990, 1058809, 999323, 1014991, 847390, 1017674, 1023822, 1109911, 1169325, 1141314, 1059753, 1089740, 1126169, 1047208, 1051415, 1233687, 1327274, 1363896, 1255297, 1365799, 1522640, 1505247, 1787296, 1840590, 1792032, 1730042, 1738135, 1583795, 1460536, 1290922, 1249390, 1243912, 1318986, 1574409, 1503964, 1763437, 1888631, 1582353, 1820447, 1891878]
16211A891878J75847j87809Q4670j76692j06636k88105J45131k18773P8420K40431
16201A638362J86152K63128j3957k3114P3037m4301R4432J53813p5897J199n4433
16190B198421J6255k62205o1592Q7642l9214L6405R111R1474N2888j28238N5805
16179B056752j1763Q7688J44275j38758r6946K09359M8881L42866q2791l32450
16169B227113j27070J18508q7577J38442q2896r5560j56201j15587K37937J31562
16159B188671J22953K95280L104N021o3052j93865M6209r1066J06150Q826j13733
16148B314498k7211L4826J76049l5532J7836n0749l8458P85J89983J63289J92040
16137B937356J7106j52324j85158q6183J14195j21640K91268J39373k0375N5615
$$ y = [1891878, 2067725, 1879916, 1964586, 1787894, 1681258, 1393153, 1538284, 1319511, 1397931, 1638362, 1824514, 2087642, 2073685, 2050571, 2123608, 2079307, 2173739, 2327552, 2251655, 2252854, 2198421, 2214676, 1952471, 1890879, 1978521, 1939307, 1975712, 1984823, 2076297, 2129185, 2000947, 2056752, 2044989, 2132677, 2276952, 2138194, 2041248, 2250607, 2299488, 2642354, 2559563, 2227113, 2100043, 2218551, 2130974, 2269416, 2186520, 2090960, 1934759, 1819172, 2057109, 2188671, 2311624, 2606904, 2610008, 2615029, 2551977, 2358112, 2404321, 2313255, 2419405, 2428231, 2314498, 2287287, 2322113, 2498162, 2462630, 2480466, 2429717, 2391259, 2392044, 2582027, 2745316, 2937356, 2954462, 2802138, 2616980, 2530797, 2644992, 2523352, 2814620, 2953993, 2933618, 2989233]
16127B989233j7424l05709j1758k7304N9524j73374l18503k04241J19597j35375
16117A974666K84941L15103j7034o6324K0877M04792L31936j36646j77094k56272
16107B678945k92536J36637j50868n4462j17061j16280K09456L00850l03923L05811
16097B596569K43680k2321O9492M0291n3449j67434q1930m6758O289K6095r802
16086B600722J18185m823o1032J8899m4745k19081P1459K27598M1259O7315j08476
16075B707280j53313R7621p9401J92660J82784l2510M4781L1765P8016J1210q4889
16064B996004k01746k51641J37154J38199J05513K4073k32883p7741J25992L5346
16054B798270k00727P6433j37417J8839O1540K13358l32561J41330K59461M6610
$$ y = [2989233, 2971809, 2666100, 2654342, 2627038, 2686562, 2513188, 2194685, 1990444, 2110041, 1974666, 2259607, 2574710, 2557676, 2491352, 2512229, 2917021, 3248957, 3112311, 2935217, 2678945, 2386409, 2523046, 2372178, 2317716, 2200655, 2084375, 2293831, 2594681, 2290758, 2596569, 2840249, 2817928, 2887420, 2927711, 2874262, 2706828, 2624898, 2578140, 2584429, 2610524, 2600722, 2718907, 2714084, 2653052, 2671951, 2627206, 2408125, 2479584, 2707182, 2748441, 2815756, 2707280, 2553967, 2651588, 2572187, 2764847, 2947631, 2915121, 2959902, 2991667, 3069683, 3080893, 2996004, 2794258, 2542617, 2679771, 2817970, 2923483, 2947556, 2714673, 2636932, 2762924, 2798270, 2597543, 2673976, 2536559, 2555398, 2616938, 2830296, 2497735, 2639065, 2898526, 2945136]
16044B945136j4657J42668o9142K2896l3684P088K9294k86162j00522K17426M3893
16033B904234R7563n3511k98270j61634r8947J15385K02252J66795J58043Q1569
16023C113479j68206j14115j00555k3304j57623K93929M0127j02099n0498N9551
16013B790686j82515J53109o488K9750M5886r0980N6447J02907N103j43385j08865
16002B651655m7980j86742O1650J37677K35680k47177J82280J56056J15753R0446
15992C149298k31777q5728J58528R5431l0657j02128k89617p5677j61054Q1141
15982B507760Q7596J22707j77007J02028K21016K34817n1171J44207p5842j58279
15972B957832J23114K505k41340l8127j85436P7327j15568O302O2015J01975J71538
$$ y = [2945136, 2930479, 3073147, 3004005, 3026901, 2993217, 3000305, 3029599, 2743437, 2642915, 2860341, 2904234, 3001797, 2948286, 2650016, 2488382, 2389435, 2504820, 2707072, 2873867, 3031910, 3113479, 2945273, 2831158, 2730603, 2707299, 2549676, 2843605, 2883732, 2781633, 2731135, 2790686, 2608171, 2761280, 2754792, 2784542, 2830428, 2739448, 2795895, 2898802, 2903905, 2760520, 2651655, 2603675, 2416933, 2478583, 2616260, 2851940, 2604763, 2787043, 2943099, 3058852, 3149298, 2917521, 2831793, 2990321, 3085752, 3055095, 2952967, 2663350, 2587673, 2426619, 2507760, 2595356, 2718063, 2541056, 2643084, 2864100, 3098917, 3047746, 3191953, 3116111, 2957832, 3080946, 3083451, 2842111, 2803984, 2618548, 2695875, 2580307, 2586609, 2648624, 2750599, 2922137]
15961B922137j57499Q8505K84556j64246K15565R0785j36777j11043j3869k67992
15951B750122j86752r2663M2432R8154j80062J56457j74878L36360K11452j05634
15941B854988j97766m9993J41123J17001J57705J1132m2088K9246k458J6100j80593
15930B854397J08427l0813K19184k790j58623j87953j33478j31474J08818o9533
15920B576162O9002n6054l5880J09604Q6466M2731L07863o0597j91512j07490
15910B740295k43025J26764k69500k47700L20696L68088J18443M4464p3524P5259
$$ y = [2922137, 2764638, 2853143, 3137699, 2973453, 3189018, 3279803, 3143026, 3031983, 3018114, 2750122, 2563370, 2470707, 2513139, 2611293, 2431231, 2587688, 2412810, 2749170, 2960622, 2854988, 2657222, 2607229, 2748352, 2865353, 3023058, 3034190, 2992102, 3021348, 3018890, 3034990, 2854397, 2962824, 2932011, 3151195, 3148405, 2989782, 2801829, 2668351, 2536877, 2645695, 2576162, 2645164, 2589110, 2553230, 2662834, 2749300, 2792031, 3099894, 3039297, 2847785, 2740295, 2497270, 2624034, 2354534, 2106834, 2427530, 2795618, 2914061, 2958525, 2885001, 2960260]
$$ [...]
##END NTUPLES=NMR SPECTRUM
##END=
