##TITLE=1H_CA-8819
 CDCl3,8 sc, 
 8.02.2021
##JCAMPDX= 6.0         $$ Bruker NMR JCAMP-DX V2.0
##DATA TYPE= NMR SPECTRUM
##DATA CLASS= NTUPLES
##ORIGIN= UXNMR, Bruker Analytische Messtechnik GmbH
##OWNER= root
$$ XWIN-NMR		Version 3.5
$$ Mon Feb  8 11:44:38 2021 Russian Standard Time (UT+4h)  she@DPX200
##.OBSERVE FREQUENCY= 200.1315066352
##.OBSERVE NUCLEUS= ^1H
##.ACQUISITION MODE= SIMULTANEOUS
##.ACQUISITION SCHEME= undefined
##.AVERAGES= 8
##.DIGITISER RES= 18
##SPECTROMETER/DATA SYSTEM= spect
##.PULSE SEQUENCE= zg30
##.SOLVENT NAME= CDCl3
##.SHIFT REFERENCE= (INTERNAL, CDCl3, 0, 15.9523)
##AUDIT TRAIL= $$ (NUMBER, WHEN, WHO, WHERE, WHAT)
$$ ##TITLE= Audit trail, XWIN-NMR		Version 3.5
$$ ##JCAMPDX= 5.01
$$ ##ORIGIN= Bruker BioSpin GmbH
$$ ##OWNER= she
$$ F:/spectra/data/she/nmr/H-F/1/pdata/1/auditp.txt
$$ ##AUDIT TRAIL=  $$ (NUMBER, WHEN, WHO, WHERE, WHAT)
(   1,<2021-02-08 11:43:32.35 +0400>,<she>,<DPX200>,
      <created by zg, POWCHK disabled, PULCHK disabled
       configuration hash MD5:
       00 E9 B6 7A A2 85 ED C7 34 08 36 98 17 FE 4E 26
       data hash MD5: 16K
       2F 83 3A 6A C2 76 0E 2B FD F0 02 E2 94 2D EC A1>)
(   2,<2021-02-08 11:43:37.25 +0400>,<she>,<DPX200>,
      <Start of raw data processing
       efp BC_mod = 2 LB = 0.24 FT_mod = 6 PKNL = 1 PHC0 = -10763.81 PHC1 = 14.40094 SI = 16K 
       data hash MD5: 16K
       F0 9D FD DC B4 E0 E7 BA 00 D6 6C 83 3E 40 A7 BE>)
(   3,<2021-02-08 11:43:53.95 +0400>,<she>,<DPX200>,
      <pk PHC0 = 6.892268 PHC1 = -2.4 
       data hash MD5: 16K
       C5 C2 6B E9 2C D0 A4 36 2B 56 14 02 33 B8 9A 81>)
(   4,<2021-02-08 11:43:56.93 +0400>,<she>,<DPX200>,
      <abs ABSG = 5 
       data hash MD5: 16K
       CC 06 33 BB F5 58 88 F9 D1 D6 D7 DF C0 05 1F 06>)
$$ ##END=
$$ 
$$ hash MD5
$$ A8 43 17 77 AC E7 13 4B 4D 5A E3 05 08 D5 BF 8E
##$RELAX= 
##$RELAX= 
##$RELAX= 
##$RELAX= 
##$RELAX= 
##$RELAX= 
$$ Bruker specific parameters
$$ --------------------------
##$DU= <F:/spectra>
##$EXPNO= 1
##$NAME= <H-F>
##$PROCNO= 1
##$TYPE= <nmr>
##$USER= <she>
##$AMP= (0..31)
100 100 100 100 100 100 100 100 100 100 100 100 100 100 100 100 100 100 
100 100 100 100 100 100 100 100 100 100 100 100 100 100 
##$AQSEQ= 0
##$AQ_mod= 1
##$AUNM= <au_zg>
##$AUTOPOS= <>
##$BF1= 200.13
##$BF2= 200.13
##$BF3= 200.13
##$BF4= 200.13
##$BF5= 200.13
##$BF6= 200.13
##$BF7= 200.13
##$BF8= 200.13
##$BYTORDA= 1
##$CFDGTYP= 0
##$CFRGTYP= 5
##$CHEMSTR= <none>
##$CNST= (0..31)
1 1 145 1 1 1 1 1 1 1 1 1 1 1 1 1 1 1 1 1 1 1 1 1 1 1 1 1 1 1 1 1 
##$CPDPRG= <>
##$CPDPRG1= <>
##$CPDPRG2= <>
##$CPDPRG3= <>
##$CPDPRG4= <mlev>
##$CPDPRG5= <mlev>
##$CPDPRG6= <mlev>
##$CPDPRG7= <mlev>
##$CPDPRG8= <mlev>
##$CPDPRGB= <>
##$CPDPRGT= <>
##$D= (0..31)
0 1.2 0 0 0 0 0 0 0 0.06 0 0.03 0 0 0 0 0.0002 0 0 0 0 0 0 0 0 0 0 0 0 
0 0 0 
##$DATE= 1612770211
##$DBL= (0..7)
120 120 120 120 120 120 120 120 
##$DBP= (0..7)
150 150 150 150 150 150 150 150 
##$DBP07= 0
##$DBPNAM0= <>
##$DBPNAM1= <>
##$DBPNAM2= <>
##$DBPNAM3= <>
##$DBPNAM4= <>
$$ [...]
##$SUBNAM3= <"">
##$SUBNAM4= <"">
##$SUBNAM5= <"">
##$SUBNAM6= <"">
##$SUBNAM7= <"">
##$SUBNAM8= <"">
##$SUBNAM9= <"">
##$SW= 16.9725356469052
##$SWIBOX= (0..15)
0 0 2 0 0 0 0 0 0 0 0 0 0 0 0 0 
##$SW_h= 3396.73913043478
##$TD= 16384
##$TD0= 1
##$TE= 0
##$TE2= 300
##$TE3= 300
##$TEG= 300
##$TL= (0..7)
0 120 120 120 120 120 120 120 
##$TP= (0..7)
150 150 150 150 150 150 150 150 
##$TP07= 0
##$TPNAME0= <>
##$TPNAME1= <>
##$TPNAME2= <>
##$TPNAME3= <>
##$TPNAME4= <>
##$TPNAME5= <>
##$TPNAME6= <>
##$TPNAME7= <>
##$TPOAL= (0..7)
0.5 0.5 0.5 0.5 0.5 0.5 0.5 0.5 
##$TPOFFS= (0..7)
0 0 0 0 0 0 0 0 
##$TUNHIN= 0
##$TUNHOUT= 0
##$TUNXOUT= 0
##$USERA1= <user>
##$USERA2= <user>
##$USERA3= <user>
##$USERA4= <user>
##$USERA5= <user>
##$V9= 5
##$VALIST= <valist>
##$VCLIST= <CCCCCCCCCCCCCCC>
##$VD= 0
##$VDLIST= <DDDDDDDDDDDDDDD>
##$VPLIST= <PPPPPPPPPPPPPPP>
##$VTLIST= <TTTTTTTTTTTTTTT>
##$WBST= 1024
##$WBSW= 4
##$XGAIN= (0..3)
0 0 0 0 
##$XL= 0
##$YL= 0
##$YMAX_a= 286402
##$YMIN_a= -221372
##$ZGOPTNS= <>
##$ZL1= 120
##$ZL2= 120
##$ZL3= 120
##$ZL4= 120
##$ABSF1= 15.9761
##$ABSF2= -0.996562
##$ABSG= 5
##$ABSL= 3
##$ALPHA= 0
##$AQORDER= 0
##$ASSFAC= 0
##$ASSFACI= 0
##$ASSFACX= 0
##$ASSWID= 0
##$AUNMP= <proc_1d>
##$AZFE= 0.1
##$AZFW= 0.1
##$BCFW= 0
##$BC_mod= 2
##$BYTORDP= 0
##$COROFFS= 0
##$CY= -3
##$DATMOD= 1
##$DC= 0
##$DFILT= <>
##$DTYPP= 0
##$F1P= 0
##$F2P= 0
##$FCOR= 1
##$FTSIZE= 16384
##$FT_mod= 6
##$GAMMA= 0
##$GB= 0
##$INTBC= 1
##$INTSCL= 2.992141e-10
##$ISEN= 128
##$LB= 0.24
##$LEV0= 0
##$LPBIN= 0
##$MAXI= 10000
##$MC2= 0
##$MEAN= 0
##$ME_mod= 0
##$MI= 1.114404
##$NCOEF= 0
##$NC_proc= -8
##$NLEV= 6
##$NOISF1= 3.799351
##$NOISF2= 2.8
##$NSP= 0
##$NTH_PI= 0
##$NZP= 0
##$OFFSET= 15.95227
##$PC= 1
##$PHC0= -10756.92
##$PHC1= 12.00094
##$PH_mod= 1
##$PKNL= yes
##$PPARMOD= 0
##$PSCAL= 0
##$PSIGN= 0
##$REVERSE= no
##$SF= 200.130012476562
##$SI= 16384
##$SIGF1= 3
##$SIGF2= 2
##$SINO= 5.538805
##$SIOLD= 16384
##$SREGLST= <1H.CDCl3>
##$SSB= 0
##$STSI= 16384
##$STSR= 0
##$SW_p= 3396.73913043478
##$SYMM= 0
##$S_DEV= 0
##$TDeff= 16384
##$TDoff= 0
##$TI= <>
##$TILT= no
##$TM1= 0
##$TM2= 0
##$TOPLEV= 0
##$USERP1= <user>
##$USERP2= <user>
##$USERP3= <user>
##$USERP4= <user>
##$USERP5= <user>
##$WDW= 1
##$XDIM= 16384
##$YMAX_p= 416250912
##$YMIN_p= -1271271
$$ End of Bruker specific parameters
$$ ---------------------------------
##NTUPLES= NMR SPECTRUM
##VAR_NAME=  FREQUENCY,     SPECTRUM/REAL,   SPECTRUM/IMAG
##SYMBOL=    X,             R,               I
##VAR_TYPE=  INDEPENDENT,   DEPENDENT,       DEPENDENT
##VAR_FORM=  AFFN,          ASDF,            ASDF
##VAR_DIM=   16384,         16384,           16384
##UNITS=     HZ,            ARBITRARY UNITS, ARBITRARY UNITS
##FACTOR=    0.207333158178281, 1,           1
##FIRST=     3192.52790489915, 0,            0
##LAST=      -204.211225535625, 0,           0
##MIN=       -204.211225535625, -1271271,    0
##MAX=       3192.52790489915, 416250912,    0
$$ Real data points
##PAGE= N=1
##DATA TABLE= (X++(R..R)), XYDATA
$$ [...]
5558E75531P6501m53383m90888L47834k4097M19275L35141j26784K19673R04033
5548A782836k77163q28017j82030O33497K73120n00703o69963J08517J221114
5539A561208n58314l06641k52997l03495J90872O06202l3386n5888K77921J9219
5529A144701o80333j49964K14591N6632L64424k14577k14762L95043m32007j15258
5519C68490k23396p4112J65500J40843K02977k25805j312k297O7619J78849k56527
5508C40829J87193M008p3862J62650j56192m8328m5812M49196k23771o76496K87011
5497B06426k2310M05891O65989m98545m93386M10805j17614k51116O8492M98346
5487H72978N3523O48145n48386n40424M47272r2294K98825m20194k20804K89312
$$ plain form
5558 575531 652032 198649 -292239 55595 31498 450773 785914 659130 878803 1782836
5548 1782836 1505673 677656 495626 1129123 1402243 901540 231577 340094 1561208
5539 1561208 1002894 696253 443256 139761 330633 936835 903449 847561 1125482 1144701
5529 1144701 464368 314404 528995 585627 950051 735474 520712 915755 483748 368490
5519 368490 145094 70982 236482 377325 580302 354497 353185 350888 418507 597356 340829
5508 340829 528022 532030 458168 620818 464626 416298 370486 819682 595911 -80585 206426
5497 206426 184116 590007 1255996 757451 264065 674870 557256 306140 374632 872978
5487 872978 926501 1574646 1026260 485836 933108 840814 1139639 719445 498641 787953
5477G87953R47246l0442n04856K25664r7031o94619K76089l02l27962j21409O51577
5466A111908K18218o61950j32223L64964l98346j63375M08525O86383n14390o7491
5456H52223M78102j053036J85795Q07052l44521J87678R6264m9676K08540L30952
5446A699373n89903k25055P99472j53913n71407M36364K54887M8883n47552j51510
5436I99639J02439J94896K73863k79034L91227J83681l27116L25887l7566n56746
5426A271170l70098n7940J84841n23312M41176N42371M69361o28641j16635K85310
5416A497603J69814K76021K37380k79096K04162k51556J23637p1119m27438j65751
5406A313657k61414N64386L83591l21946M03219m74522m8380K6827l27944j16565
$$ plain form
5477 787953 1735199 1704757 1199901 1425565 1328534 633915 910004 909702 581740 460331 1111908
5466 1111908 1330126 668176 535953 900917 502571 339196 747721 1434104 919714 852223
5456 852223 1330325 277289 463084 1270136 925615 1113293 1209557 1159881 1368421 1699373
5446 1699373 1109470 884415 1683887 1529974 958567 1394931 1649818 1698701 1151149 999639
5436 999639 1102078 1296974 1570837 1291803 1683030 1866711 1539595 1865482 1827916 1271170
5426 1271170 901072 843132 1027973 504661 945837 1488208 1957569 1328928 1212293 1497603
5416 1497603 1667417 1943438 2180818 1901722 2105884 1854328 1977965 1906846 1479408 1313657
5406 1313657 1052243 1616629 2000220 1678274 2081493 1606971 1558591 1585418 1257474 1140909
5396A140909n7359Q09215n02047j67849J19547J63167L0766O7412l49268O62197
5386A916690J44351L86276m38288o45299N96938j1565k57169j15513O08068n9397
5376B125092k06469K062l56511l84247M17742J39219j82731J6677O07976m22386
5366A756424J49037M32171k35418K44387k15997M16011k14138J29240L8712j8215
5356B482214R7600L74943O8540l82546P08420J25272n13957k41175J96177j32591
5346B782897N37001k20380K10677L76430k95933O2860n76357L37758L40345k60834
5336C294464K33700J85189J22128J07398J37861L28736k98540J54989P88743l4657
5326E020011l65719L32836P95214j92777J23717J030757Q8056Q5965M20203L00304
$$ plain form
5396 1140909 1083550 1892765 1390718 1222869 1342416 1505583 1536349 1603761 1254493 1916690
5386 1916690 2061041 2447317 2009029 1363730 1960668 1949103 1691934 1576421 2184489 2125092
5376 2125092 1918623 1920685 1564174 1179927 1597669 1736888 1554157 1570834 2178810 1756424
5366 1756424 1905461 2337632 2102214 2346601 2130604 2546615 2332477 2461717 2500429 2482214
5356 2482214 2579814 2954757 3023297 2640751 3349171 3474443 2960486 2719311 2915488 2782897
5346 2782897 3319898 3099518 3310195 3686625 3390692 3453552 2877195 3214953 3555298 3294464
5336 3294464 3528164 3713353 3835481 3942879 4080740 4409476 4110936 4265925 5054668 5020011
5326 5020011 4654292 4987128 5782342 5589565 5713282 6744039 6832095 6918060 7338263 7638567
5316G638567k82930M02631M26753k08986m51614O21575O53099k08898M5286J82140
5306H817623K40074J73970P88580Q1302M43326N18702p8454K12761P89814J54595
5296A2142293M55072O31909O56175O93605J10634Q62737J94722q1751n03489K20782
5286A5382689K10998Q4097J6705L36366l39829L0344j71838k66712J37314M25254
5276A5845388L44503L39479K01716J1414Q27007L86808M71496l3923O27425N27104
5266A9548417L38598N48833K35529O97811M37897o27439j91231J84500o61405
5257B0511510m36306k66639r75591o59905k27142q51700m28468J76562n55939
5248A6286382l53608L78501J87792q73632L9516k6500O15030j54466Q7937R2864
$$ plain form
5316 7638567 7355637 7758268 8185021 7976035 7524421 8145996 8799095 8590197 8635483 8817623
5306 8817623 9057697 9231667 10020247 10101549 10544875 11063577 10985123 11197884 11987698 12142293
5296 12142293 12597365 13229274 13885449 14579054 14689688 15552425 15747147 15665396 15161907 15382689
5286 15382689 15593687 15677784 15694489 16030855 15691026 15721370 15549532 15282820 15420134 15845388
5276 15845388 16189891 16529370 16731086 16742500 17569507 17956315 18427811 18393888 19021313 19548417
5266 19548417 19887015 20435848 20671377 21369188 21807085 21179646 20988415 21172915 20511510
5257 20511510 20075204 19808565 18832974 18173069 17945927 17094227 16665759 16842321 16286382
5248 16286382 15932774 16311275 16499067 15625435 15664951 15638451 16253481 16099015 16186952 16279816
5238A6279816P0447J96705k58550K03098k83097j54495m65896l73836k53934q37540
5228A4122718q25627M22995m04021j087158l56964m02376n12230j26915m06346
5219A0424076j74803o53242q02010L90544J86281n46073Q151k07678k48737l41314
5209H035195M15556K24442r81401l1884j59428n28470M9252l8835p42375o25154
5199E616898M70963K95432k72500L47908j186867m95456O65433l25713j059839
5190D056259J39183J67215o27214J27198Q15881L9334o88440p40908j51937K02532
5180C339103n44425L95376J12834J65826K2277n18055l18951k90514n69229r8442
5170A695800L73828O7873P6267J16419M20318o69140l13747j09389j61466L61533
$$ plain form
5238 16279816 16350263 16546968 16288418 16491516 16208419 16053924 15588028 15214192 14960258 14122718
5228 14122718 13297091 13720086 13316065 12228907 11871943 11469567 10957337 10830422 10424076
5219 10424076 10249273 9596031 8794021 9184565 9370846 8824773 8832924 8625246 8376509 8035195
5209 8035195 8450751 8675193 7693792 7661908 7502480 6974010 7023262 6984427 6242052 5616898
5199 5616898 6087861 6383293 6110793 6458701 5271834 4776378 5441811 5116098 4056259
5190 4056259 4195442 4362657 3735443 3862641 4678522 4717856 4029416 3288508 3136571 3339103
5180 3339103 2794678 3190054 3302888 3468714 3490991 2972936 2653985 2363471 1794242 1695800
5170 1695800 2069628 2137501 2213768 2330187 2750505 2081365 1767618 1658229 1496763 1858296
5160A858296N90731k11590J53390J23778p16962p9011M87618k69196m35533P35409
5150B236930J72514K93213m72013l28558j58324k65571K35142R02462k10257k24618
5140B180920L18127k82235k53902n20404N2795J13845K9941l00938l18957R19066
5130A938258p8385q87512j93173M94855n6903j00886L90025M64805j65899k96517
5120A508668q3989m72201J58718k09817K27398N22073L29554K12630m58651j63065
5110A571318J48509n41698k54545N29209k01991L91653J07307l9632j89480k98617
5100A222033j3525k41535J64460Q24229N7885q13117k39132J82965P179m55239
5090F96203M28332k22641N10065N26283n4043k27150O5467K4791O6901n64116
$$ plain form
5160 1858296 2449027 2237437 2390827 2514605 1797643 1718632 2206250 1937054 1501521 2236930
5150 2236930 2409444 2702657 2230644 1902086 1743762 1478191 1713333 2615795 2405538 2180920
5140 2180920 2499047 2216812 1962910 1442506 1495301 1609146 1639087 1338149 1019192 1938258
5130 1938258 1859873 972361 779188 1274043 1217140 1116254 1506279 1971084 1805185 1508668
5120 1508668 1424679 952478 1111196 901379 1128777 1650850 1980404 2193034 1734383 1571318
5110 1571318 1719827 1178129 923584 1452793 1250802 1642455 1749762 1710130 1520650 1222033
5100 1222033 1208508 966973 1131433 1955662 2013547 1200430 961298 1144263 1151442 696203
5090 696203 1124535 901894 1411959 1938242 1884199 1657049 1722516 1747307 1814208 1250092
5080A250092M35179L71240o54880m4713M56428P514q39437L87229l31572k37815
5070G99265M40734o9198Q1481J23984k24531N00694m76098j48637J56888l47592
5060H36990L57589L1196R8073n5646j44462l1528j25156N17823J97310R6486K5040
5049A803715j5759O06129J03736p79456M87296k65912m45614K81217R70929j70832
5039B575449k70998J23418l8655j04282m30677K6991P8794K1019O36424K60676
5029B878159k30652m3628j38849n6411j098009P07867J28984j5813Q7863o60256
5019A559255Q4558O64072k48594m30702k33936M62039q93069N95017N35822m39354
5009A655108K43222l12979j82075j43885l02146J06182O32413J21905Q6687k71320
$$ plain form
5080 1250092 1685271 2056511 1401631 1356918 1813346 1820860 981423 1368652 1037080 799265
5070 799265 1239999 1170801 1252282 1376266 1151735 1652429 1176331 1027694 1184582 836990
5060 836990 1194579 1225775 1323848 1268202 1123740 1092212 967056 1484879 1682189 1778675 1803715
5049 1803715 1787956 2394085 2497821 1718365 2205661 1939749 1494135 1775352 2746281 2575449
5039 2575449 2304451 2427869 2389214 2284932 1854255 1881246 1960040 1981059 2617483 2878159
5029 2878159 2647507 2603879 2465030 2408619 1310610 2018477 2147461 2131648 2219511 1559255
5019 1559255 1643813 2307885 2059291 1628589 1394653 1856692 963623 1558640 2094462 1655108
5009 1655108 1898330 1585351 1403276 1259391 957245 1063427 1695840 1817745 1904432 1633112
4999A633112k81476k40497J76274l84855Q74659N3737n04962M42494L50594k65433
4989A853647o88082j6212N13239k18756P3650K83768m39998o9272L74121p87111
4979H78994k50172J297304k49416P2659m3587n6223o4466k71361l99267M02895
4969A317360J54376j71502J49258M48217l01335r4253K68811l30809Q6848l0054
4959A496917J7332L73269K05563k45994m94362L24310K8391j88440J50093k59154
4949A407925L55918k07068n313O02107o68870p26839P49687L61320N837m61442
4939A413262R4061L3441K82953k85053k07398P22846j98108N0640O7693k58683
4929A715654p0034J63732o0706l79725r88k3796J6529J28884j24058j85787N62284
$$ plain form
4999 1633112 1351636 1111139 1287413 902558 1777217 1830954 1325992 1768486 2119080 1853647
4989 1853647 1165565 1149353 1662592 1443836 1517486 1801254 1361256 1291984 1666105 878994
4979 878994 628822 1926126 1676710 1749369 1705782 1649559 1585093 1313732 914465 1317360
4969 1317360 1471736 1300234 1449492 1897709 1596374 1502121 1770932 1440123 1526971 1496917
4959 1496917 1514249 1887518 2093081 1847087 1352725 1677035 1705426 1516986 1667079 1407925
4949 1407925 1763843 1556775 1551462 2153569 1484699 757860 1507547 1868867 1874704 1413262
4939 1413262 1507323 1540764 1823717 1538664 1331266 2054112 1856004 1906644 1974337 1715654
4929 1715654 1645620 1809352 1748646 1368921 1367933 1344137 1360666 1489550 1365492 1179705 1741989
4918A741989l95659K83333m69880l0890O26735l4239k30563m65238O01967l57235
4908A270320K05870L39090N21450p4737j86528l7384J22354R3067m29582l8849
4898A785071J87879j96147m70627L65340k14526M35623O7950k27052j16290K73259
4888A890480K38434k78429K97096l7043k40257N9740m4486J0215l49313N23306
4878B069743L79846p91003J50422P16502k97772K66246n64880K26356j70159m68540
4868A516761P83523o43203K99385J24769j45202m74160J26488l0410J70073K13334
4858A941358N7255p8664K0928q5641j34975Q9645L48173J74774l11437l02144
4848A719272M67462p6950q0962M08710R0701k13364k79571K79642m2958m30780
$$ plain form
4918 1741989 1346330 1629663 1159783 1128893 1755628 1721389 1490826 1025588 1627555 1270320
4908 1270320 1476190 1815280 2336730 2261993 2075465 2038081 2160435 2253502 1823920 1785071
4898 1785071 1972950 1776803 1306176 1671516 1456990 1892613 1960563 1733511 1617221 1890480
4888 1890480 2128914 1850485 2147581 2110538 1870281 1930021 1885535 1895750 1546437 2069743
4878 2069743 2449589 1658586 1809008 2525510 2227738 2493984 1929104 2155460 1985301 1516761
4868 1516761 2300284 1657081 1956466 2081235 1936033 1461873 1588361 1557951 1728024 1941358
4858 1941358 1998613 1919949 1940877 1855236 1720261 1809906 2158079 2332853 2021416 1719272
4848 1719272 2186734 2109784 2028822 2437532 2528233 2314869 2035298 2314940 2271982 1841202
4838A841202j45457k74845p4992L95341j89279k72310k21068M49853L99448l13638
4828A594255n507K89965J7747l75944m42028J97354N72084p9979l920o08567O20823
4817A776283M52823l44997L60855k45179L23831j55257J17914k22388j15280j38793
4807A809812p6720L29604M6369p58340K66624J127647l02008p38958j4127L89077
4797B078980n35195K45600k45108P92083j32676K44111J55425o23084j0944J53305
4787B122497J29393m77023K9383L07011l12245P5029Q7901p03106N99022J63636
4777B021498k27270P9976J13535J72629k73429Q0208J98783p42660R13991j07078
4767B230183Q1312l98157J17562p0338k17103K10335M9016J96102l18088k77162
$$ plain form
4838 1841202 1695745 1420900 1345908 1741249 1551970 1279660 1058592 1508445 1907893 1594255
4828 1594255 1588748 1878713 1896460 1520516 1078488 1275842 1847926 1767947 1764027 1155460 1776283
4817 1776283 2229106 1884109 2244964 1999785 2323616 2168359 2286273 2063885 1948605 1809812
4807 1809812 1733092 2062696 2109065 1350725 1617349 2744996 2442988 1704030 1689903 2078980
4797 2078980 1543785 1789385 1544277 2336360 2203684 2447795 2603220 1980136 1969192 2122497
4787 2122497 2251890 1774867 1804250 2111261 1799016 1874045 1961946 1258840 1857862 2021498
4777 2021498 1794228 1874204 1987739 2160368 1886939 1967147 2165930 1423270 2337261 2230183
4767 2230183 2311495 1913338 2030900 1960562 1743459 1953794 2002810 2198912 1880824 1603662
4757A603662N79594k06251k78210N13477k73734J98836Q3388l4091L93052K98659
4747B878382q06288L46900R0722o37374L40770Q1122J58455K6203l83211k00898
4737A894783M47783j17560J53609Q7445k80441j81668L5215M98824k90123l52998
4727A894869N7114J13032o91935P56515j96643L66630N09247j018175L10862N31025
4717B632541o33285N0874N72119o661k25003O18286M4923o11280k41575l7763
4707B163176J56674l6610o9319O94449j23062k04679L83496o81103O3031k49616
4697B096437j83157M78742M08311N99186m65548R4409k8287n39296J0911N46357
4687C018065n48497q9784K98838J2275L33307j24477n21408j62330L91518k1319
$$ plain form
4757 1603662 2183256 1977005 1698795 2212272 1938538 2137374 2220762 2186671 2579723 2878382
4747 2878382 2072094 2418994 2509716 1872342 2213112 2294234 2452689 2478892 2095681 1894783
4737 1894783 2342566 2225006 2378615 2466060 2185619 2003951 2039166 2537990 2247867 1894869
4727 1894869 1951983 2065015 1373080 2129595 1932952 2299582 2808829 1790654 2101516 2632541
4717 2632541 1999256 2050130 2622249 2615588 2390585 3008871 3053794 2442514 2200939 2163176
4707 2163176 2319850 2283240 2213921 2908370 2785308 2580629 2964125 2283022 2346053 2096437
4697 2096437 1913280 2392022 2800333 3399519 2933971 3028380 3000093 2460797 2471708 3018065
4687 3018065 2469568 2379784 2678622 2690897 3024204 2899727 2378319 2215989 2607507 2586188
4677B586188N34431m08139M6133K58257j87784m74667m95796M44307K41458K7447
4667B571835J62938l19248J93622L48106j15301j39847L0094K7657K68945k178
4657C026623K428k24776J78271k22603J3579m24599K51348M73418M3042L86848
4647C503579j74386J7460m00781k91126l52079j39181J41917Q86878l02232j37353
4637B752696L88703J23629l84572o6739P1705k94728O08782l06929M40858K1083
4627C354488n9389j25748l07876M94985r6105J88430k60563K91033N54269p25350
4617C308174o64829N61543N94086m63293j63476P75193N49l43507J7307p5713
4607C546034K86406n24625L60466N15951k75602K16722l4857n65573N04261P1228
$$ plain form
4677 2586188 3120619 2712480 2758613 3016870 2829086 2354419 1858623 2302930 2544388 2571835
4667 2571835 2734773 2415525 2609147 2957253 2841952 2702105 2732199 2759856 3028801 3026623
4657 3026623 3029051 2804275 2982546 2759943 2773522 2348923 2600271 3073689 3116731 3503579
4647 3503579 3329193 3346653 2945872 2654746 2302667 2163486 2305403 3192281 2890049 2752696
4637 2752696 3141399 3265028 2880456 2813717 2885422 2590694 3199476 2892547 3333405 3354488
4627 3354488 3295099 3169351 2861475 3356460 3260355 3448785 3188222 3479255 4033524 3308174
4617 3308174 2643345 3204888 3798974 3335681 3172205 3947398 3947947 3604440 3621747 3546034
4607 3546034 3832440 3307815 3668281 4184232 3908630 4125352 4090495 3524922 4029183 4100411
4597D100411p3110n41542P88784R348l39253Q19685k55954n57957R1422J33523
4587D175357j48591M88472K67897o00770j31978O13825p54808N41555O03021n55472
4577D498508l39735O05614k9408k31490n31581P00943J3470R9620r8505m16751
4567D270685O50377k66956k91287M35176j21228o00778L32969M04173K44757J70031
4557E227919K12289L99618m43296j93689O58666K30578l66223K4411L31657j79451
4547E902479J59750l06742M1236M47410L92268m18692R1954L42519q03212J46522
4537E995492R70702Q7618n28444M61365J07464K41101R6578k94923K28333j9452
4527G345834k41638J99532N55445m4640J8755N09483L8925q34143J99599Q37219
$$ plain form
4597 4100411 4027301 3485759 4274543 4283891 3944638 4764323 4508369 3950412 4041834 4175357
4587 4175357 4026766 4515238 4783135 4182365 4050387 4664212 3909404 4450959 5053980 4498508
4577 4498508 4158773 4764387 4734979 4503489 3971908 4672851 4686321 4785941 4687436 4270685
4567 4270685 4921062 4654106 4362819 4797995 4676767 4075989 4408958 4813131 5057888 5227919
4557 5227919 5440208 5839826 5396530 5202841 5861507 6092085 5725862 5750273 6081930 5902479
4547 5902479 6062229 5755487 5796723 6244133 6636401 6217709 6309663 6652182 5848970 5995492
4537 5995492 6966194 7053812 6525368 6986733 7094197 7335298 7431876 7136953 7365286 7345834
4527 7345834 7104196 7303728 7859173 7814533 7833288 8342771 8381696 7547553 7747152 8584371
4517H584371j38263J36250k67673K1267M40102J70485l70641J89844N54373p1547
4507I248568M9430j29o912K65515j55700P2057k06832q8373R60487R9587m86074
4496I751624J39781L8557k1790K89097M53928q5597k75766R47737k88574q09689
4486A0139308j17130N67867l3195L41024j04371n7906M15267M224j23300o9036
4476A0962752k50670K65256M33095p45188j81188N40011M6258l21131K64011l82271
4466A0630935j32271J25260K06836R8663K15527j16928j81756k34340M3534n06220
4456A0149240Q8056Q87793q9487n01335k32176r9464M41337l77081m74926J013117
4446A0805074O0771L70148l221j51907o70646L50842K29071l59439j62874M69321
$$ plain form
4517 8584371 8446108 8582358 8314685 8335952 8776054 8946539 8575898 8765742 9320115 9248568
4507 9248568 9297998 9297869 9290957 9556472 9400772 9472829 9265997 9177624 10138111 10237698 9751624
4496 9751624 9891405 9929962 9908172 10197269 10651197 10565600 10289834 11237571 10948997 10139308
4486 10139308 10022178 10590045 10556850 10897874 10793503 10735597 11150864 11155088 11031788 10962752
4476 10962752 10712082 10977338 11410433 10665245 10484057 11024068 11070326 10749195 11013206 10630935
4466 10630935 10498664 10623924 10830760 10929423 11144950 11028022 10846266 10611926 10655460 10149240
4456 10149240 10237296 11125089 11035602 10534267 10302091 10202627 10643964 10266883 9791957 10805074
4446 10805074 10865845 11235993 11232772 11080865 10410219 10761061 10990132 10630693 10467819 10937140
4436A0937140P06668R7158q12735J62303J44642n6835l45760L7567M95115j58537
4426A1206726M24321J65197l21019K18735m14691K22346Q80363n9656K31266N27831
4416A3081419K28801K60334M39794K11066L1701K70388j80867r8365J344803j35929
4406A5453145O0701N83664O16346J6038M59256K97875L12774R47922L60237N90924
4396A9698882J279397o3965L69219J340092J408876J011782P66095J500248J622079
4387B8932705J141679O09961R39046J473288Q03010O37828J165583J28033J85951
4378C6017084K68527k44417k22747K85588k56929j68320K82181n47147l30184
4369C5083636P07646L35445n47308K52178R88698Q93314N97372M98939K069056
$$ plain form
4436 10937140 11643808 11740966 10928231 11090534 11235176 11178341 10832581 10870148 11365263 11206726
4426 11206726 11631047 11796244 11475225 11693960 11279269 11501615 12381978 12322322 12553588 13081419
4416 13081419 13310220 13570554 14010348 14221414 14253115 14523503 14342636 14244271 15589074 15453145
4406 15453145 15513846 16097510 16713856 16729894 17189150 17487025 17799799 18747721 19107958 19698882
4396 19698882 20978279 20914314 21283533 22623625 24032501 25044283 25810378 27310626 28932705
4387 28932705 30074384 30684345 31623391 33096679 33899689 34537517 35703100 35831133 36017084
4378 36017084 36285611 36041194 35818447 36104035 35847106 35678786 35960967 35413820 35083636
4369 35083636 35791282 36126727 35579419 35831597 36820295 37713609 38310981 38809920 40878976
4360D0878976J333773R41495J952059J540353J177386J608014J796437J270113
4352E2498606J064799Q78496Q74835R0551J44256k38959n73507o7601N6375j127328
4342E3600523q08036j843510j163776j188416k377321j227111j309519j801500
4334D1881334r13968j36261j297942p19450Q6045o1782o86391m91453L23958J28891
4324C8112981N21716n97898J69454K73245L28149J39506k23641J68595j88563
4315C8703544J93q94227q07823o15254j277415j853254j305682j724255r05670
4306B9320157j031228j641003j221360p58609j025089j073624p77477j074158
4298B0717609k98238p16324k36336l36899n55922r67701m93686M37550j045352
$$ plain form
4360 40878976 42212749 43154244 45106303 46646656 47824042 49432056 51228493 52498606
4352 52498606 53563405 54441901 55316736 55407287 55551543 55312584 54739077 54671476 54727851 53600523
4342 53600523 52792487 50948977 49785201 48596785 46219464 44992353 43682834 41881334
4334 41881334 40967366 40831105 39533163 38813713 38899758 38837976 38151585 37660132 37984090 38112981
4324 38112981 38634697 38036799 38206253 38479498 38807647 38947153 38723512 38892107 38703544
4315 38703544 38703737 37809510 37001687 36386433 35109018 33255764 31950082 30225827 29320157
4306 29320157 28288929 26647926 25426566 24667957 23642868 22569244 21791767 20717609
4298 20717609 20419371 19703047 19466711 19129812 18573890 17606189 17112503 17550053 16504701
4289A6504701p83088J36856l15505l50126K43886q63719l88420L13091j87669
4280A4310007l78804N82286M41355m07277l19987j14350o63607k4364R7330j09577
4270A3413012l76992J86819K86283p4981r37865n7962J39526j46663k69022N06873
4260A2669028k47131m07008M14074k80178k03981m89359k5797N35709N06427j76395
4250A2295389o10551J48241M49396m73405k47204K78802L31790k91748J82560
4241A2063270L64697r9495p82351K54205O30540j16008n61520O79339m06874k87726
4231A1738077k23637n17600M70841N75032l18318p24192J014566j46991L7247
4222A1905025l51333Q3383J52179o5178M04942L6592J60150L63003o06923l1772
$$ plain form
4289 16504701 15721613 15858469 15542964 15192838 15436724 14573005 14184585 14497676 14310007
4280 14310007 13931203 14513489 14954844 14547567 14227580 14113230 13449623 13425259 13522589 13413012
4270 13413012 13036020 13222839 13509122 13434141 12496276 12438314 12577840 12431177 12162155 12669028
4260 12669028 12421897 12014889 12428963 12148785 11944804 11455445 11429648 11965357 12471784 12295389
4250 12295389 11684838 11833079 12282475 11809070 11561866 11840668 12172458 11880710 12063270
4241 12063270 12427967 12328472 11546121 11800326 12430866 12314858 11753338 12432677 12025803 11738077
4231 11738077 11514440 10996840 11467681 12042713 11724395 11000203 12014769 11867778 11905025
4222 11905025 11553692 11637075 11789254 11724076 12129018 12165610 12325760 12688763 12081840 12050068
4212A2050068O83260l84942n2982k28711M12565o6335l79970m4860M79281l6843
4202A2430531p39038O05918O54506p3094k78542R5259j50596o10204O6159O35360
4192A2636259j49374J82105O06095p8503k57100r54462P52087L82585K94713r4752
4182A3319653l51602J13039R15059k11651q16083j50078j19499o6573P94533J42249
4172A3569047n29765N0487P12779J32344m26300k03657m8296k7403J66256L57232
4162A3752724N41408K081m27669Q7219k83522o7978j52451N02081K4556K37112
4152A4215561Q5067J4142m6102j43152R6130O6722J66663J98897o37431L91985
4142A4408482O04656l43866J89457j21374L17875O5527K15061P26370n50824l6751
$$ plain form
4212 12050068 12733328 12348386 12295404 12066693 12479258 12412923 12032953 11988093 12467374 12430531
4202 12430531 11691493 12297411 12951917 12878823 12600281 12695540 12544944 11934740 12000899 12636259
4192 12636259 12486885 12668990 13275085 13196582 12939482 11985020 12737107 13119692 13414405 13319653
4182 13319653 12968051 13081090 13996149 13784498 12968415 12818337 12698838 12632265 13426798 13569047
4172 13569047 13039282 13089769 13802548 13934892 13508592 13304935 13256639 13229236 13395492 13752724
4162 13752724 14294132 14296213 13868544 13955763 13672241 13604263 13451812 13953893 13978449 14215561
4152 14215561 14300628 14314770 14268668 14125516 14221646 14288368 14455031 14653928 14016497 14408482
4142 14408482 15013138 14669272 14858729 14737355 15055230 15120757 15335818 16062188 15511364 15474613
4132A5474613K51457N359p2684j90143N73520k66638K5572N17248m16044N70255
4122A6472515J43928j38948p31617N23299K85836l27662o3960O28164J5860K20259
4112A7027674k3994K30258J93053k01770J385299m60377j63096R02660N97367
4103A9487074l97417K92663J48439k05867P32015N15877k31930N5886O25126K27220
4093B1249086J57239L74593Q70071J50340P34701O25765M93434N59622J086250
4084B6301101M58482K40562J241969J144091Q71896Q53314J347697Q72483J463950
4075C4795545J596469J635205J368175J510800J257555R28421J316970O94598
4067D5103738j32097L65621J34532k88867j18991l31700r7298J60501k43740q5408
$$ plain form
4132 15474613 15726070 15731429 15658745 15468602 16042122 15775484 15801056 16318304 15902260 16472515
4122 16472515 16616443 16477495 15745878 16269177 16555013 16227351 16163391 16791555 16807415 17027674
4112 17027674 17003680 17233938 17426991 17225221 18610520 18150143 17987047 18889707 19487074
4103 19487074 19089657 19382320 19530759 19324892 20056907 20572784 20340854 20396740 21021866 21249086
4093 21249086 21406325 21780918 22650989 22801329 23536030 24161795 24655229 25214851 26301101
4084 26301101 26759583 27000145 28242114 29386205 30258101 31111415 32459112 33331595 34795545
4075 34795545 36392014 38027219 39395394 40906194 42163749 43092170 44409140 45103738
4067 45103738 44971641 45337262 45471794 45182927 45063936 44732236 44634938 44795439 44551699 44466291
4057D4466291O0977M55923M11722L88619L96553j26816Q78879R77600O54796J735532
4047E0300076J713996N70419R88371Q30510R21516R22054P82124M4583L28983
4038E7402632L77457p06116l14643o07704l73444k16082m55665j471681r28584
4029E2706170k69846j526646j904689n57914j515625j291217j330914q97926q78247
4020D2533146r33945q82079k90344o18135l58485j30739j0963j20891n147p1431
4010C9110987l34409j34529q41222N07241L71293j291708n29312l04762q65263
4001C5688316j452346j330248j019712j430183j234455r65789j061504j285383
3993B5908696j013403j183677k82755n58521q19144j092622l14865q72021l31844
$$ plain form
4057 44466291 44527268 44983191 45394913 45783532 46180085 46053269 46932148 47909748 48564544 50300076
4047 50300076 52014072 52584491 53572862 54403372 55324888 56246942 57029066 57073649 57402632
4038 57402632 57780089 57073973 56759330 56151626 55778182 55562100 55106435 53634754 52706170
4029 52706170 52436324 50909678 49004989 48447075 46931450 45640233 44309319 43411393 42533146
4020 42533146 41599201 40717122 40426778 39808643 39450158 39319419 39308456 39187565 39182418 39110987
4010 39110987 38776578 38642049 37800827 38308068 38679361 37387653 36858341 36553579 35688316
4001 35688316 34235970 32905722 31886010 30455827 29221372 28255583 27194079 25908696
3993 25908696 24895293 23711616 23428861 22870340 22051196 20958574 20643709 19771688 19439844
3984A9439844k06203p64656o37322j23448l68385J0631m23358n65313m36884j25419
3974A5799487q33990j79232L0214k06144m9640k99440L50092p56917K3746m87216
3964A3390960o50111M69382L37406o98117j13664L14314k86731J12285m40445
3955A2435279M974o0594j89831L21497m47712m60306J51087k05999l29249M1818
3945A1260964k74444l5037N98737j07504k6717K88532k45652m48133j41326K79955
3935A1149375R600n59866K62631Q55450K46284p36900q40734K42039M79756m27201
3925A0680434k01478N25949P4099j13012k14170j12233J85562j81522k01775N34151
3915A0976005J82861n5253P1679j77066k90174j53447r7009O13551j20724l92503
$$ plain form
3984 19439844 19233641 18468985 17831663 17708215 17339830 17350461 16927103 16361790 15924906 15799487
3974 15799487 14965497 14786265 14816479 14610335 14560695 14261255 14611347 13854430 13878176 13390960
3964 13390960 12740849 13210231 13547637 12849520 12735856 13050170 12763439 12875724 12435279
3955 12435279 12440253 12379659 12189828 12511325 12063613 11603307 11754394 11548395 11219146 11260964
3945 11260964 10986520 10951483 11550220 11442716 11415999 11704531 11458879 11010746 10869420 11149375
3935 11149375 11158975 10599109 10861740 11717190 11963474 11226574 10385840 10627879 11107635 10680434
3925 10680434 10478956 11004905 11079004 10965992 10751822 10639589 10825151 10643629 10441854 10976005
3915 10976005 11158866 11103613 11175292 10998226 10708052 10554605 10457596 11071147 10950423 10557920
3905A0557920Q79132l72650q47179J26823k88267K23470o3991K61653J29667j2635
3895A0593943n26494o4865M29394j4289m11018J53476M90840R5048n89121J78317
3885A0335231P54085k69932l97584j01196j47886N5602M29458J32182k31396n9130
3875A0499434L22107n34839J35404m3878k78078J02949L34520l95560l55404l4081
3865I752574K21391K15672l50310J83553k63309J01365m07333K56008j47155J70528
3855I732984K58646J5632M74469L13048k14568j99139m3568k26118M50597N78547
3845A1140530m8755m05818L25563N10645l51336r25778L35270K34366j74115K7367
3835A0667939J42183j69858k2151J66991L85820P7837O2183m51055Q01514J38806
$$ plain form
3905 10557920 11437052 11064402 10217223 10344046 10055779 10279249 10215258 10476911 10606578 10593943
3895 10593943 10067449 10002584 10431978 10417689 10006671 10160147 10650987 10746035 10156914 10335231
3885 10335231 11089316 10819384 10421800 10320604 10172718 10228320 10657778 10789960 10558564 10499434
3875 10499434 10821541 10286702 10422106 10378228 10100150 10203099 10537619 10142059 9786655 9752574
3865 9752574 9973965 10189637 9839327 10022880 9759571 9860936 9453603 9709611 9562456 9732984
3855 9732984 9991630 10007262 10481731 10794779 10580211 10381072 10337504 10111386 10561983 11140530
3845 11140530 11091775 10685957 11011520 11522165 11170829 10245051 10580321 10814687 10640572 10667939
3835 10667939 10810122 10640264 10618113 10785104 11170924 11248761 11310944 10859889 11661403 11800209
3825A1800209n19492N55467K3489M21556P47953K36314J022911n0962p082k12248
3815A4018115l32199q05386j65739m43288l70694l19896j24741l15154J86940
3806A1327958M58634p52902k83256J30811j77094j163934L43018N66069k20434
3797A0228870l34030m0559K55333J8555l24095N30392r3994j81701L04461M30734
3787A0793966p02338J26287m4931L94989J50253L40936k56236J04186k0717k57
3777A0886138J7563j4948J285473k63237j47015R8256L67176k46025J74919J3935
3767A2172235R26402l09949k79720J003967O53832k79272N17332P15979R2820
3758A5213626K13286j06751k77471o87467K26390m80657J44335m91809j08964
$$ plain form
3825 11800209 11280717 11836184 11859673 12281229 13029182 13265496 14288407 14237445 14230363 14018115
3815 14018115 13685916 12880530 12714791 12271503 11900809 11580913 11456172 11141018 11327958
3806 11327958 11786592 11033690 10750434 10881245 10704151 9540217 9883235 10449304 10228870
3797 10228870 9894840 9854281 10109614 10128169 9804074 10334466 10240472 10058771 10363232 10793966
3787 10793966 10091628 10217915 10172984 10567973 10718226 11059162 10802926 10907112 10886395 10886138
3777 10886138 10903701 10888753 12174226 11910989 11763974 11862230 12229406 11983381 12158300 12172235
3767 12172235 13098637 12788688 12508968 13512935 14166767 13887495 14404827 15120806 15213626
3758 15213626 15426912 15320161 15042690 14355223 14581613 14100956 14245291 13753482 13644518
3749A3644518Q66404r1802j63494M54894k63687j92062q4208l8745J14322O17350
3739A4863490L5947k78392L09656j66427p35019J61970Q01060o4835l21176L77384
3729A4983658L67034m83592O38520J60188J58979J48850l95781O85418N4540M76773
3719A6794587n8480r41984P56448O61923q46586N32197N14446K035j18577N00885
3709A7796894J79714j09812O69454p1230N90013N65981n5716N21508M10423N61983
3699B1059212k62373j25988R36184K79557O7254Q85630O74324K03356L51582j12359
3689B3956379O75729N73903L91043L37986P92484O85945M80959P11104J14693
3680B8720225Q60093M42644K87135P75803J185612M16557N86831K92726P79890
$$ plain form
3749 13644518 14510922 14419120 14255626 14710520 14446833 14254771 14170563 14131818 14246140 14863490
3739 14863490 14899437 14621045 14930701 14764274 14029255 14191225 14992285 14927450 14606274 14983658
3729 14983658 15350692 14867100 15505620 15665808 15824787 15973637 15577856 16263274 16317814 16794587
3719 16794587 16736107 15794123 16550571 17212494 16365908 16898105 17412551 17414586 17296009 17796894
3709 17796894 17976608 17866796 18536250 18465020 19055033 19621014 19565298 20086806 20497229 21059212
3699 21059212 20796839 20670851 21607035 21886592 21953846 22839476 23513800 23717156 24068738 23956379
3689 23956379 24632108 25206011 25597054 25935040 26727524 27413469 27894428 28605532 28720225
3680 28720225 29580318 30022962 30310097 31085900 32271512 32688069 33274900 33567626 34347516
3671C4347516P94264N39817J159977J43252Q84570K62218L40205K30181L88486
3662C9090486N99584J439360M83650J457951Q47123K69501J278624P18130O67136
3653D6851545J096250J015648O09517J097090J479370P11787J358512J001419
3645E5221138K95745J355826J747958J440727J892498J156514J688476K054958
3637F6853840K478455K392473J714077L234931L228829L646401L577624L475742
3629I0602372M477542M152578M096257N018821N331779N687870O337952O477502
3621A32182673P153353P523172P233642N967243O360424O269311O089868N758871
3613A84538557N243236M812623M106442K596834K014894J474882J49328R20923
$$ plain form
3671 34347516 35141780 35681597 36841574 36984826 37869396 38131614 38471819 38702000 39090486
3662 39090486 39690070 41129430 41613080 43071031 43918154 44187655 45466279 46184409 46851545
3653 46851545 47947795 48963443 49572960 50670050 52149420 52861207 54219719 55221138
3645 55221138 55516883 56872709 58620667 60061394 61953892 63110406 64798882 66853840
3637 66853840 69332295 71724768 73438845 76673776 79902605 83549006 87126630 90602372
3629 90602372 95079914 99232492 103328749 108347570 113679349 119367219 125705171 132182673
3621 132182673 139336026 146859198 154092840 160060083 166420507 172689818 178779686 184538557
3613 184538557 189781793 194594416 198700858 201297692 203312586 204787468 204936796 205857719
3605B05857719J770598K555972L089158M345767N179443N675180O622232P288354
3597B42384423O674373O071261O573419O516326N838859O180841O803649O505176
3589B93548327N524659L108519J200320P61577p95855j158940j835929k836285
3581B97516393l541410m539909p100246n886011l608510l057534k131900O8017
3573B67718890Q60696K992885M538588N497995N143569O247727N764736N051789
3565C03816875L570066K985476J455948m18053j194783k377532l678664m918368
3557B99240965n604809o577293n831959m346321k717724j774067j58036J446447
3549B73677203J875250M644938O302919O477390P144586O685797N299703L941856
$$ plain form
3605 205857719 207628317 210184289 213273447 217619214 222798657 228473837 235096069 242384423
3597 242384423 249058796 255130057 261703476 268219802 274058661 280239502 287043151 293548327
3589 293548327 299072986 302181505 303381825 304143402 303347547 302188607 300352678 297516393
3581 297516393 293974983 289435074 282334828 276448817 272840307 269782773 267650873 267718890
3573 267718890 268579586 271572471 276111059 281609054 286752623 293000350 298765086 303816875
3565 303816875 307386941 310372417 311828365 311410312 310215529 307837997 304159333 299240965
3557 299240965 293636156 287058863 281226904 276880583 274162859 272388792 272230756 273677203
3549 273677203 275552453 280197391 286500310 292977700 300122286 306808083 312107786 316049642
3541C16049642K466356J32055l06993N64322j13877k999450n081721p356066r070703
3532B94283565r296160p381641p070819p426500p545304q084259o986866o810156
3524B33681860o518373n018259l470302k532423j81322R97962M70013M13843l49722
3515B17493277r44806k428930m829505o672078o310649o969186p411436q142760
3507A73783927q519030q861336r029329q918592q183326p337912o476340o002966
3499A10455096n130938m739663m001509m310572m377057l916939j823197k826265
3491G9328956k950385j864670j673391k618485k170358j581803k200541k025361
3483F2243962k791188j366541j132897j443010j796891r02034j098347j047224
$$ plain form
3541 316049642 318515998 318648053 318341060 318905382 318791505 315792055 310710334 303354268 294283565
3532 294283565 284987405 277605764 270534945 263108445 255563141 247478882 240492016 233681860
3524 233681860 227163487 222145228 218674926 216142503 215961181 216959143 217429156 217842999 217493277
3515 217493277 216548471 214119541 209290036 202617958 196307309 189338123 181926687 173783927
3507 173783927 165264897 156403561 147374232 138455640 130272314 122934402 116458062 110455096
3499 110455096 105324158 100584495 96582986 92272414 87895357 83978418 82155221 79328956
3491 79328956 76378571 74513901 72840510 70222025 68051667 66469864 64269323 62243962
3483 62243962 59452774 58086233 56953336 55510326 53713435 52811401 51713054 50665830
3475E0665830j151798j206351q18258j368919r67400j015413r05262q12725p50214
3466D1669490p03710n72343n37875n97311l23179p31087n63878p1308n55209o8102
3456C6945488m29121j208488n05029R2593q30180j208364j212174r7545n66119
3447C0981061n47923p10677q5534n12893q73424j38511K11021q79612j263102
3438B6180406p8071J25508L52333o93590j35646n71648q83029p86878m91944K03613
3428B3221054q38191m77412j22796J88500o83403j137702n32732O52971m80845
3419A9789444j115543L73477l59975O9226m09830J99102o52649K50043k18055
3410A7925240k52536o1459J01540O124k54484m05434J49432k38783J23267M33870
$$ plain form
3475 50665830 49514032 48307681 47489423 46120504 45153104 44137691 43232429 42419704 41669490
3466 41669490 40965780 40393437 39855562 39258251 38935072 38203985 37640107 37568799 37013590 36945488
3456 36945488 36516367 35307879 34802850 34895443 34065263 32856899 31644725 31547180 30981061
3447 30981061 30433138 29722461 29636927 29124034 28250610 28112099 28323120 27443508 26180406
3438 26180406 26102335 26227843 26580176 25886586 25750940 25179292 24296263 23509385 23017441 23221054
3428 23221054 22382863 21905451 21782655 21971155 21287752 20150050 19617318 20270289 19789444
3419 19789444 18673901 19047378 18687403 18756629 18346799 18545901 17893252 18143295 17925240
3410 17925240 17672704 17611245 17712785 17718909 17464425 17058991 17208423 16969640 17092907 17526777
3400A7526777n93057n21182L03001j8289l24790p29215n97177m61602K62081K34562
3390A5081109p16659k66436n7108K65448r30338o8011L39977q83665m10960M83106
3380A2836463J77897n62954j87649p8998j28803m17367P02277K32472n66033k69789
3370A1737516O59290J75111p066n88901p80591N55390K21238M12061r03421K4372
3360A1504999K51033j013450K34114O10188m12871l84422L76328l24176k6997
3351A0814746J89341M75301r06337j33976l13624l70451O12439q08659J72432
3342I731212k05448L14325m31864j87154j21658n13253o109J063077l80681m86806
3332H775641J99695R0978L07270n84334J30286n52641N09882O49045p7279L78213
$$ plain form
3400 17526777 16933720 16412538 16715539 16697250 16372460 15643245 15046068 14584466 14846547 15081109
3390 15081109 14364450 14098014 14040906 14306354 13376016 13308005 13647982 12764317 12353357 12836463
3380 12836463 13014360 12451406 12263757 12184759 12055956 11638589 12340866 12573338 12007305 11737516
3370 11737516 12396806 12571917 12564851 11975950 11195359 11750749 11971987 12384048 11480627 11504999
3360 11504999 11756032 10742582 10976696 11586884 11174013 10789591 11165919 10841743 10814746
3351 10814746 11004087 11479388 10573051 10439075 10125451 9755000 10367439 9558780 9731212
3342 9731212 9525764 9840089 9408225 9221071 9099413 8586160 8580051 9643128 9262447 8775641
3332 8775641 8975336 9066314 9373584 8789250 8919536 8366895 8876777 9525822 9448543 9826756
3322I826756o04754k45860J97162j34887K7600J32263l254M7432n10209Q95800
3312I628049p38868m21174O24789q65540K51237k0213J15104k36991r2232O45768
3302H889929k04664n28271J65072k65517O04852N70655m62161j2832K47293M54694
3292I459050p05170l94954O39118k05265m64399K32636K3711O05939J5770k51762
3282H954674m07023m09025L79409J01992Q9999l00295p70712J134531M6010r30542
3272G889018k0964N07164N96471n22983L0742J77528o37125K62304p01193l3922
3262G547040O84981m78141j74128L89653J9876j42062k49305J57184j89436r8481
3252G467181K88109N34283o7q22198K47501L08059K44715n16535j32462L63798
$$ plain form
3322 9826756 9222002 8976142 9173304 9038417 9066017 9198280 9195026 9242458 8732249 9628049
3312 9628049 8889181 8468007 9092796 8227256 8478493 8458280 8573384 8336393 8244161 8889929
3302 8889929 8685265 8156994 8322066 8056549 8661401 9232056 8769895 8757063 9004356 9459050
3292 9459050 8753880 8358926 8998044 8792779 8328380 8561016 8584727 9190666 9206436 8954674
3282 8954674 8547651 8138626 8518035 8620027 8710026 8409731 7639019 8773550 8819560 7889018
3272 7889018 7868054 8375218 8971689 8448706 8479448 8656976 8019851 8282155 7580962 7547040
3262 7547040 8232021 7753880 7579752 7969405 7989281 7847219 7597914 7755098 7565662 7467181
3252 7467181 7755290 8289573 8289506 7467308 7714809 8022868 8267583 7751048 7618586 7982384
3242G982384j53913l46572J38833M33817R6554k27748J89061p3971K2313j82142
3232G878616L5551M05293j50529j59855m66470J58039L74085p54074P62077P0259
3222H152992n91331r6480P443l88800K57403J021l33698O93298M36222p71058
3212G367012L32515O91824j350051P3731P19084K64729p78594K42337Q5999o70166
3202F978420J72095J51377o03665J36113L06153m93564O0951J92279N43628l97380
3192G046407P8441L42138k93401M9743k632k39614J2626j16458M27520k82965
3182G021805N8949L74245N99131k1390p60578K73039K65072n88017j2778L42736
3172G552214r8479M7063J07323L42110q58945j2877J012771p03432K50594L42964
$$ plain form
3242 7982384 7828471 7481899 7620732 8054549 8151103 7923355 8112416 8038445 8060758 7878616
3232 7878616 7914167 8319460 8168931 8009076 7542606 7700645 8074730 7320656 8082733 8152992
3222 8152992 7561661 7465181 7472624 7083824 7341227 7342248 7008550 7701848 8138070 7367012
3212 7367012 7699527 8391351 7041300 7115031 7834115 8098844 7320250 7562587 7648586 6978420
3202 6978420 7150515 7301892 6698227 6834340 7140493 6646929 6707880 6900159 7443787 7046407
3192 7046407 7124848 7466986 7173585 7223328 7220696 6981082 6993708 6877250 7304770 7021805
3182 7021805 7080754 7454999 8054130 8032740 7272162 7545201 7810273 7222256 7209478 7552214
3172 7552214 7453735 7500798 7608121 7950231 7091286 7078409 8091180 7387748 7638342 7981306
3162G981306M54622o7607j39398N6920n23997K80871L83349l28870K23690K56707
3152H577593K49953R3688n10117Q23899l04054n79375Q87264m01677K80539O8136
3142I185849m5730J61268k76666M17195l33066K68075N29307j67021K75445M71898
3132A0486554k63702j01238n74439M60026L29669K86637l8663L96421N78700K0985
3122A1580950r48683R6259O56920J98643j05544n81764J13045J89395q7195j29210
3112A0982816K51659J27952Q75520n8594J76149K64450J58398K99204m40464K41353
3102A2878443K41807M43035k89347J82575K74572L20573P3564M49087p3162j11936
3092A4389211j47130J90811K93648l33810P33699k89267k02177O27219J35513
$$ plain form
3162 7981306 8435928 8368321 8228923 8285843 7761846 8042717 8426066 8097196 8320886 8577593
3152 8577593 8827546 8921234 8411117 9235016 8930962 8351587 9238851 8837174 9117713 9185849
3142 9185849 9140119 9301387 9024721 9441916 9108850 9376925 9906232 9739211 10014656 10486554
3132 10486554 10222852 10121614 9547175 10007201 10336870 10623507 10584844 10981265 11559965 11580950
3122 11580950 10632267 10728526 11385446 11584089 11478545 10896781 11009826 11199221 11112026 10982816
3112 10982816 11234475 11362427 12237947 12179353 12355502 12619952 12778350 13077554 12637090 12878443
3102 12878443 13120250 13563285 13273938 13456513 13731085 14051658 14125222 14574309 14501147 14389211
3092 14389211 14242081 14432892 14726540 14392730 15126429 14837162 14634985 15262204 15397717
3083A5397717M79542O73163L79211j9265M87233Q47350k61525O28290M64762Q9392
3073A9165870o9442n37796J18912L8122m49713J03554K5183K56733J88056P9308
3063A8918787P26534j85749K40325M74882Q2249K01280J52975K71055K44916R71190
3053B2098444O20015j81440L33503O22287K01235J42711N31603J095514R6975
3044B5560847K61790Q79370L27041N40959Q84439Q87749O63733O56121R03227
3035C1565276R98554Q95472P60468J548111J161416J214265O94634J481118J467387
3026D1786701J618513J650421J605740J609196K037735J936831J661947K092512
3018E5999596K185801K267507J844109L171721J796762K411130K835782K502654
$$ plain form
3083 15397717 15877259 16550422 16929633 16910368 17397601 18244951 17983426 18611716 19076478 19165870
3073 19165870 19096428 18558632 18677544 18715666 18265953 18369507 18394690 18651423 18839479 18918787
3063 18918787 19645321 19459572 19699897 20174779 20257028 20458308 20611283 20882338 21127254 22098444
3053 22098444 22718459 22537019 22870522 23492809 23694044 23836755 24368358 25463872 25560847
3044 25560847 25822637 26702007 27029048 27570007 28454446 29342195 30005928 30662049 31565276
3035 31565276 32563830 33459302 34219770 35767881 36929297 38143562 38838196 40319314 41786701
3026 41786701 43405214 45055635 46661375 48270571 50308306 52245137 53907084 55999596
3018 55999596 58185397 60452904 62297013 65468734 67265496 69676626 72512408 75015062
3010G5015062K340029K605369K815749K338541K413453K801063L676707K604108
3002I6610081K412984L132589L144373K575636K237639L013696K474424K489180
2994A18090602J876442K298044K702013J991721J651731K038634J816962K081967
2986A34548116J409957R31710J266883P44144R26386k38947O72637N07706j01859
2977A40666733P90447k68107n87857l27079m43330l21020r14395j313099r37996
2968A36344297j108627j346113j488798j506564j695653j734843k101264j889611
2960A23472824j669871j810442k098374k647660k611168k288563k365629k322771
2952A05658346k275934k251484k358278k028673j914418k634014k466077j977367
$$ plain form
3010 75015062 77355091 79960460 82776209 85114750 87528203 90329266 94005973 96610081
3002 96610081 99023065 102155654 105300027 107875663 110113302 113126998 115601422 118090602
2994 118090602 119967044 122265088 124967101 126958822 128610553 130649187 132466149 134548116
2986 134548116 135958073 136889783 138156666 138900810 139827196 139588249 140260886 140768592 140666733
2977 140666733 141457180 141189073 140601216 140274137 139830807 139509787 138595392 137282293 136344297
2968 136344297 135235670 133889557 132400759 130894195 129198542 127463699 125362435 123472824
2960 123472824 121802953 119992511 117894137 115246477 112635309 110346746 107981117 105658346
2952 105658346 103382412 101130928 98772650 96743977 94829559 92195545 89729468 87752101
2944H7752101j693153j940713k072511j898973k083312j999502j426427j774089
2936G2863421j668794j646635j916660k027240j822990j088056j579455j375643
2928E9737948p93835j555810j383843j013049j102142j423972k01794j260446
2920E1003057j175456j256388m68373q94024o12945k70728o05603j039580l12273
2911D4367687L51290k18331j66714j59003k40572o26901m4147Q56437M52721m17587
2901D4154880M91117K74960K15974N70665O84300K80371K77178L06487P58827
2892D8014759J073067J034900N35613P38386J546911J589965J00059J682171K279430
2883E8595261Q25991J374394J598039J475779Q73386J195687J178526Q44338J115373
$$ plain form
2944 87752101 86058948 84118235 82045724 80146751 78063439 76063937 74637510 72863421
2936 72863421 71194627 69547992 67631332 65604092 63781102 62693046 61113591 59737948
2928 59737948 58944113 57388303 56004460 54991411 53889269 52465297 52263503 51003057
2920 51003057 49827601 48571213 48102840 47208816 46595871 46325143 45719540 44679960 44367687
2911 44367687 44718977 44500646 44333932 44174929 43934357 43307456 43263309 44119746 44572467 44154880
2901 44154880 44645997 44920957 45136931 45707596 46391896 46672267 46949445 47255932 48014759
2892 48014759 49087826 50122726 50658339 51396725 52943636 54533601 54633660 56315831 58595261
2883 58595261 59421252 60795646 62393685 63869464 64742850 65938537 67117063 67961401 69076774
2874F9076774J564070J657549J286776J357819J439963J118645K399897K090572
2866H1992065J591878K855478K950158K104938K039970J823076J373221J253223
2858I7984007P07715P43161J578163K218732J101787K025059K191491K027430
2850A10577545K493048K978046L555509L297431L551344M084669M369184L388740
2842A38295516K380191L363274L662817M243618N016319N579869P186008P730633
2834A77458245P088636O525885N859533N274718L840094M255353L608880M535673
2826B18447017M089389M253857M041467M616470N090824O269188O706768O858517
2818B60373497P370099P805203R437096R714426J1617801J2453236J5443756J6371524
$$ plain form
2874 69076774 70640844 72298393 73585169 74942988 76382951 77501596 79901493 81992065
2866 81992065 83583943 86439421 89389579 91494517 93534487 95357563 96730784 97984007
2858 97984007 98691722 99434883 101013046 103231778 104333565 106358624 108550115 110577545
2850 110577545 113070593 116048639 119604148 122901579 126452923 130537592 134906776 138295516
2842 138295516 140675707 144038981 147701798 151945416 156961735 162541604 169727612 177458245
2834 177458245 184546881 191072766 196932299 202207017 206047111 210302464 213911344 218447017
2826 218447017 222536406 226790263 230831730 235448200 240539024 246808212 253514980 260373497
2818 260373497 267743596 275548799 284985895 294700321 306318122 318771358 334215114 350586638
2810C50586638J6553726J6178413J2981334Q008259L103623l21356j918540j550847
2802D03621250o85863n43070J40036J990383K606940K665739L225627K010953
2794D15031995J12234L65637O02660J38386n88901k063043l893431l530466m160058
2785D02015013l070192j968182j316971p62157j834506j963033k820793n463215
2777C82815964j0465528j4486321j7739744j6834756j5576569j3650730j1580267
2770B82482049j0306341q211091p390410o457619n674469n423125n131793n446952
2762B28440249m657177m990124m861289m659808n084167m154118m012082m195162
2754A91826322l475089m544319o005042p035510p588307p185676o384647n876968
$$ plain form
2810 350586638 367140364 383318777 396300111 404308370 407411993 407090637 405172097 403621250
2802 403621250 402935387 402392317 402532353 404522736 407129676 409795415 413021042 415031995
2794 415031995 415144229 415509866 416112526 416250912 415662011 413598968 409705537 406175071 402015013
2785 402015013 398944821 396976639 395659668 394897511 393063005 391099972 388279179 382815964
2777 382815964 372350436 357864115 340124371 323289615 307713046 294062316 282482049
2770 282482049 272175708 263964617 256574207 250116588 244442119 239018994 233887201 228440249
2762 228440249 223783072 218792948 213931659 209271851 204187684 200033566 196021484 191826322
2754 191826322 188351233 183806914 177801872 170766362 163178055 155992379 149607732 143730764
2746A43730764m482051l431304k708087k746125k740847l683709l962209m257216
2738A15719216l706315l811692k996410k867136k578422j855312r34765j443293
2730I5525871j541561j267232j825881r17381n19462k78489j145306j494982j937665
2721H4597912k465890l297405k034631k690186k097675j234291j355219j941044
2713F7481571j297483j425273j892754j522252j274437r36678j515335k09773
2705E7407586r32866k55520j230759j637399j742341j587481k68672j505177j651645
2696D6595726m83951n62225q40053p42332j043990L77311o59608o02876m70456
2687D1567546Q981O8792n70883l65322l59783J51800K53695n83299L75811k63076
$$ plain form
2746 143730764 139248713 135817409 133109322 130363197 127622350 123938641 119976432 115719216
2738 115719216 112012901 108201209 105204799 102337663 99759241 97903929 96969164 95525871
2730 95525871 93984310 92717078 90891197 89973816 89454354 89175865 88030559 86535577 84597912
2721 84597912 82132022 78834617 76799986 74109800 72012125 70777834 69422615 67481571
2713 67481571 66184088 64758815 62866061 61343809 60069372 59132694 57617359 57407586
2705 57407586 56474720 56219200 54988441 53351042 51608701 50021220 49752548 48247371 46595726
2696 46595726 46111775 45549550 44709497 43967165 42923175 43300486 42640878 42038002 41567546
2687 41567546 41576527 41645319 41074436 40709114 40349331 40501131 40754826 40171527 40547338 40284262
2677D0284262k39062K25498m0173m93735k9246K03876Q0568J61762K35681j00526
2667D0288905k8033M67687K40523K04236J52885K68543L52537K30985M39674K30024
2657D2847966Q97260N40081L57400M12236N96845N68194R60964O99822L20456
2648D8201224J335344P72458O62463P62106J838126K048907J093838J104703K220960
2639F0040129J259641J877735K021007J173446J854979J952828J754106J641838
2631G3575709J554658J333995R54962K326072J589793Q53461J242631J940452
2623H5371733J407064R11234J653507P85447O57980J574318N17980L02889Q39280
2614I4021432L17773M83929l87777P45643q8051L85863J199533j89609m63619
$$ plain form
2677 40284262 40045200 40270698 40230525 39736790 39707544 39911420 39991988 40153750 40389431 40288905
2667 40288905 40260872 40728559 40969082 41173318 41326203 41594746 41947283 42178268 42617942 42847966
2657 42847966 43745226 44285307 44642707 45054943 45651788 46219982 47180946 47880768 48201224
2648 48201224 49536568 50309026 50971489 51733595 53571721 55620628 56714466 57819169 60040129
2639 60040129 61299770 63177505 65198512 66371958 68226937 70179765 71933871 73575709
2631 73575709 75130367 76464362 77419324 79745396 81335189 82188650 83431281 85371733
2623 85371733 86778797 87690031 89343538 90128985 90786965 92361283 92879263 93182152 94021432
2614 94021432 94339205 94823134 94435357 95181000 95092949 95478812 96678345 96488736 96025117
2605I6025117P61756K82642L32830M81400j66413K44783J146425J529028l11037
2596A00326531J287885J600686J163740J496764J559441K319926K250927K529908
2588A14535808K941181L427506L386056L774729L695753M881921M816103M426240
2580A45885297N500601N380907M795526N118212N629066N006128M521800M795987
2572A86633524N423576M957325M838612M997442N358500M425734M902007N645372
2564B27182092M533992L779256M591294L648842L695329L097676K087823J836221
2556B54452525K415043J714354J663464K230332K456264K248918J148721K617422
2548B70947043K397505J495920J362016K536967K384855J121843J655226K036189
$$ plain form
2605 96025117 96786873 97069515 97402345 97883745 97717332 97962115 99108540 100637568 100326531
2596 100326531 101614416 103215102 104378842 105875606 107435047 109754973 112005900 114535808
2588 114535808 117476989 120904495 124290551 128065280 131761033 136642954 141459057 145885297
2580 145885297 151385898 156766805 161562331 166680543 172309609 177315737 181837537 186633524
2572 186633524 192057100 197014425 201853037 206850479 212208979 216634713 221536720 227182092
2564 227182092 231716084 235495340 240086634 243735476 247430805 250528481 252616304 254452525
2556 254452525 256867568 258581922 260245386 262475718 264931982 267180900 268329621 270947043
2548 270947043 273344548 274840468 276202484 278739451 281124306 282246149 283901375 285937564
2540B85937564J711106L78870O12638J625872J434366J394401K50126P06646J470662
2531B95522251l83899k63777M04031k30470o45203o68568j401616j366549j988453
2522B88977747k094758k030263k613022j910977k365763k469485l075617m104311
2514B68313551l501102k937818l481123l817656l439606l660858m150822l590837
2506B39733729m235558m571109m055835m151849l393467l471168l201679l060351
2498B09592713l113921j683859k242255k146653j635608r66205o78915q3392J61399
2489A97203304R33574J923907K869025K271496M040594N790638O395198O842832
2481B28270568P752040R973537J0397066R712679R913043Q718408P606502O686425
$$ plain form
2540 285937564 287648670 288027540 288640178 290266050 291700416 293094817 293344943 294051589 295522251
2531 295522251 295138352 294874575 295278606 295048136 294402933 293734365 292332749 290966200 288977747
2522 288977747 286882989 284852726 282239704 280328727 277962964 275493479 272417862 268313551
2514 268313551 264812449 261874631 258393508 254575852 251136246 247475388 243324566 239733729
2506 239733729 235498171 230927062 226871227 222719378 219325911 215854743 212653064 209592713
2498 209592713 206478792 204794933 202552678 200406025 198770417 197804212 197125297 197041905 197203304
2489 197203304 198136878 200060785 202929810 205201306 209241900 215032538 221427736 228270568
2481 228270568 236022608 245996145 256393211 266105890 276018933 284737341 292343843 299030268
2473B99030268M736735L070289J123714o5631j15792j589158j822836r96350j224098
2464C02147141j120146j379583k383814l398048l503195m952507p103293r236034
2456B69070521j0247152j1672707j1881668j2864820j2604995j2822587j1504507
2449A85472085j1097214r979235r486110q644667p452668o968227o762756o677572
2441A18403636n063401m782114m659120m680476l928999m055048l518739l766176
2433H3949563l561014l130293k812674k154025k801532k919102k193292k525723
2425F1851908k533917j727409j849531j503999j260912j948182j693895j261090
2417D8072973j046897r64762j103956j064106j172026j351502j003208k50858
$$ plain form
2473 299030268 303767003 306837292 307961006 307895375 307779583 306190425 304367589 303371239 302147141
2464 302147141 301026995 299647412 297263598 293865550 290362355 285409848 278306555 269070521
2456 269070521 258823369 247150662 235268994 222404174 209799179 196976592 185472085
2449 185472085 174374871 164395636 154909526 146264859 138812191 131843964 125081208 118403636
2441 118403636 113340235 108558121 103899001 99218525 95289526 91234478 87715739 83949563
2433 83949563 80388549 77258256 74445582 72291557 69490025 66570923 64377631 61851908
2425 61851908 59317991 57590582 55741051 54237052 52976140 51027958 49334063 48072973
2417 48072973 47026076 46061314 44957358 43893252 42721226 41369724 40366516 40115658
2409D0115658j084198j234173p56713r12117q5679j287603j076846j41420j454124
2400C2082785j172503m76657j65543q22185p52560p5051k44013r57696k43829
2391B7172748p41150r03282j14926o13737j76858Q2839l18662o56352p4308o33406
2381B3022906p02103J72187J23271o36711k53000n92218k26550o47086m52402
2372A9808294n54266q80106J55279O5574r17357Q786K29652m13898n15826k963
2362A6983169m34065j46927L67501k18376k26367p0072n91528o01485n1250l22009
2352A4688591j42145k23778Q01520j358102l9253L57958k80491j22095k69217
2343A3412988m68840j24579L64997q5139k79670m56631Q2641o08168j15682p3751
$$ plain form
2409 40115658 39031460 37797287 37040574 36128457 36042778 34755175 33678329 33536909 32082785
2400 32082785 30910282 30433625 30268082 29445897 28693337 28618286 28374273 27416577 27172748
2391 27172748 26431598 25528316 25413390 24799653 24622795 24705634 24386972 23730620 23656312 23022906
2381 23022906 22320803 22492990 22616261 21979550 21726550 21134332 20907782 20260696 19808294
2372 19808294 19254028 18373922 18529201 18594775 17677418 17686204 17915856 17501958 16986132 16983169
2362 16983169 16549104 16402177 16769678 16551302 16324935 16254863 15663335 15061850 15010600 14688591
2352 14688591 14546446 14322668 15124188 13766086 13726833 14084791 13804300 13682205 13412988
2343 13412988 12944148 12819569 13184566 13099427 12819757 12363126 12445767 11837599 11721917 11648166
2333A1648166j39480M48072J19790n38015p04675M0436l04653K8270M09192k56280
2323A0750823M05562K23266r5953p29435o1734k07077j66128J90797L73141q1000
2313A0602262l373j98367q02452j34094K45093k51364p84272L6433N69835k97168
2303H982533O30983k67086o52517r0161M7680P54606j22789K47865l31404J05001
2293I304711P0570q16746k22044J65865L61295Q0561l56793J43522l14108N9036
2283H475869k11156k92545L34323L1972l57526K86340J27923m10252k96326K58744
2273G947366j09833O9585N91116O5702J43142N8753l38971j89706j75274M45401
2263H507281o14375N38185N36721l93359J46340L74959m41911k48720M573L0554
$$ plain form
2333 11648166 11508686 11956758 12076548 11538533 10833858 10874294 10569641 10597911 11007103 10750823
2323 10750823 11156385 11379651 11283698 10554263 10492529 10285452 10119324 10310121 10683262 10602262
2313 10602262 10598889 10400522 9598070 9463976 9709069 9457705 8673433 8709866 9279701 8982533
2303 8982533 9613516 9346430 8693913 8603752 8651432 9406038 9283249 9531114 9199710 9304711
2293 9304711 9375281 8558535 8336491 8502356 8863651 8944212 8587419 8730941 8416833 8475869
2283 8475869 8264713 7972168 8306491 8338463 7980937 8267277 8395200 7984948 7688622 7947366
2273 7947366 7837533 7907118 8498234 8563936 8707078 8765831 8426860 8237154 8061880 8507281
2263 8507281 7892906 8431091 8967812 8574453 8720793 9095752 8653841 8405121 8409694 8440248
2253H440248M51321N9318K23833o6155M03169l53596j35621m11852J20494J66137
2243H897296J22677N73919m97921N2820o5436j74000M2125L34946N93160m51029
2233I428557K09530J9532m71339N636l5636N82662r4253J07626J5804J31043K32761
2222A0131923n47574N92232K31792m38984M38725M38599K40191J98072K42598
2213A1527574O99855p24944K29464K96192J87313k84070K91112M25730P33600
2204A3381826O00793R0985m00089Q33375K15951j86787P30650J34122P35229j20454
2194A6015601M6707n0653l67262l06911n80924o82140l26999k70216r9722l49859
2184A3027622o84126L31612M55452k83559l85995K47481j35816j32671J14681
$$ plain form
2253 8440248 8891569 8950887 9174720 9108565 9511734 9158138 9022517 8610665 8731159 8897296
2243 8897296 9019973 9593892 9095971 9148791 9083355 8909355 8951480 9286426 9879586 9428557
2233 9428557 9638087 9657619 9186280 9191916 9156280 9738942 9644689 9752315 9768119 9899162 10131923
2222 10131923 9584349 10176581 10408373 9969389 10408114 10846713 11086904 11284976 11527574
2213 11527574 12227429 11502485 11731949 12028141 12215454 11931384 12222496 12648226 13381826
2204 13381826 13982619 14073604 13673515 14506890 14722841 14536054 15266704 15400826 16136055 16015601
2194 16015601 16062308 16011655 15644393 15337482 14756558 14074418 13747419 13477203 13377481 13027622
2184 13027622 12343496 12675108 13130560 12847001 12461006 12708487 12572671 12440000 12554681
2175A2554681j49907L89851J18487L14039M99151N57408Q29131N16273M21090
2166A6050204J149834J054675n69921j393163j324181j297219r78769n35081n23131
2157A1633248l7392l62658l57883N93881k62335j84369q39170K55387L927n22269
2147I920367J26387m07482J25166K06321j07689j59673N36733L03234J09074O28833
2137A1281271J557475O44140N77502r93987j868651j162700r90509o59883k97314
2128H087344K33286n47083l64733o20747J25014m54667k07529j1870N12635p43830
2118F007820l16221J53822R729n54296n19736l17815L67869n6465M0945k42032
2108D573620m8329L306k54749M55024m9199j64803M76650l8400j56366J53157
$$ plain form
2175 12554681 12404774 12794625 12913112 13227151 13726302 14283710 15112841 15629114 16050204
2166 16050204 17200038 18254713 17684792 16291629 14967448 13670229 12691460 12156379 11633248
2157 11633248 11595856 11233198 10875315 11469196 11206861 11022492 10183322 10438709 10442636 9920367
2147 9920367 10046754 9639272 9764438 9970759 9863070 9703397 10240130 10543364 10652438 11281271
2137 11281271 12838746 13482886 14060388 13066401 11197750 10035050 9044541 8384658 8087344
2128 8087344 8320630 7773547 7408814 6788067 6913081 6458414 6250885 6239015 6751650 6007820
2118 6007820 5691599 5845421 5855150 5300854 4781118 4463303 4831172 4774707 4815652 4573620
2108 4573620 4525291 4528597 4273848 4728872 4679673 4514870 4991520 4953120 4796754 4949911
2098D949911p62248K66553m57546l88316J07533L55374j14893K65068K79773k60091
2088D241118j36862K93790q18942j6178K9809m66036O65329N0899k7852j71615
2078C643460j19243k6159m27588k18714j17169O06275N33500k96361n24044m79991
2068B573966L12989J17620n90245O01045m95239J74378K09931p5759m0517l75676
2058B412493L37390n4925n06979N80839M39889p0119l57231l45796L04817j3340
2048B727038R7982p43183K64077M63610P9465n14570j79319J23883n06798L33620
2038B145805L58610l9586K21735L1978p13333J1493L91539l28505k12343O48148
2028B515541o76332N14466j28026k94628j54742k42731J4666J78022J42970K80973
$$ plain form
2098 4949911 4187663 4454216 3996670 3608354 3715887 4071261 3956368 4221436 4501209 4241118
2088 4241118 4104256 4398046 3579104 3562926 3592735 3126699 3792028 3842927 3815075 3643460
2078 3643460 3524217 3498058 3070470 2851756 2734587 3340862 3874362 3578001 3053957 2573966
2068 2573966 2886955 3004575 2414330 3015375 2520136 2694514 2904445 2828686 2788169 2412493
2058 2412493 2749883 2694958 2187979 2768818 3208707 3138588 2781357 2435561 2740378 2727038
2048 2727038 2825020 2081837 2345914 2809524 2888989 2374419 2195100 2318983 1812185 2145805
2038 2145805 2504415 2464829 2686564 2718542 2005209 2016702 2408241 2079736 1867393 2515541
2028 2515541 1839209 2353675 2225649 1931021 1776279 1533548 1548214 1726236 1869206 2150179
2018B150179J13354l09844Q5101k77972K65612k03822j212l18863O87430q8636
2008B101327n85913K63643J93019Q9360j63037n21993K02526K04674L43877l59169
1998A768314n98828P12373J40652l16532p0977J28697J50574O1022j32566J13322
1988A956051l5724J40010j12073L80585k95565o5617N67457p89763n63158J20305
1978A302508K24945r7990j46117j30688J34117k00810M0643j94524O10880J16762
1968A659726n7880m41785O56607l29408l27121Q82331l50557m93541P02429R7283
1958A998084M12891k93844m32342M10198o50080J79916M979k91911N78095k21330
1948A694656k63633L36383J16794j038700N85212N33684p53965k26052J24153
$$ plain form
2018 2150179 2263533 1953689 2038790 1760818 2026430 1822608 1821396 1502533 2189963 2101327
2008 2101327 1515414 1779057 1972076 2061436 1898399 1376406 1578932 1783606 2127483 1768314
1998 1768314 1169486 1881859 2022511 1705979 1635002 1763699 1914273 1975295 1842729 1956051
1988 1956051 1920327 2060337 1948264 2328849 2033284 1967667 2535124 1745361 1182203 1302508
1978 1302508 1527453 1429463 1283346 1152658 1286775 1085965 1126608 932084 1542964 1659726
1968 1659726 1601846 1160061 1816668 1487260 1160139 2042470 1691913 1198372 1900801 1998084
1958 1998084 2410975 2117131 1684789 2094987 1444907 1624823 1629802 1337891 1915986 1694656
1948 1694656 1431023 1767406 1884200 845500 1430712 1964396 1210431 984379 1108532
1939A108532K69204L72159j19415j51399P753K23130P04842j128505K70609R26665
1929B483575o7352o77991n15037N3085O71936o90290r9611K22814M76794j71577
1919A686346l5050k84887K01117P4782J3008K89231m49491j76182N94390m070
1909A909194o19027M86203L42866N25820M1042j005170K56558N86387o59018m3512
1899A821343J040502m63337n06135j1556L24541r7620n63518N24764J30364l98606
1889A800742J53833j25292o11539J87531k1569l82565J34281J94166M79018J33948
1879A942554n65336J37432M88112l49566j78060l71532K928J287185N66342n70998
1869B389061p38497P7170P62587p94902k72242M07403M9357q4197j47765M07309
$$ plain form
1939 1108532 1377736 1749895 1630480 1479081 1486834 1709964 2414806 1286301 1556910 2483575
1929 2483575 2416223 1738232 1223195 1276280 1948216 1257926 1158315 1381129 1857923 1686346
1919 1686346 1651296 1366409 1567526 1642308 1655316 1944547 1495056 1318874 1913264 1909194
1909 1909194 1290167 1776370 2119236 2645056 2686098 1680928 1937486 2523873 1864855 1821343
1899 1821343 2861845 2398508 1892373 1880817 2205358 2107738 1544220 2068984 2199348 1800742
1889 1800742 1954575 1829283 1217744 1405275 1383706 1001141 1135422 1329588 1808606 1942554
1879 1942554 1377218 1514650 2002762 1653196 1475136 1103604 1106532 2393717 2960059 2389061
1869 2389061 1650564 1727734 2490321 1695419 1423177 1830580 1879937 1795740 1647975 2055284
1859B055284K22952m9853o50972m27024J88550M44227N85930k81480k81056L90315
1849B196873j112965K42566Q73236n59040J19997j42623j15641N00055o79105
1840A323353j72924K50851L10924o05163J25326N48319J11887L23034k72573K05945
1830B148979Q7302o85090K88405p4931k67778M01413K31064j16292k14610j99882
1820A598580L53032L25718n79441k31671n1499N35209j19892m38769k40831L60333
1810A510769L37724l15385j12606Q0655m7515j72406O50333k30739l81297j03378
1800A216155J175867n16823m90958L39725k44761k07562K30956J84900j11997
1791A575502l63443K79449Q5867j57142l6400j83392L04277J05118m93468k10422
$$ plain form
1859 2055284 2278236 2228383 1577411 1150387 1338937 1783164 2369094 2087614 1806558 2196873
1849 2196873 1083908 1326474 2199710 1640670 1760667 1618044 1502403 2002458 1323353
1840 1323353 1150429 1401280 1712204 1107041 1232367 1780686 1892573 2215607 1943034 2148979
1830 2148979 2236281 1551191 1839596 1764665 1496887 1898300 2129364 2013072 1798462 1598580
1820 1598580 1951612 2277330 1697889 1466218 1414719 1949928 1830036 1391267 1150436 1510769
1810 1510769 1848493 1533108 1420502 1501157 1453642 1281236 1931569 1700830 1319533 1216155
1800 1216155 2392022 1875199 1384241 1723966 1479205 1271643 1502599 1687499 1575502
1791 1575502 1212059 1491508 1577375 1420233 1383833 1200441 1504718 1609836 1116368 905946
1781I05946O91349O6789l98338k38660j33515K57722M81474p82417N08821P80464
1771B139635l99071k12746J01218q82363K01432O23835k22659m29475k63474M14736
1761A071068L94572n69641j55773K82606J11818r227l1564j78133M39002J09658
1751A464386r47901N1641O27043m56771m31329P43078p35999k91887P10896p0183
1741F62974o93796K34453L45889l91280O90359M71052o44915K34907j28836k90844
1731D89963L90523J42050n89778J27671O56617k06007K33731l64142m94765M96327
1721H82190K938j48273J19430k18250O12361k13395j89851j85256l16283N09275
1711H54886k46536j14012P25318K34339o63395r31653J110375j07432j99582L61454
$$ plain form
1781 905946 1597295 1664084 1265746 1027086 893571 1151293 1632767 850350 1359171 2139635
1771 2139635 1740564 1527818 1629036 746673 948105 1571940 1349281 919806 656332 1071068
1761 1071068 1465640 895999 740226 1022832 1134650 1125423 1093859 915726 1354728 1464386
1751 1464386 516485 568126 1195169 738398 307069 1050147 314148 22261 733157 662974
1741 662974 -30822 203631 549520 158240 848599 1319651 674736 909643 780807 489963
1731 489963 880486 1022536 432758 560429 1217046 1011039 1244770 880628 385863 882190
1721 882190 885128 736855 856285 638035 1250396 1037001 847150 661894 345611 854886
1711 854886 608350 494338 1219656 1453995 790600 -141053 969322 861890 662308 1023762
1701A023762l30601l18240L01792J98880n9863o76212O08584R5906j42709M8324
1691G49623m22895o6932k64908R8572K48192L86520l97696n55749Q07956L5720
1681F18403q17377M78438J98525j08240K7728M91945m32354j86738n1584k95735
1671g6989M52254K54312o10238N76668L32027q14199L17597O4813J0252n18417
1661a1920J17470O62593O11269l86886q82645J06024K99511j14449J99170l94305
1651B05832l47149L16920k16733K11157J06708k89093l78966K5589J07893Q18061
1641E60219k08319o0593j97299L58580o1536J45331m01879l33713N69515O38482
1631A008788n52653L25371j40995m29650l15238N36740O30764j159186M09423
$$ plain form
1701 1023762 693161 374921 676713 875593 815730 139518 748102 844008 701299 749623
1691 749623 326728 259796 -5112 93460 341652 728172 330476 -225273 582683 618403
1681 618403 -198974 279464 477989 369749 397477 889422 457068 270330 218746 -76989
1671 -76989 375265 629577 19339 596007 928034 113835 431432 496245 506497 -11920
1661 -11920 105550 768143 1379412 992526 109881 215905 515416 400967 600137 205832
1651 205832 -141317 175603 -41130 170027 276735 -12358 -391324 -365735 -257842 560219
1641 560219 351900 291307 94008 452588 391052 536383 134504 -199209 370306 1008788
1631 1008788 456135 781506 640511 210861 -104377 432363 1063127 -96059 313364
1622C13364J95081n75353O72679n1413o11085L89120M49455j56500o43487J11635
1612I3496l24166l29709M24610J67309k13929M87463K59608n28706M28075K10638
1602F74689m56185K5867Q3499m91138K37710P70769n69086l64785K28450j72769
1592c2979J9352N3306L94211k82406l5546M39852j26749l90493N82815l64215
1582B57148K7806M67450n60940k44886M27825M24252l65670M36959K10321j454580
1572c74315L17930L99177n5096J38464M7803J79862j96254J63616j98965l98242
1562B3980K70161N2288n71037J97856L71781k27251j173440Q87131N37758q6596
1552B82631m89407K68791k37022K30641J13773K35702j12679L14267J01061K15969
$$ plain form
1622 313364 508445 -66908 605771 554358 -56727 332393 781848 625348 -18139 93496
1612 93496 -230670 -560379 -135769 31540 -182389 305074 564682 35976 464051 674689
1602 674689 218504 244371 327870 -163268 74442 845211 276125 -88660 139790 -32979
1592 -32979 -13627 39679 433890 151484 115938 555790 429041 38548 621363 257148
1582 257148 284954 752404 191464 -53422 374403 798655 432985 869944 1080265 -374315
1572 -374315 -56385 342792 287696 426160 473963 653825 457571 621187 422222 23980
1562 23980 294141 346429 -224608 -26752 345029 117778 -1055662 -168531 369227 282631
1552 282631 -206776 62015 -175007 55634 169407 405109 292430 606697 707758 923727
1542I23727q8634k21912Q4955l43212j87351j7743j43673O03475j99390l79662
1532C0580O1842M47580n9972k94178J09455j14134N23013j05409q7347m3916l66259
1521A01255k33389L60440L78807K62846J95782l20905K74054o03457K27607Q801
1511F51841m16155J48181P7828K66530p43196n3138j6596O400K09131J6709k00246
1500e2711M5989L33159M19660m50722L18138q8978n12557n503L63219j51381j05404
1489A12909K35053k86298l56908O49158J1814o9714j31509j30588M93676j97369
1479C30224n5274m12518l17560P36187m1527m30809J077K62422J90378j49246
1469A13354L9980J33351n85227M51905K55342k47448l6863P8278q9156r5383J74102
$$ plain form
1542 923727 835093 613181 698136 354924 167573 149830 6157 609632 410242 30580
1532 30580 92422 540002 480030 185852 295307 181173 704186 598777 511430 467514 101255
1521 101255 -132134 228306 607113 869959 1065741 744836 1018890 415433 643040 651841
1511 651841 235686 383867 461695 728225 -14971 -68109 -84705 -78305 130826 147535 -52711
1500 -52711 -6722 326437 746097 295375 613513 524535 11978 6475 369694 218313 112909
1489 112909 347962 61664 -295244 353914 365728 296014 164505 33917 527593 330224
1479 330224 274950 -137568 -455128 281059 239532 -191277 -190200 72222 262600 113354
1469 113354 153334 286685 -298542 153363 408705 161257 124394 202672 113516 18133 192235
1458A92235J1598j95525K72597k98159L05725J86876n02827j63455L83988J04686
1448B97739m29780j56957N56312J70509o95563k33430P6078Q10160m4085j7702
1438C33281n80823M7848Q36762n41208M1008L09926j01981J25412K02382j30056
1428E42551p77652j78096N31382j8493O12475k37637J18270l51575j43867j01789
1418d431m14873P44209m13580o69199J548517l0177o25895N16257r5162m28410
1408A27256l04584J15910l6064r8101N41181k07767j5340J09138l76564l8010
1398a82945q5317L40984J70796j23013j94604K60994K19210L6432l32756o67398
1388e57617j18332J210903J17823k49587j49859k13137J76462k54870p44063K0394
$$ plain form
1458 192235 203833 8308 280905 -17254 288471 475347 -27480 -190935 193053 297739
1448 297739 -132041 -288998 267314 437823 -257740 -491170 -415092 395068 350983 333281
1438 333281 -247542 -199694 637068 95860 136868 446794 344813 470225 672607 542551
1428 542551 -235101 -413197 118185 99692 712167 474530 592800 241225 97358 -4431
1418 -4431 -419304 324905 -88675 -757874 790643 760466 134571 650828 555666 127256
1408 127256 -177328 -61418 -97482 -195583 345598 137831 122491 231629 -144935 -182945
1398 -182945 -268262 72722 243518 120505 -74099 186895 406105 442537 109781 -557617
1388 -557617 -675949 534954 652777 403190 253331 40194 216656 -38214 -782277 -761883
1378g61883L59313Q61216j45865J2262k22815O45313p06725j48242Q5083M37254
1368D14911m01493M92485J66805q20820r8456K08352J36666p41037l1118J96733
1358d76972N95441N92634l13182o88532L0927M36483r0626n21950K2903O84835
1348B71961O1739M92945Q7043j118885r5527L6563M01557j22074l35414N69761
1338B49669m3707n72219P6989K32762L1270J06243k59656l20092N33600J29713
1328A64572n46l6390l43724O33491K07090l45839M9717k2278K00126R4457k23251
1317C77425l31487Q6269J04472K23446n82246N19046P7142l94107l10216M08428
1307A78172j6276k32316k28018J04711Q1515l4812p7641K7334J15599K6616q1320
$$ plain form
1378 -761883 -402570 458646 312781 325043 102228 747541 40816 -107426 -22343 414911
1368 414911 13418 505903 672708 -148112 -246568 -38216 98450 -642587 -673705 -476972
1358 -476972 118469 711103 397921 -290611 -259684 176799 86173 -435777 -412874 271961
1348 271961 333700 826645 913688 -205197 -300724 -264161 137396 15322 -320092 249669
1338 249669 205962 -366257 -289268 -56506 -25236 81007 -178649 -498741 34859 164572
1328 164572 164026 127636 -216088 417403 624493 278654 328371 306093 506219 600676 377425
1317 377425 45938 132207 236679 460125 -122121 396925 474067 79960 -230256 178172
1307 178172 161896 -70420 -298438 -193727 -112212 -147024 -224665 -197331 -81732 -55116 -136436
1296a36436m58097N52323O83235o27835l43716k37146P79198M4416L8831K25561
1286E20334p8211J95966J53757l37197o15528L32059J09074j585N53091K5261
1276H57021n27305n13781O95761L99849k71276L71640M24888l74451j587L50685
1266A411444q78246k81942M53401K61229j33805m42927L2731l93474p5781K26439
1256A79069l22457K53365N86347p44807K20722M77335K40484k14906l65611m07266
1246i7725k88262N83786L17241l47851k21840M03974J59819K2008o25876J30899
1236C6173M95987M78919p37284m23550M2419L14107M69275l59527l00621K76176
1226B92074J45266p1507o56868L17570K90965J56692P4051M71264p97513R8083
$$ plain form
1296 -136436 -594533 -42210 641025 13190 -330526 -567672 211526 255942 294773 520334
1286 520334 442123 638089 791846 454649 -160879 171180 280254 278669 831760 857021
1276 857021 329716 -184065 511696 911545 640269 1011909 1436797 1062346 1060759 1411444
1266 1411444 533198 251256 704657 965886 832081 389154 421885 28411 -47370 179069
1256 179069 -143388 109977 696324 -48483 172239 649574 890058 675152 309541 -97725
1246 -97725 -385987 197799 515040 167189 -54651 349323 509142 531150 -94726 36173
1236 36173 532160 1011079 273795 -149755 -107336 206771 676046 316519 15898 292074
1226 292074 437340 365833 -291035 26535 317500 474192 548243 1019507 221994 320077
1216C20077K25469l48144J46867o495K9323J89471m43408J57630m00317N25998
1206C96471N84756m65718q01810J83738M28432K36732L75646k21751n99665q0483
1196C6348j9851R913m1201j89396P82564O84068n84101p35115J86457N33385o12685
1185E0386k45387L64778J75035L92082m44761P2089m7051j12880P0225l42747
1175f8231k60135N04554O31490m70522J35788K42898q54157k3995O53313m90073
1165I30k46811N58055M06317K33879m71321j76107j83471k70586K68856J98588
1155C18329k58131P16109M7935p72671o1708Q88774l49350r7304r2405K99555
1145F39133j16853o5523L99036m45996l01882N25455l84843K56364q2285K11048
$$ plain form
1216 320077 545546 197402 344269 337774 367097 556568 113160 270790 -129527 396471
1206 396471 981227 515509 -286301 -102563 325869 562601 938247 716496 116831 36348
1196 36348 16497 26410 -14791 -204187 578377 1262445 678344 -56771 129686 663071 50386
1185 50386 -195001 169777 344812 736894 292133 364222 317171 204291 274516 -68231
1175 -68231 -328366 176188 807678 337156 472944 715842 -138315 -162310 491003 930
1165 930 -245881 312174 718491 952370 481049 304942 121471 -149115 119741 318329
1155 318329 60198 776307 824242 51571 -10137 878637 529287 431983 339578 639133
1145 639133 522280 456757 855793 409797 107915 633370 248527 504891 422606 633654
1135F33654N00448p5180n76753l25008L04685j65191o7040N85918l0333Q8997
1125H74197p2726P9008M95698n04803n71249Q5016j1923M55073m10768M13453
1115H30976K59624p58822O46679K40376p3916j15899M40450M34444o65959K74339
1105A512292p4564m08300O5543j72309J84434k03493M47693K07358o78949R8451
1095I78156M00805k31764J89173K17072r9922l7933l5371R3615n33453M77451
1085A417829L17186N0736L27622K9023l96625j40365M56777K18010n15720M22740
1075B187213N02301k25054n65315J48286N96345J7061o96702K54461J25683j68537
1065B175742J68158J19838J95576q14237L31572N3163k084l88737J081863J59726
$$ plain form
1135 633654 1134102 1058922 482169 157161 461846 296655 229615 815533 785200 874197
1125 874197 801471 880479 1376177 871374 300125 385141 373218 828291 417523 830976
1115 830976 1090600 331778 978457 1218833 1144917 1029018 1469468 1903912 1237953 1512292
1105 1512292 1437728 1029428 1094971 922662 1107096 903603 1351296 1558654 879705 978156
1095 978156 1378961 1147197 1336370 1553442 1453520 1415587 1380216 1473831 940378 1417829
1085 1417829 1735015 1785751 2113373 2142396 1745771 1605406 2062183 2280193 1764473 2187213
1075 2187213 2689514 2464460 1899145 2047431 2643776 2660837 1964135 2218596 2344279 2175742
1065 2175742 2343900 2463738 2659314 1845077 2176649 2229812 2227728 1838991 2920854 3080580
1055C080580J89341p4527J06288L38667N47060k30572l19671K05692J22523n8662
1045C906719O1094K60849M09309o14177L60057M69084l32285k63488Q62760l52159
1035D767763l00429M79059L04873O7940p7259N23467K52010J99827J25588P0678
1025F413517O83342M08407M59778j11668J39848J079919l13822J56391O74553
1016I590265L90992J98070K70019R63605Q01092K20056J015581N74146N92865
1007A4616691J602472J102660J639844J481695J684075K129377K591158K081113
999B8929085O99097J301233J905833K963692L630816L885474M924319N322535
991E3562084Q146722J0831833J3085406J7013268K0937800K6044620K6737065
$$ plain form
1055 3080580 3269921 3195394 3301682 3640349 4187409 3956837 3637166 3842858 3965381 3906719
1045 3906719 3967813 4228662 4637971 4023794 4383851 4852935 4520650 4257162 5119922 4767763
1035 4767763 4467334 4946393 5251266 5319206 5241947 5765414 6017424 6217251 6342839 6413517
1025 6413517 7096859 7505266 7965044 7853376 7993224 9073143 8759321 8915712 9590265
1016 9590265 9981257 10179327 10449346 11412951 12214043 12434099 13449680 14023826 14616691
1007 14616691 16219163 17321823 18961667 20443362 22127437 24256814 26847972 28929085
999 28929085 29628182 30929415 32835248 35798940 39429756 43315230 48239549 53562084
991 53562084 61708806 72540639 85626045 102639313 123577113 149621733 176358798
984A76358798k963343l6772864l2861963k0879704j3590890j0090696q199476
977E0999862n976619n177697n177060l081436j865962k010179j677847j339643
969B4693419r21220j042865k424575j730385q07005j498779j423329M49075r13746
960A4380590j275131n92927k77413m37898j046025m03267j67093o03899k42107
951I334830n49816k28952K7775p16871o40312J2627K91104n85176q33631K24271
941F335849L98986m23643m91377N98735j17185j157296j16611k79167l38184Q3569
931D493676l84178K1683O8036j89099L11029j59319n04630M0142Q1327L09034
921D087701m23863j18685l36317N1875J86901o97985L02744j10232n03612N61307
$$ plain form
984 176358798 173395455 136622591 103760628 82880924 69290034 59199338 50999862
977 50999862 45023243 39845546 34668486 31587050 29721088 27710909 26033062 24693419
969 24693419 23772199 22729334 20304759 18574374 17767369 16268590 14845261 15294336 14380590
960 14380590 13105459 12512532 12235119 11797221 10751196 10347929 10180836 9576937 9334830
951 9334830 8785014 8556062 8583837 7866966 7226654 7239281 7530385 6945209 6111578 6335849
941 6335849 6734835 6311192 5819815 6418550 6301365 5144069 5027458 4748291 4410107 4493676
931 4493676 4109498 4131181 4199217 4010118 4321147 4161828 3657198 3697340 3778667 4087701
921 4087701 3663838 3545153 3208836 3260711 3447612 2749627 3052371 2942139 2438527 2999834
911B999834k71509k14631n4366L10256q9724n49395j58411k45553o5540M62156
901B123117j00969n26483M05314K45972M53942q62498O9049M44376J35889k03769
891B183940j41510L11331l36145j080412L94588K51353n20199J70387M81064M517
881A718914k13708m62304Q4819m16556r4658q6741N32557P57361j015166K27477
871A031995J12317l34640L73593l65108j20612j85233K4810K97102L51236n6148
861A129312r75719N48196J35014p00921M11244L18369K40067j3754m17612q7571
851E86625j60116k24003p9950n25675M51867J03914O48991n75240J46767Q70467
841A243647k77224n01885j85005P6238M92094Q1819j38188p71440K89896L26220
$$ plain form
911 2999834 2728325 2513694 2459328 2769584 2679860 2130465 1972054 1726501 1660961 2123117
901 2123117 2022148 1495665 1900979 2146951 2600893 1738395 1807444 2251820 2387709 2183940
891 2183940 2042430 2353761 2017616 937204 1331792 1583145 1062946 1233333 1714397 1718914
881 1718914 1505206 1042902 1127721 711165 616507 529766 1062323 1819684 804518 1031995
871 1031995 1144312 809672 1183265 818157 697545 512312 537122 834224 1185460 1129312
861 1129312 153593 701789 836803 135882 547126 865495 1105562 1091808 674196 586625
851 586625 426509 202506 122556 -403119 48748 152662 801653 226413 373180 1243647
841 1243647 966423 464538 279533 355771 847865 929684 791496 20056 309952 636172
831F36172k10683j4026J99821k87562K73983l4280l37494l26476K61573O3486
821B24514j01819k56418l20538P72839K81942k13556k96136n6267N663M30145
811D70369L46795l51134J7177K70640j59805q8589k57163j20557J92677L4633
801C55043j38628j2041n50773L75377L17725M37246j124486O28516L10479j069342
791d70884p5344J022002j24514J24710k27934n74774L71298L71426l22367J53472
781B47091k01714N7807K43211J43907m69228j87714k6481J21377j10782j83033
771c65559k1973R64220j06195q33555J40119M86231k48549O41697J07950q14041
761d9655j80272P23108n02933m60104L1260k43079M60217M94390k89824l74235
$$ plain form
831 636172 425489 411463 611284 323722 597705 563425 225931 -100545 161028 224514
821 224514 122695 -133723 -454261 318578 600520 386964 90828 34561 40224 470369
811 470369 817164 466030 483207 753847 594042 505453 248290 127733 320410 355043
801 355043 216415 204374 -346399 28978 346703 783949 -340537 287979 598458 -470884
791 -470884 -546228 475774 351260 475970 248036 -326738 44560 415986 93619 247091
781 247091 45377 103184 346395 490302 21074 -166640 -193121 -71744 -182526 -365559
771 -365559 -387532 576688 470493 -363062 -222943 263288 14739 656436 764386 -49655
761 -49655 -229927 493181 -9752 -469856 -438596 -681675 -221458 272932 -16892 -391127
751c91127M03702L88671l33442o20021K65921J021897l8849m17283L34317n33870
741G9916O2079J73076q4429n79651K3875J73168K90683n66356P6912j50855J47082
730c54500J21946k34269K78743L59780K98570L7994j65180J6211j69982Q4097
720B73410k31136O22112q6360r82679R26533N62823j279174m05362L87811J52262
710e9760m89090P55370J78894l06375O3597m15167l30301N19633M00801O06751
700I24353l74778K23981N16647o26283r3255j34193j17613m74636L80215L01594
690E26032j99120O6135M00105o51275J1361q4871l62783M93407L39758m0905j09573
679C88271L01673o82951n12441L38213R8286n33089N99382L6726P0712m12890
$$ plain form
751 -391127 12575 401246 67804 -552217 -286296 735601 696752 279469 613786 79916
741 79916 141995 315071 230642 -349009 -325134 -151966 138717 -427639 -350727 -501582 -354500
730 -354500 -232554 -466823 -188080 171700 470270 508264 343084 359295 189313 273410
720 273410 42274 664386 578026 -404653 521880 1084703 -194471 -599833 -212022 -59760
710 -59760 -548850 206520 385414 79039 142636 -272531 -602832 -83199 317602 924353
700 924353 549575 773556 1290203 663920 570665 436472 318859 -155777 224438 526032
690 526032 326912 393047 793152 141877 153238 68367 -294416 198991 538749 497844 388271
679 388271 689944 6993 -505448 -167235 -68949 -602038 -2656 34070 104782 -308108
669c08108N6946J54265j85213m50116N38224M22053J4520m21102L51293N1857
659B24619j80170m5722l9579L28078j71655K83574l53993m89500j26178p4708
649f45234L41605Q014j21780Q80276l47085J88916k54717J8301L46933l63458
639E1771m49928K30136K90882M84594j108754K48835l4857l82466L16194J34500
629b19093l52689N2461O55088j3823n06380n1931p7647K90422l9190J07769L36703
618A81690p3113m90642J26285j08685M931M05290k88412J0193N82938l88201k29565
607b67291P75724n58380l38827k21993L88641K66187M6182n31975k30211q2883
597g54826l8728j62784J35357K93152K62503J08061j01401Q9504o15932k93768
$$ plain form
669 -308108 -251162 -96897 -282110 -732226 -194002 228051 242571 -178531 172762 224619
659 224619 44449 -1273 -40852 287226 115571 399145 45152 -444348 -570526 -645234
649 -645234 -303629 -295615 -417395 462881 115796 304712 49995 68296 415229 51771
639 51771 -398157 -168021 122861 607455 -501299 -252464 -287321 -669787 -353593 -219093
629 -219093 -571782 -519321 135767 121944 -384436 -436367 -514014 -223592 -262782 -155013 181690
618 181690 108577 -382065 -255780 -364465 -359534 45756 -242656 -232463 350475 -37726 -267291
607 -267291 508433 -49947 -388774 -610767 -222126 44061 90243 -441732 -671943 -754826
597 -754826 -793554 -956338 -820981 -527829 -265326 -157265 -258666 -169162 -785094 -1078862
587a078862L49162K49592k11516M44648O85921k54670o47508L66581M66458n94705
577b24899j43249L18021j34762N98736k99843j033176L96325L67264n66723J39662
567e82644P25930L37559m36088K7549k17839J64260n2837o9675K20937n70948
557d53796L96781N6732J08285k70014P3593k95128n45285M85708O26969j29265
547E4580J02259k4796k66491q0888r4770n37227J29963P61329o977k1232k36835
536b21085q93732K32479L59470p28358M07010j86506P13644K96896n39066N77622
526A8374k25952p1267J4521j91931j05787R1096M78747k91064o2056M43373o50115
515e52061l43216P40620M12014r47958j21876R71089k84099o38399J81174j1194
$$ plain form
587 -1078862 -729700 -480108 -691624 -246976 438945 184275 -463233 -96652 369806 -224899
577 -224899 -368148 -50127 -184889 413847 114004 -919172 -522847 -155583 -722306 -582644
567 -582644 143286 480845 44757 72306 -145533 18727 -34110 -103785 117152 -453796
557 -453796 -57015 -283 108002 -162012 -88419 -383547 -928832 -443124 183845 54580
547 54580 156839 132043 -134448 -215336 -310106 -847333 -717370 43959 36982 15750 -221085
536 -221085 -1114817 -882338 -522868 -1251226 -844216 -1030722 -317078 -20182 -559248 18374
526 18374 -207578 -278845 -264324 -456255 -562042 -470946 7801 -283263 -345319 98054 -552061
515 -552061 -895277 -154657 257357 -690601 -812477 158612 -125487 -763886 -582712 -593906
505e93906N52579m71204K0489L63461K13290J69960K23790l89841n27635J45478
495b93539k3104N6684L21165n3540J76742J77575j33857j41562n23182L48528
485h8090J23039l78488j45699K1952J55773J00745m87936m2359L21159m83474
475i03378L98162M26127o58479N2934L85113K70677j68109r8301m26467K24145
465d97576j31715K48053J01923m3928n0012L02466K29697l55784p63947J68656
455g92167M99926q53720L26098J09686M31553m5274k65244l46291j13661P4447
445i74647L50717l02303K67554K95792k81789K87440K03075p0478p41175L16888
435f48926N51819k70604k3562M31275p71063l66085J64916L93465n73518L05472
$$ plain form
505 -593906 -41327 -512531 -492042 -128581 84709 254669 478459 88618 -439017 -293539
495 -293539 -316643 -259959 61206 7666 184408 361983 228126 86564 -436618 -88090
485 -88090 34949 -343539 -489238 -467286 -311513 -210768 -698704 -741063 -419904 -903378
475 -903378 -505216 -79089 -737568 -684634 -299521 -28844 -196953 -295254 -721721 -497576
465 -497576 -629291 -381238 -279315 -323243 -373255 -70789 158908 -196876 -960823 -792167
455 -792167 -292241 -1145961 -819863 -710177 -278624 -323898 -589142 -935433 -1049094 -974647
445 -974647 -623930 -926233 -658679 -362887 -644676 -357236 -154161 -224639 -965814 -648926
435 -648926 -97107 -367711 -391273 40002 -731061 -1097146 -932230 -538765 -1112283 -806811
425h06811K80218N70358k31855o36589L86794j00313k94921R8042N37747J48458
415d8872j02671l07897L74815j35279J31812j97356o01137L05315L48562k42843
405d75551k75456L64984m36232k65349P35501L62667j58928l00887K02800l79097
395f25548j58408L02863K33587o1549k71408n2860R1428J01173L96906l99475
385d43291n5890M91313k51535O6335l17709K9906J92642L48549L26711l25350
375F1681j37135m21285k19476L36707j81782k53425O51874L55276l57724j43054
365c08343O70718n52056q17740N78345m3035o00539k07425R70541p50706M23277
355f36963K95594n07058j31152L56347J70704n30454L64060K79276k94731k8319
$$ plain form
425 -806811 -526593 43765 -188090 -824679 -437885 -538198 -833119 -735077 -197330 -48872
415 -48872 -151543 -459440 -84625 -219904 -88092 -285448 -886585 -581270 -232708 -475551
405 -475551 -751007 -386023 -822255 -1087604 -352103 10564 -148364 -449251 -246451 -625548
395 -625548 -783956 -481093 -247506 -309055 -580463 -633323 -541895 -440722 -43816 -443291
385 -443291 -499181 -7868 -259403 -193068 -510777 -480871 -288229 60320 387031 61681
375 61681 -75454 -496739 -716215 -379508 -561290 -814715 -162841 192435 -165289 -308343
365 -308343 362375 -189681 -1007421 -429076 -472111 -1072650 -1280075 -309534 -1060240 -636963
355 -636963 -341369 -848427 -979579 -623232 -452528 -982982 -618922 -339646 -634377 -662696
345f62696P09115p30700o00150Q7866O30940n32310L97121L12785n32567L9958
335h80638M96159m51605R4775L46398L18840k22879J52021j35637m89204J63036
325f08734k91575P0688l0801j41761J20855M45900n60885N41887K050Q7397k34822
314e99801n4532m58648J899M80460K22268l25072j89185L12894m47224J81992
304h74949o3064P81398N6000l87118K15678o3248k1148j1505J27002j43768j52246
293e36968K42738P402l10607j8976l38909j87967N94613j2984j12776j62314M78418
282c58330l32811K4675K30134n18776j38110L60696N32124r281o45384N43192
272c11871J69180k97100J59517k13485K83498n00216j19287j17574o7480R85622
$$ plain form
345 -662696 46419 -684281 -1284431 -1196565 -565625 -1097935 -700814 -388029 -920596 -880638
335 -880638 -384479 -836084 -741309 -394911 -76071 -298950 -146929 -282566 -771770 -608734
325 -608734 -900309 -829621 -860422 -1002183 -881328 -435428 -996313 -454426 -452376 -364979 -599801
314 -599801 -654333 -1112981 -1111082 -630622 -408354 -733426 -922611 -609717 -1056941 -874949
304 -874949 -938013 -156615 -100615 -487733 -272055 -335303 -356451 -367956 -240954 -384722 -536968
293 -536968 -294230 -286828 -597435 -616411 -955320 -1143287 -548674 -561658 -674434 -836748 -358330
282 -358330 -691141 -666466 -436332 -955108 -1093218 -732522 -200398 -209679 -855063 -311871
272 -311871 -142691 -439791 -280274 -493759 -210261 -710477 -829764 -947338 -1014818 -29196
262b9196o97488n77658P16077N3021o95414M84930L67614l31546P6176L47115
252b86369l54135l50873K77876q1924P28665n43136o579K77137K52454m09709
242d96593R9071r5070l06045O50068n6230K0567m92242k30804K15015O17788n47832
231f22307m63899Q89683m23409n67482J03369O4476m5337L70332K02804j43390
221f35160J21535l12435K60249J35935k75248l17901J37801K53654m41974n4762
211a128306K9871J78723j209K46230k32990j59735K75764r8471n61138L03575
201a147686p073M28512o3531k96919K23999p8345j05352O2729m0348p10947P10408
190a024553L37658l07502M3619L77308J97971p08041r0886L55969j18601k38563
$$ plain form
262 -29196 -726684 -1304342 -588265 -535244 -1230658 -745728 -378114 -709660 -633484 -286369
252 -286369 -640504 -991377 -713501 -795425 -66760 -609896 -616475 -339338 -86884 -496593
242 -496593 -397522 -492592 -798637 -148569 -204799 -184232 -676474 -907278 -692263 -74475 -622307
231 -622307 -1086206 -196523 -619932 -1187414 -1084045 -1019569 -1064906 -694574 -491770 -635160
221 -635160 -513625 -826060 -565811 -429876 -705124 -1023025 -885224 -631570 -1073544 -1128306
211 -1128306 -1098435 -919712 -920921 -674691 -907681 -1067416 -791652 -890123 -1451261 -1147686
201 -1147686 -1154759 -726247 -789778 -1086697 -862698 -941043 -1046395 -983666 -1024014 -1734961 -1024553
190 -1024553 -686895 -994397 -950778 -573470 -375499 -1083540 -1174426 -818457 -937058 -1175621
180a175621L98729L80826o5924n81846J12822K44103k29571K93204k90780j30536
170a044594R71085J3309j096670P33895J96805j160603K22561P34562k39916k53116
160i22682M16294m70635l78854L58240n65826M95097N84847m49008M52376J30487
150c49664m76787l13486j03092P77695k83131p08843K48959N30684L0777k00882
140h47770L86470M2446l55164K65297n6152k99714K21281j81538k56227J11940
130i69131j18541l31000j96952O13156j20936R716Q5865J59835K12705l52673
120a007956n03102J48709L53078L38214l32248L07783K36454m7967j87743o57290
110a352068Q7264P40991n1987R5803L23617m18497K80025j69470k89122l26649
$$ plain form
180 -1175621 -776892 -396066 -461990 -1043836 -931014 -686911 -916482 -623278 -914058 -1044594
170 -1044594 -73509 -60200 -1156870 -422975 -226170 -1386773 -1164212 -429650 -669566 -922682
160 -922682 -506388 -977023 -1355877 -997637 -1563463 -1068366 -483519 -932527 -480151 -349664
150 -349664 -826451 -1139937 -1243029 -465334 -748465 -1457308 -1208349 -677665 -646888 -847770
140 -847770 -461300 -418854 -774018 -508721 -564873 -864587 -643306 -824844 -1081071 -969131
130 -969131 -1087672 -1418672 -1615624 -1002468 -1123404 -1113688 -1027823 -867988 -655283 -1007956
120 -1007956 -1511058 -1362349 -1009271 -671057 -1003305 -695522 -459068 -507035 -694778 -1352068
110 -1352068 -1264804 -523813 -575800 -479997 -156380 -574877 -294852 -464322 -753444 -1080093
100a080093J52484K39864J00719J94960m69759m12070J42443j50799K64326L09700
90g08225j87179J6969K02369k08986j95134j77215L6471p0666M57556Q3707l13976
79a064309N37154k17431j49355l45573n419N64552R4169m88962l63322K48547
69a189949j10597Q7596l78493J36501K90396O9891J53674j66209K30895q082j71031
58a055408j90764m63242J22379P40682O5372J24230m48947q9753N86791k84204
48h92864l73654Q466L59217l74077J57446M71364k9467p08908J87834J29882k60922
37a325683K14559N69204j95633J12596j03634m42020J45861Q9145n52162J9993
27a467774K12914J76711K16027j7212L7200k565k71963k9335J81331N4470K269
$$ plain form
100 -1080093 -927609 -687745 -587026 -392066 -861825 -1273895 -1131452 -1282251 -1017925 -708225
90 -708225 -895404 -878435 -676066 -885052 -1080186 -1257401 -1220930 -1291596 -834040 -750333 -1064309
79 -1064309 -527155 -744586 -893941 -1239514 -1244933 -680381 -586212 -1075174 -1438496 -1189949
69 -1189949 -1300546 -1212950 -1591443 -1454942 -1164546 -1094655 -940981 -1107190 -876295 -884377 -1055408
58 -1055408 -1246172 -1709414 -1587035 -846353 -780981 -656751 -1105698 -1195451 -608660 -892864
48 -892864 -1266518 -1258052 -898835 -1272912 -1115466 -644102 -673569 -1382477 -1194643 -1064761 -1325683
37 -1325683 -1111124 -541920 -737553 -624957 -728591 -1170611 -1024750 -935605 -1487767 -1467774
27 -1467774 -1254860 -1078149 -862122 -879334 -842134 -844699 -1116662 -1145997 -964666 -910196 -907927
16i07927J18946j25526n90344J14241J08610K06160j69339L27902l9441J75536
6g81182j73064o6235j55098m02757K58537M43292
0h76507
$$ plain form
16 -907927 -788981 -914507 -1504851 -1390610 -1282000 -1075840 -1245179 -917277 -956718 -781182
6 -781182 -954246 -1020481 -1175579 -1578336 -1319799 -876507
0 -876507
$$ Imaginary data points
##PAGE= N=2
$$ [...]
##END NTUPLES=NMR SPECTRUM
##END=
