##TITLE=1H_CA-8817-1
 CDCl3,8 sc, 
 5.02.2021
##JCAMPDX= 6.0         $$ Bruker NMR JCAMP-DX V2.0
##DATA TYPE= NMR SPECTRUM
##DATA CLASS= NTUPLES
##ORIGIN= UXNMR, Bruker Analytische Messtechnik GmbH
##OWNER= root
$$ XWIN-NMR		Version 3.5
$$ Fri Feb  5 10:12:00 2021 Russian Standard Time (UT+4h)  she@DPX200
##.OBSERVE FREQUENCY= 200.1315066352
##.OBSERVE NUCLEUS= ^1H
##.ACQUISITION MODE= SIMULTANEOUS
##.ACQUISITION SCHEME= undefined
##.AVERAGES= 8
##.DIGITISER RES= 18
##SPECTROMETER/DATA SYSTEM= spect
##.PULSE SEQUENCE= zg30
##.SOLVENT NAME= CDCl3
##.SHIFT REFERENCE= (INTERNAL, CDCl3, 0, 15.8974)
##AUDIT TRAIL= $$ (NUMBER, WHEN, WHO, WHERE, WHAT)
$$ ##TITLE= Audit trail, XWIN-NMR		Version 3.5
$$ ##JCAMPDX= 5.01
$$ ##ORIGIN= Bruker BioSpin GmbH
$$ ##OWNER= she
$$ F:/spectra/data/she/nmr/H-F/1/pdata/1/auditp.txt
$$ ##AUDIT TRAIL=  $$ (NUMBER, WHEN, WHO, WHERE, WHAT)
(   1,<2021-02-05 10:10:41.07 +0400>,<she>,<DPX200>,
      <created by zg, POWCHK disabled, PULCHK disabled
       configuration hash MD5:
       00 E9 B6 7A A2 85 ED C7 34 08 36 98 17 FE 4E 26
       data hash MD5: 16K
       F1 F9 52 51 89 72 D1 5A 81 AB 43 B7 4E 7C 34 01>)
(   2,<2021-02-05 10:10:43.65 +0400>,<she>,<DPX200>,
      <Start of raw data processing
       efp BC_mod = 2 LB = 0.24 FT_mod = 6 PKNL = 1 PHC0 = -10392.27 PHC1 = -1.399052 SI = 16K 
       data hash MD5: 16K
       70 15 0C C0 16 3C 88 57 76 1F CB 61 EB D4 C6 C3>)
(   3,<2021-02-05 10:11:03.65 +0400>,<she>,<DPX200>,
      <pk PHC0 = -1.049402 PHC1 = 5.8 
       data hash MD5: 16K
       83 BD FF 54 2B BB BC 10 BF EF 26 09 86 C5 CA 7E>)
(   4,<2021-02-05 10:11:07.03 +0400>,<she>,<DPX200>,
      <abs ABSG = 5 
       data hash MD5: 16K
       F6 A7 F9 0D 45 9D F8 AB 24 80 F9 03 45 13 1B 25>)
(   5,<2021-02-05 10:11:19.40 +0400>,<she>,<DPX200>,
      <pk PHC0 = -0.9249266 PHC1 = 1.4 
       data hash MD5: 16K
       96 AA 5D 26 1B FF CA 22 C9 F6 50 F8 8D 11 F1 F5>)
(   6,<2021-02-05 10:11:22.89 +0400>,<she>,<DPX200>,
      <abs ABSG = 5 
       data hash MD5: 16K
       C5 62 A8 A3 52 29 E2 E2 73 7D 5D 26 23 10 07 88>)
$$ ##END=
$$ 
$$ hash MD5
$$ 12 83 CC FA 79 BA 05 18 E8 4E 71 72 BA 07 07 6C
##$RELAX= 
##$RELAX= 
##$RELAX= 
##$RELAX= 
##$RELAX= 
##$RELAX= 
$$ Bruker specific parameters
$$ --------------------------
##$DU= <F:/spectra>
##$EXPNO= 1
##$NAME= <H-F>
##$PROCNO= 1
##$TYPE= <nmr>
##$USER= <she>
##$AMP= (0..31)
100 100 100 100 100 100 100 100 100 100 100 100 100 100 100 100 100 100 
100 100 100 100 100 100 100 100 100 100 100 100 100 100 
##$AQSEQ= 0
##$AQ_mod= 1
##$AUNM= <au_zg>
##$AUTOPOS= <>
##$BF1= 200.13
##$BF2= 200.13
##$BF3= 200.13
##$BF4= 200.13
##$BF5= 200.13
##$BF6= 200.13
##$BF7= 200.13
##$BF8= 200.13
##$BYTORDA= 1
##$CFDGTYP= 0
##$CFRGTYP= 5
##$CHEMSTR= <none>
##$CNST= (0..31)
1 1 145 1 1 1 1 1 1 1 1 1 1 1 1 1 1 1 1 1 1 1 1 1 1 1 1 1 1 1 1 1 
##$CPDPRG= <>
##$CPDPRG1= <>
##$CPDPRG2= <>
##$CPDPRG3= <>
##$CPDPRG4= <mlev>
##$CPDPRG5= <mlev>
##$CPDPRG6= <mlev>
##$CPDPRG7= <mlev>
##$CPDPRG8= <mlev>
$$ [...]
##$SUBNAM3= <"">
##$SUBNAM4= <"">
##$SUBNAM5= <"">
##$SUBNAM6= <"">
##$SUBNAM7= <"">
##$SUBNAM8= <"">
##$SUBNAM9= <"">
##$SW= 16.9725356469052
##$SWIBOX= (0..15)
0 0 2 0 0 0 0 0 0 0 0 0 0 0 0 0 
##$SW_h= 3396.73913043478
##$TD= 16384
##$TD0= 1
##$TE= 0
##$TE2= 300
##$TE3= 300
##$TEG= 300
##$TL= (0..7)
0 120 120 120 120 120 120 120 
##$TP= (0..7)
150 150 150 150 150 150 150 150 
##$TP07= 0
##$TPNAME0= <>
##$TPNAME1= <>
##$TPNAME2= <>
##$TPNAME3= <>
##$TPNAME4= <>
##$TPNAME5= <>
##$TPNAME6= <>
##$TPNAME7= <>
##$TPOAL= (0..7)
0.5 0.5 0.5 0.5 0.5 0.5 0.5 0.5 
##$TPOFFS= (0..7)
0 0 0 0 0 0 0 0 
##$TUNHIN= 0
##$TUNHOUT= 0
##$TUNXOUT= 0
##$USERA1= <user>
##$USERA2= <user>
##$USERA3= <user>
##$USERA4= <user>
##$USERA5= <user>
##$V9= 5
##$VALIST= <valist>
##$VCLIST= <CCCCCCCCCCCCCCC>
##$VD= 0
##$VDLIST= <DDDDDDDDDDDDDDD>
##$VPLIST= <PPPPPPPPPPPPPPP>
##$VTLIST= <TTTTTTTTTTTTTTT>
##$WBST= 1024
##$WBSW= 4
##$XGAIN= (0..3)
0 0 0 0 
##$XL= 0
##$YL= 0
##$YMAX_a= 1038500
##$YMIN_a= -608521
##$ZGOPTNS= <>
##$ZL1= 120
##$ZL2= 120
##$ZL3= 120
##$ZL4= 120
##$ABSF1= 15.98957
##$ABSF2= -0.9830942
##$ABSG= 5
##$ABSL= 3
##$ALPHA= 0
##$AQORDER= 0
##$ASSFAC= 0
##$ASSFACI= 0
##$ASSFACX= 0
##$ASSWID= 0
##$AUNMP= <proc_1d>
##$AZFE= 0.1
##$AZFW= 0.1
##$BCFW= 0
##$BC_mod= 2
##$BYTORDP= 0
##$COROFFS= 0
##$CY= -3
##$DATMOD= 1
##$DC= 0
##$DFILT= <>
##$DTYPP= 0
##$F1P= 0
##$F2P= 0
##$FCOR= 1
##$FTSIZE= 16384
##$FT_mod= 6
##$GAMMA= 0
##$GB= 0
##$INTBC= 1
##$INTSCL= 2.992141e-10
##$ISEN= 128
##$LB= 0.24
##$LEV0= 0
##$LPBIN= 0
##$MAXI= 10000
##$MC2= 0
##$MEAN= 0
##$ME_mod= 0
##$MI= 1.114404
##$NCOEF= 0
##$NC_proc= -5
##$NLEV= 6
##$NOISF1= 3.799351
##$NOISF2= 2.8
##$NSP= 0
##$NTH_PI= 0
##$NZP= 0
##$OFFSET= 15.89737
##$PC= 1
##$PHC0= -10394.25
##$PHC1= 5.800948
##$PH_mod= 1
##$PKNL= yes
##$PPARMOD= 0
##$PSCAL= 0
##$PSIGN= 0
##$REVERSE= no
##$SF= 200.13002346478
##$SI= 16384
##$SIGF1= 3
##$SIGF2= 2
##$SINO= 5.538805
##$SIOLD= 16384
##$SREGLST= <1H.CDCl3>
##$SSB= 0
##$STSI= 16384
##$STSR= 0
##$SW_p= 3396.73913043478
##$SYMM= 0
##$S_DEV= 0
##$TDeff= 16384
##$TDoff= 0
##$TI= <>
##$TILT= no
##$TM1= 0
##$TM2= 0
##$TOPLEV= 0
##$USERP1= <user>
##$USERP2= <user>
##$USERP3= <user>
##$USERP4= <user>
##$USERP5= <user>
##$WDW= 1
##$XDIM= 16384
##$YMAX_p= 400498412
##$YMIN_p= -497934
$$ End of Bruker specific parameters
$$ ---------------------------------
##NTUPLES= NMR SPECTRUM
##VAR_NAME=  FREQUENCY,     SPECTRUM/REAL,   SPECTRUM/IMAG
##SYMBOL=    X,             R,               I
##VAR_TYPE=  INDEPENDENT,   DEPENDENT,       DEPENDENT
##VAR_FORM=  AFFN,          ASDF,            ASDF
##VAR_DIM=   16384,         16384,           16384
##UNITS=     HZ,            ARBITRARY UNITS, ARBITRARY UNITS
##FACTOR=    0.207333158178281, 1,           1
##FIRST=     3181.54109886028, 0,            0
##LAST=      -215.198031574497, 0,           0
##MIN=       -215.198031574497, -497934,     0
##MAX=       3181.54109886028, 400498412,    0
$$ Real data points
##PAGE= N=1
##DATA TABLE= (X++(R..R)), XYDATA
$$ [...]
8410 1368337 1402090 1350762 1305760 1383756 1355463 1373583 1361551 1362913 1417757 1476670 1641567
8399 1641567 1698979 1736738 1801333 1764888 1677820 1629810 1694111 1739881 1671078 1631353 1553786
8388 1553786 1488222 1586291 1611790 1557960 1544645 1595880 1544041 1506673 1579632 1569827 1579746 1601276
8376 1601276 1565541 1511140 1496872 1571271 1620737 1630270 1658072 1695603 1657900 1668317 1720597 1828967
8364 1828967 1920239 1961466 1954464 2071511 2155884 2277346 2371919 2381177 2281729 2275705 2223055 2199795
8352 2199795 2147817 2071547 2063548 2046428 2079662 2101372 2160705 2305852 2326150 2312495 2419990
8341 2419990 2393935 2321284 2373267 2478403 2435734 2446076 2480185 2429696 2528466 2728595 2785909
8330 2785909 2742217 2750249 2767790 2682536 2686092 2783222 2789031 2797770 2826565 2796244 2751131 2773168
8318 2773168 2881967 2847127 2835954 2858202 2935012 2957355 2962077 3123849 3169652 3102394 3120517
8307 3120517 3226634 3304417 3348286 3448278 3480906 3427181 3459391 3564791 3649387 3846929 4025643
8296 4025643 4076716 3939339 3839341 3777697 3736154 3857712 3903175 3909936 3874972 3896212 3975949
8285 3975949 4010050 4001456 3857882 3782794 3788418 3702162 3649867 3622579 3598742 3643614 3627003 3657869
8273 3657869 3655668 3585749 3688965 3767792 3720069 3724322 3806847 3797966 3835682 3909832 3946717 3937830
8261 3937830 3947887 3973050 4045538 4066662 4083371 4110434 4039257 4079000 4184752 4325026 4399470
8250 4399470 4372374 4343618 4318523 4224519 4233790 4199631 4081013 4048391 4019755 3958099 3912242
8239 3912242 3935661 3871206 3883133 3852100 3780433 3781810 3763655 3806352 3869362 3894560 3963310 3972050
8227 3972050 3926880 4001976 4066777 4107231 4120938 4080290 4052541 4116298 4163570 4206157 4198826 4182141
8215 4182141 4205598 4120030 4134371 4185606 4197503 4271686 4361464 4345280 4406840 4324131 4317807 4411985
8203 4411985 4376606 4282234 4255045 4258219 4183680 4169153 4237328 4261685 4170879 4210348 4319424
8192 4319424 4521086 4436959 4394862 4356243 4270230 4365359 4425837 4468664 4459399 4468109 4569309
8181 4569309 4594143 4639213 4742247 4810277 4802995 4854416 4865923 4843435 4833913 4879300 5030528
8170 5030528 5032804 5046501 5152877 5167900 5242185 5276959 5229532 5179833 5151348 5182128 5178464 5251064
8158 5251064 5223781 5333438 5388249 5451629 5499590 5553006 5701978 5762628 5847876 5966995 6000660
8147 6000660 5998223 6021714 6133568 6183394 6240329 6313386 6424993 6556931 6573497 6694913 6840805
8136 6840805 6946800 7001286 7018518 7170855 7148241 7143735 7254704 7210556 7232495 7269192 7292519
8125 7292519 7242824 7375762 7573652 7628569 7675440 7796944 7967210 7988800 8043906 8235046
8115 8235046 8362140 8517093 8728079 8846366 8904444 9005298 9193397 9330084 9497442 9700592
8105 9700592 9960188 10062404 10113209 10394434 10598396 10776375 10979096 11252818 11470342 11719105
8095 11719105 11987223 12265370 12612553 12937171 13330895 13608900 13961190 14323471 14659847
8086 14659847 15098363 15430579 15809802 16201595 16613254 17081240 17685642 18242437 18731296
8077 18731296 19265092 19828408 20391801 20969280 21574642 22286882 23054939 24101081 25400561
8068 25400561 26789212 28497738 30438183 32566091 34515051 35755511 36147342 36247564
8060 36247564 36957864 38392588 40306912 42128036 43144365 42822867 41463238 39726027
8052 39726027 38315841 37646571 37781166 38400015 39202207 39817561 40344152 40868123 41468621
8043 41468621 42025399 42300038 42488098 42116917 41869593 42161216 42983167 44202620 45730716
8034 45730716 47385603 49093206 51136653 53718254 57160095 61485662 66122241 70223956
8026 70223956 73728002 78002679 83649448 89502528 93540360 94854506 95144646 96357616
8018 96357616 98149178 99291225 98895979 96762010 92813876 87785265 83147944 79147714
8010 79147714 75640021 72344919 69794552 68426958 68323343 69061847 69848664 69781025 68884035
8001 68884035 68090213 68462804 69825781 71963089 75086535 79058786 84231338 90717252
7993 90717252 99106222 110030031 123570488 137981805 149111185 153311554 151604880 148068614
7985 148068614 143938521 137027183 126919469 116037405 106823433 100248616 96285937 94416553
7977 94416553 94128533 95078713 97357238 100313084 102796607 101150860 96818045 94195304
7969 94195304 93842954 95163819 97752997 101655037 106875756 113314209 120811746 129928741
7961 129928741 140776183 153052020 165754559 179368207 193560229 204945203 214002352
7954 214002352 221789410 224009065 221053486 214669703 203837119 189487167 172895308 156073190
7946 156073190 140574300 126735906 115372646 106792232 100617881 96359450 93554195 91814121
7938 91814121 90811013 90111886 89925064 89980471 90269923 90884859 91827853 93312184 94576632
7929 94576632 95846988 97068861 97950173 99384034 101157010 102817338 104509291 106806129
7921 106806129 109385184 110816536 111520864 111805762 110554372 107549466 103389174 98032330
7913 98032330 91752873 85347316 78526556 72242599 67040734 61874887 57291233 53699283
7905 53699283 50526552 47894931 45974044 44539894 43518683 42866974 42415495 42028123 41508381
7896 41508381 40822573 40110745 39197649 38126727 37277022 36603045 35944566 35509298 35352968
7887 35352968 35150064 35014512 34896420 34470607 33870535 33260702 32353940 31353561 30577525
7878 30577525 29754974 29175258 28547997 27735854 27041634 26150993 25203218 24332411 23628568
7869 23628568 22998280 22472842 22195140 21878681 21613896 21418744 21194486 20978387 20756948
7860 20756948 20702646 20604946 20481849 20348847 20310274 20336804 20430274 20581168 20555496 20619921 20682621
7849 20682621 20809075 20982156 21196007 21467231 21721474 21889335 22037693 22285426 22445890
7840 22445890 22690062 22958674 23112470 23263678 23302803 23126199 22962427 22758667 22670220 22610100
7830 22610100 22504843 22612351 22693087 22943811 23299181 23601967 24004896 24574982 25209801 25924289
7820 25924289 26776120 27602237 28369436 29123753 29670146 30050692 30254506 30553968 30770526
7811 30770526 30748478 30687949 30457310 30260995 30236329 30382686 30562432 30764348 30965443 31184727
7801 31184727 31398653 31470268 31380056 30954484 30221317 29390058 28608311 27764126 26980517 26244703
7791 26244703 25637988 25054561 24607847 24399850 24312608 24281098 24408697 24575376 24745092 25156488
7781 25156488 25613645 25965787 26286092 26558699 26818100 27196662 27557452 27982826 28338044
7772 28338044 28620423 28934055 29150672 29337266 29428082 29367269 29020462 28514116 27755562 26843394
7762 26843394 25948081 25269426 24910787 24698914 24489570 24309905 24031390 23626001 23234353
7753 23234353 22669753 21688747 20526048 19447045 18399274 17469608 16664856 16073240 15589728
7744 15589728 15179738 14847132 14515681 14295174 14208432 14085349 14092769 14147344 14257410 14406853
7734 14406853 14550826 14627151 14738136 14792468 14574185 14260712 13928263 13654462 13488059 13369018
7724 13369018 13424507 13483602 13662188 13831303 13831097 13767979 13602539 13195595 12701323 12261387
7714 12261387 11857958 11538431 11299735 11053567 10890243 10708884 10627998 10539727 10379151 10360651
7704 10360651 10299221 10177011 10016780 9873658 9733086 9651029 9563077 9529135 9492082 9379791
7694 9379791 9376441 9386158 9376162 9340118 9340240 9307283 9171734 9074502 9098020 9048173 9026846 9010005
7682 9010005 9049298 9064178 9118490 9134126 9072282 9122661 9029702 8998523 9010219 8946638 8950951 8979756
7670 8979756 9015193 9006052 8963626 9008909 9048941 9108275 9225602 9279626 9207177 9099917 9134924
7659 9134924 9059158 9115992 9251704 9312081 9467317 9568825 9664142 9797847 10025178 10181482
7649 10181482 10379773 10543145 10739965 11021140 11260402 11472934 11708544 11810400 11881748 11847038
7639 11847038 11953250 12081862 12167339 12356802 12530355 12659503 12891736 13154930 13270461 13317433
7629 13317433 13371067 13385027 13409877 13448336 13537230 13588651 13620318 13603234 13468899 13371152 13363887
7618 13363887 13339444 13393663 13444892 13432317 13536137 13719045 13839613 13993803 14137178 14231282
7608 14231282 14355572 14469249 14637413 14892455 15170524 15518473 15905119 16224280 16456965
7599 16456965 16626327 16599852 16438593 16304498 16182541 16110898 16167346 16441208 16809476 17031572
7589 17031572 17307321 17550485 17561974 17568953 17518985 17446676 17360108 17220317 17081189 16936098
7579 16936098 16680391 16529345 16409549 16226071 16051985 15943902 15848098 15699737 15538245 15474708
7569 15474708 15432202 15261517 15088710 14950890 14735764 14632725 14506716 14440522 14398989 14426455
7559 14426455 14428011 14413653 14428100 14355109 14141296 13711385 13361772 13183845 13057824 13010810
7549 13010810 13036544 13148494 13166899 13253811 13285451 13204329 12965931 12610652 12288433 11964317
7539 11964317 11729851 11506765 11223445 10888865 10569369 10323355 10030124 9808070 9622914
7530 9622914 9480623 9304242 9157151 9021751 8800650 8660810 8494931 8295553 8077947 7849340
7520 7849340 7676025 7511320 7438516 7323702 7176108 7110228 6959365 6754679 6540991 6319649
7510 6319649 6181501 6080042 5948204 5828520 5812520 5822341 5761274 5694093 5615611 5534881 5277722
7499 5277722 5075578 4840011 4709269 4616428 4511249 4363262 4273877 4099507 3946781 3887378
7489 3887378 3884405 3835148 3800696 3767258 3671218 3601442 3519437 3498200 3434414 3398588 3401743 3298074
7477 3298074 3192885 3097226 3067808 2954992 2969843 2952685 2869471 2870054 2803385 2817234 2882066
7466 2882066 2828574 2760500 2774957 2677446 2563172 2540899 2555481 2438083 2355131 2363957 2356235
7455 2356235 2304500 2319791 2295114 2226977 2273725 2211436 2159892 2169676 2130519 2065289 2114659 2040947
7443 2040947 2000764 2049641 2020016 1936618 1950148 2057205 2068523 1960077 1965131 1992676 1896433
7432 1896433 1853982 1816280 1771600 1748563 1787767 1819649 1782159 1718591 1779058 1787468 1670781
7421 1670781 1646588 1684273 1573863 1481807 1525185 1561405 1499823 1522025 1571564 1512506 1420663
7410 1420663 1493895 1511913 1431539 1448710 1472977 1355427 1349159 1309011 1333118 1395237 1410741
7399 1410741 1372028 1345972 1330393 1359912 1354778 1375336 1400562 1370774 1317683 1271226 1264803 1284374
7387 1284374 1240530 1273321 1286070 1242172 1259052 1337889 1360895 1318834 1370430 1347201 1259066
7376 1259066 1276286 1272276 1220989 1138433 1145323 1102894 1098470 1118646 1121299 1054663 1103193 1132808
7364 1132808 1058700 1022725 971667 891744 898274 938266 928968 905490 894185 920862 902127 895943
7352 895943 832834 828838 858536 924374 895146 914554 1012399 988989 943959 948219 856400 844156
7340 844156 835171 804713 821089 833410 761686 770657 780188 808038 781710 783335 809784 797650
7328 797650 812970 864439 790164 716926 665857 632387 648318 659762 628413 663918 681877 676842
7316 676842 674398 747031 702022 728502 719992 698436 600232 582539 590463 522413 528635 578555
7304 578555 549025 512065 583278 605664 502124 505689 461636 465733 528200 518535 492874 509751
7292 509751 536150 473386 442919 542251 571265 525281 525330 559745 578392 534131 531824 474207
7280 474207 473495 482928 462693 448579 472226 462383 491366 441903 475918 576961 588003 546566
7268 546566 548170 595534 576399 499964 505065 491785 372284 342471 392941 328304 261696 294246
7256 294246 298871 292112 383107 414227 437505 471627 509180 492516 467327 433485 423240 391506
7244 391506 388316 376916 368251 343415 375764 455909 545323 499826 478362 470544 433026 409525
7232 409525 431966 426225 392049 331448 300702 223866 325245 454587 509361 501828 513615 468048
7220 468048 438942 435776 439131 406165 405191 396654 349475 284107 250294 269674 340484 365683 358937
7207 358937 442654 454697 388489 340054 343307 297956 212132 226847 261157 255398 285874 316522
7195 316522 267459 221707 261468 273777 252372 257829 355003 334394 256661 228111 294257 331891
7183 331891 329936 316801 300536 236803 282904 323304 235743 159446 241186 272658 213275 196312
7171 196312 294625 312774 255420 264083 257756 270384 243507 199034 177785 91468 104095 104450
7159 104450 49778 60257 188316 188564 160577 165401 176958 148355 156698 124987 117976 95919
7147 95919 55593 -12698 -10098 95758 177220 208347 241543 179210 190248 206666 179461 125579
7135 125579 84675 34621 -18262 -110103 -134457 -61251 9436 -12771 27600 84910 51142 91306
7123 91306 98151 136664 74377 71372 90692 13616 28212 62951 102441 93558 131875 141625 108714
7110 108714 131580 90739 89853 98089 2923 -94937 -131049 -85746 749 -4041 6738 -40935
7098 -40935 28016 31072 33760 15544 61541 96070 61756 54087 13031 66333 49078 24028
7086 24028 55714 69323 43270 54857 12505 -36478 -18950 -60350 -63022 -91474 -64345 -92747
7074 -92747 -38018 -41405 -17393 21615 58302 40231 321 24691 -14997 -32980 -57079 -37003
7062 -37003 -79962 -59320 -49977 -66873 -53924 -13295 33036 -12145 49685 40078 22505 -47749
7050 -47749 -60196 -69397 -66273 -28509 -44002 -107390 -114198 33639 26505 -34856 -25867 -46117 -50705
7037 -50705 -47251 -98306 -85832 -50833 -54660 -65306 -115811 -74443 -98748 -64588 -91649 -95722
7025 -95722 -120136 -151880 -146119 -222683 -185319 -156458 -202159 -225079 -159450 -84196 -125130 -169324
7013 -169324 -122672 -179718 -159407 -142600 -97090 -128366 -139312 -96758 -163763 -150042 -104807 -85252
7001 -85252 -126952 -142423 -52623 -100393 -118187 -149038 -53123 -87628 -70494 -51158 -132616 -162342
6989 -162342 -208943 -114401 -141944 -218227 -165172 -174859 -233122 -171360 -141091 -149822 -168806 -158286
6977 -158286 -248544 -263892 -193881 -191946 -204621 -163051 -84403 -129776 -82917 -79786 -99744 -124154
6965 -124154 -134522 -131543 -192947 -186941 -142178 -140965 -194583 -209579 -244583 -235569 -173538 -70020
6953 -70020 -6657 -20286 -89544 -133813 -143502 -89818 33881 28299 -35760 -48798 -37733 -123048
6941 -123048 -126868 -69034 -81094 -188794 -212191 -219654 -291786 -198660 -124347 -215181 -180664 -87625
6929 -87625 -59169 -94467 -72729 -75844 -140652 -144781 -209463 -199347 -208607 -204046 -191008 -193037 -188883
6916 -188883 -247624 -281753 -226648 -191775 -206190 -255027 -300618 -412334 -414575 -420634 -419056 -332754
6904 -332754 -280074 -192596 -226050 -235989 -160378 -151240 -146576 -174377 -256781 -368090 -361131 -340543
6892 -340543 -333750 -296096 -272342 -252477 -308265 -312176 -243265 -165690 -204080 -251179 -255107 -304784
6880 -304784 -366189 -348346 -328063 -294432 -267727 -175148 -228088 -280657 -196685 -211010 -266531 -349382
6868 -349382 -336941 -368618 -436505 -366934 -291121 -342774 -369797 -370299 -393106 -309191 -272303 -285699
6856 -285699 -293385 -346010 -378762 -400033 -435535 -497934 -448344 -374005 -380921 -305356 -252083 -207314
6844 -207314 -226199 -273440 -250956 -283323 -261562 -215138 -221842 -291521 -330468 -317503 -356362 -378545
6832 -378545 -294951 -196921 -154262 -248120 -272147 -301189 -290060 -270158 -249834 -229285 -288512 -333753
6820 -333753 -376585 -398682 -364969 -311284 -268461 -362583 -370159 -228832 -209704 -260120 -227833 -203320
6808 -203320 -300222 -368825 -333193 -359559 -399026 -359363 -338228 -386585 -432487 -362394 -355849 -338888
6796 -338888 -248193 -229617 -287376 -345889 -294285 -310291 -265091 -197937 -267887 -272167 -290276 -260000
6784 -260000 -279603 -247830 -243085 -229293 -190171 -262710 -218614 -209908 -171825 -220691 -315914 -296503
6772 -296503 -331098 -310663 -241363 -280071 -239205 -201529 -242266 -254414 -302518 -278373 -309130 -282036
6760 -282036 -310520 -280166 -294203 -266417 -262689 -301488 -320563 -358061 -352303 -339001 -315397 -263364
6748 -263364 -258506 -364046 -401807 -418408 -331894 -314312 -255344 -200104 -224443 -204471 -238275 -286196
6736 -286196 -310728 -220900 -191747 -258259 -234226 -200254 -195669 -169111 -187981 -206722 -152511 -101226
6724 -101226 -107525 -123600 -117807 -212840 -272588 -304418 -238041 -122979 -99180 -65564 -41125 -27483
6712 -27483 -88548 -64707 -28464 -98229 -112681 -125638 -196927 -306115 -267329 -226755 -194969 -203274
6700 -203274 -226971 -246508 -311854 -307052 -211545 -151547 -219568 -250367 -255403 -274710 -258004 -219048
6688 -219048 -240136 -253059 -202940 -199867 -249960 -202643 -152389 -190917 -207386 -219985 -197005 -236408
6676 -236408 -226044 -130246 -158523 -191735 -194327 -193344 -254452 -272149 -248321 -141986 -187218 -300380
6664 -300380 -302456 -283594 -246608 -188744 -116235 -156783 -234210 -200784 -192942 -317827 -260551 -173047
6652 -173047 -203404 -246249 -286203 -286832 -367204 -351929 -362433 -305201 -276160 -234157 -196254 -258664
6640 -258664 -257956 -299014 -275830 -351058 -303964 -234601 -282794 -303397 -271597 -186797 -258362 -287258
6628 -287258 -197389 -193374 -185516 -209674 -222419 -234979 -219203 -138330 -186159 -200608 -250615 -230574
6616 -230574 -198803 -276069 -235929 -235620 -234608 -303411 -270765 -173625 -175650 -192496 -171458 -199409
6604 -199409 -218337 -204099 -134406 -127886 -132507 -125663 -216807 -265319 -287367 -242084 -233351 -265074
6592 -265074 -228330 -243439 -235138 -249466 -182413 -116677 -132286 -155782 -259386 -289368 -289138 -237036
6580 -237036 -176125 -174577 -176784 -170556 -200590 -266632 -220232 -151346 -155209 -181650 -199938 -240361
6568 -240361 -232069 -222320 -271947 -301482 -290290 -260298 -239066 -192009 -115046 -165991 -208196 -167205
6556 -167205 -148169 -139893 -208714 -200062 -226760 -259084 -251504 -185731 -137699 -168173 -181811 -207231
6544 -207231 -269016 -283269 -243396 -258717 -276773 -284612 -303161 -349969 -359163 -296456 -298406 -328018
6532 -328018 -274255 -283995 -318517 -218187 -238440 -207573 -187887 -257237 -228177 -267725 -290853 -243467
6520 -243467 -254448 -316739 -360768 -397707 -391526 -291224 -188013 -180895 -123317 -193151 -247743 -239028
6508 -239028 -215347 -152716 -167924 -127075 -211073 -319280 -412598 -305960 -301769 -310930 -180570
6497 -180570 -175779 -174916 -210415 -214703 -152178 -178694 -172779 -244941 -320675 -387349 -358626 -263890 -251085
6484 -251085 -278299 -268954 -159449 -148648 -182888 -112443 -104284 -199689 -225029 -246674 -273004 -280161
6472 -280161 -209988 -204378 -194556 -134240 -153024 -203122 -169144 -140340 -173048 -180440 -233584 -298592
6460 -298592 -256409 -172576 -153178 -135877 -99433 -147628 -174666 -121543 -43446 -83151 -110095 -94293
6448 -94293 -172117 -189219 -132618 -155528 -129986 -116576 -137177 -102385 -142039 -91481 -104198 -96705
6436 -96705 -125220 -176638 -184490 -244032 -165624 -169854 -185867 -219447 -153653 -176292 -235140 -144644
6424 -144644 -55105 -127430 -210327 -168144 -198695 -186125 -34649 27713 -10159 -43799 -83728
6413 -83728 -89452 -90192 -31341 -37400 -66135 -31343 -82268 -138915 -113025 -18637 -72290 -27264 -12341
6400 -12341 5539 17993 50398 185938 148277 71803 79814 88882 83240 125092 147976 158568
6388 158568 163244 179309 53904 26598 86545 129160 100218 116880 125872 52459 77926 144658
6376 144658 134840 90513 141373 138066 10234 10667 61646 32139 24513 95260 94009 32052 78576
6363 78576 94109 18616 41201 124164 23386 -24986 26221 78686 34984 -31822 -22708 19063
6351 19063 36538 40014 -45967 -52050 -1927 -12635 -1357 15398 9170 -8950 20644 27838 43633
6338 43633 45363 69491 165046 174035 177309 160051 95982 70033 43222 137340 108065 52441
6326 52441 55103 9207 -45647 5775 12663 8577 64700 85081 4421 -22493 -66686 -55799
6314 -55799 9910 48659 49446 21363 -7016 34382 48981 80623 71575 39694 56346 94998
6302 94998 62463 90877 133136 128216 100661 108677 149446 100315 125185 187802 206008 150048
6290 150048 137754 56993 11268 44763 204508 199138 160982 132094 119724 84232 89103 157187
6278 157187 123084 66685 45165 21661 39848 90354 27323 3528 -43481 -1292 57128 8807
6266 8807 -5309 30982 -1143 -69566 -81213 -82759 -65659 -23936 57032 18149 -45031 -10887
6254 -10887 8009 -42992 9231 -45172 -84852 -89858 -97972 -68903 -83329 -6559 -82446 -95145
6242 -95145 -47178 -61504 -49789 -31746 -39386 -61014 -10568 8522 -98315 -77145 -12009 -27453
6230 -27453 -74958 -79028 -48820 -34870 -21073 -75175 -81047 -96810 -76684 -58438 -145165 -110746
6218 -110746 -15898 -75709 -135403 -131829 -107007 -160411 -127650 -137916 -178661 -201134 -194190 -119724
6206 -119724 -139780 -105227 -83169 -123866 -106006 -75367 -59681 -73974 -97454 -140136 -199783 -175523
6194 -175523 -96963 -87914 -101318 -105034 -13289 -14186 3863 19880 -32708 -39865 -74865 -107604 -143225
6181 -143225 -61191 -72720 -65549 -55799 -18030 -53305 -18433 71593 43734 26200 40611 -53717
6169 -53717 -98923 -45108 -43241 -100669 -125578 -71072 -54645 -60510 -41213 -19877 -54558 -40674
6157 -40674 -70437 -116997 -89393 -75189 -63127 -25090 -27581 -53617 -65278 -60142 -90136 18585
6145 18585 45893 -21663 -68498 3695 -1893 1388 44278 -19669 -76815 -38711 40365 11849
6133 11849 -39899 -39973 -42604 -33602 -11092 17907 29619 24317 79496 142483 174602 158308 201454
6120 201454 191690 205290 269667 247290 116049 87227 148534 233421 206362 253809 322520 279264
6108 279264 306037 363202 400872 378616 337939 295195 193029 139097 174361 254790 236400
6097 236400 222987 276263 259295 269682 327380 355610 279710 229110 235024 177162 146382 115391
6085 115391 159171 115192 100132 129763 165376 141982 141614 230039 202561 109598 78749 95867
6073 95867 29146 86765 203530 173651 164278 280688 303173 336081 389406 374401 339445 228557
6061 228557 199738 164284 142947 177511 231234 298913 327868 344580 378741 428873 347124 426148
6049 426148 442877 382755 302887 206886 154739 140853 209981 206705 207780 227210 188457 156646
6037 156646 138388 195549 178634 98851 101666 114164 132264 97320 119722 172432 120251 109012
6025 109012 143368 157847 112526 140486 191549 69812 4323 9951 -61696 -59480 -5712 49141
6013 49141 57787 83694 100692 6674 -21430 21339 46453 8338 38086 65047 28824 49130
6001 49130 50040 80688 84314 27015 6068 30073 34316 8324 -16507 -74950 -162771 -128250 -63904
5988 -63904 -85393 -50673 36395 28511 49967 103811 69506 19613 31071 44583 -14810 -7655
5976 -7655 -5857 59727 -2670 17438 33168 -64324 -33140 75395 79530 75577 23844 1701
5964 1701 -22817 29017 98874 76282 71574 87472 180349 178043 118536 70108 131415 111406
5952 111406 96382 60624 57833 58908 19231 85769 74007 61572 62674 53542 74506 122955
5940 122955 173686 106810 57089 -36710 -33024 20560 29066 44268 114848 129870 162805 112944
5928 112944 144483 105607 125602 171003 97265 70054 65444 11026 6158 63023 143029 150938
5916 150938 80391 149488 171162 211410 174113 154920 86001 9676 54225 125999 126570 74199
5904 74199 115966 57654 42864 109511 157967 148361 179300 257583 189677 142066 83096 79817
5892 79817 76998 39048 76028 75572 80600 95375 74552 65829 62212 43604 -5146 54187 -12066
5879 -12066 -12950 13579 -30277 9574 35347 39655 102456 25861 61622 51953 23136 10274 12638
5866 12638 72814 -31350 -71537 -70399 -61940 -16940 51678 104996 48264 46916 24094 27234
5854 27234 43656 161411 163748 100868 7408 -13856 -38184 -80761 19715 116669 108279 -556
5842 -556 -38241 7974 -8920 -70890 18838 -64486 -80927 -90486 -24712 48572 2768 56522
5830 56522 17533 19828 -33712 22191 38823 -27240 59928 72629 61026 41222 36231 21384
5818 21384 41473 123165 109782 55742 -2141 -57247 9891 -54940 -21399 -15602 -49954 -43705
5806 -43705 -18439 -59005 -74186 -23693 -64291 22890 53893 57971 55093 27339 104395 77741
5794 77741 10199 -46208 -35522 -18982 -6326 -24403 -24293 -23971 31974 -2131 4154 12449 29724
5781 29724 -2655 30164 97351 45249 -6465 -77463 -104780 -29171 71061 81044 48749 84268
5769 84268 55427 722 37106 6596 29774 16590 78411 17418 -59335 8573 -25810 -25049
5757 -25049 16515 44118 -2587 39476 68349 40618 69689 52479 70355 30929 27397 48310
5745 48310 40825 41399 69418 108423 51025 22868 68066 111696 139793 154346 231241 124349
5733 124349 158244 232765 118094 82946 100282 109633 68258 74267 101818 31985 72304 160900
5721 160900 103377 106194 133098 132229 -2172 164126 208169 89766 68917 47318 8982 -51451
5709 -51451 77899 104715 87333 39900 81407 74792 67599 100649 140210 133553 171274 192400
5697 192400 181155 156447 32546 71167 126139 129549 126074 187716 96419 168162 246323 195725
5685 195725 172768 134846 198586 163219 232719 222782 187160 155034 218139 175620 150938 143077
5673 143077 150753 143123 167175 202157 180086 162611 161718 222580 211836 252280 224369 213737
5661 213737 245765 220151 207715 244420 226714 157512 206257 226000 197736 170796 253445 298448
5649 298448 280669 225485 211597 221835 221801 286354 298575 199476 210937 256802 298316 292765
5637 292765 295749 364285 341081 321082 425943 377428 276111 281443 326925 312718 294214 350290
5625 350290 386715 355352 311914 418119 291018 239808 291960 334756 341662 375304 399334
5614 399334 398262 417185 421295 466868 509631 508965 485974 415280 421532 380001 415759 411692 374776
5601 374776 389886 391201 362910 428028 482848 461909 456861 444749 424464 467554 483844 502503
5589 502503 521571 469834 479457 501615 538485 583903 643033 703854 654133 674196 653965 652027
5577 652027 661815 642314 688128 626613 588611 624143 626528 711217 717654 692519 708953 718759
5565 718759 724072 749741 828819 846455 892763 807103 859988 915910 900780 984506 982353 1003284
5553 1003284 974517 977714 978289 978655 969702 1059923 1080087 1056100 1110380 1096961 1108399 1150415 1135735
5540 1135735 1164386 1235083 1307934 1379285 1406548 1423236 1426335 1443636 1455035 1513381 1585909 1625836
5528 1625836 1650963 1652010 1642329 1671763 1647151 1682840 1731121 1839064 1874737 1887653 1894627 2002266
5516 2002266 2040102 2107408 2247659 2317861 2382102 2492243 2523608 2617716 2762743 2833475 2914266
5505 2914266 3012760 3093465 3164668 3288273 3400100 3449235 3478912 3608326 3676737 3756930 4021315
5494 4021315 4244325 4435333 4671655 4997356 5301006 5624434 5967976 6311264 6630465 7034955
5484 7034955 7524466 8026868 8565248 9139531 9688264 10303748 10971464 11639736 12407220 13067765
5474 13067765 13652149 14273448 14878161 15576811 16315929 17304750 18506365 19871785 21360480
5465 21360480 22654719 23674403 24138961 23924363 23035864 21581186 19804802 17970922 16295829
5456 16295829 14728015 13272654 12123368 11085227 10101149 9264061 8563938 7874714 7391200
5447 7391200 6995039 6498316 6031402 5675852 5466913 5076336 4788148 4711701 4510603 4380919
5437 4380919 4224164 4049677 3857858 3713271 3527182 3408896 3304087 3131309 2975120 2910763
5427 2910763 2851125 2818493 2826201 2855415 2724118 2704549 2763309 2754529 2675694 2599416 2534864 2409969
5415 2409969 2331067 2370514 2357531 2352400 2390728 2409981 2448871 2419042 2498977 2545306 2595066 2688044
5403 2688044 2750764 2767191 2744303 2849609 3017187 3137345 3257525 3313721 3171353 2976408
5393 2976408 2987009 2991577 2882795 2788709 2662336 2557610 2466080 2476307 2488630 2472164 2434995
5382 2434995 2428888 2465509 2493001 2528819 2489157 2441296 2240517 2137562 2006963 1869907 1810640
5371 1810640 1767586 1740731 1719509 1763894 1812747 1763851 1746648 1745217 1734800 1642198 1563268 1561523
5359 1561523 1456031 1489790 1479144 1357436 1329878 1324857 1355421 1290451 1370273 1492444 1459872
5348 1459872 1404780 1369387 1324023 1318131 1291404 1295306 1234537 1279293 1265699 1343334 1469115 1492173
5336 1492173 1497333 1382021 1433668 1435811 1528639 1560192 1447204 1475959 1394577 1418412 1408103
5325 1408103 1550461 1630415 1597501 1581077 1457656 1462507 1381082 1345838 1375138 1405944 1431094
5314 1431094 1416804 1468090 1413904 1449233 1615838 1626629 1582407 1554348 1591826 1531219 1502801
5303 1502801 1595945 1511627 1362497 1331180 1318592 1399183 1433945 1511955 1521559 1543951 1542787 1553651
5291 1553651 1556863 1513666 1508070 1515200 1480620 1528761 1584791 1593898 1618761 1680698 1764407 1820397
5279 1820397 1853496 1823774 1843521 1866045 1932933 1904450 1805833 1840963 1892687 1989068 1996047 2077712
5267 2077712 2077913 2066296 2089044 2102825 2174367 2173606 2268688 2277273 2302822 2422871 2499565 2633541
5255 2633541 2680635 2886888 3014286 3052241 3209727 3240255 3229484 3213369 3271588 3268398 3272804
5244 3272804 3202201 3165913 3251764 3130468 3122115 3120800 3112909 3129065 3189913 3247454 3242907 3262960
5232 3262960 3277265 3261324 3331264 3516915 3648016 3841012 3931649 4008848 4144218 4292651
5222 4292651 4445981 4559268 4612461 4564467 4497878 4458613 4419542 4296913 4193582 4124651 3950161
5211 3950161 3848795 3733542 3624877 3610933 3626576 3600372 3475140 3467717 3461089 3508949 3612344
5200 3612344 3622199 3703767 3709628 3788812 3854263 3875350 3914773 3969149 4028916 4039383 3989388 3931844
5188 3931844 3906270 3860437 3713087 3636431 3558878 3439962 3378252 3331319 3258704 3249828 3134834
5177 3134834 3023890 2940399 2859985 2844854 2833279 2755844 2643130 2615773 2699167 2697464 2723457
5166 2723457 2715659 2728215 2675349 2762107 2732864 2714763 2759802 2679582 2645292 2612041 2577666 2488904
5154 2488904 2430110 2347795 2324976 2282614 2232076 2139355 2111865 2220253 2246060 2203375 2168323
5143 2168323 2075579 2126365 2156053 2227122 2255117 2212963 2188542 2152453 2210144 2204778 2247202 2278041
5131 2278041 2254149 2245948 2149312 2159104 2134410 2132346 2165330 2188804 2070309 2004786 2043400 2064238
5119 2064238 2100938 2130790 2108021 2068446 2089184 2079819 2106455 2161934 2174948 2219207 2172948 2099427
5107 2099427 2068408 2105993 2105876 2112505 2196485 2220988 2095679 2128871 2118672 2091738 2132077 2124927
5095 2124927 2020839 1980744 2061921 2061109 2007593 2100652 2118769 2029858 1966564 2010767 1994292 1942735
5083 1942735 2020512 2033459 2008353 1981569 1998268 2042900 2045417 2158166 2144413 2115136 2102827
5072 2102827 2038667 2034473 1935487 1965363 2041120 2045750 2029582 2056252 2097279 2099229 2091387 2079782
5060 2079782 2075910 2060364 2078695 2118957 2051372 2086532 2089530 2018250 2034030 2055655 2019021 2056070
5048 2056070 2034515 2049316 2063348 2081221 2039316 1990636 1966422 1997812 2028741 2080590 2152362
5037 2152362 2171708 2191004 2224535 2242217 2194677 2166711 2106603 2113350 2115124 2077994 2101444 2129944
5025 2129944 2139314 2218296 2288507 2229841 2272716 2264344 2352539 2344128 2289924 2291418 2219480 2056909
5013 2056909 2002392 2021630 2003736 2023966 2001477 2020613 2007712 2051745 2109284 2040587 1984934
5002 1984934 2030753 2067460 2026962 2001178 2037257 2041512 2055469 2113970 2161632 2106445 2148194 2258322
4990 2258322 2181989 2167323 2213077 2205901 2113019 2088904 2107945 2019331 2011344 2067669 2173382 2202356
4978 2202356 2183832 2207790 2206277 2254468 2230801 2229363 2284910 2303517 2336327 2370428 2334443 2363734
4966 2363734 2398626 2387526 2438246 2576023 2621539 2611649 2669401 2682422 2769932 2778003 2805735 2803374
4954 2803374 2761240 2725964 2809553 2893186 2929240 2880729 2898446 2924334 2986550 3057031 3222977
4943 3222977 3205278 3191598 3236546 3198211 3189637 3139189 3152485 3138129 3163977 3189753 3260112 3307768
4931 3307768 3387945 3466374 3478190 3472714 3419567 3382648 3362912 3425404 3499561 3557342 3552861 3623038
4919 3623038 3727130 3754753 3907575 4050112 4166369 4205336 4306941 4390214 4436002 4586166
4909 4586166 4715880 4757373 4901579 5062699 5231210 5394673 5624904 5834290 5967773 6157580
4899 6157580 6326890 6571933 6824628 7089147 7402814 7712041 8019835 8327066 8788217 9228091
4889 9228091 9812229 10473164 11069526 11709983 12523927 13409860 14397425 15510081 16676173
4880 16676173 17770062 18861421 19920624 20692410 21097915 21076882 20596199 19542162 18271246
4871 18271246 16916476 15569373 14310994 13269874 12303393 11447774 10642253 10010185 9463836
4862 9463836 9009319 8659537 8325435 8021717 7629028 7323626 7113583 6957507 6728911 6501207
4852 6501207 6374503 6179233 6028853 6004892 5976770 5812326 5669404 5636920 5402990 5214915
4842 5214915 5178716 5147034 4960924 4863883 4807538 4669849 4558506 4538841 4633809 4540757 4401476
4831 4401476 4335872 4286788 4191811 4158592 4097385 3940220 3778078 3740902 3684425 3638337 3621471
4820 3621471 3649860 3669260 3553578 3503774 3438757 3348800 3270580 3273323 3260017 3217996 3192442
4809 3192442 3211594 3275350 3231674 3264714 3283240 3260734 3212021 3246492 3230219 3178276 3128234
4798 3128234 3075647 3058651 3068324 3088212 3109401 3132027 3048487 3110797 3077832 3082500 3077287 3102537
4786 3102537 3001492 2883557 2874002 2898220 2946953 2866000 3016675 2996148 2937610 2958597 2970180
4775 2970180 2967469 2992408 3042602 2955464 2855717 2899655 2891931 2830079 2965130 3026704 3003412 3021860
4763 3021860 3096918 3122350 3173207 3209071 3194781 3190234 3151007 3182323 3196462 3193388 3289632 3319259
4751 3319259 3299050 3336928 3400765 3413761 3473982 3580157 3661532 3577953 3532554 3545831 3538390
4740 3538390 3489769 3604052 3673865 3631128 3616981 3641445 3704872 3711227 3798235 3883608 3886940 3825918
4728 3825918 3884563 3848488 3717742 3747027 3751225 3744798 3690713 3639225 3640295 3585013 3598985 3671209
4716 3671209 3643476 3619929 3694268 3678707 3645170 3654011 3617963 3626365 3542950 3584615 3673026 3677296
4704 3677296 3632426 3637512 3677240 3658140 3691006 3726331 3774958 3794370 3789418 3873245 3829192 3824795
4692 3824795 3945062 3922015 3921652 3932549 3944478 3837155 3759216 3855416 3933442 3883979 3915910
4681 3915910 4024994 3983633 4005119 4169046 4117571 4074459 4139688 4174748 4183121 4202326 4285932
4670 4285932 4281812 4242679 4325955 4391958 4401842 4482423 4591670 4516210 4554016 4595562 4624805 4643415
4658 4643415 4658488 4723596 4816270 4890407 4894836 4926476 5015288 5138776 5288416 5330112 5387069
4647 5387069 5463068 5498801 5551810 5574561 5697720 5765867 5798267 5920626 6050821 6115881 6121001
4636 6121001 6158147 6181942 6225810 6270807 6302785 6371639 6340692 6391540 6535367 6543486 6621486
4625 6621486 6691394 6816559 6940950 6974208 7069546 7143094 7135768 7136741 7169655 7167513 7178819 7165722
4613 7165722 7143319 7208684 7292545 7320707 7386855 7426341 7509716 7587213 7614186 7722958 7774139
4602 7774139 7769645 7865727 7930068 7965638 7999362 7972611 7976595 8019892 8128366 8157464 8144419 8192118
4590 8192118 8236869 8210344 8237246 8378484 8439558 8441819 8522505 8689618 8777966 8830349 8839134
4579 8839134 8904995 8861996 8831271 8849610 8791626 8713362 8659336 8599564 8587276 8572453 8562260
4568 8562260 8588496 8611601 8592346 8617020 8595905 8548937 8581122 8547218 8512465 8554321 8471590
4557 8471590 8451521 8462149 8447467 8458871 8412775 8379692 8421422 8416086 8384716 8375487 8347901 8432752
4545 8432752 8445157 8408756 8523127 8597565 8609382 8700190 8820992 8773536 8775177 8866846 8918480
4534 8918480 8931032 8923079 8954551 8909132 8873660 8975272 9079690 9168157 9255578 9371684 9507545
4523 9507545 9586152 9680516 9840502 9981217 10134662 10334640 10457648 10542586 10721289 10928088
4513 10928088 11087235 11329564 11500807 11718860 11954554 12242137 12544329 12896670 13285408
4504 13285408 13695667 14107797 14641767 15272525 15862545 16627653 17447117 18203460 19102145
4495 19102145 20109079 21313520 22619169 24004886 25455081 27053259 28731171 30448880
4487 30448880 32281077 33918195 35522603 36926215 37904011 38521305 38474859 37986119 36958630
4478 36958630 35453866 33742106 31819414 29810902 27783794 25997636 24297723 22734364
4470 22734364 21249173 19870817 18688319 17625407 16712669 15912858 15140072 14400229 13859121
4461 13859121 13418332 12947500 12487443 12086707 11670325 11223813 10871487 10611182 10337567
4452 10337567 10124229 10003799 9806817 9582699 9396164 9189077 9071781 8914009 8797427
4443 8797427 8664837 8530896 8460417 8386794 8367848 8360317 8301145 8261131 8328333 8315533 8317877
4432 8317877 8307806 8165104 8079042 8118698 8075037 8100068 8143767 8145656 8249526 8372502 8495164
4421 8495164 8641708 8896488 9188811 9487242 9751410 10125851 10339348 10412495 10269060 9878000
4411 9878000 9469925 9082127 8799716 8400718 8219789 8042306 7941266 7826309 7713581 7672343
4401 7672343 7531820 7419786 7465456 7471276 7482057 7624140 7698962 7804791 7950967 8138805
4391 8138805 8371885 8520229 8598974 8644178 8518557 8323364 8078147 7737303 7436231 7212740
4381 7212740 6990176 6781031 6614623 6490905 6346883 6182896 6104603 6057496 5924550 5767609
4371 5767609 5710704 5762169 5820678 5806986 5734729 5755159 5715223 5669706 5745781 5749619 5688840 5615515
4359 5615515 5530094 5417527 5417993 5437928 5453808 5469359 5461577 5503403 5440849 5340615 5359024 5370118
4347 5370118 5367810 5366849 5215156 5198702 5184287 5233118 5294225 5258587 5337148 5344959 5349592 5367106
4335 5367106 5353034 5281664 5294805 5367583 5326728 5450027 5466386 5439109 5545883 5578981 5668008
4324 5668008 5786257 5798342 5888620 5937138 5994667 5963532 5974491 6037038 6093198 6162075 6238328
4313 6238328 6410091 6488686 6712021 6801966 6992152 7144879 7270698 7444264 7617502 7804897
4303 7804897 7986914 8214136 8302593 8321792 8386976 8442851 8458700 8514903 8569165 8543525 8410460
4292 8410460 8391479 8415700 8380355 8380400 8379162 8362040 8286399 8303158 8341942 8388390 8534017 8759572
4280 8759572 8893844 8959895 9167193 9443861 9701407 10074715 10443001 10694307 10977946 11185469
4270 11185469 11375145 11495211 11565438 11637142 11632816 11592011 11586382 11575436 11422240 11280570 10968469
4259 10968469 10651406 10306952 9930951 9714864 9425257 9202114 9030750 8869396 8664224
4250 8664224 8613565 8535533 8521492 8545031 8543267 8591387 8627400 8642242 8768893 8835535 8874137
4239 8874137 8948380 9005733 8982723 8958704 8990109 8943453 8852171 8678659 8460472 8170751 7881105
4228 7881105 7677142 7397056 7209113 7046569 6849983 6642635 6482694 6322819 6145337 6066466
4218 6066466 5885353 5811964 5784137 5685685 5581097 5480737 5410608 5363561 5372830 5466186 5442359
4207 5442359 5432547 5405548 5250606 5154741 5211821 5156648 5100625 5118581 5033779 4943343 4978237
4196 4978237 5045405 4975868 4904929 4898899 4802645 4793404 4839016 4805653 4719045 4688360 4665583 4648899
4184 4648899 4629267 4652721 4666780 4673530 4678441 4634740 4559428 4493730 4436106 4507051 4526314 4454293
4172 4454293 4481312 4498786 4473870 4497167 4586381 4597955 4571945 4566175 4515691 4491056 4480105 4488204
4160 4488204 4390279 4409105 4468070 4436478 4497445 4528960 4561919 4642837 4630107 4545717 4489148
4149 4489148 4464173 4468491 4396404 4419856 4440282 4392094 4464841 4552113 4522633 4515676 4562923 4523752
4137 4523752 4532088 4572224 4518397 4474002 4404213 4416912 4432665 4484578 4512264 4612973 4652405
4126 4652405 4702535 4723667 4701820 4699850 4691413 4720918 4717279 4624766 4643277 4668375 4635102 4654086
4114 4654086 4674612 4630083 4552007 4588920 4599008 4528527 4536243 4513118 4548771 4535133 4513735 4517816
4102 4517816 4588208 4690194 4700282 4707116 4779387 4750315 4724180 4817486 4848634 4828485 4848634
4091 4848634 4877353 4945889 5015388 5032590 5068707 5105857 5202714 5288710 5298511 5301302 5329796 5381174
4079 5381174 5487264 5498285 5492301 5576474 5584009 5661981 5759502 5884188 5975361 5995368 6085369
4068 6085369 6129303 6182283 6267378 6343407 6415855 6531034 6549683 6516904 6583184 6656121 6709688
4057 6709688 6934044 6998387 7008175 7052286 7098536 7169738 7377711 7589498 7806307 7994050 8237681
4046 8237681 8500539 8825918 9157287 9447162 9741008 10059904 10340313 10630384 10904953 11141509
4036 11141509 11343464 11478810 11569539 11614350 11678841 11768330 11907259 12093993 12104006 11985549
4026 11985549 11868036 11810600 11836438 11954494 12139659 12327456 12528184 12822968 13146148 13508488
4016 13508488 13953449 14365785 14658026 15011455 15411202 15784814 16108570 16262021 16224532 16127830
4006 16127830 15967763 15857582 15837357 15855553 16047228 16206323 16445586 16631300 16739629 16570278
3996 16570278 16139668 15674272 15248622 14883959 14571805 14365492 14158565 13859702 13680196
3987 13680196 13668214 13730402 13775969 13778878 13856159 13985158 14198101 14482532 14534816 14285748 13899916
3976 13899916 13561793 13162775 12880520 12706994 12611181 12558661 12515311 12510016 12526427 12537150 12354679
3965 12354679 11945260 11417623 10983424 10693985 10394281 10012109 9493886 9017745 8722744
3956 8722744 8567509 8396332 8280388 8184788 8161938 8172102 8173807 8171720 8129767 7935859 7544870
3945 7544870 7184753 6857695 6645100 6528102 6489991 6476271 6439143 6366022 6347263 6429531 6407641
3934 6407641 6403865 6280448 6157154 6028401 5894714 5856032 5827394 5861984 5916417 5917762 5929164
3923 5929164 5887845 5835667 5855005 5876843 5806414 5747243 5739075 5605344 5556038 5554477 5568030 5596992
3911 5596992 5692597 5754635 5731761 5714309 5806491 5840453 5760142 5727073 5705156 5651807 5576253
3900 5576253 5554836 5551269 5547659 5523058 5511036 5509646 5551052 5645674 5632073 5699156 5711898 5698867
3888 5698867 5724648 5729632 5769374 5818848 5875878 5871523 5967350 6043538 5969853 5958426 5978756 6011354
3876 6011354 5989668 5995032 6077877 6086567 6137194 6225482 6305250 6341385 6390839 6439700 6481080 6640730
3864 6640730 6654202 6733738 6739738 6681811 6737128 6734758 6774224 6838154 6865213 6895092 7005461 7102398
3852 7102398 7141721 7190796 7145491 7169028 7243115 7280243 7422979 7562633 7608398 7714992 7829036
3841 7829036 7922369 8005475 8164483 8328391 8525029 8708307 8938243 9110250 9268988 9542171
3831 9542171 9870166 10331392 10833523 11341660 11901819 12499713 12874670 12894657 12594780 12163845
3821 12163845 11839683 11627132 11462805 11443278 11524088 11593884 11655160 11827153 12141565 12408419
3811 12408419 12771923 13311413 13733841 14175722 14528306 14486140 14152287 13949507 13665589 13426537
3801 13426537 13313362 13242510 13172958 13169873 13350820 13389887 13398251 13597401 13799493 13923358 14125071
3790 14125071 14348212 14548658 14713026 14890346 15134932 15448600 15715557 16004588 16365128
3781 16365128 16642899 16969092 17389116 17776725 18161346 18814136 19388138 19957964 20595154
3772 20595154 21334849 22120899 22972083 24077377 25163016 26278063 27416782 28106284 28312978
3763 28312978 28312495 28309796 28411460 28746286 29294409 29924037 30647655 31409158 32122278 32776385
3753 32776385 33589444 34538888 35594220 36936285 38363584 39616208 40711675 41524490 42032142
3744 42032142 42383094 42794818 43168254 43307791 43356093 43142905 42597325 41928473 41126342 40122575
3734 40122575 38944715 37870624 36894169 36015570 35256313 34744534 34285337 33887447 33532727
3725 33532727 33332199 33197565 33053426 32989918 32870060 32700795 32502591 32337452 32168647 32000931
3715 32000931 31858874 31806379 31795599 31855787 31988237 32176482 32277595 32520409 32803835 33092723
3705 33092723 33593929 34157080 34633829 34550554 33983016 33145862 32554678 32215224 32037764 32001365
3695 32001365 32047861 32235828 32410674 32728995 33207145 33709625 34390114 35217657 36275254
3686 36275254 37496374 38938367 40401957 41586522 42316873 42991668 43868650 44641930 44961377
3677 44961377 44730996 44242817 43883519 43696693 43627561 43644766 43581669 43580592 43641618 43777752
3667 43777752 43924097 44280834 44806280 45652770 46642824 47774578 49019487 50136808 50695655
3658 50695655 50670191 50016232 49253990 48730773 48215954 47661086 47208974 46707489 46127223 45472297
3648 45472297 44841740 44201390 43492213 42714048 42045874 41326462 40699399 40107277 39435799
3639 39435799 38846846 38244269 37677270 37226913 36728012 36090030 35601483 35011539 34351350
3630 34351350 33761732 33293207 32767392 32197339 31736491 31266975 30806975 30403975 30007165
3621 30007165 29644433 29239991 28857974 28453329 27957344 27509262 27059228 26707786 26334070
3612 26334070 25901164 25662649 25392079 25196061 25035733 25017586 24930263 24875503 24815965 24734539
3602 24734539 24721366 24708804 24742844 24758962 24872367 25051358 25135400 25358168 25715337 26027746
3592 26027746 26549920 27141393 27740076 28337920 28939357 29506080 29782477 29555609 28866336
3583 28866336 28017225 27088261 26369354 25897935 25542767 25255736 25034195 24780012 24528795
3574 24528795 24351056 24173135 24058589 24008798 23979338 24110273 24202636 24219424 24431382 24640390
3564 24640390 24820522 24869779 24931558 25039906 25103842 25332340 25614356 25957386 26042001 25936595
3554 25936595 25425165 24625936 23900855 23205300 22752315 22423441 22148169 22064274 22005512 21977510
3544 21977510 22076458 22271034 22520647 22825457 23257067 23745847 24221505 24738654 25475253 26259994
3534 26259994 27196473 28291859 29211740 29740578 29671803 29244662 28878764 28550564 28198900
3525 28198900 27833467 27400063 26996744 26886060 27080784 27465638 27834374 27880387 27303796 26446974
3515 26446974 25755242 25393596 25229726 25306008 25623724 26002634 26560705 27048217 27243787 26929140
3505 26929140 26332319 25793398 25505535 25417105 25529652 25889964 26322167 27021279 27806032 28537296
3495 28537296 29060792 29042367 28334200 27342289 26490245 25920748 25689032 25459285 25389838 25433206
3485 25433206 25526182 25660829 25789648 25957908 26203454 26514533 26911173 27530216 28073504 28764211
3475 28764211 29481162 30293236 31196725 32057447 32782666 33585415 34433396 35456079 36639205
3466 36639205 37943419 39569905 41377856 43464662 45964528 48840544 52186129 56115921
3458 56115921 60601926 65664373 71272649 77142091 82534425 86014262 86177249 82500240
3450 82500240 76056717 68953915 62576089 57115670 52560760 49054385 46238204 43925269
3442 43925269 42221941 40983106 39925854 39200304 38784613 38677402 38747738 39089777 39704078
3433 39704078 40560277 41759078 43234845 45038227 47192359 49562548 51991090 54302156
3425 54302156 55684249 55449630 53372003 50115660 46313647 42681804 39492510 36810239
3417 36810239 34549508 32625979 31106796 29840644 28729500 27849957 27133922 26422051 25863825
3408 25863825 25327017 24857504 24423125 24018053 23569586 23127228 22781176 22437365 22160923
3399 22160923 22017340 21845564 21706883 21654693 21659215 21739236 21908518 22048753 22170838 22293331
3389 22293331 22383080 22403286 22436151 22452999 22486670 22549937 22583639 22611335 22645282 22804451 22976219
3378 22976219 23152020 23258700 23244266 23082789 22887851 22817048 22689188 22566915 22453046 22382793
3368 22382793 22332839 22423572 22558389 22769096 22966423 23219682 23461998 23650671 23797911 23813516
3358 23813516 23938854 24098116 24245740 24538925 24933023 25264840 25692927 26205771 26693115
3349 26693115 27175562 27634570 28200212 28565585 28941577 29300159 29665055 29828044 30115099
3340 30115099 30304432 30475799 30739460 30958176 31246649 31498414 31712667 31895248 32093325
3331 32093325 32414204 32842394 33318895 33934312 34664309 35552364 36548044 37677862 38834442
3322 38834442 40070783 41313620 42304495 43100458 43931320 44916184 46029351 47308068 48833447
3313 48833447 50550886 52484568 54638563 56926862 59274391 61859538 64528137 67391215
3305 67391215 70469808 73895363 77761620 82336775 87473998 93295166 100034756 107791324
3297 107791324 116701292 127119467 139497403 154420006 172821378 195917925 225152040
3290 225152040 261092139 300989683 338678897 371521551 394877324 400498412 390166996
3283 390166996 367471921 332911012 290566780 249234916 212530032 180124406 153650280
3276 153650280 133826832 119315175 108244710 99525182 92327625 86257109 81012968 76447704
3268 76447704 72294507 68527151 64902995 61389427 58103213 55151580 52557763 50246903
3260 50246903 48087046 46250428 44664157 43244134 41955608 40854943 39902962 39002376
3252 39002376 38192905 37515395 36790551 36044095 35367901 34662847 33960899 33460151 33030018
3243 33030018 32527954 32016283 31569153 31194354 30779897 30409062 30107381 29773773 29422352
3234 29422352 29111110 28803184 28552371 28376233 28207792 28047283 27850162 27709720 27561146
3225 27561146 27354630 27119786 26962666 26808288 26513474 26284415 26114684 25919888 25876498 25820067
3215 25820067 25758444 25656115 25609322 25594721 25507851 25421004 25296764 25026539 24810000 24641224
3205 24641224 24417561 24304721 24324408 24452991 24633741 24918047 25312871 25801434 26346672 26962979
3195 26962979 27826336 28767138 29928434 31208140 32746062 34384118 35895315 37280113
3187 37280113 38437478 39164119 39318277 38703879 37168441 35028183 32806262 30680207 28713805
3178 28713805 27014389 25612294 24377850 23300284 22518618 21793545 21167435 20652747 20229797
3169 20229797 19758745 19373671 19086211 18699014 18398187 18090793 17721751 17427773 17142990
3160 17142990 16894059 16718752 16618173 16565205 16561162 16594044 16633189 16700362 16818839 16940028
3150 16940028 16947158 16856888 16664556 16171429 15556891 15032713 14467110 14028362 13652735 13282602
3140 13282602 12948489 12682973 12526980 12359272 12211711 12118050 12084879 12002121 11993617 11972896
3130 11972896 11986601 11961120 11899403 11883550 11863440 11809105 11812576 11812103 11745538 11796224 11784219 11751061
3118 11751061 11786687 11872522 11881943 11888967 11946554 11924134 11951472 11896060 11931562 11928184 11880535 11926402
3106 11926402 11998233 11942244 11972255 12059419 12066689 12091938 12171843 12416667 12549395 12566808 12673143
3095 12673143 12718894 12739150 12809900 12886650 12940821 12922611 12977861 13048154 13065167 13140479 13245849
3084 13245849 13319843 13406824 13589874 13749967 13936748 14184621 14377327 14572573 14727325 14861413
3074 14861413 15130565 15275545 15444297 15777397 15921079 16128373 16375607 16747482 17082467
3065 17082467 17429155 17899254 18260174 18575880 18989400 19400878 19764747 20283113 20812081
3056 20812081 21349482 21874712 22469344 23165031 23908984 24690481 25463559 26467876 27386576
3047 27386576 28204942 29111378 30083900 31078365 32116324 33139665 34217316 35310177 36481584
3038 36481584 37722662 38982919 40313300 41698793 43031927 44351646 45763152 47067087
3030 47067087 48475916 49891044 51215646 52618087 54024293 55463483 56820450 58206878
3022 58206878 59610338 60980270 62358655 63637885 64773033 65805394 66840341 67712913
3014 67712913 68571484 69399514 70116795 70759679 71473134 72005085 72444517 72870950 73002572
3005 73002572 72902072 72690990 72524043 72258310 71889376 71461250 71038322 70505999 69822164
2996 69822164 69109551 68184581 67241452 66195125 65154683 64085634 62998074 61851432 60707640
2987 60707640 59433054 58155477 57095313 55957565 54733832 53546746 52262286 50847846
2979 50847846 49397734 47870552 46337014 44566142 42915382 41339394 39661739 38102259
2971 38102259 36710545 35317112 33923361 32659142 31435682 30289103 29138785 28137807
2963 28137807 27085895 26039290 25111861 24242265 23330196 22493641 21718816 20977357 20239282
2954 20239282 19551435 18966076 18240175 17647680 17048235 16535566 16068292 15601985 15188920
2945 15188920 14685293 14326504 14031469 13614535 13163799 12845060 12532016 12229522 11955652
2936 11955652 11674372 11358064 11143812 10956118 10719050 10545932 10377558 10179786 10000462
2927 10000462 9915399 9744027 9566889 9441086 9261261 9009535 8908289 8822398 8728993 8621053
2917 8621053 8500739 8403033 8284243 8143205 8016588 7914982 7886283 7751428 7691221 7590806
2907 7590806 7434877 7347582 7328574 7202196 7155244 7184063 7163654 7057606 6963575 6939824 6875570
2896 6875570 6846083 6812349 6815228 6839465 6816190 6742235 6691206 6714069 6606929 6618732 6641340
2885 6641340 6618763 6612092 6585129 6554301 6500557 6506518 6522640 6482744 6476837 6490682 6491361 6525842
2873 6525842 6524095 6575085 6547947 6568169 6527901 6508226 6539426 6545309 6579397 6620065 6577127 6520166
2861 6520166 6574596 6594004 6561366 6498411 6483644 6430695 6389646 6383105 6371727 6347346 6309607 6412620
2849 6412620 6359958 6323651 6364933 6390704 6389831 6339862 6295397 6288611 6128329 6141439 6210111 6158132
2837 6158132 6205587 6233042 6179602 6109814 6147604 6215210 6135856 6178167 6247760 6195273 6133837
2826 6133837 6146911 6128967 6099649 6169949 6245959 6262467 6334069 6440477 6456857 6462864 6586180
2815 6586180 6615836 6656599 6730395 6775728 6790872 6870600 6987002 7096347 7162988 7268352 7391876
2804 7391876 7475596 7534083 7726176 7807327 7880610 7919417 7951433 8065672 8070776 8179475 8224752
2793 8224752 8230049 8286563 8404107 8442498 8447482 8537342 8634524 8609007 8628463 8611924 8587235 8608585
2781 8608585 8721775 8776132 8769577 8824930 8834413 8887306 8924207 8949051 9023431 9062011 9037085 9022468
2769 9022468 9010712 9014892 9092082 9191036 9264106 9222959 9287952 9309040 9335015 9423975 9487131 9453266
2757 9453266 9357534 9443559 9499765 9439405 9443815 9461637 9492092 9534371 9542487 9559886 9619547 9594537
2745 9594537 9633015 9721916 9765120 9725810 9827940 9854085 9853818 9900887 10113927 10238153 10185750
2734 10185750 10369918 10489636 10606051 10800347 10882112 10957221 11122932 11291831 11413431 11519034
2724 11519034 11728118 11909610 12102406 12391777 12662791 12857532 13027821 13258799 13452193
2715 13452193 13728776 13996211 14284408 14565266 14792573 15130399 15484385 15830628 16129122
2706 16129122 16533085 16957036 17245261 17626840 17985828 18372067 18845535 19376482 19901234
2697 19901234 20375442 20969148 21627795 22267331 23049806 23916904 24690036 25370339 26095394
2688 26095394 26752960 27420597 28186311 28869034 29642533 30294650 31029735 31670885 32363722
2679 32363722 33259434 34087436 34926178 35790343 36628645 37458892 38306306 39129627 39998880
2670 39998880 40863254 41642248 42366282 43065943 43798154 44513913 45231963 46051145 46813323
2661 46813323 47531140 48335991 49145552 49970437 50741324 51526311 52309012 53145047 53967761
2652 53967761 54821866 55713499 56540924 57429738 58265277 59013686 59671903 60435916 61199832
2643 61199832 61950148 62790985 63568457 64344187 65139551 66037184 66949260 67945836 68962724
2634 68962724 70072165 71150337 72424129 73758489 75071102 76502094 77975353 79571244
2626 79571244 81215355 82930797 84618711 86433017 88232644 90117188 92121020 94110591
2618 94110591 96249520 98473686 100737220 103062010 105476068 107962159 110396720 112800445
2610 112800445 115250849 117625761 119941328 122347818 124645683 126914684 129208688 131613170
2602 131613170 133999211 136371960 138788075 141256269 143704643 146273609 148855430 151434297
2594 151434297 154132279 156893383 159960488 163230231 166627799 170039544 173379473 176337486
2586 176337486 178802326 180837287 182180633 182792268 182785130 182248091 181281482 180180034 179148425
2577 179148425 178235138 177513267 177053084 176585115 176070077 175468186 174639211 173430117 171700668
2568 171700668 169507501 166706872 163383820 159917317 156435586 153020053 149926102 147046376
2560 147046376 144468585 142187039 140232426 138547864 136993559 135605472 134312379 132972911
2552 132972911 131735261 130473129 129051338 127677837 126410753 125040799 123614760 122195043
2544 122195043 120792954 119340204 117869999 116409059 114782734 113001236 111031110 108880280
2536 108880280 106550796 104142365 101634908 99089374 96508246 94014598 91581873 89195591
2528 89195591 86883187 84739604 82647364 80665018 78647619 76670332 74726824 72761771
2520 72761771 71059312 69166147 67322992 65601051 63975003 62328450 60826257 59502519
2512 59502519 58164472 56974074 55954340 54984162 53951531 53072970 52284436 51549748 50825239
2503 50825239 50149568 49622024 49098954 48622471 48327075 48006742 47685990 47514889 47371927
2494 47371927 47346631 47322888 47334616 47426715 47486215 47594189 47914646 48368085 48853108 49472328
2484 49472328 50098717 50880219 51726597 52776451 53896686 54855683 55826051 56581175 57131894
2475 57131894 57511373 57644298 57464511 57105575 56538718 55775767 54921048 54078912 53307207
2466 53307207 52534170 51780290 50970201 50024165 49043827 48067756 46809523 45409005 43856881
2457 43856881 42101651 40103412 38054521 35978016 33886532 31963806 30124143 28419468
2449 28419468 26905457 25540632 24228053 23006625 21951116 20942575 19991799 19148803
2441 19148803 18423843 17721609 17177345 16657519 16057323 15554482 15105116 14653822 14237409
2432 14237409 13821578 13422021 13078940 12790594 12422456 12034535 11779981 11501231 11245628
2423 11245628 11029266 10884544 10593164 10366598 10175478 9896020 9722049 9506263 9343073
2414 9343073 9177402 8970808 8776709 8638489 8511920 8308205 8125007 8037461 7876178 7682783
2404 7682783 7563628 7492469 7385500 7181464 7043433 6833761 6759480 6713226 6639934 6555161
2394 6555161 6419771 6375563 6246306 6113871 5980506 5946179 5854767 5801947 5707680 5643531 5639123
2383 5639123 5540172 5491672 5412385 5402971 5315193 5210558 5091216 4994184 4948572 4825030 4640874
2372 4640874 4644106 4613657 4537071 4496640 4464684 4426105 4330853 4338447 4285043 4164812 4084880 4006064
2360 4006064 3888023 3810603 3842194 3781892 3721719 3639196 3665393 3658477 3610278 3593361 3534348
2349 3534348 3421714 3378099 3340497 3339684 3261556 3164057 3196581 3207570 3202536 3180328 3179857 3180205 3142324
2336 3142324 3119421 3117804 3055989 3024773 2980722 2936865 2987513 2958429 2949579 2975573 2966723 2952812
2324 2952812 2975534 3078248 2959392 2928227 2917083 2909812 2855195 2881402 2908411 2810833 2733841
2313 2733841 2774197 2823356 2754923 2743798 2816699 2856068 2860184 2942822 2892869 2806671 2801792 2824415
2301 2824415 2866187 2830542 2873033 2840454 2802679 2798758 2815525 2791142 2799815 2750197 2798045 2853681
2289 2853681 2801177 2828407 2903064 2911176 2919149 3024168 3025531 2948280 2859635 2903417 2962382 2984068
2277 2984068 2981002 2975667 3052510 3127411 3185962 3196326 3222376 3264263 3316795 3284544 3270298 3375976
2265 3375976 3419200 3414781 3411522 3595790 3671823 3679593 3734780 3879757 3984440 4067676 4105475
2254 4105475 4180945 4214352 4349487 4493896 4438610 4315949 4164096 4024518 3842170 3657664
2244 3657664 3500443 3423721 3272082 3085295 3021151 2883733 2667120 2594247 2586702 2466318
2234 2466318 2429655 2323209 2205367 2117181 2145425 2203726 2087792 2027846 1969374 1917096 1911887
2223 1911887 1888562 1879974 1860461 1798103 1779909 1761232 1744248 1673104 1636915 1613860 1549073 1579051
2211 1579051 1628052 1524288 1432813 1403289 1397034 1305745 1247337 1189334 1214129 1176162 1191695
2200 1191695 1131857 1012807 970952 987818 1005244 1016336 985913 1008725 976033 912410 994993
2189 994993 1021651 998662 903835 905361 960581 947747 913818 948307 945774 824418 795233 828786
2177 828786 835152 791452 790918 825124 805239 806124 836805 868024 852744 912699 953023 940205 860167
2164 860167 866025 864743 849757 828233 807611 706255 603164 688581 715569 772417 745910 742762
2152 742762 712001 682252 697237 738562 749018 669354 637946 520422 452743 447855 409339 433816
2140 433816 495406 416545 451222 443907 403431 451611 454095 431477 340883 249168 259356 319999
2128 319999 301853 316715 304641 250315 220491 243442 284491 278769 288600 331295 277783 245832
2116 245832 385683 347895 248534 293909 319376 290285 198583 244714 316773 229373 228875 251642
2104 251642 162322 111985 105646 179641 210312 262809 304703 218750 165588 154536 263694 98192
2092 98192 10086 48004 66122 21706 69025 155262 65932 50063 116822 115524 118011 84586
2080 84586 102410 43981 -69192 9410 37285 -81190 -49938 7638 96683 55291 28641
2069 28641 93823 62372 55378 119777 113629 19680 48617 73344 98746 105045 139356 152295
2057 152295 97880 164074 212285 148236 128787 158245 156014 159338 137707 130635 113825 34986
2045 34986 27681 84237 30647 -54536 55069 47335 28557 -12118 54295 91593 87740 191787
2033 191787 264745 168246 241755 351240 344855 258365 261647 242263 106130 36518 30171 52478
2021 52478 34431 71150 198761 127356 194249 205460 212433 255207 220874 175342 144403 152297
2009 152297 152586 120788 112558 164970 228759 238052 318978 357561 301592 311625 244593 274225
1997 274225 188405 108534 146537 103584 80341 187841 261246 242522 283666 291633 257895 232564
1985 232564 251798 318235 276370 256577 287156 148034 101933 171533 246152 325961 353515
1974 353515 393111 424453 398934 388297 534347 548070 464174 426955 395410 324402 297810
1963 297810 313826 353530 322037 333395 334882 341053 328997 416450 420754 401695 367250 271273
1951 271273 220925 216021 239484 285537 279682 236232 257398 283863 188626 170388 223846 243464
1939 243464 185817 213041 259008 229927 285502 330791 328955 286373 299555 282496 256570 287519
1927 287519 329247 314297 217723 231213 292898 259975 270302 269279 260648 264578 213944 239773
1915 239773 277809 216650 196505 176051 161751 178231 164908 180623 199221 194337 197795 264444
1903 264444 238315 249930 198819 133169 181292 205472 258204 276488 280134 248913 241186 221919
1891 221919 285791 268823 232170 240707 270813 259395 242389 213771 261271 252134 208925 255373
1879 255373 247174 226056 249785 219981 112638 149111 161476 79024 71715 97905 131590 116536
1867 116536 89223 166885 138489 130803 136134 114676 146867 135337 154713 127541 92639 65009
1855 65009 111243 128258 115776 152019 136662 133550 122213 96150 66593 8522 21090 33457
1843 33457 -56204 22165 110613 45987 112184 192539 119242 125794 163664 98519 67876 80990
1831 80990 92719 42587 -27762 -128703 -94216 -83826 -91926 -52971 -74109 -6665 -39731 -42068
1819 -42068 -85384 -111148 -31765 -10814 247 -20136 -72795 -129879 -120472 -33619 -64532 -89537
1807 -89537 -123999 -178770 -171875 -190206 -100662 -136476 -125774 -84942 -166501 -182416 -99010 -101287
1795 -101287 -160741 -98355 -114073 -189892 -211339 -219241 -210872 -181910 -183485 -230238 -224034 -206462
1783 -206462 -268089 -243767 -164304 -166738 -168289 -168367 -164709 -161318 -154192 -111535 -120470 -131068 -142966
1770 -142966 -173935 -220566 -221123 -191077 -201053 -176009 -201221 -200464 -164014 -153402 -103710 -130439 -123971
1757 -123971 -163595 -174657 -243849 -299015 -261469 -295765 -310639 -224127 -106397 -128406 -126391 -55564
1745 -55564 -46581 -182522 -147578 -114918 -196423 -282913 -201465 -122299 -245195 -307097 -298347 -298771
1733 -298771 -299770 -271803 -209693 -214967 -181001 -20521 -82792 -178626 -187387 -174166 -226551 -224340
1721 -224340 -127360 -107969 -142532 -135534 -138942 -228229 -138335 -109139 -209927 -188278 -118252 -110469
1709 -110469 -194163 -183798 -207061 -274010 -265184 -232349 -233369 -153935 -161917 -199019 -243134 -299655
1697 -299655 -289286 -241335 -215302 -237122 -222388 -194348 -162748 -239695 -235995 -265629 -302936 -331062
1685 -331062 -284950 -268688 -242772 -239773 -230410 -242764 -236350 -185261 -167526 -232569 -211260 -198700
1673 -198700 -305260 -335688 -387980 -364505 -325478 -278763 -251314 -204822 -184418 -125291 -148703
1662 -148703 -136591 -118616 -133420 -163596 -247982 -264809 -251908 -323168 -388679 -305861 -290198 -279459
1650 -279459 -239698 -259319 -284476 -335462 -358877 -414157 -386653 -386480 -398302 -434509 -452109 -343056
1638 -343056 -324787 -272998 -226435 -229672 -216217 -215625 -232459 -235037 -263961 -284519 -256582 -293467
1626 -293467 -276211 -235313 -229033 -220023 -200589 -191562 -213236 -233029 -178329 -208214 -204503 -124773
1614 -124773 -160081 -261617 -237212 -248906 -213435 -152484 -125412 -126646 -107823 -83895 -113346 -133255
1602 -133255 -149688 -180691 -274664 -217118 -158008 -117537 -121723 -210512 -196694 -191707 -215281 -168955
1590 -168955 -197658 -195836 -206360 -148666 -128498 -143486 -139042 -145542 -127501 -149284 -164216 -125924
1578 -125924 -112413 -60024 -37839 -100550 -91343 -66772 -101029 -65505 -21913 -60677 -76085 -76624
1566 -76624 -143027 -180186 -172473 -132885 -166475 -172925 -187330 -178004 -141906 -176640 -167938 -185399 -161965
1553 -161965 -152032 -109739 -55331 -36242 -82974 -128668 -96143 -132107 -208607 -139101 -154930 -186783
1541 -186783 -176965 -216975 -283204 -317601 -212444 -178661 -168765 -261208 -303125 -269870 -251340 -246242
1529 -246242 -200675 -164333 -180423 -158779 -168176 -183863 -206485 -221914 -228555 -263585 -254353 -185851
1517 -185851 -234660 -247332 -226221 -290470 -276760 -263745 -227179 -222243 -239194 -264086 -228589 -218620
1505 -218620 -236530 -181636 -157603 -184451 -209161 -150449 -117090 -240607 -170671 -133951 -298476
1494 -298476 -314231 -271494 -253691 -316156 -254056 -245364 -325821 -367271 -330085 -293128 -313298 -277199
1482 -277199 -271304 -351129 -336005 -328783 -278799 -263650 -279190 -258114 -378794 -353759 -346971 -305882
1470 -305882 -293691 -251189 -280884 -294485 -273419 -269364 -199811 -229025 -177369 -203618 -231640 -271362
1458 -271362 -262913 -225908 -221712 -280824 -316762 -302514 -256461 -222035 -207491 -216184 -171043 -192270
1446 -192270 -258579 -264026 -269034 -269196 -274068 -178362 -200441 -255313 -229087 -246125 -230827 -260550 -165884
1433 -165884 -209939 -299914 -234849 -194257 -265045 -305281 -255320 -263197 -271962 -185522 -127619 -259965
1421 -259965 -272613 -225285 -250799 -320232 -235088 -218430 -269612 -242547 -199607 -187997 -285016 -245583
1409 -245583 -223212 -232778 -218241 -191723 -218187 -233619 -219604 -205336 -260242 -283740 -209212 -154178
1397 -154178 -179462 -149145 -151513 -153583 -178102 -196283 -187030 -203418 -156377 -204227 -233266 -206319
1385 -206319 -251321 -274998 -257680 -270337 -254269 -217117 -160464 -269735 -242882 -172968 -199700
1374 -199700 -214153 -176429 -163908 -262015 -272433 -214191 -203772 -231903 -170421 -149323 -204701 -196023
1362 -196023 -147299 -177098 -223687 -163143 -169320 -208446 -243047 -239271 -207399 -227536 -246520 -233491
1350 -233491 -243314 -256931 -237772 -204105 -195717 -255226 -223016 -210812 -307791 -246625 -145978 -189707
1338 -189707 -153812 -106348 -136560 -177214 -174305 -190628 -220193 -203595 -259968 -254725 -287116 -240454
1326 -240454 -231412 -214744 -212945 -212834 -201626 -231189 -227073 -231409 -151803 -134324 -154681 -147522 -154485
1313 -154485 -169430 -163520 -130306 -154216 -179987 -257850 -184977 -166713 -245471 -262676 -250146 -236796
1301 -236796 -259724 -187994 -171371 -206049 -223177 -191617 -192703 -274504 -243692 -189259 -225301 -193135
1289 -193135 -134144 -135264 -181943 -163210 -48824 -32685 -62850 -128157 -228002 -255762 -264875 -211846
1277 -211846 -206434 -312203 -326561 -290885 -277335 -228587 -114457 -76381 -194289 -155678 -66319
1266 -66319 -16685 -41105 -103150 -78492 -127134 -145191 -166049 -194121 -137363 -127044 -168637 -164999
1254 -164999 -173480 -214242 -225760 -106524 -143299 -201663 -141387 -202529 -230268 -226404 -108766 -84851
1242 -84851 -133234 -68912 -52531 -68046 -89770 -100537 -104004 -117603 -93959 -128430 -224119 -160972
1230 -160972 -43763 -69532 -143853 -120297 -118349 -197877 -188964 -166832 -165266 -206253 -85884 -135401
1218 -135401 -150430 -95392 -82239 -125842 -110890 -81936 -91469 -114250 -150658 -197281 -240263 -233215
1206 -233215 -211351 -210418 -228250 -166328 -119416 -62998 -118435 -87390 -41068 -135009 -169481 -251283
1194 -251283 -235129 -284867 -233566 -208245 -195049 -143881 -146328 -98378 -106002 -101335 -128057 -119572
1182 -119572 -121540 -159392 -248870 -131922 -154935 -268461 -109334 -97296 -143419 -54826 -17537
1171 -17537 -79710 -65934 -43553 -129349 -127701 -51986 -133952 -114834 -116025 -82589 -11374 13737
1159 13737 27807 -62268 -27599 -48642 -81720 -578 -5572 -57764 -36078 -41458 -86446 -73950
1147 -73950 45753 39340 90616 104035 21230 9481 -30942 -30909 -23991 56658 62003 -120518 13377
1134 13377 90353 66297 105921 187136 128600 88548 141653 159875 201779 267988 283087 197154
1122 197154 123052 237607 232259 200970 268993 319129 218004 122118 179298 190100 174594
1111 174594 252189 295711 205340 182679 295549 344859 371929 347403 331181 331640 247595 274305
1099 274305 340395 376679 357997 384665 399354 302677 362831 466947 483755 462756 511560
1088 511560 475658 365455 404584 518037 449025 407151 421556 402938 437855 617059 687493
1077 687493 616873 690004 692295 630847 763209 884715 904240 933931 964140 973261 1004822 1102474
1065 1102474 1200176 1301242 1418319 1472771 1543699 1648292 1715278 1796117 1926107 2123809
1055 2123809 2224401 2391187 2556420 2693138 2934841 3173872 3379362 3695308 4140663 4752839
1045 4752839 5350947 6223301 7154571 8294287 9881445 12152981 14926669 16871393 14669354
1036 14669354 10716526 8053015 6369752 5283283 4447132 3837286 3418173 3013777 2658182
1027 2658182 2411942 2194691 2066882 2044734 1994636 1856670 1704079 1464900 1264733 1217157
1017 1217157 1223414 1136493 1112683 1053406 916137 764364 802162 821287 780473 703390 699469
1006 699469 649079 653881 696620 718598 688950 618715 565358 587610 576464 574293 555709 479097
994 479097 407745 364754 372270 402865 378341 430800 398066 332704 286487 258935 242479 333381
982 333381 409400 312304 242930 259088 249079 280574 275149 285872 238860 257173 210477 169638
970 169638 119641 171527 167072 236456 279879 260542 175194 160343 158215 153037 171018 119201
958 119201 98919 116575 113430 155091 173407 135958 149758 57275 128622 216752 147444 83396
946 83396 151759 175217 81498 60477 75988 89660 52624 119278 162388 93806 143397 168372
934 168372 185865 140376 97110 -29133 -90090 -97619 -55715 -58629 -87028 -100485 -78589 -43272
922 -43272 -78803 -28274 24168 82310 84534 79385 33495 -14138 13028 6716 -28601 -40276 27564
909 27564 49919 68424 1928 -25282 -67920 -58412 -70851 -106047 -64979 13823 -49485 -56680
897 -56680 -16656 -111175 -81502 6858 60748 121456 123208 83383 45428 70506 57501 79903
885 79903 65848 54499 864 24688 -35740 -104934 -35824 -32269 -76151 -98406 -40019 -93774
873 -93774 -129904 -86065 -128752 -114892 17445 50573 -41725 -4095 68579 25404 19009 23040
861 23040 7206 -43084 -24458 14270 -89770 -44709 9539 33558 45686 -8003 41550 5389
849 5389 26836 14960 91772 68649 -79071 -52903 -6662 -11087 -61498 -13475 -10175 -37901
837 -37901 13099 73276 74674 140615 144671 55352 20251 -31162 -29499 36906 68743 22448 24304
824 24304 -85319 -101838 -80892 14687 28696 -12613 11963 13889 -55473 -72085 -17510 -27923
812 -27923 -98099 -9652 53966 -1025 24921 42812 23647 39437 86979 51771 -44260 -40830
800 -40830 73674 108423 71584 82990 -5396 -31143 -10699 15969 14054 3760 67506 63656
788 63656 41514 25669 12955 3258 -4090 61457 77401 78624 102628 74683 30877 -8256 45858
775 45858 4808 -35571 6836 30478 -16338 -53836 42851 16673 -53329 15279 24019 -6874
763 -6874 -1764 44361 -6365 -51553 12126 70017 19838 25251 75114 84144 79902 112051 23078
750 23078 -3021 1897 -11252 26044 57414 94517 38505 -2054 -780 44355 65569 135321
738 135321 117978 96275 106387 30849 -24544 13673 61859 85329 89710 48487 52520 26195
726 26195 66026 32459 74069 82640 115574 36108 -6874 14480 -19220 -25150 -16767 -2180 -14969
713 -14969 26016 77327 86803 54941 97263 117476 47179 25835 12079 24325 52821 85485
701 85485 48153 17984 35557 99963 88151 86182 169705 175337 74863 78205 165368 94844
689 94844 54585 38388 37542 -6568 18383 73326 38318 76791 139646 149460 85128 36911 134182
676 134182 128292 139405 149779 188702 155241 74107 55853 43293 102065 159544 102290 138243
664 138243 111315 114991 88831 1921 -51629 -18229 75761 32243 22553 52614 66086 60942
652 60942 49479 69708 62304 57789 118069 191146 170122 151224 128294 96101 37218 60662
640 60662 58732 28597 -35550 -7709 41404 30943 95047 70920 121896 97893 131615 148656
628 148656 109746 117538 51994 97996 23010 44711 95507 47135 10468 27608 94424 87054
616 87054 16215 59944 84114 80956 112386 99173 81358 -6755 39399 2957 -19164 -26446
604 -26446 30484 55714 90137 136866 113148 154395 157032 82696 102371 153261 135506 63109
592 63109 1396 29097 15793 8929 54852 79281 86963 97613 101230 123575 133799 106061 88574
579 88574 18070 1746 26910 61704 69564 15057 86391 136480 138831 125645 133368 134224 63112
566 63112 104831 86777 52077 83984 134171 130151 121975 189131 179713 146734 103583 155136 193234
553 193234 104410 92672 40143 3477 8170 36632 43158 37968 53961 189800 159075 171447
541 171447 229731 237163 121285 78874 62050 13976 19183 -2003 53801 12331 63514 129200
529 129200 127588 103330 208030 171448 138916 130948 142002 149661 50801 65721 55155 21833
517 21833 -3498 100938 83055 78743 170547 171238 76094 7627 12128 -3112 -26828 -5778 144468
504 144468 50765 68038 129867 108504 99337 134802 170486 147547 188482 134170 117547 28113
492 28113 30067 93820 85486 116500 115692 157128 107525 89090 59512 140462 89140 63026 44402
479 44402 -10907 -36802 53321 58400 123030 164764 192016 233819 114339 159908 115601 103686
467 103686 131232 173518 70185 -18566 41037 42777 49342 94513 137759 120116 58094 99003
455 99003 127065 84305 79416 83014 88582 98257 91539 182654 149520 163091 228962 217834 181329
442 181329 164988 229526 159664 93961 57549 53365 -31364 209 64932 74488 77710 146443
430 146443 167917 54766 124561 168657 156342 141187 121791 65043 68822 84284 146227 133408
418 133408 148327 161917 188204 204082 152763 166277 165589 173098 118204 134534 126580 131534 153390
405 153390 116692 117209 88481 145182 151611 229697 234882 236628 137237 103269 125397 131957 169878
392 169878 205444 234374 191396 236441 191704 189420 225144 237755 186039 168008 139871 174269
380 174269 151444 196625 213777 134608 139411 134459 192298 199856 206275 138063 136619 106398 76265
367 76265 109281 92601 72541 98445 117359 88573 114573 158695 222317 179526 204668 220309
355 220309 172566 184778 195094 227205 193581 175655 196290 207132 185179 225457 356716 316622
343 316622 307054 300418 273780 194636 133929 170775 157705 71656 133481 207620 135939 154986
331 154986 219733 228703 163576 190918 272624 254401 236746 226968 200930 88979 81418 130207
319 130207 111874 76543 156991 93651 110324 148441 176617 179389 174602 218749 216467 133719
307 133719 138543 186762 66080 115655 177004 177107 187363 224503 186672 190778 204398 263456
295 263456 226672 143325 156592 202885 197988 176773 160009 89510 185451 220983 206594 224108
283 224108 146262 147586 103973 178138 160180 180071 212326 176531 159982 188656 224744 227374
271 227374 236084 222728 212079 234025 188757 146374 148344 75251 116675 117552 191012 208308 220539
258 220539 253867 231518 319425 242525 196295 171935 141845 115724 99920 110033 80278 80184
246 80184 177606 229904 196126 190028 243933 285953 270970 321244 286124 272080 266177 240343
234 240343 218807 201267 218062 175533 150885 191703 226328 215779 219225 172539 212121 157389
222 157389 118249 175250 180051 143538 179581 204710 205919 194749 205298 247416 227449 313600
210 313600 328918 273601 201890 176956 191344 209387 246003 171386 126284 129953 77630 181338
198 181338 223388 114746 140384 269393 250769 224730 334550 436064 321119 331746 355031
187 355031 269787 258331 330650 363557 230329 162673 103286 71698 103755 109158 247754 267597
175 267597 239484 296404 302039 283915 265286 230082 225565 165366 180413 192370 179642 180279 225004
162 225004 261188 257149 250327 240417 231336 260984 242911 174236 125862 56977 87915 115630 108317
149 108317 132964 170744 185600 178763 206674 251251 295211 287583 251924 229621 217795 246984
137 246984 234924 208055 225623 233602 227172 273948 210545 195294 189915 171354 172924 225316 183024
124 183024 151256 224712 261977 260712 237771 230517 201680 197320 218139 311603 210020 161997
112 161997 201004 210013 185190 149766 181717 132020 173394 169835 197976 185960 219246 197520
100 197520 189206 228767 244062 233387 222341 232602 263095 262607 237675 209694 199064 234379
88 234379 279355 272843 200471 247495 274764 282649 322665 314024 296409 285608 279494 251758 228353
75 228353 167219 149119 170738 144995 190062 214153 225638 280084 286505 260983 233081 215820
63 215820 235956 260071 260392 254202 227678 199207 197541 272357 325832 293741 333680 335410 272621
50 272621 204011 220714 191379 152739 190739 189643 193402 204047 247549 258106 300849 325023
38 325023 328616 322012 316767 293836 284813 253577 187536 166397 184205 207878 227656 256640 282600
25 282600 317290 277716 236851 205924 235148 233801 205725 193200 167142 155860 170752 248292
13 248292 289862 298163 345464 309678 275905 291617 277029 273405 252243 216618 232382 167720
1 167720 178082
0 178082
$$ Imaginary data points
##PAGE= N=2
##DATA TABLE= (X++(I..I)), XYDATA
16383 -2557194 -2502858 -2531627 -2541124 -2563350 -2514083 -2496666 -2486869 -2479868 -2474363 -2382633 -2300332 -2304447
16371 -2304447 -2274714 -2194069 -2152333 -2131464 -2088364 -2085184 -2083910 -2079433 -2038249 -2039326 -2018825 -1958884
16359 -1958884 -1897572 -1900507 -1848351 -1807030 -1814728 -1818095 -1780726 -1740781 -1671975 -1628499 -1604550 -1596205
16347 -1596205 -1601168 -1533832 -1512259 -1503308 -1424036 -1420397 -1410292 -1377567 -1388386 -1356719 -1331544 -1311613
16335 -1311613 -1254441 -1193834 -1142365 -1113990 -1093348 -1099687 -1077326 -1074102 -1046279 -998919 -994315 -874591
16323 -874591 -821759 -861253 -865222 -856337 -808483 -724393 -673374 -659858 -701674 -719774 -727198 -725580
16311 -725580 -621059 -562313 -593866 -561148 -519975 -555368 -515350 -382786 -366569 -334131 -311002
16300 -311002 -317451 -325818 -289360 -278207 -228317 -189946 -232130 -225271 -186198 -149626 -139744 -100749
16288 -100749 -45202 -61458 -56690 -17325 -805 58772 145573 136655 134214 163301 147141 192085
16276 192085 231582 198669 232978 238273 272244 261040 269214 328437 374131 420325 481537 458901
16264 458901 433856 449097 467440 516114 531056 506386 467275 459071 478983 633471 670411
16253 670411 680201 680735 694887 706923 738277 771078 758630 761674 767580 776783 773659 771409 785469
16240 785469 800043 845368 862819 883229 926798 908045 955373 992009 957812 970906 929312
16229 929312 955841 1026437 1080112 1049209 1071624 1091435 1068013 1193589 1264823 1308057 1212100
16218 1212100 1149266 1193675 1101864 1178980 1256218 1188668 1206670 1216341 1210424 1203100 1247289 1335900
16206 1335900 1333131 1332152 1321068 1357169 1283021 1363653 1444322 1426593 1397449 1343332 1384779 1394473
16194 1394473 1448129 1502666 1501391 1416352 1390148 1449928 1522041 1526625 1615760 1601941 1522943 1507634
16182 1507634 1554630 1586523 1532933 1536469 1535810 1539967 1537949 1572755 1641583 1629267 1665073 1672893
16170 1672893 1706004 1645152 1681215 1766661 1765872 1776792 1736374 1695674 1640663 1647565 1732004 1790873
16158 1790873 1807099 1738477 1788624 1823300 1806823 1908764 1930059 1847614 1732228 1791080 1855208
16147 1855208 1799930 1804489 1823175 1764861 1745088 1787610 1839229 1854218 1895732 1949581 1973722
16136 1973722 1888896 1817173 1833016 1834336 1894052 1916297 1905686 1848954 1817312 1825838 1850557 1963439
16124 1963439 1992255 1953431 1923290 1878413 1930761 2025104 2029074 1932410 1906705 1964282 1918022
16113 1918022 1875018 1948133 1959286 1935113 1957441 1981642 1929682 1939015 2018575 2047708 2002295
16102 2002295 1971192 1996748 1965692 1955567 2020846 2004730 1951849 1966681 1973805 1927720 1942272
16091 1942272 2015172 2046043 2020059 2000848 1998492 1968510 1957370 1973400 1979425 1999138 2051246 1979529
16079 1979529 1979188 1960392 1962938 1982156 1998235 1999553 2040058 2066856 1987940 1969736 1947796 1993994
16067 1993994 1985160 2008166 2110566 2049207 1964890 1937479 1920451 1938389 2006161 1979975 1982691
16056 1982691 1903582 1885235 1988282 2044801 2091710 2137984 2108523 2073674 2064675 2023520 1981400
16045 1981400 2000179 2008676 2013704 2029143 2017253 2013662 2034044 2074125 2082683 2075768 2055820 2083440
16033 2083440 2098727 2047362 2098100 2046771 1980771 2035553 2045936 2006640 2000932 2068694 2030530
16022 2030530 2003984 1957856 1939074 1994505 2098981 2083473 2034758 2006321 2057872 2115484 2045522
16011 2045522 2045628 2134508 2100431 2053261 2033709 2041212 1928776 1908060 2027318 2020718 1977189 2019673
15999 2019673 1995288 1941071 2028161 2138976 2141305 2076750 1985451 1917346 2044685 2056165 2009398
15988 2009398 2040437 2050070 2082108 2122270 2161623 2132291 2121014 2126350 2087564 2023332 1974188 2007360
15976 2007360 1915698 1929056 2003765 2021157 1984803 1920495 2034125 2070433 2037060 2099365 2094707
15965 2094707 2043359 1920257 1900993 1928058 1919261 1940753 1893840 1889690 1936703 2078136 2069626
15954 2069626 2096957 2168534 2146522 2139297 2095892 2045183 2028020 2051274 2014324 1908093 1926161
15943 1926161 1922987 1939444 1974036 2019556 2054667 1990587 2034929 2111579 2088092 2094808 2123518 2055270
15931 2055270 2018493 2027708 2095067 2115264 2103056 2074124 2060085 2022482 2039358 2100054 2052240
15920 2052240 2036273 1986636 1913386 1878971 1946747 2012504 2023003 2078930 2105949 1969165 1986750
15909 1986750 2062271 2071544 2082464 2076171 2049467 1966651 1994838 2042399 2095549 2070024 2100109 2110170
15897 2110170 2005898 2044616 2131017 2029209 1995866 2117613 2015612 1908743 1935872 2002549
15887 2002549 2039663 1988399 2028481 2029494 1990615 2051387 2108645 2066470 2093478 2073252 2079487 2004192
15875 2004192 2010925 2080029 2135203 2124496 2085738 2085241 2075057 2083742 2105013 2077515 2048123 1978149
15863 1978149 1912678 1924150 1920733 1979289 1976899 1974759 1982977 2010729 2060013 2120779 2123483 2079101
15851 2079101 2088124 1992796 1912987 1973560 2021915 2031500 2002769 2057613 2009202 1967378 1999598 2065659
15839 2065659 2088896 2030098 1997140 1985566 1976914 1960200 1961889 2016432 2076889 2044392 1994343 2014163
15827 2014163 2045480 2095964 2131628 2106283 2046208 1991919 2009893 1986054 1960303 2042496 1978009
15816 1978009 1836102 1866609 1988769 1986569 1967891 2004602 2059033 2025732 2061334 2132300 2103394
15805 2103394 2051995 2035868 2039261 1972475 2002793 2100161 2120796 2104897 2112681 2141530 2032852
15794 2032852 1980730 2033691 2111242 2087424 2051938 2040264 2011767 1973094 1928860 1946696 1948892
15783 1948892 1966299 2013764 2039839 2043755 2136030 2107954 2104059 2109867 2118536 2095706 2137174 2107909
15771 2107909 2080902 2071289 2022661 1988911 1962785 2063120 2111878 2080662 2054228 2087242 2035694
15760 2035694 2075727 2154302 2142002 2082336 2022654 2010694 1997445 2011840 1984421 2048629 2075657
15749 2075657 2035520 1978551 2043153 2187022 2147806 2176779 2165826 2078509 1973738 1955402 2046396
15738 2046396 1997227 1981331 2014782 2004803 1886139 1950774 2096100 2077110 2067449 2157004 2168989
15727 2168989 2033686 1962411 2004299 1982376 1942708 1951942 1993457 2027791 2026986 2165063 2159779 2071464
15715 2071464 2071296 2113564 2042441 2017997 2068282 2064572 2006455 2016403 2040199 1999489 1956464 2008528
15703 2008528 2074269 2090742 2097648 2117668 2098263 2006225 1987426 2088106 2089953 2073316 2114869
15692 2114869 2074265 2017802 2010115 2002371 2004352 1943111 1989537 2028819 2003953 2050070 2031289 2014620
15680 2014620 1981468 2073186 2218269 2250584 2161149 2148906 2111334 2068288 2053039 2051946 2033502
15669 2033502 2084441 2085527 2091108 2114685 2104345 2145798 2098381 2086102 2113160 2103891 2072572 1989473
15657 1989473 2035546 2029767 2085488 2109364 2031662 2066833 2140601 2222257 2219685 2207611 2160236 2038749
15645 2038749 2004001 2022009 2084880 2053218 2108021 2160980 2077286 2088094 2115784 2228976 2144286
15634 2144286 2118967 2135604 2050559 2033428 2100920 2098734 2053199 2066449 2083943 2069826 2084623
15623 2084623 2173598 2149732 2145518 2159029 2171033 2118084 2046322 2010716 2047784 2138287 2143823 2190888
15611 2190888 2229554 2256749 2186632 2136498 2168373 2117983 2154007 2158310 2087230 2025519 1991745
15600 1991745 2001352 1974991 2054143 2176693 2185235 2144509 2194767 2162375 2084518 2062444 2091084
15589 2091084 2109054 2159074 2131169 2102544 2060774 2038461 2123824 2154458 2144410 2117894 2137034
15578 2137034 2073840 1991602 1960384 2033896 1990677 2013058 2095197 2055853 2074723 2160682 2133067
15567 2133067 2034074 2040028 2069749 2039561 2010922 2099146 2060643 2064161 2079728 2028136 2028514 2104078
15555 2104078 2195988 2181893 2170627 2124929 2111433 2118232 2112021 2107196 2145945 2180272 2144345 2152851
15543 2152851 2176928 2132289 2115908 2129906 2065318 2062033 2096336 2057276 1962410 1999224 2022305
15532 2022305 2012563 2056552 2116509 2116302 2129505 2173653 2174773 2139800 2156967 2121378 2073867 2063283
15520 2063283 2083900 2097240 2095311 2103741 2146115 2206316 2128151 2097676 2116798 2109834 2080554 2150726
15508 2150726 2163922 2099633 2159862 2119011 2064540 2089574 2130202 2088417 2017898 2129623 2137574
15497 2137574 2094216 2079965 2155885 2116634 2100145 2152261 2202464 2194920 2195867 2193024 2163557 2093457
15485 2093457 2080766 2165884 2202207 2199150 2262048 2207852 2114988 2124923 2139153 2173910 2189426 2226512
15473 2226512 2146201 2032043 2012464 2017338 1962328 1962096 2052310 2054639 2028505 2087998 2091614 2096651
15461 2096651 2096546 2173454 2169072 2152323 2212622 2269473 2282639 2235426 2147262 2092833 2142049 2147052
15449 2147052 2204804 2241366 2210461 2100653 2047295 1978085 1927956 1998767 2052302 2023067 2035581
15438 2035581 2121317 2093421 2111159 2196697 2253893 2249763 2202356 2163133 2183372 2189093 2218370 2218550
15426 2218550 2191313 2108946 2090164 2126835 2119073 2086194 2082113 2142526 2078345 2027679 2022085 2053868
15414 2053868 2131782 2111926 2140878 2112514 2147748 2176331 2179036 2240926 2193584 2141296 2067125
15403 2067125 2137773 2140002 2157024 2173267 2160223 2121579 2149774 2197735 2164915 2166096 2245557 2275004
15391 2275004 2189497 2180761 2167609 2116596 2126985 2145805 2178482 2140068 2115215 2120661 2175937 2241834
15379 2241834 2241598 2260773 2173798 2149427 2178375 2223867 2197037 2163126 2175305 2157993 2160351 2263113
15367 2263113 2233139 2177371 2171734 2151991 2048718 1987094 2065757 2117059 2090380 2096303 2096403 2057904
15355 2057904 2111985 2177406 2204121 2250699 2231020 2141241 2113722 2131454 2114394 2108327 2145316
15344 2145316 2159695 2073186 2163031 2187525 2176224 2170452 2181406 2188587 2157785 2156108 2185590 2200651
15332 2200651 2193752 2188124 2210557 2208444 2155063 2191476 2178873 2108178 2085625 2082723 1962984 2011054
15320 2011054 2107036 2102867 2129096 2130474 2157870 2108162 2145857 2165765 2174668 2223201 2184593 2174164
15308 2174164 2105210 2117368 2115044 2135694 2144071 2166115 2126836 2141731 2141711 2144865 2186642 2157310
15296 2157310 2101711 2078706 2104813 2071745 2086868 2102519 2150605 2161650 2099052 2167466 2156666
15285 2156666 2145846 2184737 2176211 2152257 2134362 2120188 2219748 2239396 2194170 2127837 2080846
15274 2080846 2106755 2107414 2068901 2138085 2241529 2228795 2174820 2200036 2188896 2171263 2178073 2222930
15262 2222930 2254647 2216791 2136249 2107202 2056113 2102886 2180621 2105703 2080465 2123452 2187041
15251 2187041 2146957 2122309 2164624 2128015 2088093 2198313 2168819 2171361 2200754 2217315 2212360
15240 2212360 2095839 2130685 2141327 2084606 2080899 2141603 2188465 2207892 2234850 2186393 2191417
15229 2191417 2178948 2147943 2105142 2084325 2152738 2104750 2113116 2118154 2120584 2209958 2212699 2216318
15217 2216318 2199147 2196984 2210392 2230128 2237735 2152415 2120125 2090709 2059442 2025626 2051379 2129579
15205 2129579 2185273 2275427 2277283 2278738 2246217 2275715 2228490 2226094 2280800 2257719 2109654 2114765
15193 2114765 2076173 2060958 2197325 2239576 2242320 2234181 2239643 2204054 2185184 2150080 2160522 2108092
15181 2108092 2079727 2108462 2116632 2165918 2123650 2177300 2241769 2210857 2152134 2191610 2283227
15170 2283227 2271026 2314211 2308474 2158191 2142404 2221680 2212536 2206623 2201303 2266715 2226526 2239717
15158 2239717 2243356 2284307 2305473 2248288 2209180 2138441 2137419 2136358 2221719 2209570 2262580 2280306
15146 2280306 2301747 2260399 2276075 2321446 2248655 2217933 2194858 2148960 2183421 2194401 2143799
15135 2143799 2103084 2129641 2172367 2160722 2253838 2288981 2281710 2254440 2232998 2180769 2125348
15124 2125348 2259275 2299034 2240259 2234635 2231794 2196021 2132457 2211638 2319147 2300113 2229248
15113 2229248 2190633 2193715 2204116 2233689 2256810 2259974 2318419 2289314 2244078 2258347 2250630 2318161
15101 2318161 2244847 2207974 2261744 2220867 2235459 2261277 2269866 2239072 2200253 2190889 2308783
15090 2308783 2332658 2358274 2277653 2233593 2158194 2089651 2136489 2209970 2272645 2224984 2234247
15079 2234247 2241753 2217533 2257943 2251401 2274083 2259883 2240802 2186513 2143319 2165737 2208269 2208370
15067 2208370 2294657 2282351 2243643 2271541 2352458 2345064 2352423 2355256 2294658 2248400 2216977 2276177
15055 2276177 2230346 2234579 2253743 2285504 2254304 2302132 2328713 2323853 2393811 2395111 2337248 2185202
15043 2185202 2230914 2249460 2216835 2189703 2247790 2228044 2167463 2175961 2193041 2210567 2203863 2196533
15031 2196533 2196324 2226672 2246105 2265579 2233060 2248143 2283079 2229707 2250016 2250551 2246158 2314401
15019 2314401 2218601 2236856 2234631 2213099 2237325 2253215 2288527 2295041 2274728 2259566 2255519 2300562
15007 2300562 2280106 2322196 2224512 2259104 2249919 2203494 2260198 2316746 2317225 2336114 2331639 2289668
14995 2289668 2321324 2377964 2335968 2297367 2282882 2256579 2227598 2263047 2237718 2252421 2289938
14984 2289938 2329754 2308874 2268634 2268248 2234060 2283872 2310024 2261174 2218681 2207884 2193827 2220265
14972 2220265 2313635 2341929 2327892 2361637 2345509 2299238 2289734 2291107 2266573 2198186 2162361 2251286
14960 2251286 2314250 2253352 2273318 2284115 2300266 2270778 2337441 2331693 2233089 2345925 2416801
14949 2416801 2367286 2234242 2305787 2305872 2278195 2359393 2412031 2363348 2273195 2320518 2294150 2284951
14937 2284951 2304488 2240564 2247612 2262499 2252622 2252719 2277907 2207850 2158933 2175523 2226520 2224933
14925 2224933 2266569 2300850 2329987 2284156 2291624 2286202 2260387 2247835 2302155 2260696 2231747 2241857
14913 2241857 2265485 2252788 2257417 2306463 2266491 2192470 2245869 2290975 2287725 2312731 2320011 2265502
14901 2265502 2195055 2187025 2308209 2280659 2271837 2359162 2363782 2359631 2351229 2407312 2344687 2349229
14889 2349229 2336767 2294880 2236435 2201658 2253986 2253170 2235093 2196075 2138448 2149448 2242545 2298347
14877 2298347 2347110 2383595 2365636 2344564 2347958 2284934 2196843 2288468 2282683 2257467 2298899 2282358
14865 2282358 2234708 2235293 2284025 2352576 2379201 2381030 2349048 2262488 2213800 2220634 2212975 2177327
14853 2177327 2177257 2178984 2219901 2178281 2200022 2281354 2299614 2355897 2369395 2366819 2362403 2400471
14841 2400471 2270461 2306010 2314063 2278224 2256946 2231511 2229842 2106586 2106416 2156747 2214126 2212724
14829 2212724 2215582 2223516 2193729 2241090 2291237 2244945 2259034 2319227 2269542 2274620 2284949 2274407
14817 2274407 2225971 2290774 2298514 2180315 2159788 2146877 2171650 2231668 2258192 2271518 2224438
14806 2224438 2242830 2244638 2288940 2422842 2323191 2274390 2235623 2214232 2230658 2230220 2291377 2242587
14794 2242587 2294394 2297829 2276023 2277301 2314158 2321985 2307591 2330024 2264900 2220623 2178078 2166366
14782 2166366 2184689 2318028 2347191 2331121 2313143 2320876 2398802 2411573 2424288 2255610 2155301
14771 2155301 2235721 2202092 2197247 2150131 2172577 2160776 2145345 2241906 2282667 2316247 2378648
14760 2378648 2374371 2349310 2258733 2208466 2151212 2152177 2234821 2202717 2188403 2212037 2202116 2243640
14748 2243640 2334692 2378746 2352444 2299719 2316924 2283776 2310661 2254131 2204278 2184479 2116941
14737 2116941 2174141 2257711 2324695 2328723 2379840 2396701 2291357 2273786 2286562 2294060 2269031
14726 2269031 2307827 2248346 2259009 2262410 2225700 2279835 2281132 2311736 2251730 2240276 2224067 2244778
14714 2244778 2243980 2188146 2185108 2160098 2141271 2151511 2215691 2385150 2345593 2329121 2282136 2261465
14702 2261465 2215971 2239900 2263933 2198102 2229593 2214213 2216978 2144713 2155981 2212000 2207233 2234628
14690 2234628 2227326 2226784 2272367 2285942 2235854 2233356 2154931 2109331 2185826 2200872 2277022 2309103
14678 2309103 2318187 2267944 2258783 2238855 2262419 2284089 2201804 2195565 2235687 2205452 2187173 2146888
14666 2146888 2218149 2273756 2280741 2329980 2320847 2322026 2391901 2330512 2321402 2284825 2263424 2238142
14654 2238142 2261274 2270189 2283877 2298223 2211870 2165846 2259426 2339930 2360367 2338051 2290991
14643 2290991 2312106 2215020 2290173 2268620 2272113 2310023 2295231 2248481 2243307 2266347 2328413 2431587
14631 2431587 2378115 2385285 2428442 2404894 2336809 2337241 2357708 2265742 2227199 2211804 2191927 2158133
14619 2158133 2243717 2291840 2292556 2277802 2230162 2210799 2296977 2349402 2376707 2399599 2360039 2291300
14607 2291300 2333078 2327118 2308752 2350816 2361705 2377512 2327332 2392154 2350699 2265693 2249177
14596 2249177 2250591 2189639 2141942 2232497 2213872 2241878 2244217 2309657 2272343 2241852 2281973 2293426
14584 2293426 2329917 2302512 2348120 2282330 2215696 2179083 2242788 2215407 2236829 2328887 2391855
14573 2391855 2319622 2304687 2328362 2313765 2316789 2279524 2251363 2213589 2203057 2273141 2288926
14562 2288926 2286833 2310074 2282950 2327784 2404576 2436212 2432979 2427469 2353949 2293575 2275331 2232852
14550 2232852 2251643 2228718 2210477 2304372 2343902 2363632 2350772 2350491 2338028 2327147 2331064 2374749
14538 2374749 2319014 2222093 2271485 2243750 2224172 2225767 2249871 2235831 2283938 2390064 2350407
14527 2350407 2305301 2257295 2342992 2298487 2300322 2355580 2278637 2296349 2325652 2410360 2388629
14516 2388629 2308806 2297752 2304603 2281975 2341938 2387733 2349838 2261498 2322455 2336104 2297466
14505 2297466 2328649 2307301 2293695 2282799 2364525 2350843 2273121 2299771 2315876 2297504 2357330
14494 2357330 2353329 2267561 2238053 2263306 2341638 2341540 2326445 2364999 2362848 2371806 2460720 2408904
14482 2408904 2345088 2334183 2328701 2263806 2235027 2248666 2184073 2254612 2264370 2333469 2394987 2359194
14470 2359194 2352579 2382168 2395137 2403776 2369105 2344047 2327113 2304813 2309283 2332846 2269460 2281399
14458 2281399 2310832 2297870 2333524 2287727 2307338 2294817 2297146 2391220 2387342 2342823 2290955 2290873
14446 2290873 2329070 2415601 2394260 2375909 2280541 2231550 2308931 2370973 2350931 2358151 2374089
14435 2374089 2291584 2297200 2362818 2350425 2307076 2340472 2364454 2336025 2244136 2332892 2291951
14424 2291951 2257607 2304627 2287233 2268902 2203336 2210879 2271171 2378734 2387105 2341808 2321846
14413 2321846 2282602 2259445 2325367 2344833 2312585 2320542 2391051 2308447 2252176 2370304 2366456
14402 2366456 2422356 2427870 2376795 2327291 2352988 2351061 2315472 2382604 2362372 2284402 2268953 2285966
$$ [...]
##END NTUPLES=NMR SPECTRUM
##END=
