##TITLE=1H_CA-8816-3
 CDCl3,8 sc, 
 4.02.2021
##JCAMPDX= 6.0         $$ Bruker NMR JCAMP-DX V2.0
##DATA TYPE= NMR SPECTRUM
##DATA CLASS= NTUPLES
##ORIGIN= UXNMR, Bruker Analytische Messtechnik GmbH
##OWNER= root
$$ XWIN-NMR		Version 3.5
$$ Thu Feb  4 10:16:04 2021 Russian Standard Time (UT+4h)  she@DPX200
##.OBSERVE FREQUENCY= 200.1315066352
##.OBSERVE NUCLEUS= ^1H
##.ACQUISITION MODE= SIMULTANEOUS
##.ACQUISITION SCHEME= undefined
##.AVERAGES= 8
##.DIGITISER RES= 18
##SPECTROMETER/DATA SYSTEM= spect
##.PULSE SEQUENCE= zg30
##.SOLVENT NAME= D2O
##.SHIFT REFERENCE= (INTERNAL, D2O, 0, 16.0248)
##AUDIT TRAIL= $$ (NUMBER, WHEN, WHO, WHERE, WHAT)
$$ ##TITLE= Audit trail, XWIN-NMR		Version 3.5
$$ ##JCAMPDX= 5.01
$$ ##ORIGIN= Bruker BioSpin GmbH
$$ ##OWNER= she
$$ F:/spectra/data/she/nmr/H-F/1/pdata/1/auditp.txt
$$ ##AUDIT TRAIL=  $$ (NUMBER, WHEN, WHO, WHERE, WHAT)
(   1,<2021-02-04 10:14:32.95 +0400>,<she>,<DPX200>,
      <created by zg, POWCHK disabled, PULCHK disabled
       configuration hash MD5:
       00 E9 B6 7A A2 85 ED C7 34 08 36 98 17 FE 4E 26
       data hash MD5: 16K
       65 53 0C 2D BC 6B 6E 7E B0 84 2C C9 E1 DD F2 92>)
(   2,<2021-02-04 10:14:39.21 +0400>,<she>,<DPX200>,
      <Start of raw data processing
       efp BC_mod = 2 LB = 0.24 FT_mod = 6 PKNL = 1 PHC0 = -10401.41 PHC1 = 15.80095 SI = 16K 
       data hash MD5: 16K
       CF 15 03 53 2F EC 34 52 16 A7 27 EC FB 41 92 39>)
(   3,<2021-02-04 10:14:55.07 +0400>,<she>,<DPX200>,
      <pk PHC0 = -4.62586 PHC1 = 3.2 
       data hash MD5: 16K
       73 23 E9 98 9F 4C E6 1C D0 AD 4C CB EE 97 36 01>)
(   4,<2021-02-04 10:14:58.45 +0400>,<she>,<DPX200>,
      <abs ABSG = 5 
       data hash MD5: 16K
       53 F8 01 BC 0F C7 46 EF 52 F2 52 CB C6 AB 21 75>)
$$ ##END=
$$ 
$$ hash MD5
$$ 7F 26 CD C5 AC F6 7D D3 42 47 72 A1 95 0E 3E CF
##$RELAX= 
##$RELAX= 
##$RELAX= 
##$RELAX= 
##$RELAX= 
##$RELAX= 
$$ Bruker specific parameters
$$ --------------------------
##$DU= <F:/spectra>
##$EXPNO= 1
##$NAME= <H-F>
##$PROCNO= 1
##$TYPE= <nmr>
##$USER= <she>
##$AMP= (0..31)
100 100 100 100 100 100 100 100 100 100 100 100 100 100 100 100 100 100 
100 100 100 100 100 100 100 100 100 100 100 100 100 100 
##$AQSEQ= 0
##$AQ_mod= 1
##$AUNM= <au_zg>
##$AUTOPOS= <>
##$BF1= 200.13
##$BF2= 200.13
##$BF3= 200.13
##$BF4= 200.13
##$BF5= 200.13
##$BF6= 200.13
##$BF7= 200.13
##$BF8= 200.13
##$BYTORDA= 1
##$CFDGTYP= 0
##$CFRGTYP= 5
##$CHEMSTR= <none>
##$CNST= (0..31)
1 1 145 1 1 1 1 1 1 1 1 1 1 1 1 1 1 1 1 1 1 1 1 1 1 1 1 1 1 1 1 1 
##$CPDPRG= <>
##$CPDPRG1= <>
##$CPDPRG2= <>
##$CPDPRG3= <>
##$CPDPRG4= <mlev>
##$CPDPRG5= <mlev>
##$CPDPRG6= <mlev>
##$CPDPRG7= <mlev>
##$CPDPRG8= <mlev>
##$CPDPRGB= <>
##$CPDPRGT= <>
##$D= (0..31)
0 1.2 0 0 0 0 0 0 0 0.06 0 0.03 0 0 0 0 0.0002 0 0 0 0 0 0 0 0 0 0 0 0 
0 0 0 
##$DATE= 1612419272
##$DBL= (0..7)
120 120 120 120 120 120 120 120 
##$DBP= (0..7)
150 150 150 150 150 150 150 150 
##$DBP07= 0
##$DBPNAM0= <>
##$DBPNAM1= <>
##$DBPNAM2= <>
##$DBPNAM3= <>
##$DBPNAM4= <>
$$ [...]
##$SUBNAM3= <"">
##$SUBNAM4= <"">
##$SUBNAM5= <"">
##$SUBNAM6= <"">
##$SUBNAM7= <"">
##$SUBNAM8= <"">
##$SUBNAM9= <"">
##$SW= 16.9725356469052
##$SWIBOX= (0..15)
0 0 2 0 0 0 0 0 0 0 0 0 0 0 0 0 
##$SW_h= 3396.73913043478
##$TD= 16384
##$TD0= 1
##$TE= 0
##$TE2= 300
##$TE3= 300
##$TEG= 300
##$TL= (0..7)
0 120 120 120 120 120 120 120 
##$TP= (0..7)
150 150 150 150 150 150 150 150 
##$TP07= 0
##$TPNAME0= <>
##$TPNAME1= <>
##$TPNAME2= <>
##$TPNAME3= <>
##$TPNAME4= <>
##$TPNAME5= <>
##$TPNAME6= <>
##$TPNAME7= <>
##$TPOAL= (0..7)
0.5 0.5 0.5 0.5 0.5 0.5 0.5 0.5 
##$TPOFFS= (0..7)
0 0 0 0 0 0 0 0 
##$TUNHIN= 0
##$TUNHOUT= 0
##$TUNXOUT= 0
##$USERA1= <user>
##$USERA2= <user>
##$USERA3= <user>
##$USERA4= <user>
##$USERA5= <user>
##$V9= 5
##$VALIST= <valist>
##$VCLIST= <CCCCCCCCCCCCCCC>
##$VD= 0
##$VDLIST= <DDDDDDDDDDDDDDD>
##$VPLIST= <PPPPPPPPPPPPPPP>
##$VTLIST= <TTTTTTTTTTTTTTT>
##$WBST= 1024
##$WBSW= 4
##$XGAIN= (0..3)
0 0 0 0 
##$XL= 0
##$YL= 0
##$YMAX_a= 829012
##$YMIN_a= -1008851
##$ZGOPTNS= <>
##$ZL1= 120
##$ZL2= 120
##$ZL3= 120
##$ZL4= 120
##$ABSF1= 15.95745
##$ABSF2= -1.015212
##$ABSG= 5
##$ABSL= 3
##$ALPHA= 0
##$AQORDER= 0
##$ASSFAC= 0
##$ASSFACI= 0
##$ASSFACX= 0
##$ASSWID= 0
##$AUNMP= <proc_1d>
##$AZFE= 0.1
##$AZFW= 0.1
##$BCFW= 0
##$BC_mod= 2
##$BYTORDP= 0
##$COROFFS= 0
##$CY= -3
##$DATMOD= 1
##$DC= 0
##$DFILT= <>
##$DTYPP= 0
##$F1P= 0
##$F2P= 0
##$FCOR= 1
##$FTSIZE= 16384
##$FT_mod= 6
##$GAMMA= 0
##$GB= 0
##$INTBC= 1
##$INTSCL= 2.992141e-10
##$ISEN= 128
##$LB= 0.24
##$LEV0= 0
##$LPBIN= 0
##$MAXI= 10000
##$MC2= 0
##$MEAN= 0
##$ME_mod= 0
##$MI= 1.114404
##$NCOEF= 0
##$NC_proc= -4
##$NLEV= 6
##$NOISF1= 3.799351
##$NOISF2= 2.8
##$NSP= 0
##$NTH_PI= 0
##$NZP= 0
##$OFFSET= 16.02479
##$PC= 1
##$PHC0= -10406.04
##$PHC1= 19.00095
##$PH_mod= 1
##$PKNL= yes
##$PPARMOD= 0
##$PSCAL= 0
##$PSIGN= 0
##$REVERSE= no
##$SF= 200.129997964258
##$SI= 16384
##$SIGF1= 3
##$SIGF2= 2
##$SINO= 5.538805
##$SIOLD= 16384
##$SREGLST= <1H.CDCl3>
##$SSB= 0
##$STSI= 16384
##$STSR= 0
##$SW_p= 3396.73913043478
##$SYMM= 0
##$S_DEV= 0
##$TDeff= 16384
##$TDoff= 0
##$TI= <>
##$TILT= no
##$TM1= 0
##$TM2= 0
##$TOPLEV= 0
##$USERP1= <user>
##$USERP2= <user>
##$USERP3= <user>
##$USERP4= <user>
##$USERP5= <user>
##$WDW= 1
##$XDIM= 16384
##$YMAX_p= 275154474
##$YMIN_p= -202939
$$ End of Bruker specific parameters
$$ ---------------------------------
##NTUPLES= NMR SPECTRUM
##VAR_NAME=  FREQUENCY,     SPECTRUM/REAL,   SPECTRUM/IMAG
##SYMBOL=    X,             R,               I
##VAR_TYPE=  INDEPENDENT,   DEPENDENT,       DEPENDENT
##VAR_FORM=  AFFN,          ASDF,            ASDF
##VAR_DIM=   16384,         16384,           16384
##UNITS=     HZ,            ARBITRARY UNITS, ARBITRARY UNITS
##FACTOR=    0.207333158178281, 1,           1
##FIRST=     3207.04115208912, 0,            0
##LAST=      -189.697978345661, 0,           0
##MIN=       -189.697978345661, -202939,     0
##MAX=       3207.04115208912, 275154474,    0
$$ Real data points
##PAGE= N=1
##DATA TABLE= (X++(R..R)), XYDATA
$$ [...]
$$ plain form
5652 -21884 -28603 10719 58129 62268 18935 -20347 -16106 -29942 -39255 44289 97383 27201 -8080
5639 -8080 8967 35351 48244 68130 69197 87572 65773 -9470 -73521 -23798 34069 -25349
5627 -25349 -5510 22577 29024 -6883 16357 75194 70959 53595 15631 -22298 18960 81182
5615 81182 45859 -4876 21873 -5696 -826 41469 -4811 -28176 11858 10765 3665 44367
5603 44367 18872 65562 58330 37358 35462 -6632 -35342 36433 59165 40575 26147 -4247
5591 -4247 -23195 -3007 -31571 8531 54983 48420 27813 -2856 -51621 -60723 -12628 -476
5579 -476 4898 -72797 -71043 -12628 -1790 7912 54340 -10229 -13425 23191 -7545 -46332 -29642
5566 -29642 -59263 -55192 -26423 -21443 -45729 -31979 -71279 -62771 -30592 -30192 -23065 45 -32624
$$ packed form
5652b1884o719L9322M7410M139m3333l9282M241j3836r313Q3544N3094p0182l5281
5639h080J7047K6384J2893J9886J067J8375k1799p5243o4051M9723N7867n9418
5627b5349J9839K8087O447l5907K3240N8837m235j7364l7964l7929M1258O2222
5615H1182l5323n0735K6749k7569M870M2295m6280k3365M0034j093p100M0702
5603D4367k5495M6690p232k0972j896m2094k8710P1775K2732j8590j4428l0394
5591d247j8948K0188k8564M0102M6452o563k0607l0669m8765r102M8095J2152
5579d76N374p7695J754N8415J0838R702M6428o4569l196L6616l0736l8787J6690
5566b9642k9621M071K8769M980k4286J3750l9300Q508L2179M00P127K3110l2669
$$ plain form
5553 -32624 -42000 -27975 -67054 -88871 -92361 -76332 -68761 -98695 -126692 -57693 -33657 -47376
5541 -47376 -10582 -21220 14343 -38076 -49117 -3617 -3147 -76751 -26696 1426 -46064 57966
5529 57966 -11594 -76251 9533 20134 17547 28945 -12551 -40672 -13065 -2077 57277 44032
5517 44032 -6923 25731 -7532 18181 10708 -50616 -33954 -2305 -1737 35145 41768 -10611 -6909
5504 -6909 12005 1705 45230 19908 -14245 49420 44939 -1524 20928 8543 17986 105487
5492 105487 136190 84037 65191 30359 36623 86737 62333 10175 61824 53661 13854 38404
5480 38404 102178 89878 68527 95909 136481 89080 49540 77256 96438 73983 61643 48214
5468 48214 45695 34292 1753 27639 53840 40519 31207 15570 24424 34146 35050 1266 35851
$$ packed form
5553c2624r376J4025l9079k1817l490J6029P571k9934k7997O8999K4036j3719
5541d7376L6794j0638L5563n2419j1041M5500M70p3604N0055K8122m7490J04030
5529E7966o9560o4657Q5784J0601k587J1398m1496k8121K7607J0988N9354j3245
5517D4032n0955L2654l3263K5713p473o1324J6662L1649N68L6882O623n2379L702
5504f909J8914j0300M3525k5322l4153O3665m481m6463K2452j2385R443Q7501
5492A05487L0703n2153j8846l4832O264N0114k4404n2158N1649q163l9807K4550
5480C8404O3774j2300k1351K7382M0572m7401l9540K7716J9182k2455j2340j3429
5468D8214k519j1403l2539K5886K6201j3321r312j5637Q854R722R04l3784L4585
$$ plain form
5455 35851 22699 -9590 -10192 46903 94875 37348 -26475 -41929 -15093 -8234 31329 61708
5443 61708 36808 -50441 -25047 57023 33821 -20776 12077 44988 -19332 -21837 36718 10117
5431 10117 -40430 -4105 75224 34919 -4108 32679 51968 -24782 -5528 38578 -48101 -89864
5419 -89864 -70253 -27752 9330 22274 23221 6535 -10043 -131 17700 -55530 -69939 -44320
5407 -44320 -32063 -65269 7103 -42837 -113242 -52449 -12061 22212 3735 8169 -28460 -47025
5395 -47025 -56328 -29481 49425 22242 -18784 -32181 -1105 27576 7802 44922 42265 1582
5383 1582 -8404 60493 69175 45065 76785 74356 121652 96608 97339 135324 143128 155995 163710
5370 163710 96501 80093 60162 20219 55184 114714 100473 90670 141024 118738 106293 69110
$$ packed form
5455C5851j3152l2289o02N7095M7972n7527o3823j5454K6836O859L9563L0379
5443F1708k4900q7249K5394Q2070k3202n4597L2853L2911o4320k505N8555k6601
5431A0117n0547L6325P9329m0305l9027L6787J9289p6750J9254M4106q6679m1763
5419h9864J9611M2501L7082J2944R47j6686j6578R912J7831p3230j4409K5619
5407d4320J2257l3206P2372m9940p0405O0793M0388L4273j8477M434l6629j8565
5395d7025r303K6847P8906k7183m1026j3397L1076K8681j9774L7120k657m0683
5383A582r986O8897Q682k4110L1720k429M7296k5044P31L7985P804J2867P715
5370A63710o7209j6408j9931l9943L4965N9530j4241r803N0354k2286j2445l7183
$$ plain form
5358 69110 102625 188457 182266 156834 102067 113259 107516 85195 101326 150336 130001 36712
5346 36712 72624 129745 126344 148241 134295 126054 82544 92649 149431 133447 98821 62282
5334 62282 93779 91707 134198 146248 108999 104050 89475 104348 163107 143671 150110 152243 145993
5321 145993 117598 99507 120278 181539 138841 87783 46855 78796 119209 155974 122069 114000
5309 114000 122157 83435 113053 160817 134339 46348 -7705 21311 -2092 7157 29230 71349
5297 71349 46831 -42985 42888 54603 25865 13126 69996 95125 54270 25533 8118 -37426
5285 -37426 -23471 10033 -12953 -18425 -14457 6912 -26534 -17050 11792 -50476 -70983 -70177 -31169
5272 -31169 3133 5199 -50365 -19282 134 -19290 10937 -58075 -55413 -11477 -18106 -66199
$$ packed form
5358F9110L3515Q5832o191k5432n4767J1192n743k2321J6131M9010k0335r3289
5346C6712L5912N7121l401K1897j3946q241m3510J0105N6782j5984l4626l6539
5334F2282L1497k072M2491J2050l7249m949j4575J4873N8759j9436O439K133o250
5321A45993k8395j8091K0771O1261m2698n1058m0928L1941M0413L6765l3905q069
5309A14000Q157l8722K9618M7764k6478q7991n4053K9016k3403R249K2073M2119
5297G1349k4518q9816Q5873J1715k8738j2739N6870K5129m0855k8737j7415m5544
5285c7426J3955L3504k2986n472L968K1369l3446R484K8842o2268k0507Q06L9008
5272c1169L4302K066n5564L1083J9416j9424L0227o9012K662M3936o629m8093
$$ plain form
5260 -66199 -62304 36045 56509 9609 -6581 34471 -14197 -23238 38047 -4539 -11016 -22548
5248 -22548 -47394 -20573 -12037 -29796 45284 68234 98933 110557 13688 9349 93279 110557
5236 110557 97878 104484 80440 50805 36567 789 55249 70334 49645 100167 96095 90325
5224 90325 109044 160585 188010 171668 98402 119967 169813 164406 118565 121838 62447 120202
5212 120202 168111 158788 154263 191289 187377 139117 198122 247076 224621 227296 211652 202807 183666
5199 183666 211167 185190 197353 217534 192090 169799 140827 198860 231496 219099 225389 201851
5187 201851 225538 242358 183240 164044 219276 227888 214617 206691 159539 162225 178896 180484
5175 180484 185026 175052 109001 122681 164807 178661 133841 140008 127026 144905 149981 114735
$$ packed form
5260f6199L895R8349K0464m6900j6190M1052m8668r041O1285m2586o477j1532
5248b2548k4846K6821Q536j7759P5080K2950L0699J1624r6869m339Q3930J7278
5236A10557j2679O606k4044k9635j4238l5778N4460J5085k0689N0522m072n770
5224I0325J8719N1541K7425j6342p3266K1565M9846n407m5841L273n9391N7755
5212A20202M7909r323m525L7026l912m8260N9005M8954k2455K675j5644q845j9141
5199A83666K7501k5977J2163K0181k5444k2291k8972N8033L2636j2397O290k3538
5187B01851K3687J6820n9118j9196N5232Q612j3271p926m7152K686J6671J588
5175A80484M542r974o6051J3680M2126J3854m4820O167j2982J7879N076l5246
$$ plain form
5163 114735 130709 166184 90955 71480 96636 99422 19099 45346 130145 164481 102289 67457
5151 67457 63247 54238 64842 50787 63835 58702 25807 -13035 -3972 19024 35198 32578 60660
5138 60660 84113 55782 -5192 -27339 -53311 -55513 11 -2147 -18151 8666 8640 -12933 18916
5125 18916 66989 75558 70217 16900 27094 35227 63185 47798 25751 -1327 -8621 -2269 9429
5112 9429 38764 -8926 28436 9549 -15746 12663 53084 22841 14968 -1968 -6785 34622
5100 34622 30132 35039 51538 73378 48553 -27002 -43191 -26212 52568 67910 39437 44680
5088 44680 15372 24276 42585 46739 23221 18430 62708 56818 127853 141091 142761 121901 59139
5075 59139 102421 122794 113969 81784 38346 18362 88843 80218 94557 152308 175199 177934
$$ packed form
5163A14735J5974L5475p5229j9475K5156K786q0323K6247Q4799L4336o2192l4832
5151F7457m210r009J0604j4055J3048n133l2895l8842R063K2996J6174k620K8082
5138F0660K3453k8331o0974k2147k5972k202N5524k158j6004K6817k6k1573L1849
5125A8916M8073Q569n341n3317J0194Q133K7958j5387k2047k7078p294O352J1698
5112I429K9335m7690L7362j8887k5295K8409M0421l0243p873j6936m817M1407
5100C4622m490M907J6499K1840k4825p5555j6189J6979P8780J5342k8473N243
5088D4680k9308Q904J8309M154k3518m791M4278n890P1035J3238J670k0860o2762
5075E9139M3282K0373q825l2185m3438j9984P0481q625J4339N7751K2891K735
$$ plain form
5063 177934 185414 85197 66348 169311 169378 112065 130146 132253 100447 70364 147575 243725
5051 243725 182199 112253 115777 125548 99151 148621 174605 140429 149115 149942 114749 137434 189992
5038 189992 185328 138926 154398 131089 90788 120323 182337 159087 99102 121492 115507 127966
5026 127966 119667 136733 161011 179880 109285 74177 126726 128524 108919 99124 89984 67522
5014 67522 110364 128594 71194 111538 80835 11635 -4318 62485 136414 98564 83342 85391
5002 85391 136350 155526 107858 90265 75771 86327 116954 88602 84540 160512 141746 141141
4990 141141 115411 75291 23195 12598 74621 60513 101394 122141 89339 91339 94464 123571
4978 123571 123883 89452 40563 30781 91725 72983 33159 35391 100831 74957 44873 101774
$$ packed form
5063A77934P480j00217j8849J02963O7n7313J8081K107l1806l0083P7211R6150
5051B43725o1526o9946L524R771k6397M9470K5984l4176Q686Q27l5193K2685N2558
5038A89992m664m6402J5472k3309m0301K9535O2014k3250n9985K2390n985J2459
5026A27966q299J7066K4278J8869p0595l5108N2549J798j9605r795r140k2462
5014F7522M2842J8230n7400M0344l0703o9200j5953O6803P3929l7850j5222K049
5002H5391N0959J9176m7668j7593j4494J0556L0627k8352m062P5972j8766o05
4990A41141k5730m0120n2096j0597O2023j4108M0881K0747l2802K000L125K9107
4978A23571L12l4431m8889r782O0944j8742l9824K232O5440k5874l0084N6901
$$ plain form
4966 101774 87654 99649 109910 65080 15206 56983 74318 -1035 -5317 24138 94385 83316
4954 83316 94108 134641 115914 79785 81371 104753 104519 110764 112426 106008 78727 110774 150038
4941 150038 155598 207138 181642 164401 141698 60412 101894 176630 144770 168521 183514 113415
4929 113415 116346 175295 212822 226853 169126 193842 222195 227309 232196 270383 199630 150843
4917 150843 171826 130091 177535 189151 188216 230969 227663 249507 254813 270745 307490 331782
4905 331782 261637 217395 218311 234888 247543 196096 239922 286660 248249 230479 248791 259453
4893 259453 288798 237846 196561 219336 231996 244153 275090 290188 302764 303748 253219 224191
4881 224191 237338 183450 164488 205504 257702 213221 243347 232412 247307 301625 241398 240608
$$ packed form
4966A01774j4120J1995J0261m4830m9874M1777J7335p5353m282K9455P0247j1069
4954H3316J0792M0533j8727l6129J586K3382k34O245J662o418k7281L2047L9264
4941A50038N560N1540k5496j7241k2703q1286M1482P4736l1860K3751J4993p0099
4929A13415K931N8949L7527J4031n7727K4716K8353N114M887L8187p0753m8787
4917A50843K0983m1735M7444J1616r35M2753l306K1844N306J5932L6745K4292
4905C31782p0145m4242R16J6577J2655n1447M3826M6738l8411j7770J8312J0662
4893B59453K9345n0952m1285K2775J2660J2157L0937J5098J2576R84n0529k9028
4881B24191J3147n3888j8962M1016N2198m4481L0126j0935J4895N4318o0227p90
$$ plain form
4869 240608 269977 232893 169526 185655 216950 223646 247881 223638 265057 259345 194754 204784
4857 204784 193484 198622 172353 135346 135024 215881 198452 144962 135575 110099 187748 139771
4845 139771 76816 109432 150480 158897 185948 156575 116676 151447 156848 197800 150885 100102
4833 100102 61199 39656 67849 144161 164270 135572 158616 124284 92729 76742 126646 182972
4821 182972 171458 134373 149071 149221 112864 120889 168116 150873 99773 70353 86611 76367
4809 76367 101134 172195 228976 232505 236300 201109 148503 220063 301363 298920 186869 116591
4797 116591 158513 212236 182718 202075 213740 153196 153622 251542 317245 261559 215160 274921
4785 274921 279443 233523 223487 228625 157165 176667 209176 182586 172843 212720 213277 219426 260806
$$ packed form
4869B40608K9369l7084o3367J6129L1295O696K4235k4243M1419n712o4591J0030
4857B04784j1300N138k6269l7007l22Q0857j7429n3490r387k5476P7649m7977
4845A39771o2955L2616M1048Q417K7051k9373l9899L4771N401M0952m6915n0783
4833A00102l8903k1543K8193P6312K0109k8698K3044l4332l1555j5987M9904N6326
4821A82972j1514l7085J4698J50l6357Q025M7227j7243n1100k9420J6258j0244
4809G6367K4767P1061N6781L529L795l5191n2606P1560Q1300k443j12051p0278
4797A16591M1922N3723k9518J9357J1665o0544M26R7920O5703n5686m6399N9761
4785B74921M522m5920j0036N138p1460J9502L2509k6590r743L9877N57O149M1380
$$ plain form
4772 260806 243052 254258 261006 252282 259151 220188 180496 209469 231998 178649 205466 225165
4760 225165 211924 202147 235811 273737 265299 220157 200225 187756 190145 262189 267084 228141
4748 228141 233802 227793 265766 308753 299478 332968 291856 273277 269055 302954 333545 311919
4736 311919 304449 270942 248109 281851 264626 239903 231040 271032 214575 203756 216997 249288
4724 249288 328561 323622 280879 222913 229613 264915 230231 242703 188672 165532 191602 233412
4712 233412 248352 233874 213318 199655 269148 264791 276947 309890 254776 245064 306070 347571
4700 347571 287671 241482 255476 263338 234561 201614 194901 163981 208435 272784 298089 259175
4688 259175 264738 279623 276025 235111 288278 310942 276443 284962 282454 265431 264344 312101 386466
$$ packed form
4772B60806j7754J1206O748q724O869l8963l9692K8973K2529n3349K6817J9699
4760B25165j3241r777L3664L7926q438m5142j9932j2469K389P2044M895l8943
4748B28141N661o009L7973M2987r275L3490m1112j8579m222L3899L0591k1626
4736C11919p470l3507k2833L3742j7225k4723q863L9992n6457j0819J3241L2291
4724B49288P9273m939m2743n7966O700L5302l4684J2472n4031k3140K6070M1810
4712B33412J4940j4478k0556j3663O9493m357J2156L2943n5114r712O1006M1501
4700C47571n9900m6189J3994P862k8777l2947o713l0920M4454O4349K5305l8914
4688B59175N563J4885l598m0914N3167K2664l4499Q519k508j7023j087M7757P4365
$$ plain form
4675 386466 338991 263527 297397 358063 350916 282314 271118 281663 298298 349378 350882 321561
4663 321561 342615 408050 367022 325362 343127 329073 309770 280306 288386 290630 266938 272459
4651 272459 344535 353153 295532 298053 316429 292200 270580 316469 372009 342610 341642 390043
4639 390043 304087 321995 418148 388956 377333 388207 365800 343965 400524 430741 401292 354875
4627 354875 358168 529825 504819 416851 411267 473413 534465 492135 514889 564226 548989 469588
4615 469588 497308 515973 458654 504365 531772 551594 559552 550332 579634 602179 565980 611436
4603 611436 657218 572283 563682 591248 588802 603120 643158 649788 605263 657773 650019 631233
4591 631233 644299 689321 724817 622191 649380 708116 773871 717814 703247 752805 770494
$$ packed form
4675C86466m7475p5464L3870O0666p147o8602j1196J0545J6635N1080J504k9321
4663C21561K1054O5435m1028m1660J7765j4054j9303k9464Q080K244k3692N521
4651B72459P2076Q618n7621K521J8376k4229k1620M5889N5540k9399r68M8401
4639C90043q5956J7908R6153k9192j1623J0874k2407k1835N6559L0217k9449m6417
4627C54875L293J71657k5006q7968n584O2146O1052m2330K2754M9337j5237p9401
4615D69588K7720J8665n7319M5711K7407J9822P958r220K9302K2545l6199M5456
4603F11436M5782q4935q601K7566k446J4318M0038O630m4525N2510p754j8786
4591F31233J3066M5022L5496j02626K7189N8736O5755n6057j4567M9558J7689
$$ plain form
4580 770494 732674 699361 696825 687961 687994 703006 693633 760279 736583 780099 808122 790886 800162
4567 800162 812990 788569 769700 810803 813940 806819 744256 749842 803231 738893 729917 713869
4555 713869 751633 744681 774620 825875 763308 767644 737876 756648 753008 816363 863056 800338
4543 800338 744391 814236 874468 844792 847683 825705 765404 771312 714945 751925 731230 705769
4531 705769 705041 710145 707389 674745 682411 705827 769294 676653 611568 604068 558988 585255 589566
4518 589566 597865 607731 618761 563086 534998 545962 548518 572379 557265 582902 548974 495649
4506 495649 549147 612874 587197 576110 518706 460490 586302 593961 546098 530642 578637 612755
4494 612755 644956 676544 644691 616279 579649 602697 620187 616212 567664 518573 602783 654501
$$ packed form
4580G70494l7820l3313k536q864L3J5012r373O6646k3696M3516K8023j7236R276
4567H00162J2828k4421j8869M1103L137p121o2563N586N3389o4338q976j6048
4555G13869L7764o952K9939N1255o2567M336k9768J8772l640O3355M6693o2718
4543H00338n5947O9845O0232k9676K891k1978o0301N908n6367L6980k0695k5461
4531G05769p28N104k756l2644P666K3416O3467r2641o5085p500m5080K6267M311
4518E89566Q299R866J1030n5675k8088J0964K556K3861j5114K5637l3928n3325
4506D95649N3498O3727k5677j1087n7404n8216J25812P659m7863j5456M7995L4118
4494F12755L2201L1588l1853k8412l6630K3048J7490l975m8548m9091Q4210N1718
$$ plain form
4482 654501 715500 720056 763204 799178 756794 707898 682733 703040 651695 579686 576750 584392
4470 584392 591086 627449 713581 751366 750940 719897 736151 798296 780031 739117 680383 743734
4458 743734 795158 778371 797006 884251 857226 856363 835678 774898 850156 911144 838585 809759
4446 809759 842764 800117 782116 788991 810833 832962 781766 773822 818142 814040 735591 777142
4434 777142 811697 857722 833459 773697 819413 834513 823079 850859 848796 830278 817363 828517
4422 828517 778982 768708 756401 735704 741042 765292 792261 822455 890356 873383 911165 942482
4410 942482 908915 967796 1019075 997613 1043177 1115108 1158614 1170272 1190042 1244193 1265522 1255510
4398 1255510 1220454 1196140 1168242 1132340 1135822 1121541 1179724 1160468 1133255 1089970 1060810 1087662
$$ packed form
4482F54501O0999M556M3148L5974m2384m8896k5165K0307n1345p2009k936P642
4470E84392O694L6363Q6132L7785m26l1043J6254O2145j8265m0914n8734O3351
4458G43734N1424j6787J8635Q7245k7025q63k0685o0780P5258O0988p2559k8826
4446H09759L3005m2647j8001O875K1842K2129n1196p944M4320m102p8449M1551
4434G77142L4555M6025k4263n9762M5716J5100j1434K7780k063j8518j2915J1154
4422H28517m9535j0274j2307k0697N338K4250K6969L0194O7901j6973L7782L1317
4410I42482l3567N8881N1279k1462M5564P1931M3506J1658J9770N4151K1329j0012
4398A255510l5056k4314k7898l5902L482j4281N8183j9256k7213m3285k9160K6852
$$ plain form
4386 1087662 1024849 952939 976613 1090741 1114862 1110548 1143341 1153230 1204339 1205956 1216031 1190027
4374 1190027 1177594 1217997 1182005 1208691 1269434 1309014 1323672 1405503 1482229 1464339 1460392 1414856
4362 1414856 1437521 1486829 1520604 1486363 1464450 1494387 1472076 1447526 1423100 1380598 1307796
4351 1307796 1277108 1266688 1249701 1195104 1188020 1208675 1159739 1172309 1142498 1132764 1143209 1212604
4339 1212604 1195598 1146591 1189517 1229506 1269983 1283661 1350730 1401280 1337086 1325043 1324865 1297337
4327 1297337 1243766 1273088 1284086 1215704 1137295 1061710 1038143 1121973 1179154 1056201 992245
4316 992245 1026123 1026771 997409 1003535 987115 960340 965920 963257 949990 940312 897664 851350 788088
4303 788088 740619 731071 756623 743748 772913 766107 777085 795601 814632 887208 909064 830669
$$ packed form
4386A087662o2813p1910K3674J14128K4121m314L2793R889N1109J617J0075k6004
4374A190027j2433M0403l5992K6686O0743L9580J4658Q1831P6726j7890l947m5536
4362A414856K2665M9308L3775l4241k1913K9937k2311k4550k4426m2502p2802
4351A307796l0688j0420j6987n4597p084K0655m8936J2570k9811r734J0445O9395
4339A212604j7006m9007M2926L9989M0477J3678O7069N0550o4194j2043j78k7528
4327A297337n3571K9322J0998o8382p8409p5585k3567Q3830N7181j22953o3956
4316I92245L3878O48k9362O126j6420k6775N580k663j3267r678m2648m6314o3262
4303G88088m7469r548K5552j2875K9165o806J0978J8516J9031P2576K1856p8395
$$ plain form
4291 830669 838849 838363 793038 757461 753524 717850 692973 651468 661232 680358 656190 652007 673205
4278 673205 699314 709021 719019 682457 700295 664908 556863 525217 584930 608560 593399 592098
4266 592098 535745 606247 632716 555041 598025 666661 683348 678608 661508 610275 619042 566709
4254 566709 528354 577137 603182 568989 565574 552995 604261 592890 531293 522681 534091 556239
4242 556239 557593 514602 468556 458753 422378 457824 562092 524044 495394 544737 561750 553765
4230 553765 526713 581119 542219 436303 414173 416332 342132 340590 401804 397984 420913 433386
4218 433386 429439 446429 480858 490865 428987 460487 486261 452862 423864 443165 420782 401295
4206 401295 417015 431172 402418 363494 386418 357817 365186 337025 397868 431030 400746 397292
$$ packed form
4291H30669Q180m86m5325l5577l937l5674k4877m1505R764J9126k4168m183K1198
4278F73205K6109R707R998l6562J7838l5387j08045l1646N9713K3630j5161j301
4266E92098n6353P0502K6469p7675M2984O8636J6687m740j7100n1233Q767n2333
4254E66709l8355M8783K6045l4193l415j2579N1266j1371o1597q612J1410K2148
4242E56239J354m2991m6046r803l6375L5446J04268l8048k8650M9343J7013p985
4230E53765k7052N4406l8900j05916k2130K159p4200j542O1214l820K2929J2473
4218D33386l947J6990L4429J0007o1878L1500K5774l3399k8998J9301k2383j9487
4206D01295J5720J4157k8754l8924K2924k8601P369k8161O0843L3162l0284l454
$$ plain form
4194 397292 379042 411388 409928 383967 392877 367742 394637 345142 334622 391525 403324 352951
4182 352951 346063 350481 356146 353040 330305 412508 419138 381551 400413 433406 458876 461102 391664
4169 391664 362095 402729 328147 321638 350899 320532 296165 262334 318585 365629 361406 351041
4157 351041 453108 441888 431027 461264 412260 448047 444561 393850 410621 454428 402952 317436
4145 317436 295961 293105 364383 350335 349996 367159 388267 405873 345206 377797 395298 417741
4133 417741 400108 391687 411356 368227 380549 404177 397579 368087 308267 309699 330490 349908
4121 349908 336326 331978 352239 363369 407792 475574 467865 449519 454807 522027 481553 388725
4109 388725 386077 369242 358921 369110 389109 306190 361391 370133 366990 453740 462352 486276
$$ packed form
4194C97292j8250L2346j460k5961Q910k5135K6895m9495j0520N6903J1799n0373
4182C52951o888M418N665l106k2735Q2203O630l7587J8862L2993K5470K226o9438
4169C91664k9569M0634p4582o509K9261l0367k4367l3831N6251M7044m223j0365
4157C51041J02067j1220j0861L0237m9004L5787l486n0711J6771M3807n1476q5516
4145C17436k1475k856P1278j4048l39J7163K1108J7606o0667L2591J7501K2443
4133D17741j7633q421J9669m3129J2322K3628o598k9492n9820J432K0791J9418
4121C49908j3582m348K0261J1130M4423O7782p709j8346N288O7220m0474r2828
4109C88725k648j6835j0321J0189J9999q2919N5201Q742l143Q6750Q612K3924
$$ plain form
4097 486276 518306 469633 419342 473260 501381 497111 457804 408579 403609 410908 442971 465393
4085 465393 483026 480891 483786 427410 419136 491981 460511 524925 585778 533865 549679 550609 497948
4072 497948 509766 538165 481237 483601 495546 483442 535253 508249 496378 525782 538413 488007
4060 488007 516975 571294 648163 646824 551934 556059 605230 617006 636982 623127 607897 577101
4048 577101 619131 657427 662729 689260 674807 698866 707311 716396 657063 649642 691215 748873
4036 748873 702142 649676 743702 778185 705004 716074 722786 710026 664689 712465 721690 688673
4024 688673 708209 777423 816610 787364 762481 773066 797372 784658 763292 779660 700001 697246
4012 697246 690069 680938 703168 726905 741824 725789 776905 776487 816565 801808 799034 882174 863546
$$ packed form
4097D86276L2030m8673n0291N3918K8121m270l9307m9225m970P299L2063K2422
4085D65393J7633k135K895n6376q274P2845l1470O4414O0853n1913J5814R30n2661
4072D97948J1818K8399n6928K364J1945j2104N1811k7004j1871K9404J2631n0406
4060D88007K8968N4319P6869j339r4890M125M9171J1776J9976j3855j5230l0796
4048E77101M2030L8296N302K6531j4453K4059Q445R085n9333p421M1573N7658
4036G48873m6731n2466R4026L4483p3181J1070O712j2760m5337M7776R225l3017
4024F88673J9536O9214L9187k9246k4883J0585K4306j2714k1366J6368p9659k755
4012F97246p177r131K2230K3737J4919j6035N1116m18M0078j4757k774Q3140j8628
$$ plain form
3999 863546 854312 912098 931362 932553 972992 986805 971916 953710 933269 1026250 958607 1007588
3987 1007588 1096747 1073853 1038066 1110018 1172125 1146309 1125332 1187058 1278906 1255481 1270414
3976 1270414 1284512 1328454 1382326 1426727 1497936 1513296 1507459 1493899 1501500 1594064 1666862 1652993
3964 1652993 1647069 1713289 1738662 1806369 1841006 1879060 2012531 2056657 1989310 2007478 2101653
3953 2101653 2160476 2259002 2310619 2341272 2399886 2414914 2552011 2735586 2835667 2964262 3059480
3942 3059480 3187657 3362833 3479342 3615864 3927658 4139978 4328055 4660618 4998549 5406879
3932 5406879 5896829 6293167 6636967 6908060 7044235 7015764 7027834 6986291 7178366 7413509
3922 7413509 7698782 8200072 8652126 9182639 9920923 10603771 11204192 11849630 12367894 12860731
$$ packed form
3999H63546r234N7786J9264J191M0439J3813j4889j8206k0441R2981o7643M8981
3987A007588Q9159k2894l5787P1952O2107k5816k0977O1726R1848k3425J4933
3976A270414J4098M3942N3872M4401P1209J5360n837j3560P601R2564P2798j3869
3964A652993n924O6220K5373O7707L4637L8054J33471M4126o7347J8168R4175
3953B101653N8823R8526N1617L0653N8614J5028J37097J83575J00081J28595R5218
3942C059480J28177J75176J16509J36522L11794K12320J88077L32563L37931M08330
3932E406879M89950L96338L43800K71093J36175k8471J2070m1543J92075K35143
3922G413509K85273N01290M52054N30513P38284O82848O00421O45438N18264M92837
$$ plain form
3912 12860731 13433826 13770790 13899538 13842442 13504846 13229317 13105536 13252652 13591138 14227911
3902 14227911 15090764 16087663 17009930 17719130 18238038 18352056 18151484 17875943 17516335
3893 17516335 17267823 17213017 17222014 17120348 17076872 17143098 17377851 17656382 17965130 18312802
3883 18312802 18739220 19246901 19696844 19805628 19330091 18431854 17385138 16377062 15679925
3874 15679925 15300019 15197274 15281353 15500642 15906216 16323656 16587261 16595922 16322433 15713923
3864 15713923 15091616 14530308 13943283 13377143 12585888 11776449 11017057 10346980 9955166
3855 9955166 9638639 9498095 9484306 9636915 9788439 9802553 9661837 9340831 8859920 8159348
3845 8159348 7513945 6913298 6408353 6014801 5696505 5450683 5186351 4957295 4771455 4627739
$$ packed form
3912A2860731N73095L36964J28748n7096l37596k75529j23781J47116L38486O36773
3902A4227911Q62853R96899R22267P09200N18908J14018k00572k75541l59608
3893A7516335k48512n4806Q997j01666m3476O6226K34753K78531L08748L47672
3883A8312802M26418N07681M49943J08784m75537q98237j046716j008076o97137
3874A5679925l79906j02745Q4079K19289M05574M17440K63605Q661k73489o08510
3864A5713923o22307n61308n87025n66140p91255q09439p59392o70077l91814
3855I955166l16527j40544j3789J52609J51524J4114j40716l21006m80911p00572
3845H159348o45403o00647n04945l93552l18296k45822k64332k29056j85840j43716
$$ plain form
3835 4627739 4489611 4298859 4181513 4114175 4064752 3985452 3828763 3726351 3726948 3707142 3645954
3824 3645954 3582528 3478623 3410987 3388962 3355901 3361099 3335207 3256553 3208729 3173857 3177020 3207621
3812 3207621 3156437 3129528 3102007 2992581 2919487 2900764 2896832 2923250 2896642 2842895 2846882 2794768
3800 2794768 2793928 2849547 2893994 2878558 2854431 2715854 2699032 2766393 2767154 2832430 2803976 2681166
3788 2681166 2660089 2698841 2714832 2690415 2646154 2587102 2671877 2673672 2638782 2689885 2725714 2756331
3776 2756331 2737351 2746453 2772133 2750219 2712527 2713468 2695114 2739259 2740681 2734672 2796913 2812740
3764 2812740 2791812 2831203 2856576 2892323 2959517 2998372 3047509 3163634 3159274 3205292 3301217
3753 3301217 3427328 3496258 3492462 3554128 3588517 3675623 3740140 3863823 3924973 4036914 4237960
$$ packed form
3835D627739j38128j90752j17346o7338m9423p9300j56689j02412N97j9806o1188
3824C645954o3426j03905o7636k2025l3061N198k5892p8654m7824l4872L163L0601
3812C207621n1184k6909k7521j09426p3094j8723l932K6418k6608n3747L987n2114
3800B794768q40N5619M4447j5436k4127j38577j6822O7361P61O5276k8454j22810
3788B681166k1077L8752J5991k4417m4261n9052Q4775J795l4890N1103L5829L0617
3776B756331j8980R102K5680k1914l7692R41j8354M4145J422o009O2241J5827
3764B812740k0928L9391K5373L5747O7194L8855M9137J16125m360M6018R5925
3753C301217J26111O8930l796O1666L4389Q7106O4517J23683O1150J11941K01046
$$ plain form
3742 4237960 4455465 4734493 4890058 5122290 5426819 5697761 6052785 6429065 6812637 7238832
3732 7238832 7805979 8418051 9256849 10277805 11412204 12713232 13997682 15084014 15740492
3723 15740492 15807133 15203447 14119816 13022121 12170694 11501302 10944657 10663958 10518488
3714 10518488 10476850 10536586 10762028 11167264 11756919 12534894 13409918 14259682 14682510 14705909
3704 14705909 14154536 13169857 12087086 11091256 10308614 9709964 9206313 8816423 8506607
3695 8506607 8205365 7930959 7757369 7631650 7528926 7507499 7517204 7499249 7527445 7625719 7756665
3684 7756665 7886891 8109967 8333427 8601480 8954167 9314962 9747500 10138684 10630722 11301092
3674 11301092 12108119 12953472 13961470 15193256 16619527 18392698 20408301 22494928
$$ packed form
3742D237960K17505K79028J55565K32232L04529K70942L55024L76280L83572M26195
3732G238832N67147O12072Q38798J020956J134399J301028J284450J086332O56478
3723A5740492O6641o03686j083631j097695q51427o69392n56645k80699j45470
3714A0518488m1638N9736K25442M05236N89655P77975Q75024Q49764M22828K3399
3704A4705909n51373r84679j082771r95830p82642n98650n03651l89890l09816
3695H506607l01242k74406j73590j25719j02724k1427R705j7955K8196R8274J30946
3684G756665J30226K23076K23460K68053L52687L60795M32538L91184M92038O70370
3674A1301092Q07027Q45353J007998J231786J426271J773171K015603K086627
$$ plain form
3666 22494928 24330708 25567924 26015226 25431814 23927302 22032055 20447984 19245564
3658 19245564 18367299 17757838 17439456 17347076 17426709 17829281 18517752 19452066 20616992 21981582
3648 21981582 23336196 24379477 24764119 24294757 22994702 21185881 19440950 18013965
3640 18013965 16884294 15985793 15216869 14669006 14296510 14032469 13879606 13839711 13952695
3631 13952695 14315749 14810446 15508662 16404591 17536285 18935108 20541454 22118804 23459615
3622 23459615 24092136 23713929 22467557 20850435 19438276 18506641 17874020 17449067 17270700
3613 17270700 17214465 17470644 17926768 18633312 19620244 20838762 22374599 24305516 26382094
3604 26382094 28434690 30391565 31884510 32891549 33406672 33467034 33207031 32161480 30046813
$$ packed form
3666B2494928J835780J237216M47302n83412j504512j895247j584071j202420
3658A9245564q78265o09461l18382r2380P9633M02572O88471R34314J164926J364590
3648B1981582J354614J043281L84642m69362j300055j808821j744931j426985
3640A8013965j129671q98501p68924n47863l72496k64041j52863l9895J12984
3631A3952695L63054M94697O98216Q95929J131694J398823J606346J577350J340811
3622B3459615O32521l78207j246372j617122j412159r31635o32621m24953j78367
3613A7270700n6235K56179M56124P06544R86932J218518J535837J930917K076578
3604B6382094K052596J956875J492945J007039N15123O0362k60003j045551k114667
$$ plain form
3595 30046813 27331958 24726235 22599352 21011641 19861835 19044500 18435260 17976676 17766261
3586 17766261 17935762 18363655 19033237 20082135 21413635 22780889 23893526 24401741 24093201
3577 24093201 22783452 20620878 18409540 16662051 15302633 14138771 13161131 12371963
3569 12371963 11750495 11168446 10610205 10129134 9706538 9265329 8869029 8641191 8487759
3560 8487759 8269595 8000802 7733689 7601810 7519560 7457270 7455146 7356184 7187276 7106161 7082003
3549 7082003 7056578 6979643 6851509 6792120 6721723 6610568 6511178 6484718 6406491 6355961 6310059
3538 6310059 6266104 6275475 6238707 6229079 6272553 6282827 6242098 6236599 6264811 6299924 6365379 6464055
3526 6464055 6555586 6614835 6725054 6809602 6919378 7140840 7331217 7522849 7776782 8014363
$$ packed form
3595C0046813k714855k605723k126883j587711j149806q17335o09240m58584k10415
3586A7766261J69501M27893O69582J048898J331500J367254J112637N08215l08540
3577B4093201j309749k162574k211338j747489j359418j163862r77640p89168
3569A2371963o21468n82049n58241m81071m22596m41209l96300k27838j53432
3560H487759k18164k68793k67113j31879q2250o2290k124r8962j68908q1115k4158
3549G082003k5425p6935j28134n9389p0397j11155r9390k6460p8227n0530m5902
3538F310059m3955R371l6768r628M3474J0274m0729n499K8212L5113O5455R8676
3526F464055R1531N9249J10219Q4548J09776K21462J90377J91632K53933K37581
$$ plain form
3516 8014363 8284802 8615800 8975281 9401924 9859230 10403827 11058840 11776745 12571328 13599280
3506 13599280 14860795 16379097 18250026 20155150 22030910 23549018 24324329 24216025
3498 24216025 23193539 21542221 19552978 17815769 16468854 15422612 14522897 13829465
3490 13829465 13290900 12740094 12430459 12289290 12176928 12092695 12137378 12299244 12534772 12853675
3480 12853675 13298662 13945637 14661458 15443393 16462014 17760177 19226245 20844348 22481248
3471 22481248 23715492 24384326 24212940 23290620 21907973 20469367 19128600 18110932 17368187
3462 17368187 16746222 16338364 16129494 16103284 16193893 16412866 16830772 17405330 18175973 19153350
3452 19153350 20410616 22078817 24116243 26406822 29010949 31713722 34095231 35901405
$$ packed form
3516H014363K70439L30998L59481M26643M57306N44597O55013P17905P94583J027952
3506A3599280J261515J518302J870929J905124J875760J518108P75311j08304
3498B4216025j022486j651318j989243j737209j346915j046242q99715o93432
3490A3829465n38565n50806l09635j41169j12362q4233M4683J61866K35528L18903
3480A2853675M44987O46975P15821P81935J018621J298163J466068J618103J636900
3471B2481248J234244O68834j71386r22320j382647j438606j340767j017668p42745
3462A7368187o21965m07858k08870k6210R0609K18973M17906N74558P70643R77377
3452A9153350J257266J668201K037426K290579K604127K702773K381509J806174
$$ plain form
3444 35901405 36824771 36913552 36414817 35733027 35029200 34397384 33805314 33441398 33535809 33930031
3434 33930031 34565956 34902940 34691540 33730248 31967816 30051733 28470805 27618857 27381745
3425 27381745 27732527 28404749 29236774 29859779 30073543 29781699 28758732 27445805 26495616
3416 26495616 26199541 26463234 27154627 28185668 29424531 30647184 31394650 31348384 30391680
3407 30391680 28535661 25832822 22948323 20461438 18462427 16857170 15541311 14393239
3399 14393239 13386657 12527856 11692972 10955243 10329014 9787636 9317999 8952164 8623516
3390 8623516 8254056 7970608 7803979 7613645 7368197 7162857 7026992 6891300 6665757 6476312
3380 6476312 6367986 6246934 6089651 5909150 5826318 5720010 5629659 5548859 5397573 5298217
$$ packed form
3444C5901405R23366Q8781m98735o81790p03827o31816n92070l63916R4411L94222
3434C3930031O35925L36984k11400r61292j762432j916083j580928q51948k37112
3425B7381745L50782O72222Q32025O23005K13764k91844j022967j312927r50189
3416B6495616k96075K63693O91393J031041J238863J222653P47466m6266r56704
3407C0391680j856019k702839k884499k486885j999011j605257j315859j148072
3399A4393239j006582q58801q34884p37729o26229n41378m69637l65835l28648
3390H623516l69460k83448j66629j90334k45448k05340j35865j35692k25543j89445
3380F476312j08326j21052j57283j80501q2832j06308r0351q0800j51286r9356
$$ plain form
3370 5298217 5219841 5116315 5041258 5014457 4908072 4840919 4813073 4729930 4680078 4588931 4456928
3359 4456928 4393832 4386402 4299123 4199654 4084540 3983414 3993436 3985974 3977054 3870117 3730859
3348 3730859 3637938 3652032 3614810 3559181 3491973 3410751 3411478 3295006 3246763 3255455 3177917 3038796
3336 3038796 2982224 2910098 2794793 2773549 2688900 2644974 2604899 2562647 2591573 2545262 2572705
3325 2572705 2554531 2497075 2407986 2338468 2321290 2339242 2344091 2284263 2230680 2213345 2176446 2120253
3313 2120253 2139292 2161834 2100005 2086932 2084398 2094337 2106912 2175874 2179740 2178497 2149649 2191497
3301 2191497 2158073 2101399 2144745 2157176 2117909 2038652 2036896 2027746 2017590 2020713 2020965 2056428
3289 2056428 2031031 2031688 2000496 1997258 2021622 2008160 1979465 1926232 1898897 1844667 1864536 1774104
$$ packed form
3370E298217p8376j03526p5057k6801j06385o7153k7846q3143m9852r1147j32003
3359D456928o3096p430q7279r9469j15114j01126J0022p462q920j06937j39258
3348C730859r2921J4094l7222n5629o7208q1222P27j16472m8243Q692p7538j39121
3336C038796n6572p2126j15305k1244q4649m3926m0075m2252K8926m6311K7443
3325B572705j8174n7456q9089o9518j7178J7952M849n9828n3583j7335l6899n6193
3313B120253J9039K2542o1829j3073k534R939J2575O8962L866j243k8848M1848
3301B191497l3424n6674M3346J2431l9267p9257j756r150j0156L123K52L5463
3289B056428k5397O57l1192l238K4364j3462k8695n3233k7335n4230J9869r0432
$$ plain form
3277 1774104 1691327 1686982 1664790 1638182 1617912 1637652 1671608 1717552 1631206 1586069 1593735 1593721
3265 1593721 1595566 1519660 1467589 1400376 1422683 1405051 1394388 1462335 1460217 1395038 1416486 1464355
3253 1464355 1450447 1438887 1415855 1432802 1399712 1397619 1460531 1422086 1400622 1445115 1446404 1373389
3241 1373389 1401853 1425772 1434689 1488267 1480201 1448726 1415594 1431872 1435618 1389299 1448973 1535604
3229 1535604 1475762 1387408 1448830 1464440 1485513 1487176 1497080 1510353 1553636 1544520 1479882 1494353
3217 1494353 1531370 1514474 1472108 1485788 1502343 1482313 1516832 1534033 1509088 1497657 1561749
3206 1561749 1527620 1445716 1532682 1569818 1516056 1487233 1477460 1471443 1446143 1440444 1410333 1435745
3194 1435745 1443300 1390809 1371191 1391124 1445215 1458122 1429664 1438154 1433974 1407241 1442054 1445779
$$ packed form
3277A774104q2777m345k2192k6608k0270J9740L3956M5944q6346m5137P666j4
3265A593721J845p5906n2071o7213K2307j7632j0663O7947k118o5179K1448M7869
3253A464355j3908j1560k3032J6947l3090k093O2912l8445k1464M4493J289p3015
3241A373389K8464K3919Q917N3578q066l1475l3132J6278L746m6319N9674Q6631
3229A535604n9842q8354O1422J5610K1073J663R904J3273M3283r116o4638J4471
3217A494353L7017j6896m2366J3680J6555k0030L4519J7201k4945j1431O4092
3206A561749l4129q1904Q6966L7136n3762k8823r773o017k5300n699l0111K5412
3194A435745P555n2491j9618J9933N4091J2907k8458Q490m180k6733L4813L725
$$ plain form
3182 1445779 1495670 1539341 1553439 1533351 1503738 1534678 1640164 1683689 1617171 1608825 1626064
3171 1626064 1650560 1648708 1590506 1547649 1502781 1548694 1541528 1438621 1431037 1476717 1493107 1503853
3159 1503853 1509105 1527138 1540108 1571990 1597300 1598242 1500210 1487241 1478090 1472664 1546568 1542308 1473286
3146 1473286 1503341 1588109 1577968 1521433 1471156 1427535 1445636 1401736 1373438 1403695 1407752 1459269
3134 1459269 1487222 1432355 1388964 1428950 1444946 1389701 1363978 1361954 1355341 1350426 1300484 1306956
3122 1306956 1421411 1441487 1375380 1390368 1425771 1423731 1437785 1530547 1501707 1425457 1474436
3111 1474436 1538543 1569049 1586812 1600368 1547123 1605005 1680359 1701646 1781460 1813875 1766152
3100 1766152 1665979 1659143 1656507 1663300 1639811 1646835 1669688 1613190 1612708 1676038 1716865 1722019 1732765
$$ packed form
3182A445779M9891M3671J4098k0088k9613L0940J05486M3525o6518q346J7239
3171A626064K4496j852n8202m2857m4868M5913p166j02907p584M5680J6390J0746
3159A503853N252J8033J2970L1882K5310R42r8032j2969r151n426P3904m260o9022
3146A473286L0055Q4768j0141n6535n0277m3621J8101m3900k8298L0257M057N1517
3134A459269K7953n4867m3391L9986J5996n5245k5723k024o613m915m9942O472
3122A306956J14455K0076o6107J4988L5403k040J4054R2762k8840p6250M8979
3111A474436O4107L0506J7763J3556n3245N7882P5354K1287P9814L2415m7723
3100A766152j00173o836k636O793k3489P024K2853n6498m82O3330M0827N154J0746
$$ plain form
3087 1732765 1755376 1783216 1744032 1723653 1688250 1634147 1716753 1709744 1654527 1630601 1714740 1792241
3075 1792241 1783098 1735502 1760183 1890386 1859125 1873726 1958656 1945973 1903851 1829763 1874001
3064 1874001 1868950 1876456 1965879 2012244 2017548 1993619 2033178 2048305 2157840 2220597 2261010 2305573
3052 2305573 2264942 2255707 2230271 2227763 2347069 2403601 2369427 2396791 2394881 2376832 2476032 2587453
3040 2587453 2627461 2693469 2662456 2640564 2722717 2721723 2768043 2767820 2819301 2894756 2861089 2904870
3028 2904870 2960391 2987370 3090756 3151088 3130713 3159562 3243453 3239513 3302802 3325444 3373069
3017 3373069 3452911 3527464 3623860 3734451 3840324 3906094 4001157 4001608 4047409 4118537 4128669
3006 4128669 4210658 4320712 4429779 4493118 4579924 4713099 4864792 5022875 5124190 5228336
$$ packed form
3087A732765K2611K7840l9184k0379l5403n4103Q2606p009n5217k3926Q4139P7501
3075A792241r143m7596K4681J30203l1261J4601Q4930j2683m2122p4088M4238
3064A874001n051P506Q9423M6365N304k3929L9559J5127J09535O2757M0413M4563
3052B305573m0631r235k5436k508J19306N6532l4174K7364j910j8049R9200J11421
3040B587453M0008O6008l1013k1892Q2153r94M6320k23N1481P5455l3667M3781
3028B904870N5521K6979J03386O0332k0375K8849Q3891l940O3289K2642M7625
3017C373069P9842P4553R6396J10591J05873O5770R5063M51M5801P1128J0132
3006D128669Q1989J10054J09067O3339Q6806J33175J51693J58083J01315J04146
$$ plain form
2996 5228336 5309536 5416363 5507489 5598063 5763030 5855417 5875320 5976560 6147599 6353282
2986 6353282 6447589 6568321 6711586 6890332 7044952 7251875 7467626 7649778 7813763 8041913
2976 8041913 8219184 8387403 8668968 8969355 9226009 9528514 9798111 10071880 10398356 10755185
2966 10755185 11193184 11610147 12035107 12487446 12952750 13446413 13997002 14559610 15208091
2957 15208091 15847399 16535196 17262740 18053726 18882408 19703364 20567136 21547071 22591227
2948 22591227 23559620 24634326 25852256 27100041 28360458 29649268 30975972 32261454
2940 32261454 33604592 35007272 36456498 37909923 39343887 40831185 42427321 44089412
2932 44089412 45661619 47280581 48897120 50443253 51925017 53374282 54762401 56005475
$$ packed form
2996E228336Q1200J06827R1126R0574J64967R2387J9903J01240J71039K05683
2986F353282R4307J20732J43265J78746J54620K06923K15751J82152J63985K28150
2976H041913J77271J68219K81565L00387K56654L02505K69597K73769L26476L56829
2966A0755185M37999M16963M24960M52339M65304M93663N50589N62608O48481
2957A5208091O39308O87797P27544P90986Q28682Q20956Q63772R79935J044156
2948B2591227R68393J074706J217930J247785J260417J288810J326704J285482
2940C2261454J343138J402680J449226J453425J433964J487298J596136J662091
2932D4089412J572207J618962J616539J546133J481764J449265J388119J243074
$$ plain form
2924 56005475 57176698 58346722 59462200 60484536 61429645 62322081 63166565 64000555 64757761
2915 64757761 65425198 65984134 66352721 66603161 66657906 66549631 66335126 65898414 65380223 64836403
2905 64836403 64171879 63379184 62630990 61874508 61021565 60067924 59026468 57899904 56666720
2896 56666720 55414242 54040244 52536117 51013537 49463317 47798309 46203127 44597555
2888 44597555 43078115 41594255 40088521 38527773 37144311 35846727 34509637 33117954
2880 33117954 31729284 30425679 29160862 27881174 26661007 25446040 24250873 23164721
2872 23164721 22127490 21175283 20275562 19339739 18456948 17765904 17109858 16477878 15857856
2863 15857856 15199950 14579195 14070889 13543213 13129064 12714883 12240020 11794999 11429323
$$ packed form
2924E6005475J171223J170024J115478J022336R45109Q92436Q44484Q33990P57206
2915F4757761O67437N58936L68587K50440N4745j08275k14505m36712n18191n43820
2905F4836403o64524p92695p48194p56482q52943r53641j041456j126564j233184
2896E6666720j252478j373998j504127j522580j550220j665008j595182j605572
2888D4597555j519440j483860j505734j560748j383462j297584j337090j391683
2880C3117954j388670j303605j264817j279688j220167j214967j195167j086152
2872B3164721j037231r52207q99721r35823q82791o91044o56046o31980o20022
2863A5857856o57906o20755n08306n27676m14149m14181m74863m45021l65676
$$ plain form
2854 11429323 11095529 10801885 10521992 10272105 10077446 9786234 9495798 9322995 9097495
2845 9097495 8910966 8761303 8595653 8437506 8301157 8137090 7983055 7841852 7711115 7578327
2835 7578327 7398612 7248324 7127834 7049819 6995057 6970799 6836448 6720754 6672413 6589460
2825 6589460 6538583 6425289 6278963 6164829 6063422 5948949 5836977 5743069 5619892 5658384
2815 5658384 5603028 5474640 5363018 5255686 5238179 5191486 5084294 4989142 4936291 4830109
2805 4830109 4734364 4707090 4650807 4608080 4556464 4511931 4499843 4453083 4437881 4430942 4408619 4404602
2793 4404602 4440512 4429539 4478317 4485752 4478898 4451953 4460624 4525053 4577570 4555898 4568590 4624634
2781 4624634 4652893 4637130 4580923 4536756 4628231 4660609 4644631 4607980 4470050 4421538 4449473
$$ packed form
2854A1429323l33794k93644k79893k49887j94659k91212k90436j72803k25500
2845I097495j86529j49663j65650j58147j36349j64067j54035j41203j30737j32788
2835G578327j79715j50288j20490p8015n4762k4258j34351j15694m8341q2953
2825F589460n0877j13294j46326j14134j01407j14473j11972r3908j23177L8492
2815E658384n5356j28388j11622j07332j7507m6693j07192r5152n2851j06182
2805D830109r5745k7274n6283m2727n1616m4533j2088m6760j5202o939k2323m017
2793D404602L5910j0973M8778P435o854k6945Q671O4429N2517k1672J2692N6044
2781D624634K8259j5763n6207m4167R1475L2378j5978l6651j37930m8512K7935
$$ plain form
2770 4449473 4459252 4408028 4362639 4309700 4293071 4234465 4211496 4246938 4191159 4115875 4115520 4026201
2758 4026201 3966823 3973848 4015958 3942279 3843357 3840165 3915058 3870053 3796017 3824837 3839851 3807128
2746 3807128 3856450 3886679 3883511 3870861 3841095 3815678 3853178 3884397 3851402 3884718 3912176 3974929
2734 3974929 3942337 3922075 3971021 4009008 4043806 4090771 4116081 4090641 4045887 4045540 4034141 4034769
2722 4034769 4019834 4079447 4087847 4065392 4138058 4229196 4249773 4300624 4338232 4369738 4367419 4321471
2710 4321471 4237120 4214885 4207973 4236408 4227998 4203217 4239367 4209115 4246037 4222580 4244547 4287348
2698 4287348 4280315 4264252 4333701 4399088 4331700 4291391 4347255 4334474 4318230 4305666 4335359 4210367
2686 4210367 4137775 4208371 4226585 4219063 4246806 4382492 4405424 4350343 4391659 4470431 4507274
$$ packed form
2770D449473R779n1224m5389n2939j6629n8606k2969L5442n5779p5284l55q9319
2758D026201n9378P025M2110p3679r8922l192P4893m5005p4036K8820J5014l2723
2746C807128M9322L0229l168j2650k9766k5417L7500L1219l2995L3316K7458O2753
2734C974929l2592k0262M8946L7987L4798M6965K5310k5440m4754l47j1399O28
2722D034769j4935N9613Q400k2455P2666R1138K0577N0851L7608L1506k319m5948
2710D321471q4351k2235o912K8435q410k4781L6150l0252L6922k3457K1967M2801
2698D287348p033j6063O9449O5387o7388m0309N5864j2781j6244j2564K9693j24992
2686D210367p2592P0596J8214p522K7743J35686K2932n5081M1316P8772L6843
$$ plain form
2675 4507274 4475399 4448532 4439443 4452492 4420569 4409585 4456390 4531049 4605818 4612537 4657437 4631233
2663 4631233 4651121 4702833 4756627 4786179 4852819 4837620 4870140 4969474 4975739 4955242 4998411 5112824
2651 5112824 5164607 5095460 5142159 5282248 5291796 5260550 5373219 5448690 5527414 5562579 5621858
2640 5621858 5745519 5771622 5748755 5811988 5974213 6001671 6087124 6185451 6302586 6371192 6446171
2629 6446171 6545907 6664891 6787964 6935864 7030249 7143646 7205985 7266203 7342754 7527478
2619 7527478 7658960 7822407 8004492 8151195 8321133 8465401 8697524 8954073 9189840 9332900
2609 9332900 9499814 9751241 9924592 10087468 10350771 10664586 10897083 11137576 11512348 11814370
2599 11814370 12098262 12428763 12923523 13338968 13728719 14181319 14623796 15124552 15677686
$$ packed form
2675D507274l1875k6867r089J3049l1923j0984M6805P4659P4769O719M4900k6204
2663D631233J9888N1712N3794K9552O6640j5199L2520R9334O265k0497M3169J14413
2651E112824N1783o9147M6699J40089R548l1246J12669P5471P8724L5165N9279
2640E621858J23661K6103k2867O3233J62225K7458Q5453R8327J17135O8606P4979
2629F446171R9736J18984J23073J47900R4385J13397O2339O0218P6551J84724
2619G527478J31482J63447J82085J46703J69938J44268K32123K56549K35767J43060
2609I332900J66914K51427J73351J62876K63303L13815K32497K40493L74772L02022
2599A1814370K83892L30501M94760M15445L89751M52600M42477N00756N53134
$$ plain form
2590 15677686 16247761 16899407 17584315 18271880 18911388 19675755 20416111 21170912 21962626
2581 21962626 22742594 23499464 24212689 24908843 25593628 26309223 26983147 27640063 28278254
2572 28278254 28936473 29587692 30221374 30825833 31429036 31984024 32476165 32847652 33193715
2563 33193715 33432105 33649597 33753391 33896069 34023545 34103098 34214999 34408846 34604755 34832367
2553 34832367 35129370 35326540 35530951 35778698 36018722 36293014 36623519 36895396 37181402
2544 37181402 37629478 38156143 38745985 39471193 40180556 40997108 42008639 43149435 44307602
2535 44307602 45601609 46946252 48429415 50117054 51987659 53956538 56149670 58488648
2527 58488648 60984771 63556959 66225179 69133710 72009293 74856905 77771973 80605264
$$ packed form
2590A5677686N70075O51646O84908O87565O39508P64367P40356P54801P91714
2581B1962626P79968P56870P13225O96154O84785P15595O73924O56916O38191
2572B8278254O58219O51219O33682O04459O03203N54988M92141L71487L46063
2563C3193715K38390K17492J03794J42678J27476P9553J11901J93847J95909K27612
2553C4832367K97003J97170K04411K47747K40024K74292L30505K71877K86006
2544C7181402M48076N26665N89842P25208P09363Q16552J011531J140796J158167
2535D4307602J294007J344643J483163J687639J870605J968879K193132K338978
2527E8488648K496123K572188K668220K908531K875583K847612K915068K833291
$$ plain form
2519 80605264 83413971 86210708 88971191 91834034 94825887 97786415 100853712 104031879
2511 104031879 107244559 110472507 113686633 116922152 119972932 122911315 125833144 128792899
2503 128792899 131723503 134742667 137855864 141154435 144749547 148641458 152925118 157486890
2495 157486890 162306138 167483108 173078581 179139179 185618333 192643112 200328628 208797740
2487 208797740 217834517 227382847 237072175 246385930 254914852 262213115 268103070 272229497
2479 272229497 274482238 275154474 274393695 272508096 270078095 267516920 264908433 262532848
2471 262532848 260344007 258093441 255617905 252610163 248760886 243680052 237137063 229045281
2463 229045281 219508317 208718443 197163191 185247194 173254356 161534143 150344261
$$ packed form
2519H0605264K808707K796737K760483K862843K991853K960528L067297L178167
2511A04031879L212680L227948L214126L235519L050780K938383K921829K959755
2503A28792899K930604L019164L113197L298571L595112L891911M283660M561772
2495A57486890M819248N176970N595473O060598O479154P024779P685516Q469112
2487B08797740R036777R548330R689328R313755Q528922P298263N889955M126427
2479B72229497K252741O72236p60779j885599k430001k561175k608487k375585
2471B62532848k188841k250566k475536l007742l849277n080834o542989q091782
2463B29045281r536964j0789874j1555252j1915997j1992838j1720213j1189882
$$ plain form
2456 150344261 139837640 130122393 121268046 113264338 105983339 99383550 93513239 88352864
2448 88352864 83792494 79734405 76090980 72938472 70089764 67564629 65373956 63369978
2440 63369978 61618995 60063099 58634692 57339708 56159479 55071702 54133230 53156990
2432 53156990 52170506 51341799 50487290 49654613 48968179 48332710 47716519 47194152 46770042
2423 46770042 46362063 45971852 45483134 45070724 44606280 44064847 43436626 42779960 42155046
2414 42155046 41345597 40532660 39667593 38752396 37838027 37013081 36250198 35378339 34610825
2405 34610825 33830789 33073047 32373424 31667696 30943395 30159833 29371944 28482849 27652922
2396 27652922 26841846 26064699 25255682 24452568 23699020 22969160 22304854 21676268 21081160
$$ packed form
2456A50344261j0506621r715247q854347q003708p280999o599789n870311n160375
2448H8352864m560370m058089l643425l152508k848708k525135k190673k003978
2440F3369978j750983j555896j428407j294984j180229j087777r38472r76240
2432E3156990r86484q28707q54509q32677o86434o35469o16191n22367m24110
2423D6770042m07979l90211m88718m12410m64444n41433o28221o56666o24914
2414D2155046q09449q12937q65067r15197r14369q24946p62883q71859p67514
2405C4610825p80036p57742o99623p05728p24301p83562p87889q89095q29927
2396B7652922q11076p77147q09017q03114p53548p29860o64306o28586n95108
$$ plain form
2387 21081160 20501368 19998016 19560932 19084873 18706768 18286623 17897995 17550049 17190713
2378 17190713 16800525 16462822 16169341 15788395 15450264 15062791 14755109 14509743 14252341
2369 14252341 13993987 13777742 13550009 13253862 13028407 12790750 12573382 12335280 12072714
2360 12072714 11831113 11584231 11372782 11101845 10908435 10742347 10603110 10437049 10272298
2351 10272298 10114364 9955080 9842118 9695218 9514042 9337952 9229803 9109210 8959311
2342 8959311 8893873 8858483 8831928 8787116 8749941 8670053 8588228 8598707 8582561 8488798 8369610
2331 8369610 8321788 8294771 8219371 8146162 8115471 8074522 8098366 8100711 8034992 8017366 7986773 7931479
2319 7931479 7974404 7947192 7808406 7771414 7757689 7753085 7718680 7584613 7435050 7361255 7299915
$$ packed form
2387B1081160n79792n03352m37084m76059l78105m20145l88628l47946l59336
2378A7190713l90188l37703k93481l80946l38131l87473l07682k45366k57402
2369A4252341k58354k16245k27733k96147k25455k37657k17368k38102k62566
2360A2072714k41601k46882k11449k70937j93410j66088j39237j66061j64751
2351A0272298j57934j59284j12962j46900j81176j76090j08149j20593j49899
2342H959311o5438l5390k6555m4812l7175p9888q1825J0479j6146r3763j19188
2331H369610m7822k7017p5400p3209l0691m0949K3844K345o5719j7626l0593n5294
2319G931479M2925k7212j38786l6992j3725m604l4405j34067j49563p3795o1340
$$ plain form
2308 7299915 7283160 7259649 7083598 7036999 7024757 6924692 6883345 6857826 6808168 6729540 6678045
2297 6678045 6611546 6556907 6442138 6351464 6318797 6262156 6284748 6207850 6087357 6109511 6078669
2286 6078669 6010863 5934023 5869670 5807986 5756725 5709407 5747035 5721703 5638116 5680184 5691458
2275 5691458 5654603 5692833 5712831 5615074 5545179 5540436 5498049 5473310 5388856 5337682 5312309 5303699
2263 5303699 5318320 5294385 5249367 5188597 5157412 5105269 5118983 5083879 5053362 5081787 4996646
2252 4996646 4892608 4879969 4885515 4857588 4783659 4781863 4722997 4690188 4654722 4619433 4603636 4625002
2240 4625002 4597325 4561944 4517418 4459507 4401923 4329960 4282076 4287134 4295212 4285516 4201424 4166396
2228 4166396 4153379 4114471 4074037 4069292 4067546 4036928 4012531 3951717 3929169 3950022 3964994 3905476
$$ packed form
2308G299915j6755k3511j76051m6599j2242j00065m1347k5519m9658p8628n1495
2297F678045o6499n4639j14769r0674l2667n6641K2592p6898j20493K2154l0842
2286F078669o7806p6840o4353o1684n1261m7318L7628k5332q3587M2068J1274
2275E691458l6855L8230J9998r7757o9895m743m2387k4739q4454n1174k5373q610
2263E303699J4621k3935m5018o0770l1185n2143J3714l5104l0517K8425q5141
2252D996646j04038j2639N546k7927p3929j796n8866l2809l5466l5289j5797K1366
2240D625002k7677l5381m4526n7911n7584p1963m7884N058Q078r696q4092l5028
2228D166396j3017l8908m0434m745j746l0618k4397o0814k2548K0853J4972n9518
$$ plain form
2216 3905476 3856146 3872298 3874426 3858578 3848011 3817083 3778908 3784326 3810508 3846759 3916874 3894598
2204 3894598 3873757 3885536 3928471 3952831 3910639 3918226 3955472 3957357 3939107 3907598 3935611 3935122
2192 3935122 4005092 4006241 4016452 4037614 4038473 4024840 4035413 4075615 4025280 4042858 4095670 4142276
2180 4142276 4162935 4166894 4267192 4271370 4220093 4224685 4231089 4207976 4174795 4223832 4178173 4183443
2168 4183443 4141061 4129093 4164481 4162009 4159354 4086817 4032135 3979568 4007155 4002682 3972319 3912646
2156 3912646 3825434 3841202 3778186 3760377 3763210 3758273 3722073 3633366 3617929 3671422 3735244 3678449
2144 3678449 3693257 3671544 3672064 3672987 3692278 3696107 3709681 3710801 3691856 3719434 3804749 3899528 3988777
2131 3988777 4023710 4071568 4066313 4108678 4188166 4219455 4196339 4092965 3963983 3848426 3772824
$$ packed form
2216C905476m9330J6152K128j5848j0567l0928l8175N418K6182L6251P0115k2276
2204C894598k0841J1779M2935K4360m2192P587L7246J885j8250l1509K8013m89
2192C935122O9970J149J0211K1162Q59j3633J0573M0202n0335J7578N2812M6606
2180D142276K0659L959J00298M178n1277M592O404k3113l3181M9037m5659N270
2168D183443m2382j1968L5388k472k655p2537n4682n2567K7587m473l0363n9673
2156C912646q7212J5768o3016j7809K833m937l6200q8707j5437N3493O3822n6795
2144C678449J4808k1713N20R23J9291L829J3574J120j8945K7578Q5315R4779Q9249
2131C988777L4933M7858n255M2365P9488L1289k3116j03374j28982j15557p5602
$$ plain form
2120 3772824 3700187 3603633 3475951 3382451 3246516 3166684 3142839 3097581 3009493 2950159 2884282
2109 2884282 2842311 2796674 2771933 2798733 2713070 2648213 2718372 2649684 2616588 2621853 2598714 2542463
2097 2542463 2524005 2491725 2484170 2451999 2426492 2385931 2309057 2303577 2264795 2239430 2327728 2319323
2085 2319323 2281609 2281482 2264165 2242259 2331828 2401487 2415936 2388882 2307953 2323335 2303919 2303939
2073 2303939 2284773 2209123 2204989 2252355 2199427 2157494 2207756 2194647 2150601 2158119 2147817 2197992
2061 2197992 2179399 2184730 2229741 2218668 2197917 2184424 2114334 2055590 1991173 1883595 1857295
2050 1857295 1847845 1839221 1802473 1742538 1709382 1653406 1671200 1658051 1602899 1541376 1494564 1504615
2038 1504615 1479455 1463513 1416756 1422066 1383194 1356411 1359210 1325944 1294923 1223886 1236256 1241656
$$ packed form
2120C772824p2637r6554j27682r3500j35935p9832k3845m5258q8088n9334o5877
2109B884282m1971m5637k4741K6800q5663o4857P0159o8688l3096N265k3139n6251
2097B542463j8458l2280p555l2171k5507m0561p6874n480l8782k5365Q8298q405
2085B319323l7714j27j7317k1906Q9569O9659J4449k7054q0929J5382j9416K0
2073B303939j9166p5650m134M7366n2928m1933N0262j3109m4046P518j0302N0175
2061B197992j8593N331M5011j1073k0751j3493p0090n8744o4417j07578k6300
2050A857295r450q624l6748n9935l3156n5976J7794j3149n5152o1523m6812J0051
2038A504615k5160j5942m6757N310l8872k6783K799l3266l1021p1037J2370N400
$$ plain form
2026 1241656 1232566 1251490 1245214 1218885 1220553 1278306 1218907 1253579 1270148 1260133 1300378 1332675
2014 1332675 1249890 1266945 1291682 1260681 1335797 1299850 1299039 1305910 1273487 1230365 1221416 1234602
2002 1234602 1271180 1232820 1225435 1265642 1229422 1171868 1240109 1270624 1293232 1302751 1239888 1199193
1990 1199193 1176589 1181284 1179644 1132612 1096926 1015747 966438 997044 1062405 1088112 1070017 1049534
1978 1049534 1050492 1010185 986947 989918 987640 967787 955264 939965 841997 804070 844935 893823
1966 893823 907299 901168 863224 818173 809681 831460 847093 804850 747115 749923 715395 729829
1954 729829 779188 795275 812928 811687 773242 730996 725353 724375 772008 795392 723777 717740 745566
1941 745566 789319 757552 749513 818448 758043 727206 746165 709492 665731 708966 719336 710196
$$ packed form
2026A241656r090J8924o276k6329J668N7753n9399L4672J6569j0015M0245L2297
2014A332675q2785J7055K4737l1001P5116l5947q11O871l2423m3122q949J3186
2002A234602L6578l8360p385M0207l6220n7554O8241L0515K2608R519o2863m0695
1990A199193k2604M695j640m7032l5686q1179m9309L0606O5361K5707j8095k0483
1978A049534R58m0307k3238K971k278j9853j2523j5299r7968l7927M0865M8888
1966H93823J3476o131l7944m5051q492K1779J5633m2243n7735K808l4528J4434
1954G29829M9359J6087J7653j241l8445m2246n643r78M7633K3384p1615o037K7826
1941G45566M3753l1767q039O8935o0405l0837J8959l6673m3761M3235J0370r140
$$ plain form
1929 710196 707719 688026 714333 705508 704247 758551 733113 677266 683453 621428 613780 680918 733510
1916 733510 687470 653320 658004 580539 518507 546544 595560 550374 539046 575168 510383 567616
1904 567616 611863 593826 640232 598091 499333 429955 434131 469760 477468 481127 433947 432889
1892 432889 486401 542922 556748 547183 544113 485513 444804 447186 496530 512318 475042 467165
1880 467165 495856 498978 530917 508716 473739 490735 483300 416533 421464 479555 507076 524912
1868 524912 503793 526427 577557 587525 601694 619123 609421 505025 447659 509727 512229 497194
1856 497194 503907 503274 450657 464893 489683 525275 520928 493459 504020 524891 520872 489532 491595
1843 491595 500216 502135 453783 402815 412748 434367 476084 506397 454922 452043 501828 502840 437018
$$ packed form
1929G10196k477j9693K6307q825j261N4304k5438n5847O187o2025p648O7138N2592
1916G33510m6040l4150M684p7465o2032K8037M9016m5186j1328L6122o4785N7233
1904E67616M4247j8037M6406m2141r8758o9378M176L5629P708L659m7180j058
1892D32889N3512N6521J3826r565l070n8600m0709K382M9344J5788l7276p877
1880D67165K8691L122L1939k2201l4977J6996p435o6767M931N8091K7521J7836
1868E24912k1119K2634N1130R968J4169J7429r702j04396n7366O2068K502j5035
1856D97194O713o33n2617J4236K4790L5592m347k7469J0561K0871m019l1340K063
1843D91595Q621J919m8352n0968R933K1619M1717L0313n1475k879M9785J012o5822
$$ plain form
1830 437018 424993 440092 477095 475888 493311 492528 459637 448768 461196 473419 485924 510683
1818 510683 507947 473509 435144 466581 468098 498994 581596 575606 564299 551586 569502 591549
1806 591549 609606 629483 629615 619257 624135 624412 670514 720306 707358 676480 674260 638947 572160
1793 572160 609232 669729 662022 656306 673221 659023 649129 642955 694413 673893 653216 619644
1781 619644 596139 593905 637516 636167 638858 632966 569505 615129 664323 634089 634944 639751 594633
1768 594633 567470 646873 672318 670175 638396 608944 642036 591643 616829 659537 621615 593938
1756 593938 568804 537075 510923 487512 474218 473083 436883 440023 498008 466697 509797 576852
1744 576852 574463 563002 565775 511610 515783 561935 526697 480191 416799 405783 480002 506719
$$ packed form
1830D37018j2025J5099L7003j207J7423p83l2891j0869J2428J2223J2505K4759
1818E10683k736l4438l8365L1437J517L0896Q2602n990j1307j2713J7916K2047
1806E91549J8057J9877J32j0358M878K77M6102M9792j2948l0878k220l5313o6787
1793E72160L7072O0497p707n716J6915j4198r894o174N1458k0520k0677l3572
1781F19644k3505k234M3611j349K691n892o3461M5624M9194l0234Q55M807m5118
1768E94633k7163P9403K5445k143l1779k9452L3092n0393K5186M2708l7922k7677
1756E93938k5134l1729k6152k3411j3294j135l6200L140N7985l1311M3100O7055
1744E76852k389j1461K773n4165M173M6152l5238m6506o3392j1016P4219K6717
$$ plain form
1732 506719 507470 472961 459021 454501 463311 405341 411959 396730 368006 435050 432756 373249 383686
1719 383686 412948 359745 357194 356221 316244 225961 188626 261108 255087 280546 334792 350918
1707 350918 305342 242103 265498 228346 248896 214069 189462 238360 231315 216712 223287 273920
1695 273920 260203 231690 246425 198968 156196 144287 186329 191331 232472 246544 230472 243395
1683 243395 298950 326938 245944 204335 267303 274184 251357 272432 304266 297855 260945 255711
1671 255711 211410 136423 153254 250790 299756 286516 271684 271027 268194 335753 334118 290397
1659 290397 294922 288200 267100 230641 212232 244064 289492 292679 235186 273828 291766 266121
1647 266121 276044 293853 284195 233351 289843 305864 319714 345484 279533 301997 293470 286942
$$ packed form
1732E06719P51l4509j3940m520Q810n7970O618j5229k8724O7044k294n9507J0437
1719C83686K9262n3203k551r73l9977r0283l7335P2482o021K5459N4246J6126
1707C50918m5576o3239K3395l7152K0550l4827k4607M8898p045j4603O575N0633
1695B73920j3717k8513J4735m7457m2772j1909M2042N002M1141J4072j6072J2923
1683B43395N5555K7988q0994m1609O2968O881k2827K1075L1834o411l6910n234
1671B55711m4301p4987J6831R7536M8966j3240j4832o57k833O7559j635m3721
1659B90397M525o722k1100l6459j8409L1832M5428L187n7493L8642J7938k5645
1647B66121R923J7809r658n0844N6492J6021J3850K5770o5951K2464q527o528
$$ plain form
1635 286942 231045 176697 204659 221411 216516 225050 250125 222775 242799 291840 302512 283994
1623 283994 247049 246345 242878 201710 245062 224549 246931 282705 255986 198845 213891 240403
1611 240403 291159 316050 247632 183752 178956 279387 300996 283322 252422 218486 175932 186408
1599 186408 250976 234431 205299 153615 167456 195775 149549 156519 145573 135692 135634 99268 124857
1586 124857 166754 146834 117958 164182 226846 174092 117006 82718 109311 94362 58228 88327
1574 88327 38516 58020 60231 2014 55265 70274 59274 29261 47614 34767 48501 25371
1562 25371 41434 89060 8172 28100 70772 38117 9738 -3664 29282 4581 -81893 -30094
1550 -30094 44844 61242 68625 73077 34502 28231 56738 70900 74533 48523 29556 63203 24558
$$ packed form
1635B86942n5897n4348K7962J6752m895Q534K5075k7350K0024M9041J0672j8518
1623B83994l6945p04l467m1168M3352k0513K2382L5774k6719n7141J5046K6512
1611B40403N0756K4891o8418o3880m796J00431K1609j7674l0900l3936m2554J0476
1599A86408O4568j6545k9132n1684J3841K8319m6226O970j0946r881n8l6366K5589
1586A24857M1897j9920k8876M6224O2664n2754n7086l4288K6593j4949l6134L0099
1574H8327m9811J9504K211n8217N3251J5009j1000l0013J8353j2847J3734k3130
1562B5371J6063M7626q0888J9928M2672l2655k8379j3402L2946k4701q6474N1799
1550c0094P4938J6398P383M452l8575o271K8507J4162L633k6010j8967L3647l8645
$$ plain form
1537 24558 24089 -20248 -41416 70269 100112 63724 32868 60203 52469 66525 78719 79975
1525 79975 75372 56312 43890 58487 93714 98105 45131 94613 89254 24582 41735 115201
1513 115201 132269 86359 89818 78038 48919 88810 134352 154508 127945 117413 104039 105385
1501 105385 169283 201775 159764 140774 162413 153460 149734 188190 256462 276584 256661 201350
1489 201350 217536 242163 173550 178534 224941 187930 205592 203159 227072 251635 219978 210272
1477 210272 262309 204737 182809 265683 264654 182972 187748 188788 177316 150092 199003 252302
1465 252302 208361 132496 150297 149657 124919 156940 149308 181062 174347 212575 171987 103031
1453 103031 170221 256219 174700 70639 170551 179058 97183 128540 160576 128851 97640 137576
$$ packed form
1537B4558m69m4337k1168J11685K9843l6388l0856K7335p734J4056J2194J256
1525G9975m603j9060j2422J4597L5227M391n2974M9482n359o4672J7153P3466
1513A15201J7068m5910L459j1780k9119L9891M5542K0156k6563j0532j3374J346
1501A05385O3898L2492m2011j8990K1639q953l726L8456O8272K0122j9923n5311
1489B01350J6186K4627o8613M984M6407l7011J7662k433K3913K4563l1657r706
1477B10272N2037n7572k1928Q2874j029q1682M776J040j1472k7224M8911N3299
1465B52302m3941p5865J7801o40k4738L2021p632L1754o715L8228m0588o8956
1453A03031O7190Q5998q1519j04061R9912Q507q1875L1357L2036l1725l1211L9936
$$ plain form
1441 137576 108933 78636 80565 62495 81920 62007 64374 48053 71925 91514 100997 79012
1429 79012 37841 -15149 -44867 -5035 -9385 -64 57162 12961 -88602 -24657 52068 -7278
1417 -7278 38194 49412 -57157 -107674 -84695 -23156 1040 -8797 -34587 -13002 14389 23827
1405 23827 -9505 -20855 34732 15519 -30522 -43561 -68963 -66207 -10114 26533 28285 54457
1393 54457 7810 4572 38426 10875 19795 -6332 -55685 -9910 -9692 10981 -2365 -8601 -5130
1380 -5130 11231 -25049 -43318 -51293 -1487 5338 -39161 25179 58061 -8199 -8573 31756 24038
1367 24038 10293 -184 -29127 -62491 -65610 -16021 26464 42383 85940 78924 53398 76969
1355 76969 44936 50917 112650 121094 80132 46957 23843 48191 75779 102195 114532 73745
$$ packed form
1441A37576k8643l0297J929j8070J9425j9913K367j6321K3872J9589R483k1985
1429G9012m1171n2990k9718L9832m350R321N7226m4201j01563O3945P6725n9346
1417g278M5472J1218j06569n0517K2979O1539K4196r837k5790K1585K7391R438
1405B3827l3332j1350N5587j9213m6041j3039k5402K756N6093L6647J752K6172
1393E4457m6647l238L3854k7551Q920k6127m9353M5775K18K0673j3346o236L471
1380e130J6361l6280j8269p975M9806O825m4499O4340L2882o6260l74M0329p718
1367B4038j3745j0477k8943l3364l119M9589M2485J5919M3557p016k5526K3571
1355G6969l2033N981O1733Q444m0962l3175k3114K4348K7588K6416J2337m0787
$$ plain form
1343 73745 116267 130228 116172 128548 146058 158083 129833 117691 89903 120430 151399 153536
1331 153536 100855 79444 122314 72101 105665 180665 163780 104037 108607 133332 106488 105902
1319 105902 153936 148473 86990 11432 29933 93833 139696 122913 104620 79658 37140 67630
1307 67630 95650 75065 50161 48538 76 36907 120085 68182 25541 47469 105375 1184
1295 1184 37919 92143 75673 37867 26425 8332 -8810 33109 -18135 -20056 -9955 -38926
1283 -38926 -23830 -9039 -26163 -80295 -62198 -51402 -48942 -36278 714 21343 -32145 -12223
1271 -12223 -24655 -29247 9688 -13436 -70977 -57261 -52858 -122065 -120692 -105889 -41206 -21785
1259 -21785 -35334 14528 -7336 -74593 -53520 2221 -19464 -35968 -42072 -67194 -121071 -144146
$$ packed form
1343G3745M2522J3961j4056J2376J7510J2025k8250j2142k7788L0527L0969K137
1331A53536n2681k1411M2870n0213L3564P5000j6885n9743M570K4725k6844n86
1319A05902M8034n463o1483p5558J8501O3900M5863j6783j8293k4962m2518L0490
1307F7630K8020k0585k4904j623m8462L6831Q3178n1903m2641K1928N7906j04191
1295A184L6735N4224j6470l7806j1442j8093j7142M1919n1244j921J0101k8971
1283c8926J5096J4791j7124n4132J8097J0796K460J2664L6992K0629n3488J9922
1271a2223j2432m592L8935k3124n7541J3716M403o9207J373J4803O4683J9421
1259b1785j3549M9862k1864o7257K1073N5741k1685j6504o104k5122n3877k3075
$$ plain form
1247 -144146 -74748 -100165 -120946 -108495 -67102 -12259 -17064 -62361 -30632 14466 -29156 -7685
1235 -7685 -2520 -56587 -49337 -31814 -94675 -86889 -50 -23380 -92887 -31525 68332 83818 27081
1222 27081 77383 64520 7240 77076 108164 59449 69698 114131 138324 58493 37290 35048
1210 35048 116516 142607 112035 159676 171515 122071 132156 138918 137721 136899 146205 94606 141099
1197 141099 181886 190211 167075 152400 173821 180481 173244 168926 154786 98246 91367 93695 121494
1184 121494 112939 65007 70153 123721 99031 108836 153756 93508 60489 146494 133028 130264
1172 130264 99652 100850 64067 66588 23826 39792 55209 35320 75059 69674 45627 72505
1160 72505 59130 95356 112504 62884 74219 112474 32445 -38936 6067 -28477 -17080 39877
$$ packed form
1247a44146O9398k5417k0781J2451M1393N4843m805m5297L1729M5098m3622K1471
1235g685N165n4067P250J7523o2861P786Q6839k3330o9507O1362R9857J5486n6737
1222B7081N0302j2863n7280O9836L1088m8715J0249M4433K4193p9831k1203k242
1210C5048Q1468K6091l0572M7641J1839m9444J0085O762j197q22R306n1599M6493
1197A41099M0787Q325k3136j4675K1421O660p237m318j4140n6540o879K328K7799
1184A21494q555m7932N146N3568k4690R805M4920o0248l3019Q6005j3466k764
1172A30264l0612J198l6783K521m2762J5966J5417j9889L9739n385k4047K6878
1160G2505j3375L6226J7148m9620J1335L8255q0029p1381M5003l4544J1397N6957
$$ plain form
1148 39877 114497 62826 -55658 -17797 44799 48279 40891 -28816 -101629 -65677 -40549 -125009
1136 -125009 -68007 -85947 -72455 4916 25460 -10114 -41462 -106562 -120013 -81627 -74691 -107734
1124 -107734 -82311 -89066 -74916 -101367 -82128 -8170 -106588 -114193 -88476 -66244 -134527 -142960
1112 -142960 -104507 -109568 -149919 -149679 -86653 -99763 -83300 -36055 -59757 -69959 -28010 566
1100 566 -70743 -68993 -89058 -101647 -113222 -73025 -51389 -118084 -114763 -118957 -47032 -22403 1309
1087 1309 43261 -8723 -67408 -38833 47116 5510 -61530 -50131 -87137 -86273 -93575 -26921 -114
1074 -114 13657 -5871 -6775 5845 -50082 -37660 47757 123851 98860 28695 12500 -41521 9601
1061 9601 44752 52219 56675 50489 37037 25476 91524 29309 76456 95807 136057 126355 81826
$$ packed form
1148C9877P4620n1671j18484L7861O2596L480p388o9707p2813L5952K5128q4460
1136a25009N7002j7940J3492P7371K0544l5574l1348o5100j3451L8386O936l3043
1124a07734K5423o755J4150k6451J9239P3958r8418p605K5717K2232o8283q433
1112a42960L8453n061m0351K40O3026j3110J6463M7245k3702j0202M1949K8576
1100E66p1309J750k0065j2589j1575M0197K1636o6695L321m194P1925K4629K3712
1087A309M1952n1984n8685K8575Q5949m1606o7040J1399l7006Q64p302O6654K6807
1074a14J3771j9528r04J2620n5927J2422Q5417P6094k4991p0165j6195n4021N1122
1061I601L5151P467M456o186j3452j1561O6048o2215M7147J9351M0250r702m4529
$$ plain form
1048 81826 59083 93862 150984 127038 123888 99699 20534 95067 119024 152644 78396 60980
1036 60980 39666 87654 153260 96671 54020 55624 96438 84586 48449 88908 58036 15362
1024 15362 30112 113577 122287 86718 87637 82020 122358 97127 87377 62310 85135 151960 100983
1011 100983 47584 86947 107589 100419 114176 168884 159591 113544 52762 130926 120346 109042
999 109042 91067 110763 72403 70455 106612 137260 121150 86755 151926 172711 134901 91353
987 91353 94712 127159 109646 81375 73030 74063 81110 121663 134326 100218 139582 129115 91688
974 91688 64391 137744 144653 44057 67131 90341 98085 102235 218999 275697 214662 194852
962 194852 209212 217250 214228 264035 259683 255461 260648 281519 268605 254730 342627 370408 453476
$$ packed form
1048H1826k2743L4779N7122k3946l150k4189p9165P4533K3957L3620p4248j7416
1036F0980k1314M7988O5606n6589m2651J604M0814j1852l6137M0459l0872m2674
1024A5362J4750Q3465Q710l5569R19n617M0338k5231r750k5067K2825O6825n0977
1011A00983n3399L9363K0642p170J3757N4708r293m6047o0782P8164j0580j1304
999A09042j7975J9696l8360j948L6157L0648j6110l4395O5171K0785l7810m3548
987I1353L359L2447j7513k8271q345J033P047M0553J2663l4108L9364j0467l7427
974I1688k7297P3353O909j00596K3074K3210P744M150J16764N6698o1035j9810
962A94852J4360Q038l022M9807m352m222N187K0871j2914j3875Q7897K7781Q3068
$$ plain form
949 453476 452793 425674 406456 433363 483025 598741 632913 633867 661285 683574 713791 816221
937 816221 962776 1065488 1090479 1178944 1310148 1447725 1543340 1692408 1785809 1956499 2180783
926 2180783 2358048 2627356 3000956 3429018 4014561 4760770 5649015 6758531 8125986
917 8125986 9034329 9460881 9661322 8238597 6506822 5414223 4649566 4160006 3651320
908 3651320 3224340 2874744 2511888 2290671 2167665 1994214 1815363 1794297 1698119 1596344
898 1596344 1414094 1323483 1320949 1191520 1167634 1109542 984555 899716 945292 929350 811012
887 811012 818437 767965 730642 711141 702091 679447 613770 606390 599114 617101 578775 520310 529743
874 529743 548776 574716 526729 468593 444593 462334 470453 425711 401918 357735 359304 364686
$$ packed form
949D53476o83k7119j9218K6907M9662J15716L4172R54K7418K2289L0217J02430
937H16221J46555J02712K4991Q8465J31204J37577R5615J49068R3401J70690K24284
926B180783J77265K69308L73600M28062N85543P46209Q88245J109516J367455
917H125986R08343M26552K00441j422725j731775j092599p64657m89560n08686
908C651320m26980l49596l62856k21217j23006j73451j78851k1066r6178j01775
898A596344j82250r0611k534j29429k3886n8092j24987q4839M5576j5942j18338
887H11012P425n0472l7323j9501r050k2644o5677p380p276J7987l8326n8465R433
874E29743J9033K5940m7987n8136k4000J7741Q119m4742k3793m4183J569N382
$$ plain form
862 364686 337576 399653 406919 362934 344176 339287 338074 353273 295961 282040 339503 283820
850 283820 242431 275226 236404 235339 288898 204665 174442 185180 115748 179091 227066 201404
838 201404 170048 178053 162105 184652 184257 161165 163786 95469 76125 95686 87068 112209 56096
825 56096 41315 101587 149072 101569 90296 102503 93600 62790 -53342 -21267 10630 24217
813 24217 32892 52402 59245 49604 35011 55900 57668 42081 29555 -25169 -88427 -33398 -4391
800 -4391 6562 -32660 10217 20162 -42508 -48089 -1049 -12247 14081 36532 8064 -11591 -7462
787 -7462 -41854 -24268 -14519 -23847 4639 -24549 -51376 -10848 -3795 30812 43623 3128 10772
774 10772 42768 50089 64609 50559 47049 55233 18078 30861 56906 64393 71613 10740 46904
$$ packed form
862C64686k7110O2077P266m3985j8758m889j213J5199n7312j3921N7463n5683
850B83820m1389L2795l8822j065N3559q4233l0223J0738o9432O3343M7975k5662
838B01404l1356Q005j5948K2547l95k3092K621o8317j9344J9561q618K5141n6113
825E6096j4781O0272M7485m7503j1273J2207q903l0810j16132L2075L1897J3587
813B4217Q675J9510O843r641j4593K0889J768j5587j2526n4724o3258N5029K9007
800d391J0953l9222M2877R945o2670n581M7040j1198K6328K2451k8468j9655M129
787g462l4392J7586R749r328K8486k9188k6827M0528P053L4607J2811m0495P644
774A0772L1996P321J4520j4050l510Q184l7155J2783K6045P487P220o0873L6164
$$ plain form
761 46904 158310 88767 23643 105113 105886 91686 127802 72800 42647 81765 151610 118201
749 118201 55911 79006 118124 61018 95135 126101 115242 100238 94739 52731 29350 84821
737 84821 65972 52770 34984 57290 23141 -14391 53240 52851 62807 32629 -10718 -11010 57320
724 57320 63373 44841 94711 54486 40490 27934 59407 33303 -15833 -2552 -5903 -67325
712 -67325 -112625 -25935 -3080 21451 37716 39281 43360 -6506 -29331 -28447 -8346 -35025 -89240
699 -89240 -88268 -38141 -10809 -66989 -39012 -65531 -61186 612 -12554 -68349 -66979 -53612 -90306
686 -90306 -110545 -89526 -49653 -80258 -135844 -117620 -77084 -114362 -124882 -140433 -137286 -142926
674 -142926 -143195 -58851 -47814 -115918 -120684 -114201 -108946 -55068 -106561 -162561 -84042 -81074 -158372
$$ packed form
761D6904J11406o9543o5124Q1470P73j4200L6116n5002l0153L9118O9845l3409
749A18201o2290K3095L9118n7106L4117L0966j0859j5004n499m2008k3381N5471
737H4821j8849j3202j7786K2306l4149l7532O7631l89R956l0178m3347k92O8330
724E7320O053j8532M9870m0225j3996j2556L1473k6104m9136J3281l351o1422
712f7325m5300Q6690K2855K4531J6265J565M079m9866k2825Q84K0101k6679n4215
699h9240R72N0127K7332n6180K7977k6519M345O1798j3166n5795J370J3367l6694
686i0306k0239K1019L9873l0605n5586J8224M0536l7278j0520j5551L147n640
674a42926k69Q4344J1037o8104m766O483N255N3878n1493n6000P8519K968p7298
$$ plain form
661 -158372 -129624 -51660 -48586 -79028 -85482 -72570 -65656 -122935 -64963 -48679 -92195 -108423
649 -108423 -143442 -60725 15631 -17373 -26888 18120 9477 -21668 21952 -8013 -36828 -13839
637 -13839 -20991 -19627 3105 -19638 -32499 1981 -11982 -468 103599 102138 65328 94393
625 94393 82219 72040 65869 65500 50065 -9382 -2840 43420 -9433 -56707 -71013 -36366 32569
612 32569 94684 84889 54480 62054 23916 28984 13809 -4844 -27235 -116359 -21689 -10107 -45525
599 -45525 -38694 -2004 48684 46781 11204 -59025 5893 81038 -296 -37842 -54958 -42891
587 -42891 -7530 29221 27928 -56062 -61785 17938 55991 42975 35557 15961 -53970 -76927 -19856
574 -19856 -73763 -36632 -4639 -48777 -78734 -61417 -11784 -20217 -18740 -31832 -44086 -94395
$$ packed form
661a58372K8748P7964L074l0442o454J2912O914n7279N7972J6284m3516j6228
649a08423l5019Q2717P6356l3004r515M5008q643l1145M3620k9965k8815K2989
637a3839p152J364K2732k2743j2861L4480j3963J1514J04067j461l6810K9065
625I4393j2174j0179o171l69j5435n9447O542M6260n2853m7274j4306L4647O8935
612C2569O2115r795l0409P574l8138N068j5175j8653k2391q9124R4670J1582l5418
599d5525O831L6690N0688j903l5577p0229O4918P5145q1334l7546j7116J2067
587d2891L5361L6751j293q3990n723P9723L8053j3016p418j9596o9931k2957N7071
574a9856n3907L7131L1993m4138k9957J7317M9633q433J477j3092j2254n0309
$$ plain form
562 -94395 -94886 -69888 -90650 -118773 -92504 -83241 -131215 -107373 -49119 -58510 -25809 -15554 -90232
549 -90232 -98595 -103282 -110181 -53422 -46999 -104852 -120125 -102047 -90054 -7916 20156 24103 -23948
536 -23948 -75541 -116050 -133179 -37665 12595 1406 -48255 -56406 -28351 32671 88608 94788
524 94788 49729 -45441 -41672 -69643 -83350 -9021 21367 -34483 -118349 -114538 -87397 62131
512 62131 111546 30141 -33007 -69261 -29601 19480 30441 46424 -15952 -118611 -108361 -51892
500 -51892 -107578 -31584 46221 54219 -1171 -29306 -984 41618 43909 5032 51490 -11214
488 -11214 -76799 -99884 -53143 27194 -5924 3753 38350 2887 -42077 20654 108028 67465
476 67465 53138 -17915 -45279 5362 50869 -12187 -95822 -67063 -53615 -55743 -41233 -61969
$$ packed form
562i4395m91K4998k0762k8123K6269R263m7974K3842N8254r391L2701J0255p4678
549i0232q363m687o899N6759O423n7853j5273J8078J1993Q2138K8072L947m8051
536b3948n1593m0509j7129R5514N0260j1189m9661q151K8055O1022N5937O180
524I4788m5059r5170L769k7971j3707P4329L0388n5850q3866L811K7141J49528
512F2131M9415q1405o3148l6254L9660M9081J0961J5983o2376j02659J0250N6469
500e1892n5686P5994P7805P998n5390k8135K8322M2602K291l8877M6458o2704
488a1214o5585k3085M6741Q0337l3118R677L4597l5463m4964O2731Q7374m0563
476F7465j4327p1053k7364N0641M5507o3056q3635K8759J3448k128J4510k0736
$$ plain form
464 -61969 -88807 -87674 -27090 -21978 -55857 -107852 -19746 5647 -41921 -53086 -110478 -116870 -71112
451 -71112 -39346 -22857 -24523 -124258 -178573 -118748 -58434 -10834 -55828 -129693 -62872 -65263
439 -65263 -14921 20464 -17242 -69084 -110370 -149133 -72654 -44700 -114011 -76215 -52742 -22411
427 -22411 -11956 -22090 -37041 -92969 -67471 -43520 -15947 -28391 -36070 -92186 -62598 2675
415 2675 -61009 -55994 8038 31274 3943 5481 -64429 -77815 -97396 -114805 -37361 27539 -774
402 -774 -53592 -45300 -22432 -32082 5683 18974 -14983 -47290 -32771 -94661 -154789 -107620 -74855
389 -74855 -65077 -76491 -29330 -70735 -74645 -53335 -30743 16580 -27939 -86414 -64646 -28653
377 -28653 -94703 -99399 -51855 -46175 -13227 -16050 28909 62077 36911 5885 -9370 -31135 2627
$$ packed form
464f1969k6838J133O0584N112l3879n1995Q8106K5393m7568j1165n7392o392M5758
451g1112L1766J6489j666r9735n4315N9825O0314M7600m4994p3865O6821k391
439f5263N0342L5385l7706n1842m1286l8763P6479K7954o9311L7796K3473L0331
427b2411J0455j0134j4951n5928K5498K3951K7573j2444p679n6116K9588O5273
415B675o3684N015O4032K3236k7331J538o9910j3386j9581j7409P7444O4900k8313
402g74n2818Q292K2868r650L7765J3291l3957l2307J4519o1890o0128M7169L2765
389g4855R778j1414M7161m1405l910K1310K2592M7323m4519n8475K1768L5993
377b8653o6050m696M7544N680L2948k823M4959L3168k5166l1026j5255k1765L3762
$$ plain form
364 2627 -18818 -48336 11931 -11011 -51528 -28550 -18796 -60319 -83542 -13181 11708 -27721
352 -27721 -57099 -81423 3477 65369 69836 25012 -25398 -48381 -81138 -80741 -13654 -15820 -75751
339 -75751 -70066 -55425 -98060 -56626 -19636 -47641 -29550 -25329 -79017 -80814 -95371 -105878 -102633
326 -102633 -102589 -69354 -18156 -50417 -55390 -18385 -55723 -60930 -34799 -101042 -102722 -88584 -37174
313 -37174 -23682 -62573 -102409 -80610 -2581 -27535 -88621 -67267 -10466 -84297 -106023 -43679
301 -43679 -91679 -119907 -61387 -37263 -65100 -84858 -32565 -103112 -112670 -62107 -54070 -80518
289 -80518 -81924 -140180 -151431 -111935 -108566 -74708 -118896 -143050 -90910 -74714 -122783 -154979
277 -154979 -82904 -74792 -82376 -122127 -143439 -147076 -156085 -48323 -18826 -92386 -178815 -161609
$$ packed form
364B627k1445k9518O0267k2942m0517K2978R754m1523k3223P0361K4889l9429
352b7721k9378k4324Q4900O1892M467m4824n0410k2983l2757L97O7087k166n9931
339g5751N685J4641m2635M1434L6990k8005J8091M221n3688j797j4557j0507L245
326a02633M4L3235N1198l2261m973L7005l7338n207K6131o6243j680J4138N1410
313c7174J3492l8891l9836K1799P8029k4954o1086K1354N6801p3831k1726O2344
301d3679m8000k8228N8520K4124k7837j9758N2293p0547r558N0563Q037k6448
289h0518j406n8256j1251L9496L369L3858m4188k4154N2140J6196m8069l2196
277a54979P2075Q112p584l9751k1312l637r009J07762K9497p3560q6429J7206
$$ plain form
265 -161609 -90742 -37832 -40000 -97181 -111482 -141640 -123730 -94307 -83782 -62215 -121213 -113742
253 -113742 -124182 -130658 -108490 -65120 -25476 -42051 -55018 -84921 -92438 -66131 -33867 -27455
241 -27455 -53992 -111681 -144335 -107873 -29207 -35970 -31253 10584 19990 18542 -20233 8492 64866
228 64866 59583 39453 -5733 -34519 -37165 -42574 -18751 31539 -11820 -91789 -38595 -19562 9684
215 9684 58761 51846 55751 26820 4387 -1499 48829 47450 14569 -3833 -52721 -62593 -20025
202 -20025 43719 36172 -41957 -36381 8675 10203 45052 41315 -76769 -90839 13879 -11360
190 -11360 -2901 87207 85440 32476 16837 -15397 -9277 12587 -57019 -108515 -107476 -114095 -79412
177 -79412 -63691 -84027 -15941 -32964 -48538 -73964 -90577 -71239 -71228 -79613 -75314 -58424 -180156
$$ packed form
265a61609P0867N2910k168n7181j4301l0158J7910K9423J0525K1567n8998P471
253a13742j0440o476K2168M3370L9644j6575j2967k9903p517K6307L2264O412
241b7455k6537n7689l2654L6462P8666o763M717M1837R406j448l8775K8725N6374
228F4866n283k0130m5186k8786k646n409K3823N0290m3359p9969N3194J9033K9246
215I684M9077o915L905k8931k2433n886N0328j379l2881j8402m8888r872M2568
202b0025O3744p547p8129N576M5056J528L4849l737j18084j4070J04718k5239
190a1360Q459R0108j767n2964j5639l2234O120K1864o9606n1496J039o619L4683
177g9412J5721k0336O8086j7023j5574k5426j6613J9338J1q385M299J6890j21732
$$ plain form
164 -180156 -176066 -111850 -93131 -60766 -108060 -164398 -152378 -116319 -118553 -113302 -102447 -132407
152 -132407 -81622 -62385 -136509 -158146 -143366 -142719 -135634 -120399 -144391 -138395 -141189 -186782 -168813
139 -168813 -193224 -192988 -165607 -191389 -196120 -216530 -160131 -97264 -97174 -125721 -103817 -115251 -161447
126 -161447 -128463 -187180 -192090 -160465 -169507 -183954 -180320 -204375 -226256 -183357 -160669 -91445
114 -91445 -51175 -89350 -81353 -85058 -134925 -172362 -111949 -32303 -73057 -154884 -171494 -103053
102 -103053 -85448 -105595 -123031 -119612 -77455 -92417 -50210 -28174 -74836 -94105 -78814 -81669
90 -81669 -78460 -49476 -93244 -65836 -52410 -75480 -70714 -56587 -75965 -91913 -29015 -59325 -84591
77 -84591 -46680 -54392 -70287 -62622 -39431 -44762 7269 -24978 -51815 -38529 -71804 -31551 -23544
$$ packed form
164a80156M090O4216J8719L2365m7294n6338J2020L6059k234N251J0855k9960
152a32407N0785J9237p4124k1637J4780O47P085J5235k3992N996k794m5593J7969
139a68813k4411K36K7381k5782m731k0410N6399O2867R0k8547K1904j1434m6196
126a61447L2984n8717m910L1625r042j4447L634k4055k1881M2899K2688O9224
114i1445M0270l8175P997l705m9867l7437O0413P9646m0754q1827j6610O8441
102a03053J7605k0147j7436L419M2157j4962M2207K2036m6662j9269J5291k855
90h1669L209K8984m3768K7408J3426k3070M766J4127j9378j5948O2898l0310k5266
77h4591L7911p712j5895P665K3191n331N2031l2247k6837J3286l3275M0253Q007
$$ plain form
64 -23544 -49908 -48307 -51391 -81538 -48395 -42732 -28161 6794 -45086 -65907 -90588 -49307 -40757
51 -40757 -26273 -30471 -45911 -68377 -69123 -14276 -43888 -78195 -86672 -84617 -65438 -85695 -102184
38 -102184 -97698 -24081 -46612 -82465 -43841 -116042 -129521 -94872 -74827 -128592 -169793 -165228
26 -165228 -101406 -63833 -91451 -88997 -89588 -104742 -133498 -183800 -155994 -114638 -107498 -109116 -124731
13 -124731 -155535 -129345 -103908 -96545 -88610 -119132 -130236 -139216 -141310 -154558 -101489 -108552 -143377
0 -143377
$$ packed form
64b3544k6364J601l084l0147L3143N663J4571L4955n1880k0821k4681M1281Q550
51d0757J4484m198j5440k2466p46N4847k9612l4307q477K055J9179k0257j6489
38a02184M486P3617k2531l5853L8624p2201j3479L4649K0045n3765m1201M565
26a65228O3822L7573k7618K454n91j5154k8756n0302K7806M1356P140j618j5615
13a24731l0804K6190K5437P363P935l0522j1104q980k094j3248N3069p063l4825
0a43377
$$ Imaginary data points
##PAGE= N=2
##DATA TABLE= (X++(I..I)), XYDATA
$$ plain form
16383 -1485763 -1476833 -1457916 -1430932 -1457335 -1437806 -1392722 -1357954 -1313946 -1296603 -1321062 -1299692
16372 -1299692 -1286836 -1295156 -1291394 -1284223 -1266738 -1237332 -1200546 -1184304 -1170550 -1155060 -1076314 -1067489
16360 -1067489 -1123390 -1096704 -1067272 -1065280 -1034737 -1039092 -1039702 -1029913 -1009902 -961689 -932764 -917076
16348 -917076 -901743 -881342 -907984 -919632 -874066 -812075 -811145 -843120 -808412 -808884 -801305 -757117
16336 -757117 -761233 -741741 -740470 -738409 -708496 -687640 -693535 -653954 -671506 -653724 -602877 -626812
16324 -626812 -604603 -573547 -582824 -555769 -551323 -605781 -564686 -544146 -535627 -505841 -518565 -500963
16312 -500963 -450900 -447498 -409176 -371398 -395785 -417580 -374198 -404881 -405383 -392026 -363766 -318979
16300 -318979 -342238 -339660 -267380 -244477 -276136 -298974 -244738 -228421 -194983 -197957 -235277 -232395
$$ packed form
16383a485763Q930J8917K6984k6403J9529M5084L4768M4008J7343k4459K1370
16372a299692J2856q320L762P171J7485K9406L6786J6242J3754J5490P8746Q825
16360a067489n5901K6686K9432J992L0543m355o10R789K0011M8213K8925J5688
16348i17076J5333K0401k6642j1648M5566O1991R30l1975L4708m72P579M4188
16336g57117m116J9492J271K061K9913K0856n895L9581j7552J7782N0847k3935
16324f26812K2209L1056r277K7055M446n4458M1095K0540Q519K9786j2724J7602
16312e00963N0063L402L8322L7778k4387k1795M3382l0683n02J3357K8260M4787
16300c18979k3259K578P2280K2903l1659k2838N4236J6317L3438k974l7320K882
$$ plain form
16288 -232395 -207279 -189813 -152208 -137326 -146904 -140791 -114745 -87733 -80948 -71805 -41637 -38696
16276 -38696 -61822 -59186 -34019 -32751 72 35341 19049 54823 36580 24786 105214 147718
16264 147718 56508 37376 79425 90843 47918 70430 126191 142686 67254 116545 187364
16253 187364 209473 195157 225368 207037 205646 217074 250413 269036 221103 204564 229290 242498
16241 242498 265294 270297 273559 267579 312371 390702 421515 402059 375292 346759 296413 346003
16229 346003 332865 292570 357028 432408 425168 451878 430292 417164 378566 422312 438608 436929
16217 436929 443298 423982 429485 465684 472421 456571 490672 489963 449813 485534 532806 508881
16205 508881 464567 475135 490606 558689 559697 551706 510715 494478 555020 568844 561734 545836
$$ packed form
16288b32395K5116J7466L7605J4882r578O113K6046K7012O785R143L0168K941
16276c8696k3126K636K5167J268L2823L5269j6292L5774j8243j1794Q0428M2504
16264A47718r1210j9132M2049J1418m2925K2512N5761J6495p5432M9291P0819
16253A87364K2109j4316L0211j8331j391J1428L3339J8623m7933j6539K4726J3208
16241B42498K2796N003L262n980M4792P8331L0813j9456k6767k8533n0346M9590
16229C46003j3138m0295O4458P5380p240K6710k1586j3128l8598M3746J6296j679
16217D36929O369j9316N503L6199O737j5850L4101p09m0150L5721M7272k3925
16205E08881m4314J0568J5471O8083J008p991m0991j6237O0542J3824p110j5898
$$ plain form
16193 545836 534851 514349 533542 582949 634552 630085 584578 614837 605654 566423 507957 447900
16181 447900 528135 585269 663984 636805 613402 615110 655115 627910 583732 565543 612163 674053
16169 674053 697383 645302 595270 590537 651243 705908 684971 661839 677168 653637 616215 645820
16157 645820 667646 694722 719633 704715 720244 742012 702651 754529 780112 754598 691325
16146 691325 684422 710268 700343 716598 743620 730688 684972 680635 719455 712249 750716 751889
16134 751889 713959 704346 766439 800013 767763 769779 774891 783380 761353 739438 738523 717772 682608
16121 682608 767538 822056 764276 747627 768945 794128 807834 858428 842462 766356 741687
16110 741687 770504 731162 714803 773148 788699 759010 749930 809505 840344 850345 809335 823653
$$ packed form
16193E45836j0985k0502J9193M9407N1603m467m5507L0259r183l9231n8466o0057
16181D47900Q0235N7134P8715k7179k3403J708M0005k7205m4178j8189M6620O1890
16169F74053K3330n2081n0032m733O0706N4665k0937k3132J5329k3531l7422K9605
16157F45820K1826K7076K4911j4918J5529K1768l9361N1878K5583k5514o3273
16146F91325o903K5846r925J6255K7022j2932m5716m337L8820p206L8467J173
16134G51889l7930r613O2093L3574l2250K016N112Q489k2027k1915r15k0751l5164
16121F82608Q4930N4518n7780j6649K1318K5183J3706N0594j5966p6106k4669
16110G41687K8817l9342j6359N8345J5551k9689r080N9575L0839J0001m1010J4318
$$ plain form
16098 823653 788128 739470 754003 805404 803090 762692 801310 799664 780124 732968 714015 787066
16086 787066 765765 754111 794463 803682 782684 822960 890292 783416 750544 792232 813854
16075 813854 742400 750718 799032 841989 851335 844090 806551 753996 846015 900792 846135 871500
16063 871500 812198 714337 756936 834743 841349 833017 780831 807967 827263 817937 842279 905944
16051 905944 867649 807038 820320 838497 880460 849024 829910 843576 816846 830424 826145 780483
16039 780483 793699 865911 902510 881997 875609 853437 868367 877386 941885 936995 883294 825357
16027 825357 875839 866663 796482 826743 852993 873660 884950 867337 842970 818455 880741 883238
16015 883238 905079 865244 801132 817097 853361 841650 841798 847429 832671 888724 909308 840910
$$ packed form
16098H23653l5525m8658J4533N1401k314m0398L8618j646j9540m7156j8953P3051
16086G87066k1301j1654M0352R219k0998M0276O7332j06876l2872M1688K1622
16075H13854p1454Q318M8314M2957R346p245l7539n2555R2019N4777n4657K5365
16063H71500n9302r7861M2599P7807O606q332n2186K7136J9296r326K4342O3665
16051I05944l8295o0611J3282J8177M1963l1436j9114J3666k6730J3578m279m5662
16039G80483J3216P2212L6599k0513o388k2172J4930R019O4499m890n3701n7937
16027H25357N0482r176p0181L0261K6250K0667J1290j7613k4367k4515O2286K497
16015H83238K1841l9835o4112J5965L6264j1711J48N631j4758N6053K0584o8398
$$ plain form
16003 840910 809791 819279 793000 780577 832471 835954 830580 842384 846206 824857 812071 896552
15991 896552 965055 899801 824545 825892 812264 765014 744227 761139 768317 775147 782699 839438
15979 839438 845489 840178 889623 898245 906302 894755 850053 826171 837309 835262 777954 793685
15967 793685 831144 807657 801965 765265 786566 779482 871696 905897 871316 859989 834776 876304
15955 876304 869152 871182 835626 846341 873733 831013 856041 866644 851677 834978 849532 889315
15943 889315 892989 862598 869562 878720 832387 866578 919749 910201 907755 861707 875029 937354
15931 937354 905390 866888 888716 907973 846079 891970 938834 929704 871181 889933 892124 895664
15919 895664 866030 888897 906364 923728 919688 876786 870640 943963 943327 942295 914981 933506
$$ packed form
16003H40910l1119R488k6279j2423N1894L483n374J1804L822k1349j2786Q4481
15991H96552O8503o5254p5256J347j3628m7250k0787J6912P178O830P552N6739
15979H39438O051n311M9445Q622Q057j1547m4702k3882J1138k047n7308J5731
15967G93685L7459k3487n692l6700K1301p084R2214L4201l4581j1327k5213M1528
15955H76304p152K030l5556J0715K7392m2720K5028J0603j4967j6699J4554L9783
15943H89315L674l0391O964R158m6333L4191N3171r548k446m6048J3322O2325
15931I37354l1964l8502K1828J9257o1894M5891M6864r130n8523J8752K191L540
15919H95664k9634K2867J7467J7364m040m2902o146P3323o36j032k7314J8525
$$ plain form
15907 933506 898173 902069 914083 860140 878257 886541 867808 864050 928905 923501 863937 862279
15895 862279 890604 875244 902991 935083 902848 824811 855302 918851 885687 837016 831518 829313
15883 829313 867102 890916 909400 864005 880944 879471 894564 954574 920191 874899 818751 765119
15871 765119 829236 877531 869037 818239 828893 850926 895655 904747 884893 890619 851721 877863
15859 877863 866329 874920 891190 843146 826463 863550 881732 848760 844035 886597 893757 893169
15847 893169 845742 896177 943824 918775 910699 937027 923420 855873 836246 865696 906154 857557
15835 857557 855396 933842 929767 889414 934926 944590 900704 888877 909084 907072 909329 899621 889965
15822 889965 893172 882744 877023 871861 842661 880093 916130 925984 950779 973977 909731 876918
$$ packed form
15907I33506l5333L896J2014n3943J8117Q284j8733l758O4855n404n9564j658
15895H62279K8325j5360K7747L2092l2235p8037L0491O3549l3164m8671n498k205
15883H29313L7789K3814J8484m5395J6939j473J5093O0010l4383m5292n6148n3632
15871G65119O4117M8295q494n0798J0654K2033M4729R092j9854N726l8898K6142
15859H77863j1534Q591J6270m8044j6683L7087J8182l2972m725M2562P160n88
15847H93169m7427N0435M7647k5049q076K6328j3607o7547j9627K9450M0458m8597
15835H57557k161P8446m075m0353M5512R664m3886j1827K0207k012K257r708r656
15822H89965L207j0428n721n162k9200L7432L6037R854K4795K3198o4246l2813
$$ plain form
15810 876918 899755 907419 899306 881923 834789 863701 852939 852542 906102 897289 876318 872205 892804
15797 892804 907294 895050 825178 798056 849261 829522 831911 913575 949749 909132 909299 909027
15785 909027 856560 820176 813691 835276 832241 883232 827772 785101 856922 926141 878435 848647
15773 848647 842080 801990 799416 871033 894199 841614 832591 856361 886282 876541 821022 835209
15761 835209 810748 774766 782376 815740 873306 874605 832625 821894 933496 908299 862224 895979
15749 895979 829219 801900 807196 789642 763369 758647 804053 843859 838109 831963 847819 844970
15737 844970 789260 838197 871985 840851 792572 810457 846834 779301 795006 827441 841233
15726 841233 883512 907727 862510 846737 834918 799906 807918 778784 734116 806586 819031 821155
$$ packed form
15810H76918K2837P664q113j7383m7134K8912j0762l97N3560q813k0971m113K0599
15797H92804J4490j2244o9872k7122N1205j9739K389Q1664L6174m0617J67k72
15785I09027n2467l6384o485K1585l035N0991n5460m2671P1821O9219m7706k9788
15773H48647o567m0090k574P1617K3166n2585r023K3770K9921r741n5519J4187
15761H35209k4461l5982P610L3364N7566J299m1980j0731J11602k5197m6075L3755
15749H95979o6760k7319N296j7554k6273m722M5406L9806n750o146J5856k849
15737H44970n5710M8937L3788l1134m8279J7885L6377o7533J5705L2435J3792
15726H41233M2279K4215m5217j5773j1819l5012Q012k9134m4668P2470J2445K124
$$ plain form
15714 821155 794047 779911 771535 823801 870601 890844 908636 853786 805052 786923 786176 782905
15702 782905 824632 845292 783550 772578 776979 794663 802212 830618 899271 841229 823491 765247
15690 765247 804038 837707 813986 811266 853712 860418 802902 813369 783868 792147 838548 768172
15678 768172 809916 870136 852381 842947 865558 840532 829474 859808 840061 813627 829778 882470
15666 882470 841464 816454 829360 840215 840265 870106 860103 863551 886580 818533 795478 846091
15654 846091 861115 828547 803571 868089 896746 839697 857573 824437 806796 839136 821421
15643 821421 802330 816082 796222 800802 849786 843857 850474 870129 873669 943860 904979 822648
15631 822648 835736 862902 894005 811115 796973 893096 847241 759675 780550 818315 851109
$$ packed form
15714H21155k7108j4136q376N2266M6800K0243J7792n4850m8734j8129p47l271
15702G82905M1727K0660o1742j0972M401J7684P549K8406O8653n8042j7738n8244
15690G65247L8791L3669k3721k720M2446O706n7516J0467k9501Q279M6401p0376
15678G68172M1744O0220j7755r434K2611k5026j1058L0334j9747k6434J6151N2692
15666H82470m1006k5010J2906J0855N0K9841j0003L448K3029o8047k3055N0613
15654H46091J5024l2568k4976O4518K8657n7049J7876l3136j7641L2340j7715
15643H21421j9091J3752j9860M580M8984n929O617J9655L540P0191l8881q2331
15631H22648J3088K7166L1103q2890j4142R6123m5855q7566K0875L7765L2794
$$ plain form
15620 851109 879436 876292 900319 901851 856195 868022 866217 841113 845893 758137 727543 802282
15608 802282 838709 804922 752415 784213 808195 798177 768922 807879 824919 802546 771997
15597 771997 803179 836163 829668 834669 852811 765825 759818 814166 835497 798402 789105 826208
15585 826208 753985 713174 796026 839963 821258 860260 820337 779865 800892 816938 795013
15574 795013 824233 795662 786026 805431 835395 901214 872432 786209 751355 745780 772419 835347
15562 835347 852125 803187 790916 828357 905635 948138 849369 829082 855115 795642 719003
15551 719003 727108 798093 809405 807743 798047 816629 827195 811715 863362 877572 894229 894767
15539 894767 844982 821219 824667 813844 816353 891538 867746 850442 869231 802114 832634 894715
$$ packed form
15620H51109K8327l144K4027J532m5656J1827j805k5104M780q7756l0594P4739
15608H02282L6427l3787n2507L1798K3982j0018k9255L8957J7040k2373l0549
15597G71997L1182L2984o495N001J8142q6986o007N4348K1331l7095r297L7103
15585H26208p2223m0811Q2852M3937j8705L9002l9923m0472K1027J6046k1925
15574G95013K9220k8571r636J9405K9964O5819k8782q6223l4854n575K6639O2928
15562H35347J6778m8938j2271L7441P7278M2503r8769k0287K6033n9473p6639
15551G19003Q105P0985J1312j662r696J8582J0566j5480N1647J4210J6657N38
15539H94767m9785k3763L448j0823K509P5185k3792j7304J8789o7117L0520O2081
$$ plain form
15527 894715 916580 920829 888263 815675 892406 882605 807379 841739 859495 902444 871471 795725
15515 795725 882460 956422 941717 941908 948584 862548 868459 851592 841493 923339 862238 850775
$$ packed form
15527H94715K1865M249l2566p2588P6731r801p5226L4360J7756M2949l0973p5746
15515G95725Q6735P3962j4705J91O676q6036N911j6867j0099Q1846o1101j1463
$$ [...]
##END NTUPLES=NMR SPECTRUM
##END=
