##TITLE=1H_CA-8816-2
 CDCl3,8 sc, 
 4.02.2021
##JCAMPDX= 6.0         $$ Bruker NMR JCAMP-DX V2.0
##DATA TYPE= NMR SPECTRUM
##DATA CLASS= NTUPLES
##ORIGIN= UXNMR, Bruker Analytische Messtechnik GmbH
##OWNER= root
$$ XWIN-NMR		Version 3.5
$$ Thu Feb  4 10:11:22 2021 Russian Standard Time (UT+4h)  she@DPX200
##.OBSERVE FREQUENCY= 200.1315066352
##.OBSERVE NUCLEUS= ^1H
##.ACQUISITION MODE= SIMULTANEOUS
##.ACQUISITION SCHEME= undefined
##.AVERAGES= 8
##.DIGITISER RES= 18
##SPECTROMETER/DATA SYSTEM= spect
##.PULSE SEQUENCE= zg30
##.SOLVENT NAME= D2O
##.SHIFT REFERENCE= (INTERNAL, D2O, 0, 15.9574)
##AUDIT TRAIL= $$ (NUMBER, WHEN, WHO, WHERE, WHAT)
$$ ##TITLE= Audit trail, XWIN-NMR		Version 3.5
$$ ##JCAMPDX= 5.01
$$ ##ORIGIN= Bruker BioSpin GmbH
$$ ##OWNER= she
$$ F:/spectra/data/she/nmr/H-F/1/pdata/1/auditp.txt
$$ ##AUDIT TRAIL=  $$ (NUMBER, WHEN, WHO, WHERE, WHAT)
(   1,<2021-02-04 10:09:54.40 +0400>,<she>,<DPX200>,
      <created by zg, POWCHK disabled, PULCHK disabled
       configuration hash MD5:
       00 E9 B6 7A A2 85 ED C7 34 08 36 98 17 FE 4E 26
       data hash MD5: 16K
       FC 9C 62 00 43 91 E2 05 49 4D 52 1A B4 CE C4 95>)
(   2,<2021-02-04 10:09:56.79 +0400>,<she>,<DPX200>,
      <Start of raw data processing
       efp BC_mod = 2 LB = 0.24 FT_mod = 6 PKNL = 1 PHC0 = -10396.49 PHC1 = 9.600952 SI = 16K 
       data hash MD5: 16K
       44 40 96 F6 66 3A E7 31 19 4F 88 44 1C 93 00 55>)
(   3,<2021-02-04 10:10:18.03 +0400>,<she>,<DPX200>,
      <pk PHC0 = -4.92253 PHC1 = 6.2 
       data hash MD5: 16K
       E3 53 1E F5 13 F5 E6 DF B1 E1 B7 87 B2 8E 51 F8>)
(   4,<2021-02-04 10:10:21.34 +0400>,<she>,<DPX200>,
      <abs ABSG = 5 
       data hash MD5: 16K
       02 EA 2F 3D 57 9C 71 37 6D 5B 5E 8D A8 A2 2A D0>)
(   5,<2021-02-04 10:10:38.04 +0400>,<she>,<DPX200>,
      <abs ABSG = 5 
       data hash MD5: 16K
       6E BA C6 CF 83 3C 93 C9 FD B1 B2 DD BF 32 A5 DE>)
$$ ##END=
$$ 
$$ hash MD5
$$ ED EF E2 AF D3 03 8D 22 F1 69 D4 B1 F3 DD D1 AA
##$RELAX= 
##$RELAX= 
##$RELAX= 
##$RELAX= 
##$RELAX= 
##$RELAX= 
$$ Bruker specific parameters
$$ --------------------------
##$DU= <F:/spectra>
##$EXPNO= 1
##$NAME= <H-F>
##$PROCNO= 1
##$TYPE= <nmr>
##$USER= <she>
##$AMP= (0..31)
100 100 100 100 100 100 100 100 100 100 100 100 100 100 100 100 100 100 
100 100 100 100 100 100 100 100 100 100 100 100 100 100 
##$AQSEQ= 0
##$AQ_mod= 1
##$AUNM= <au_zg>
##$AUTOPOS= <>
##$BF1= 200.13
##$BF2= 200.13
##$BF3= 200.13
##$BF4= 200.13
##$BF5= 200.13
##$BF6= 200.13
##$BF7= 200.13
##$BF8= 200.13
##$BYTORDA= 1
##$CFDGTYP= 0
##$CFRGTYP= 5
##$CHEMSTR= <none>
##$CNST= (0..31)
1 1 145 1 1 1 1 1 1 1 1 1 1 1 1 1 1 1 1 1 1 1 1 1 1 1 1 1 1 1 1 1 
##$CPDPRG= <>
##$CPDPRG1= <>
##$CPDPRG2= <>
##$CPDPRG3= <>
##$CPDPRG4= <mlev>
##$CPDPRG5= <mlev>
##$CPDPRG6= <mlev>
##$CPDPRG7= <mlev>
##$CPDPRG8= <mlev>
##$CPDPRGB= <>
##$CPDPRGT= <>
##$D= (0..31)
0 1.2 0 0 0 0 0 0 0 0.06 0 0.03 0 0 0 0 0.0002 0 0 0 0 0 0 0 0 0 0 0 0 
0 0 0 
##$DATE= 1612418993
##$DBL= (0..7)
$$ [...]
##$SUBNAM3= <"">
##$SUBNAM4= <"">
##$SUBNAM5= <"">
##$SUBNAM6= <"">
##$SUBNAM7= <"">
##$SUBNAM8= <"">
##$SUBNAM9= <"">
##$SW= 16.9725356469052
##$SWIBOX= (0..15)
0 0 2 0 0 0 0 0 0 0 0 0 0 0 0 0 
##$SW_h= 3396.73913043478
##$TD= 16384
##$TD0= 1
##$TE= 0
##$TE2= 300
##$TE3= 300
##$TEG= 300
##$TL= (0..7)
0 120 120 120 120 120 120 120 
##$TP= (0..7)
150 150 150 150 150 150 150 150 
##$TP07= 0
##$TPNAME0= <>
##$TPNAME1= <>
##$TPNAME2= <>
##$TPNAME3= <>
##$TPNAME4= <>
##$TPNAME5= <>
##$TPNAME6= <>
##$TPNAME7= <>
##$TPOAL= (0..7)
0.5 0.5 0.5 0.5 0.5 0.5 0.5 0.5 
##$TPOFFS= (0..7)
0 0 0 0 0 0 0 0 
##$TUNHIN= 0
##$TUNHOUT= 0
##$TUNXOUT= 0
##$USERA1= <user>
##$USERA2= <user>
##$USERA3= <user>
##$USERA4= <user>
##$USERA5= <user>
##$V9= 5
##$VALIST= <valist>
##$VCLIST= <CCCCCCCCCCCCCCC>
##$VD= 0
##$VDLIST= <DDDDDDDDDDDDDDD>
##$VPLIST= <PPPPPPPPPPPPPPP>
##$VTLIST= <TTTTTTTTTTTTTTT>
##$WBST= 1024
##$WBSW= 4
##$XGAIN= (0..3)
0 0 0 0 
##$XL= 0
##$YL= 0
##$YMAX_a= 228623
##$YMIN_a= -141495
##$ZGOPTNS= <>
##$ZL1= 120
##$ZL2= 120
##$ZL3= 120
##$ZL4= 120
##$ABSF1= 15.95745
##$ABSF2= -1.015212
##$ABSG= 5
##$ABSL= 3
##$ALPHA= 0
##$AQORDER= 0
##$ASSFAC= 0
##$ASSFACI= 0
##$ASSFACX= 0
##$ASSWID= 0
##$AUNMP= <proc_1d>
##$AZFE= 0.1
##$AZFW= 0.1
##$BCFW= 0
##$BC_mod= 2
##$BYTORDP= 0
##$COROFFS= 0
##$CY= -3
##$DATMOD= 1
##$DC= 0
##$DFILT= <>
##$DTYPP= 0
##$F1P= 0
##$F2P= 0
##$FCOR= 1
##$FTSIZE= 16384
##$FT_mod= 6
##$GAMMA= 0
##$GB= 0
##$INTBC= 1
##$INTSCL= 2.992141e-10
##$ISEN= 128
##$LB= 0.24
##$LEV0= 0
##$LPBIN= 0
##$MAXI= 10000
##$MC2= 0
##$MEAN= 0
##$ME_mod= 0
##$MI= 1.114404
##$NCOEF= 0
##$NC_proc= -8
##$NLEV= 6
##$NOISF1= 3.799351
##$NOISF2= 2.8
##$NSP= 0
##$NTH_PI= 0
##$NZP= 0
##$OFFSET= 15.95745
##$PC= 1
##$PHC0= -10401.41
##$PHC1= 15.80095
##$PH_mod= 1
##$PKNL= yes
##$PPARMOD= 0
##$PSCAL= 0
##$PSIGN= 0
##$REVERSE= no
##$SF= 200.130011440494
##$SI= 16384
##$SIGF1= 3
##$SIGF2= 2
##$SINO= 5.538805
##$SIOLD= 16384
##$SREGLST= <1H.CDCl3>
##$SSB= 0
##$STSI= 16384
##$STSR= 0
##$SW_p= 3396.73913043478
##$SYMM= 0
##$S_DEV= 0
##$TDeff= 16384
##$TDoff= 0
##$TI= <>
##$TILT= no
##$TM1= 0
##$TM2= 0
##$TOPLEV= 0
##$USERP1= <user>
##$USERP2= <user>
##$USERP3= <user>
##$USERP4= <user>
##$USERP5= <user>
##$WDW= 1
##$XDIM= 16384
##$YMAX_p= 389153533
##$YMIN_p= -1620422
$$ End of Bruker specific parameters
$$ ---------------------------------
##NTUPLES= NMR SPECTRUM
##VAR_NAME=  FREQUENCY,     SPECTRUM/REAL,   SPECTRUM/IMAG
##SYMBOL=    X,             R,               I
##VAR_TYPE=  INDEPENDENT,   DEPENDENT,       DEPENDENT
##VAR_FORM=  AFFN,          ASDF,            ASDF
##VAR_DIM=   16384,         16384,           16384
##UNITS=     HZ,            ARBITRARY UNITS, ARBITRARY UNITS
##FACTOR=    0.207333158178281, 1,           1
##FIRST=     3193.56463365478, 0,            0
##LAST=      -203.174496779996, 0,           0
##MIN=       -203.174496779996, -1620422,    0
##MAX=       3193.56463365478, 389153533,    0
$$ Real data points
##PAGE= N=1
##DATA TABLE= (X++(R..R)), XYDATA
$$ [...]
5615g89456J78930L07179j0211k34195l19231L09508K34438k8604L66416L46484
$$ -789456 -610526 -303347 -313558 -547753 -866984 -557476 -323038 -351642 14774 361258
5605C61258N8095k79312J02423o34018q1660j85557j17782n6312O54056J87616
$$ 361258 419353 140041 242464 -391554 -473214 -658771 -776553 -832865 -178809 8807
5595H807n91161n96397K19400O584L8344P92744L15387o93281O01095l8416j74330
$$ 8807 -582354 -1178751 -959351 -952767 -914423 -121679 193708 -499573 101522 63106 -111224
5584a11224j29527j98633j75367N42617M58626l67766K8272j15452k11240j55158
$$ -111224 -240751 -439384 -614751 -72134 386492 18726 46998 -68454 -279694 -434852
5574d34852P16197l11337q07128L85016J08057m17964L05687J73208K16564K03145
$$ -434852 281345 -29992 -837120 -452104 -344047 -762011 -456324 -283116 -66552 136593
5564A36593l91613J42788l51778m24083j22261J77267J228630l22728m89632j15946
$$ 136593 -255020 -112232 -464010 -888093 -1010354 -833087 395543 72815 -416817 -532763
5554e32763k91751K48418K39786L69217K42483k037n6864o60172M22307J31422
$$ -532763 -824514 -576096 -336310 32907 275390 273353 216489 -443683 -21376 110046
5544A10046l86543N74812j52778p76764o0694Q4539j44474L43690M97617l23001
$$ 110046 -276497 298315 145537 -631227 -691921 -607382 -751856 -408166 89451 -233550
5534b33550N3470K86994j2615n71414K31966K82237l95395j59710R9432j33949
$$ -233550 -180080 106914 94299 -477115 -245149 37088 -358307 -518017 -418585 -552534
5524e52534L27412Q3359r6567L74125l26802o64035o6986L54639J2216J06769
$$ -552534 -225122 -141763 -238330 135795 -191007 -855042 -922028 -567389 -555173 -448404
5514d48404j2081k03207J59271J29147R7847j00693J08021l57948K4610p4709
$$ -448404 -460485 -663692 -504421 -375274 -277427 -378120 -270099 -628047 -603437 -678146
5504f78146K32055J33328l5099M34841j76750k69910J75858k39785k77837Q05852
$$ -678146 -446091 -312763 -347862 86979 -89771 -359681 -183823 -423608 -701445 104407
5494A04407K40656o5653k39960n27375J91182L22894L9429m36113m58449K21829
$$ 104407 345063 279410 39450 -487925 -296743 26151 65580 -370533 -828982 -607153
5484f07153K26117L99848L8903l13771K15555J57360K71447l2129o29744j6464
$$ -607153 -381036 18812 57715 -256056 -40501 116859 388306 356177 -273567 -290031
5474b90031n40934M22139P26361m97669k31678O29893l55688n4240R27548k04748
$$ -290031 -830965 -408826 317535 -180134 -411812 218081 -137607 -191847 735701 530953
5464E30953j96823J22366n58107m84452K67004P544J4008P74371p1279j67797
$$ 530953 334130 456496 -101611 -586063 -319059 -311515 -297507 476864 405585 237788
5454B37788O0719K62149J8571Q0040j049885k96868Q41969J33741O4410K50476
$$ 237788 298507 560656 579227 659267 -390618 -687486 154483 288224 352634 603110
5444F03110j52072r85167N43992Q91798o00007j72580L11561N3819l2275J91932
$$ 603110 451038 -534129 9863 901661 301654 129074 440635 494454 462179 654111
5434F54111l35824k75058J52760k64129j0518k34712o82058K78406J020159k74174
$$ 654111 318287 43229 195989 -68140 -78658 -313370 -995428 -717022 303137 28963
5424B8963l06799M27972L65635l30019M60030J19070o28488j28700l1572j43999
$$ 28963 -277836 150136 515771 185752 645782 764852 136364 7664 -23908 -167907
5414a67907J43856j99771k40150M63121L18993n8723l70558L50946K53017m23702
$$ -167907 -24051 -223822 -463972 -851 318142 259419 -111139 239807 492824 69122
5404F9122o035q6072j74055j03856r0703k28901j79379M49524M74917J54716J00938
$$ 69122 63087 -22985 -197040 -300896 -391599 -620500 -799879 -350355 124562 279278 380216
5393C80216m11998m91289J77422R93813j22646l68329j49449j405j17247L70034
$$ 380216 -31782 -523071 -345649 648164 525518 157189 7740 6335 -110912 259122
5383B59122j90313q2307J77115k58804j94896j16321P0283q27235P23867O38508
$$ 259122 68809 -13498 163617 -95187 -290083 -406404 -336121 -1163356 -439489 199019
5373A99019k05665j17605q5342o44591l30896N52374O33932L38723J55887k93671
$$ 199019 -6646 -124251 -209593 -854184 -1185080 -632706 1226 339949 495836 202165
5363B02165l76120K30287k39946o18200K67843N29694k97419N09750N78143n36607
$$ 202165 -173955 56332 -183614 -801814 -533971 -4277 -301696 208054 786197 249590
5353B49590K58179k42086q3278K30915l5765k06477K3752j41049p15021N17509
$$ 249590 507769 265683 182405 413320 377555 171078 194830 53781 -661240 -143731
5343a43731L01509l2104r3662J97649m31065m07019K67005R2908j08982J19806
$$ -143731 157778 125674 32012 229661 -201404 -608423 -341418 -248510 -357492 -237686
5333b37686j97497Q6313k76450k03486L84457K17091L99095k02893K34120j55406
$$ -237686 -435183 -348870 -625320 -828806 -444349 -227258 171837 -31056 203064 47658
5323D7658n74464J63097M25637l30619l22987R8065M77168L7041j74223j59115
$$ 47658 -526806 -363709 61928 -268691 -591678 -493613 -16445 20596 -153627 -312742
5313c12742l86386r0067N41723J85199m78390M38981q4070j22085M79236n0645
$$ -312742 -699128 -789195 -247472 -62273 -540663 -101682 -185752 -307837 171399 120754
5303A20754l52511K46262L98500P1732q9089k47950j02686m39511K46386j37948
$$ 120754 -231757 14505 413005 484737 395648 147698 45012 -394499 -148113 -286061
5293b86061o0873N03363j6472m22221R6351m18420k87642N99664O17180j51119
$$ -286061 -346934 156429 139957 -282264 -185913 -604333 -891975 -292311 324869 173750
5283A73750l69083K176p4280K73691J98556j36582k56982N14179j86552l36660
$$ 173750 -195333 -193157 -267437 6254 204810 68228 -188754 325425 138873 -197787
5273a97787K78307k59584J47100K76881m87285j96860J54523L40710k23379k03411
$$ -197787 80520 -179064 -31964 244917 -242368 -439228 -284705 56005 -167374 -370785
5263c70785p0535l15883L28081K39321o75752K76833M74590k5201m2714K32084
$$ -370785 -441320 -757203 -429122 -189801 -865553 -588720 -114130 -139331 -182045 50039
5253E0039R3282m07563k1500L7683K71288J44980l97738j28013M90923j66073
$$ 50039 143321 -264242 -285742 -248059 23229 168209 -229529 -357542 133381 -32692
5243c2692l13797M62095J50599p16252K10959K74077m76251l1653L75384l14119
$$ -32692 -346489 115606 266205 -450047 -239088 34989 -441262 -472915 -97531 -411650
5233d11650J6783L90084k26615o75239K12799L6437j6782K87576O50650l01909
$$ -411650 -394867 -4783 -231398 -906637 -693838 -657401 -674183 -386607 264043 -37866
5223c7866l36830O70640l47658J49604j03704o9120n1465K81694k48156m76245
$$ -37866 -374696 295944 -51714 97890 -5814 -74934 -126399 155295 -92861 -569106
5213e69106o7866o7027K95566L85198M49061r3300n22157q944m44274K86363M98775
$$ -569106 -636972 -703999 -408433 -23235 425826 332526 -189631 -198575 -642849 -356486 142289
5202A42289j90954j49680j05160l29033k575M55011K6144l44081K76945J36477
$$ 142289 -48665 -198345 -303505 -632538 -635113 -180102 -153958 -498039 -221094 -84617
5192h4617n88202j66581O50330J04304j06465m23454O836K21265J91737p6754
$$ -84617 -672819 -839400 -189070 -84766 -191231 -614685 -607849 -386584 -194847 -271601
5182b71601P0057N02624m10947l2804Q1372N376j11398J38149n830k47359k19224
$$ -271601 -201544 301080 -109867 -142671 -61299 -55923 -167321 -29172 -35002 -282361 -501585
5171e01585K86643j13846N79092M04660m84797m62383L78008m91665Q8560J74796
$$ -501585 -214942 -328788 250304 654964 170167 -292216 85792 -405873 -317313 -142517
5161a42517L39946K17699n37763j3760j61763K77418L44848K14646o15885L04498
$$ -142517 197429 415128 -122635 -136395 -298158 -20740 324108 538754 -77131 227367
5151B27367K94061R9748n43925l81496O25394R4325m15609J18575j18455k50048
$$ 227367 521428 621176 77251 -304245 321149 415474 -135 118440 -15 -250063
5141b50063K48320M09304K78838m49922n57868N35599J47481k6991J62953R1792
$$ -250063 -1743 407561 686399 236477 -321391 214208 361689 334698 497651 589443
5131E89443m31487J38087K92512n13913p4072k15430O52481j88612k17288L84699
$$ 589443 157956 296043 588555 74642 570 -214860 437621 249009 31721 416420
5121D16420M0256m82532m7905L81146J53442l00171K96571J14047j29659k42340
$$ 416420 456676 -25856 -73761 307385 460827 160656 457227 571274 441615 199275
5111A99275L56219j4549m05314N38286K72759l51643K66832N76760j97677o4207
$$ 199275 555494 540945 135631 673917 946676 595033 861865 1438625 1240948 1176741
5101A176741K2849j2172J33020l7954o13354K92485J90496j71432l42070L31235
$$ 1176741 1199590 1187418 1320438 1282484 669130 961615 1152111 980679 638609 969844
5091I69844l47142l25006K66933j26682k976J47838o813p41135L54490Q90534
$$ 969844 622702 297696 564629 437947 434971 582809 575996 -165139 189351 1079885
5081A079885O706m46621R9488l38808n8209L18175n19946J47874L7746P80075
$$ 1079885 1086591 639970 739458 400650 342441 660616 140670 288544 326290 1106365
5071A106365l80297j3551M970n65133o8803M63199j1924n0123K99700n10698J68271
$$ 1106365 726068 712517 717487 152354 83551 546750 534826 484703 784403 273705 441976
5060D41976J92589l61225j48594L89679j54506l56736L35342J11448m65128k45172
$$ 441976 634565 273340 124746 514425 359919 3183 338525 449973 -15155 -260327
5050b60327K90935j65599M4701Q65177M06437p73896k7098Q6137m42166P03536
$$ -260327 30608 -134991 -90290 774887 1181324 407428 380330 466467 24301 727837
5040G27837l1935k91935K39717L81149n02577M19972K18131p62600n04030K95288
$$ 727837 695902 403967 643684 1024833 522256 942228 1160359 397759 -106271 189017
5030A89017k2856N57883J33650m39131m18098P34756j96827o083M42065K90430
$$ 189017 166161 724044 857694 418563 465 735221 538394 532311 974376 1264806
5020A264806l48858K82611q4741o59839K48775J08585J67802k32411K05326l72907
$$ 1264806 915948 1198559 1113818 453979 702754 811339 979141 746730 952056 579149
5010E79149M82922O3046k13417l65494M9908M29632n2420l20157N11624m94155
$$ 579149 1062071 1125117 911700 546206 596114 1025746 973326 653169 1164793 670638
5000F70638K2762Q74541j81079o16814K9220L46m0777K84392k6199k95275k30385
$$ 670638 693400 1567941 1386862 770048 799268 799614 758837 1043229 1017030 721755 491370
4989D91370K09249j68785L84304K90793m53298n00189L3369Q03619j08083q8462
$$ 491370 700619 531834 916138 1206931 753633 253444 286813 1090432 982349 893887
4979H93887j56614K9123M84370m19147r20612J75843M14923j31398K67884N03832
$$ 893887 737273 766396 1250766 831619 -88993 86850 501773 370375 638259 1142091
4969A142091n32371J40318M12748j58499l42024K266M9444o76836N88285M24378
$$ 1142091 609720 750038 1162786 1004287 662263 664529 713973 37137 625422 1049800
4959A049800q68707O662J58178j48902J42846L75680k70767J97389J45435m2662
$$ 1049800 181093 187755 345933 197031 339877 715557 444790 642179 787614 744952
4949G44952p9711j8768J69604o72881N46149J29348L9049j67680L9962k46555
$$ 744952 665241 646473 816077 143196 689345 818693 857742 690062 730024 483469
4939D83469k25831r8027j0888P9254K59385N97870o3082n40084L3607K08325J99440
$$ 483469 257638 159611 148723 227977 487362 1085232 1022150 482066 515673 723998 923438
4928I23438J28089r6814j22187k56245j59812j52254R40665k45305n85432l5140
$$ 923438 1051527 954713 832526 576281 416469 264215 1204880 959575 374143 339003
4918C39003L48716o21616R3074P28509k33305m63318m67712K22665j53001N69250
$$ 339003 687719 66103 159177 887686 654381 191063 -276649 -53984 -206985 362265
4908C62265j92941K18603J53553l37268k98691N65239r2615j28296q5232l64381
$$ 362265 169324 387927 541480 204212 -94479 470760 378145 249849 164617 -199764
4898a99764K68400M39507M41663p28384j16263K09673k85556L37813J50746r5558
$$ -199764 68636 508143 949806 221422 105159 314832 29276 367089 517835 422277
4888D22277J23140j41525r7673K86017R6406p01401M8883N22604p60J20873L42224
$$ 422277 545417 403892 306219 592236 688642 -12759 36124 558728 557968 678841 1021065
4877A021065j10797K23894k78251n12851K2748K04603l00137n11638M33302N13767
$$ 1021065 910268 1134162 855911 343060 365808 570411 270274 -241364 191938 705705
4867G05705K51878l83588N4266j62238P633L32496J29317j8788q50655R7529L83435
$$ 705705 957583 573995 628261 466023 473656 806152 935469 916681 66026 163555 546990
4856E46990j06680k20554j41883K42876M77924o7967l33917K68922M32550q4552
$$ 546990 440310 219756 77873 320749 798673 730706 396789 665711 1098261 1013709
4846A013709o8013J95558k60149k62578M09849m36187K75326Q10020n86725m31423
$$ 1013709 945696 1141254 881105 618527 1028376 592189 867515 1677535 1090810 659387
4836F59387N25653R561k74834J57837j98349q9258J11711j30300o603K6595o1928
$$ 659387 1185040 1194601 919767 1077604 879255 789997 901708 771408 764805 791400 729472
4825G29472k43781L44907J40993K70851K92925m14506p72774m04857K67700J22765
$$ 729472 485691 830598 971591 1242442 1535367 1120861 348087 -56770 210930 333695
4815C33695j02545K71700K27776l39348K36994k49704k31458K72867L02607N47315
$$ 333695 231150 502850 730626 391278 628272 378568 147110 419977 722584 1269899
4805A269899k82605l2474j04796l81638L54284P3546l10076L54389K60395k15071
$$ 1269899 987294 954820 850024 468386 822670 896216 586140 940529 1200924 985853
4795I85853j29701N0771j22383K3063K78929L43010m51238j76181N37699o79321
$$ 985853 856152 906923 784540 807603 1086532 1429542 978304 802123 1339822 660501
4785F60501l40321N30774j58896n23366K43890J7778L5622O37358k00737o03524
$$ 660501 320180 850954 692058 168692 412582 430360 465982 1103340 902603 299079
4775B99079P02082J64604l82089M39128l18778l13054P24407J48047o68970K73866
$$ 299079 1001161 1165765 783676 1222804 904026 590972 1315379 1463426 794456 1068322
4765A068322O89580p10824M43773M15321r08903n61325N99979J30926O6400O37728
$$ 1068322 1757902 1047078 1490851 1906172 997269 435944 1035923 1166849 1233249 1870977
4755A870977l95267j150407P39149M91070r37081l6892O44414m86529J32083M14256
$$ 1870977 1475710 325303 1064452 1555522 618441 581549 1225963 739434 871517 1285773
4745A285773o78050L22847L77216j04588n6131M95720o14925j38205L01829k80314
$$ 1285773 607723 930570 1307786 1203198 1147067 1642787 1027862 889657 1191486 911172
4735I11172k66398N39483N7616K38519L84974l53639m58918R9150l02M83023J37605
$$ 911172 644774 1184257 1241873 1480392 1865366 1511727 1052809 1151959 1151657 1634680 1772285
4724A772285o01604Q2471k64723K69278J98551K42874m50461L52222M85113L87298
$$ 1772285 1170681 1253152 988429 1257707 1456258 1699132 1248671 1600893 2086006 2473304
4714B473304q91703n16056N85379L76224M64257M8622n34017k36841K55625L01271
$$ 2473304 1581601 1065545 1650924 2027148 2491405 2540027 2006010 1769169 2024794 2326065
4704B326065J40615k77676m50972J94782J6110j02164L30787J14897M11333j79833
$$ 2326065 2466680 2189004 1738032 1932814 1948924 1846760 2177547 2292444 2703777 2523944
4694B523944l96197k25437J79826j23576K02334j13969l25676P8271L06941K95178
$$ 2523944 2127747 1902310 2082136 1958560 2160894 2046925 1721249 1799520 2106461 2401639
4684B401639r93k41959k32140n3024P49886m7799m03050K91025m9856l5728l8248
$$ 2401639 2400646 2158687 1926547 1873523 2623409 2575610 2172560 2463585 2413729 2378001 2339753
4673B339753L41193O0429m58774j20384M39319J17193l56472k37031J87590O54781
$$ 2339753 2680946 2741375 2282601 2162217 2601536 2718729 2362257 2125226 2312816 2967597
4663B967597n23658o69337J66152Q1682k5553K41249k75458j3003N02702j13133
$$ 2967597 2443939 1774602 1940754 2022436 1996883 2238132 1962674 1949671 2452373 2339240
4653B339240O5701J61521m41719l22898l91250K32811L60850r4498J0507n56108
$$ 2339240 2404941 2566462 2124743 1801845 1410595 1643406 2004256 1909758 1920265 1364157
4643A364157K27185O74170j42783R4261J99181l35877Q242L34797k72052p2531
$$ 1364157 1591342 2265512 2122729 2216990 2416171 2080294 2088536 2423333 2151281 2078750
4633B078750N133L78674p0729m133j02488j55627J04859m545m83415J13175M09491
$$ 2078750 2083883 2462557 2391828 2387695 2285207 2129580 2234439 2229894 1746479 1859654 2269145
4622B269145l28696K34567K99430n70554j20555M66671J67571O9822p3138j35516
$$ 2269145 1940449 2175016 2474446 1903892 1783337 2250008 2417579 2487401 2414263 2278747
4612B278747M52217L14332n06766j01293P16285m74298l62731K75071J12175N361
$$ 2278747 2730964 3045296 2538530 2437237 3153522 2679224 2316493 2591564 2703739 2709100
4602B709100R3362L8555l84771K46929r6855j89097M40154L77524l51811M5237
$$ 2709100 2802462 2841017 2456246 2703175 2606320 2417223 2857377 3234901 2883090 2928327
4592B928327K34696k79183N6564K93388j75340K90826K38473l87537j1432O53364
$$ 2928327 3163023 2883840 2940404 3233792 3058452 3349278 3587751 3200214 3188782 3842146
4582C842146l5294n41468j13015K43595m87245k1980M92921l11838l5919M72152
$$ 3842146 3806852 3265384 3152369 3395964 2908719 2886739 3379660 3067822 3031903 3504055
4572C504055M04319N2729j61236k46138K06698M73615l94825K51863k59164p77614
$$ 3504055 3908374 3961103 3799867 3553729 3760427 4234042 3839217 4091080 3831916 3054302
4562C054302m72726P01404N78791j38475k62015N4752R8185M65052n09642j86566
$$ 3054302 2581576 3282980 3861771 3723296 3461281 3516033 3614218 4079270 3569628 3383062
4552C383062L24243K4604m6590j59714k13322N32582O77434J00645l00118q6138
$$ 3383062 3707305 3731909 3685319 3525605 3312283 3844865 4522299 4622944 4322826 4236688
4542D236688K2898k53579L43074j01781j63349j54909N55159O59653k84052o014
$$ 4236688 4259586 4006007 4349081 4247300 4083951 3929042 4484201 5143854 4859802 4853788
4532D853788m78958K52499K43421L09992j12797k24204Q8687J08120N08148n692
$$ 4853788 4374830 4627329 4870750 5180742 5067945 4843741 4932428 5040548 5548696 5543004
4522E543004p6909k00636L74671k5500k81733M4919J1848M69449J99347j13346
$$ 5543004 5466095 5265459 5640130 5614630 5332897 5377816 5389664 5859113 6058460 5945114
4512E945114o27932J90842Q29961p79595K46220K58830K78502l5691K43703O3460
$$ 5945114 5317182 5508024 6337985 5558390 5804610 6063440 6341942 6306251 6549954 6613414
4502F613414j37924M9494p5469M39035L64605l09930J69105l62162K30512j32714
$$ 6613414 6475490 6524984 6449515 6888550 7253155 6943225 7112330 6750168 6980680 6847966
4492F847966M7788r6094j08536L77656J30765k54869l72649K28066K74445o1820
$$ 6847966 6895754 6799660 6691124 7068780 7199545 6944676 6572027 6800093 7074538 7012718
4482G012718J60539j42780M43393j41509J0952J84205j60448Q6245n97538j27898
$$ 7012718 7173257 7030477 7473870 7332361 7343313 7527518 7367070 7453315 6855777 6727879
4472F727879L23332K69888o89405L79326M87910O861l52172K9919j47306j19434
$$ 6727879 7051211 7321099 6631694 7011020 7498930 7505791 7153619 7183538 7036232 6916798
4462F916798L45647n15115n1798K60371j23026j43680K13639k22632r7588M57615
$$ 6916798 7262445 6747330 6695532 6955903 6832877 6689197 6902836 6680204 6582616 7040231
4452G040231m6330o55407K89261J07360k92485J82755k02131o96104l0461N81863
$$ 7040231 6993901 6338494 6627755 6735115 6442630 6625385 6423254 5727150 5696689 6278552
4442F278552K2981j61859L88493j26186m33749L4780l13394m49788O89667M78952
$$ 6278552 6301533 6139674 6528167 6401981 5968232 6003012 5689618 5239830 5929497 6408449
4432F408449n95293J51751K0765j162731j5067O76746j22162o38219j00246L50696
$$ 6408449 5813156 5964907 5985672 4822941 4807874 5484620 5362458 4724239 4623993 4974689
4422D974689j76706P2984j50447l37085l0372P4421k6262Q02744m40549l18389
$$ 4974689 4797983 4870967 4720520 4383435 4353063 4427484 4401222 5203966 4763417 4445028
4412D445028L16137r1703m64605L31687N54507n88983j21269M41269n22271k25768
$$ 4445028 4761165 4669462 4204857 4536544 5091051 4502068 4380799 4822068 4299797 4074029
4402D074029M81782k81245l19884J99291k14673j38829L54471R9297o64915k3697
$$ 4074029 4555811 4274566 3954682 4153973 3939300 3800471 4154942 4254239 3589324 3565627
4392C565627P0030j66407M20883k94170m88503M03996R019n88579J43527j21327
$$ 3565627 3635657 3469250 3890133 3595963 3107460 3511456 3520475 2931896 3075423 2954096
4382B954096j18819K1328k78775k6573J98385M05277k89989L13637k67205l93172
$$ 2954096 2835277 2856605 2577830 2551257 2749642 3154919 2864930 3178567 2911362 2518190
4372B518190o2879L45583n4580k62909M6808J27253j03559L03739J76180k31265
$$ 2518190 2455311 2800894 2746314 2483405 2530213 2657466 2553907 2857646 3033826 2802561
4362B802561n3678L57312p18844l23514M35458J98028K7822J0608k76224l08818
$$ 2802561 2748883 3106195 2387351 2063837 2499295 2697323 2725145 2735753 2459529 2150711
4352B150711K44890J54615k51950j39422N14079j40225J7209O782k65925n0779
$$ 2150711 2395601 2550216 2298266 2158844 2672923 2532698 2549907 2556689 2290764 2239985
4342B239985j69493k7804M30334k49819q1455m3517O11720l56496J82679k89251
$$ 2239985 2070492 2042688 2473022 2223203 2141748 2098231 2709951 2353455 2536134 2246883
4332B246883J47870M89643J38340k62914k42710M1174L08712N48953L74134K12603
$$ 2246883 2394753 2884396 3022736 2759822 2517112 2558286 2866998 3415951 3790085 4002688
4322D002688J43308j33775J12791K10074l53111m00793K50113l82047o54879j53448
$$ 4002688 4145996 4012221 4125012 4335086 3981975 3581182 3831295 3449248 2794369 2640921
4312B640921m72722k95629O84882j9824p88202J17302N34330n72605K18850M64329
$$ 2640921 2168199 1872570 2557452 2537628 1749426 1866728 2401058 1828453 2047303 2511632
4302B511632p01265q1762M94391J24409o51996K97602r7476J21928O22562k39818
$$ 2511632 1810367 1728605 2222996 2347405 1695409 1993011 1895535 2017463 2640025 2400207
4292B400207o76281J33058N50991m1048k3632o1522n61663K06054P32004N18891
$$ 2400207 1723926 1856984 2407975 2366927 2343295 2281773 1720110 1926164 2658168 3177059
4282C177059j85903k72683L29457L85573M18078K38538o63171j63728o4499k39884
$$ 3177059 2991156 2718473 3047930 3433503 3851581 4090119 3426948 3263220 3198721 2958837
4272B958837l73085l32484l30261K03405n4959j9523m8039k60650k1660K47002
$$ 2958837 2585752 2253268 1923007 2126412 2071453 2051930 2003891 1743241 1721581 1968583
4262A968583m4365k75541k27471l44323O52961m76792o5009j15352J68443j31904
$$ 1968583 1924218 1648677 1421206 1076883 1729844 1253052 1188043 1072691 1241134 1109230
4252A109230J10537J35491k62287N49878k55791k21397K44347J61072l14990J40764
$$ 1109230 1219767 1355258 1092971 1642849 1387058 1165661 1410008 1571080 1256090 1396854
4242A396854N6132J40161k6745l911m57679j39394M18941K91796l41039m83278
$$ 1396854 1452986 1593147 1566402 1562491 1104812 965418 1384359 1676155 1335116 851838
4232H51838m22049K22382k1610K32785J93711m5597m93094M5210K13230q91175
$$ 851838 429789 652171 630561 863346 1057057 1011460 518366 563576 776806 -114369
4222a14369L27292O64352M06523l4069l84494J56056K60049J37162M2886m20935
$$ -114369 212923 877275 1283798 1249729 865235 1021291 1281340 1418502 1461388 1040453
4212A040453k17970k18477K83952J19231k8569j27642K17345L7444J40844J12966
$$ 1040453 822483 604006 887958 1007189 978620 850978 1068323 1105767 1246611 1359577
4202A359577l79811p47893N23800L44681l03108k24418K82069P6361l3077N48999
$$ 1359577 979766 231873 755673 1100354 797246 572828 854897 931258 898181 1447180
4192A447180j32055j72983J86514k96572q3557K5639q11878k63445O36310J49055
$$ 1447180 1315125 1142142 1328656 1032084 948527 974166 162288 -101157 535153 684208
4182F84208K10798j46880k40508Q9127L59998L13254n20540m62451O6685N98717
$$ 684208 895006 748126 507618 596745 956743 1269997 749457 287006 353691 952408
4172I52408j1502k18174n76381J21694K60243M73807m0378m53717m47801M03619
$$ 952408 940906 722732 146351 268045 528288 1002095 961717 508000 60199 463818
4162D63818M12228M6817k53551l44101J46314p3706Q8606j72536k83816K3711
$$ 463818 876046 922863 669312 325211 471525 397819 486425 313889 30073 53784
4152E3784K14240L04061j01903J53965M460k4947M37919j16232P6302j19590N12959
$$ 53784 268024 572085 470182 624147 628607 603660 1041579 925347 1001649 882059 1395018
4141A395018k44229m10688P9095K18437m57870K45649p4923m54976K81811M41948
$$ 1395018 1150789 740101 819196 1037633 579763 825412 750489 295513 577324 1019272
4131A019272j03474l73995p4898M103K24221J85627L14059o40148k58984L60181
$$ 1019272 915798 541803 466905 471008 695229 880856 1194915 554767 295783 655964
4121F55964K916J03880N12580l29081P0879J35251j28972P0700M0744l56993k63704
$$ 655964 658880 762760 1275340 946259 1017138 1152389 1023417 1094117 1134861 777868 514164
4110E14164K33179L73383r6175M7434l04381k39440J78835L25069k28182J69315
$$ 514164 747343 1120726 1024551 1071985 767604 528164 706999 1032068 803886 973201
4100I73201l23008K3575L11140j44513n14451K88544L49748l45140M8151J28499
$$ 973201 650193 673768 984908 840395 325944 614488 964236 619096 667247 795746
4090G95746Q2508l66107l8246j45624L37728J35415K47035R8635K46013J55557
$$ 795746 878254 512147 473901 328277 666005 801420 1048455 1147090 1393103 1548660
4080A548660M1313m27562j51873K79559l03521l31528K83220K08858m74682L0028
$$ 1548660 1589973 1162411 1010538 1290097 986576 655048 938268 1147126 672444 702472
4070G02472L25990J12912j64598o89822J41870O41666J48981j36559J99463J79282
$$ 702472 1028462 1141374 976776 286954 428824 1070490 1219471 1082912 1282375 1461657
4060A461657k89760l90888K45291L03334k20650J890l64330K05271K15547k34559
$$ 1461657 1171897 781009 1026300 1329634 1108984 1110874 746544 951815 1167362 932803
4050I32803J22502L76459j69594j6719k66668K00684K25232j11033k9154r8336
$$ 932803 1055305 1431764 1262170 1245451 978783 1179467 1404699 1293666 1264512 1166176
4040A166176K24530l30131R4169J75073K55194K15956J55917l21276J4865j98606
$$ 1166176 1390706 1060575 1154744 1329817 1585011 1800967 1956884 1635608 1650473 1451867
4030A451867P2771J35426J73050l2326P897k64443L44652O090l4237N21055j82202
$$ 1451867 1524638 1660064 1833114 1800788 1808685 1544242 1888894 1894984 1860747 2381802 2199600
4019B199600n9645j7306r241O7989j78190Q2887J65127J12371O4584k82453K17100
$$ 2199600 2139955 2122649 2113408 2181397 2003207 2086094 2251221 2363592 2428176 2145723 2362823
4008B362823n2829J13468l82997J48917J85452k15415K7030K73718J00167l32699
$$ 2362823 2309994 2423462 2040465 2189382 2374834 2159419 2186449 2460167 2560334 2227635
3998B227635O564M6376M17577J76591l35814p26691N10399L40495l53341N08810
$$ 2227635 2234199 2280575 2698152 2874743 2538929 1812238 2322637 2663132 2309791 2818601
3988B818601Q4888o14324M57530P12308l78776n19379m78K74771J67866L44329
$$ 2818601 2903489 2289165 2746695 3459003 3080227 2560848 2560370 2835141 3003007 3347336
3978C347336l0731L69647M23610m05846q30921N44866J09525Q5426N95891n59175
$$ 3347336 3316605 3686252 4109862 3704016 2873095 3417961 3527486 3612912 4208803 3649628
3968C649628n45442L06078l6186p62678M78612l76477n50984N41198P26466l24881
$$ 3649628 3104186 3410264 3374078 2611400 3090012 2713535 2162551 2703749 3430215 3105334
3958C105334o80388K73558L41095K00359O24246k71011p33865L21030K14852k36569
$$ 3105334 2424946 2698504 3039599 3239958 3864204 3593193 2859328 3180358 3395210 3158641
3948C158641j50586K80282n48953K86998K95424l49366j89933M31556K27966M79340
$$ 3158641 3008055 3288337 2739384 3026382 3321806 2972440 2782507 3214063 3442029 3921369
3938C921369o6012j92730n3644J27467L00572n82334O9148J33158K22445J81426
$$ 3921369 3855357 3662627 3608983 3736450 4037022 3454688 3523836 3656994 3879439 4060865
3928D060865k1488l12527j68674N09541k46242Q1234O02912j7488l48411J73799
$$ 4060865 4039377 3726850 3558176 4067717 3821475 3902709 4505621 4488133 4139722 4313521
3918D313521k07888m24801K38372J68958m89300L88207L83747m58896k98067Q89465
$$ 4313521 4105633 3680832 3919204 4088162 3598862 3987069 4370816 3911920 3613853 4503318
3908D503318J09722l79177K9236K08262L72299M23871R8651j066940j56456N67584
$$ 4503318 4613040 4233863 4263099 4471361 4843660 5267531 5366182 4299242 4142786 4710370
3898D710370o0049K29275J94481q8765J48857j09932K00128N12125O86123m67918
$$ 4710370 4650321 4879596 5074077 4985312 5134169 5024237 5224365 5736490 6422613 5954695
3888E954695m09259r4684R0920L95646J72898o87337J48947K76678L81286J25883
$$ 5954695 5545436 5450752 5541672 5937318 6110216 5422879 5571826 5848504 6229790 6355673
3878F355673j05115k50910m09865K36911N66096J56948k47664q1824J79318N34422
$$ 6355673 6250558 5999648 5589783 5826694 6392790 6549738 6302074 6220250 6399568 6933990
3868F933990k62856L7266j69251m88696M48063M76001L30368k37755l75666M19414
$$ 6933990 6671134 6708400 6539149 6050453 6498516 6974517 7304885 7067130 6691464 7110878
3858G110878J73203J46234k8586J18283K58964k04588j95377K53138O58199m44201
$$ 7110878 7284081 7430315 7401729 7520012 7778976 7574388 7379011 7632149 8290348 7846147
3848G846147L15555j8325j86812O04069k66903l99819L84466J02349O1823J60491
$$ 7846147 8161702 8143377 7956565 8560634 8293731 7893912 8278378 8380727 8442550 8603041
3838H603041O64511l412n61121M43771J60862j19611K3928k81471m24609N49231
$$ 8603041 9267552 9264140 8703019 9146790 9307652 9188041 9211969 8930498 8505889 9055120
3828I055120J33268J63303K26524R7876K11101J55554M98724m58570m1760J46182
$$ 9055120 9188388 9351691 9578215 9676091 9887192 10042746 10541470 10082900 10041140 10187322
3818A0187322J71560M72237l7335l6912J14403J47678q3982J45560Q4753j75763
$$ 10187322 10358882 10831119 10793784 10756872 10871275 11018953 10934971 11080531 11165284 10989521
3808A0989521j07930N31470l27531m71856J78606k56110L95093P1154o9536R1123
$$ 10989521 10881591 11413061 11085530 10613674 10792280 10536170 10931263 11002417 10932881 11024004
3798A1024004L49540K30640m02716L40715M71691j13397k41031M67503j06886
$$ 11024004 11373544 11604184 11201468 11542183 12013874 11900477 11659446 12126949 12020063
3789A2020063k27523L94917N24765K04956k12079N4076j00387K53733J81119n2955
$$ 12020063 11792540 12187457 12712222 12917178 12705099 12759175 12658788 12912521 13093640 13040685
3779A3040685K21996Q87289J03418n86096P13513J25795K74341L74976L67981
$$ 13040685 13262681 14149970 14253388 13667292 14380805 14506600 14780941 15155917 15523898
3770A5523898k39269L47601j52088k42568R53493L39715p14733L93885P93123
$$ 15523898 15284629 15632230 15480142 15237574 16191067 16530782 15816049 16209934 17003057
3761A7003057L9419q7764k831L64108L61961M96622j88346m70171J71263l61251
$$ 17003057 17042476 16954712 16951881 17315989 17677950 18174572 17986226 17516055 17687318 17326067
3751A7326067r9916R35969l60667l3182P27918M63332m49720L04304m454k85218
$$ 17326067 17226151 18162120 17801453 17768271 18496189 18959521 18509801 18814105 18809651 18524433
3741A8524433K94837M89137m29432M43274O77141p75656O9420K54740j27750q7244
$$ 18524433 18819270 19308407 18878975 19322249 19999390 19223734 19293154 19547894 19420144 19332900
3731A9332900K86570m93339l81562M35220J56270J72547K06642J8399l65055N02521
$$ 19332900 19619470 19126131 18744569 19179789 19336059 19508606 19715248 19733647 19368592 19871113
3721A9871113K41577r67144K75130j13484J92212N0121M66634L20773M63874P5520
$$ 19871113 20112690 19145546 19420676 19307192 19499404 19549525 20016159 20336932 20800806 20876326
3711B0876326K16283L09022J82794n2058l99234N53218p866j9781M24776M91824
$$ 20876326 21092609 21401631 21584425 21532367 21133133 21686351 21678485 21658704 22083480 22575304
3701B2575304J14690j04461L27405M95044k0984k16782L1206J111849J79665j82725
$$ 22575304 22689994 22585533 22912938 23407982 23386998 23170216 23201422 24313271 24492936 24310211
3691B4310211N81201J24371J96645L84698P77120Q80242n226L61467Q7182L76303
$$ 24310211 24891412 25015783 25212428 25597126 26374246 27254488 27249262 27610729 27697911 28074214
3681B8074214Q20725K95292L40611P85628P03914L88056P35348J221770M07160
$$ 28074214 28894939 29190231 29530842 30316470 31020384 31408440 32143788 33365558 33772718
3672C3772718L17313J334970O14392M49105J515134N49209R45975J477255Q36982
$$ 33772718 34090031 35425001 36039393 36488498 38003632 38552841 39498816 40976071 41813053
3663D1813053O10368O80531M15375K65881M78246N05917m49552l6952K27886k91912
$$ 41813053 42423421 43103952 43519327 43785208 44263454 44769371 44319819 44282867 44510753 44218841
3653D4218841P35060J163939P92979M96226J834621R23129J107460K287246J262865
$$ 44218841 44953901 46117840 46910819 47407045 49241666 50164795 51272255 53559501 54822366
3644E4822366Q68055J128840P52267R33805J417139K67810k93827Q88219R22605
$$ 54822366 55690421 56819261 57571528 58505333 59922472 60190282 59896455 60784674 61707279
3635F1707279J530429K041712J181561J248219K074437K853623K077343K016110
$$ 61707279 63237708 65279420 66460981 67709200 69783637 72637260 74714603 76730713
3627G6730713K823856L171055L235141L561829L732391M095679M660405M845275
$$ 76730713 79554569 82725624 85960765 89522594 93254985 97350664 102011069 106856344
3619A06856344N389165P119080P082488P401822P207173N948158N241203N035826
$$ 106856344 112245509 119364589 126447077 133848899 141056072 147004230 152245433 157281259
3611A57281259M007695M093160O029422O128318M951723L518801J542701p23866
$$ 157281259 161288954 165382114 171411536 177539854 182491577 186010378 187553079 186829213
3603A86829213j859733k225018j910764r07564J38221K162804M755589O760692
$$ 186829213 184969480 182744462 180833698 179926134 180064355 182227159 186982748 193743440
3595A93743440P449369Q485402Q727352O550389M888676N010713M520506N942167
$$ 193743440 201192809 209678211 218405563 224955952 229844628 234855341 239375847 245318014
3587B45318014Q318101Q690136Q392572N969566K662386j060322k464226k504198
$$ 245318014 253636115 262326251 270718823 276688389 279350775 278290453 275826227 273322029
3579B73322029j391535n22848m91415m145158o972341q530606r092891p130540
$$ 273322029 271930494 271407646 270916231 266771073 259798732 251268126 242175235 235044695
3571B35044695m567169j078213M98730J342471K515233M834408O781191P332262
$$ 235044695 230477526 229399313 229898043 231240514 233755747 238590155 245371346 252703608
3563B52703608P017731N796014M243146J342585k93802J96061J300323J232394
$$ 252703608 259721339 265517353 269760499 271103084 270809282 271005343 272305666 273538060
3555B73538060O83030j300850m829272o783710o544785n490274l311479j056454
$$ 273538060 274221090 272920240 268090968 261307258 254762473 249272199 245960720 244904266
3547B44904266L61455O35121K693554M829541N849896O875447O609379N572162
$$ 244904266 245265721 245900842 248594396 253423937 259273833 266149280 272758659 278330821
3539B78330821M291555J358635j150766j786704j396363J02130J536222Q64185
$$ 278330821 282622376 283981011 282830245 281043541 279647178 279749308 281285530 282149715
3531B82149715m727507q804570r045409q539144o631246l856646l264213l864239
$$ 282149715 277422208 268617638 259572229 251033085 244401839 240545193 237280980 233416741
3523B33416741n531732n695160o288175o955656n476292l180935j514029J84088
$$ 233416741 227885009 222189849 215901674 208946018 203469726 200288791 198774762 198958850
3515A98958850J423469J247914J883496K83722j252741l748332n921954o513992
$$ 198958850 200382319 201630233 203513729 203797451 202544710 198796378 192874424 186360432
3507A86360432o677706o495843o413488n745292n178741o501903p856666q577748
$$ 186360432 179682726 173186883 166773395 161028103 155849362 149347459 141490793 132913045
3499A32913045p550363o408983m413594l025930l449757k612822k694595k834488
$$ 132913045 125362682 118953699 114540105 111514175 108064418 105451596 102757001 99922513
3491I9922513k659156j115753j713948j356370l08159J78597j058044p55821j026957
$$ 99922513 97263357 96147604 94433656 93077286 92769127 92947724 91889680 91133859 90106902
3482I0106902k725455k066028j382161j599162j904353j146316j614310j485760
$$ 90106902 87381447 85315419 83933258 82334096 80429743 79283427 77669117 76183357
3474G6183357o13581j155074j040498k15469o20355j15140L55410J036962o6089
$$ 76183357 75569776 74414702 73374204 73158735 72538380 72423240 72778650 73815612 73749523
3465G3749523J71502P36260j56333J67766r7184l18230j124185j359005j258311
$$ 73749523 73921025 74657285 74500952 74668718 74571534 74253304 73129119 71770114 70511803
3456G0511803j402029j742282r11299o81032j081169j067022p88950j372752n10658
$$ 70511803 69109774 67367492 66456193 65775161 64693992 63626970 62838020 61465268 60954610
3447F0954610j399038j071677J93277r27157k220593k577938k332112k288558
$$ 60954610 59555572 58483895 58677172 57750015 55529422 52951484 50619372 48330814
3439D8330814j395324j621656j409652j357246r07321p18752k99884j85972j044821
$$ 48330814 46935490 45313834 43904182 42546936 41639615 40920863 40620979 40435007 39390186
3430C9390186Q7987N90890K09553m46328m32072o82700j3275L47147p13966j047643
$$ 39390186 39478173 40069063 40278616 39832288 39400216 38717516 38704241 39051388 38337422 37289779
3420C7289779M03146R7677j16287O75552M19086l62311O19610P39160o45293m46334
$$ 37289779 37692925 37790602 37674315 38349867 38768953 38406642 39026252 39765412 39120119 38673785
3410C8673785o71678q16755l10749L93002m95761m11905K24412L64856M43124
$$ 38673785 38002107 37185352 36874603 37267605 36771844 36359939 36584351 36949207 37392331
3401C7392331j18064o60679m09554J71265k84221j401286q02275n91870j510797
$$ 37392331 37274267 36613588 36204034 36375299 36091078 34689792 33887517 33295647 31784850
3392C1784850k44833M07913j266661L41808P61817j13778j21633J38857o91798
$$ 31784850 31540017 31947930 30681269 31023077 31784894 31671116 31549483 31688340 30996542
3383C0996542j176993k81553k83536k20113q91551j714755K75252J2179l17563
$$ 30996542 29819549 29537996 29254460 29034347 28142796 26428041 26703293 26715472 26397909
3374B6397909L85510j78492n7121r8171m0025l86095k56270L77424J79046n25976
$$ 26397909 26783419 26604927 26547806 26449635 26409610 26023515 25767245 26144669 26323715 25797739
3364B5797739m37673L3287J45741O55280J00230K62978J11014k93010l47L06137
$$ 25797739 25360066 25393353 25539094 26194374 26294604 26557582 26668596 26375586 26375239 26681376
3354B6681376j67826j65607P10261O31096N15290P87781L30335M51041M45171
$$ 26681376 26513550 26347943 27058204 27689300 28204590 28992371 29322706 29773747 30218918
3345C0218918j62078k6801j27679q19379j82236l67728K15457l95412n9219J87860
$$ 30218918 30056840 30030039 29902360 29082981 28900745 28533017 28748474 28353062 28293843 28481703
3335B8481703k44839M03382L6714J30901l79494l05395j099647j008597q71223
$$ 28481703 28236864 28640246 28676960 28807861 28428367 28122972 27023325 26014728 25143505
3326B5143505q51751o89585m89724K03064m26331m99697Q2341l58897m62328n20093
$$ 25143505 24291754 23602169 23112445 23315509 22889178 22389481 22471822 22112925 21650597 21130504
3316B1130504q60375n84908n66584k62627l41396m01521j18392q5339k99912J212
$$ 21130504 20270129 19685221 19118637 18856010 18514614 18113093 17994701 17909362 17609450 17610662
3306A7610662p9893o18153j90692j49871J27434k96184n70105K91436P53101l82592
$$ 17610662 17530769 16912616 16721924 16572053 16699487 16403303 15833198 16124634 16877735 16495143
3296A6495143l23596k96412K05791N97133L50554m82620k1974j07235l52465J153089
$$ 16495143 16171547 15875135 16080926 16678059 17028613 16545993 16524019 16416784 16064319 17217408
3286A7217408L01255j002394k92786M97245J93104K49980L26943l51828j3179
$$ 17217408 17518663 16516269 16223483 16720728 16913832 17163812 17490755 17138927 17125748
3277A7125748K68623M69325k27197o20673n99375L38686P0443m53133j09638q6928
$$ 17125748 17394371 17863696 17636499 17015826 16416451 16755137 16825580 16372447 16262809 16175881
3267A6175881j31926l38025M99889m16670m84916O19572J79068l06433l88499
$$ 16175881 16043955 15705930 16205819 15789149 15304233 15923805 16102873 15796440 15407941
3258A5407941N9526m1599N92938M20000l86435o05428n2583O8485K80726J77135
$$ 15407941 15467467 15425868 16018806 16438806 16052371 15446943 15394360 15462845 15743571 15920706
3248A5920706j17095p6092M0169J28640o97445k5398P22201k58332J22397k16277
$$ 15920706 15803611 15727519 15767688 15896328 15198883 15173485 15895686 15637354 15759751 15543474
3238A5543474k36962M16728K50018O9458L34227j53199q4965L69521J26571j02063
$$ 15543474 15306512 15723240 15973258 16042716 16376943 16223744 16138779 16508300 16634871 16532808
3228A6532808j28024K61099K64565L1253l39399j01040L00577M09217M90332j75671
$$ 16532808 16404784 16665883 16930448 16961701 16622302 16521262 16821839 17231056 17721388 17545717
3218A7545717k69384L80028L16733O6688p62220Q28372L265l04257K15896N90552
$$ 17545717 17276333 17656361 17973094 18039782 17277562 18105934 18109199 17804942 18020838 18611390
3208A8611390J74236j13844j13063m65990J24282j95049P3462K86211L0863m08054
$$ 18611390 18785626 18671782 18558719 18092729 18217011 18021962 18095424 18381635 18412498 18004444
3198A8004444p3253L71448o797j5984M21638l34952K15747n83928q59556K28273
$$ 18004444 17931191 18302639 18295842 18279858 18701496 18366544 18582291 17998363 17138807 17367080
3188A7367080J05040m08077N0571M37734l99733j45318N43338L04442k83709K53448
$$ 17367080 17472120 17064043 17114614 17552348 17152615 17007297 17550635 17855077 17571368 17824816
3178A7824816j17211l27705l23461L97520j24917k26010L16011Q8465k15946O64376
$$ 17824816 17707605 17379900 17056439 17453959 17329042 17103032 17419043 17507508 17291562 17955938
3168A7955938j78003l14675P18715j98794k954L74599k41640K30280L42250K58398
$$ 17955938 17777935 17463260 18181975 17983181 17980227 18354826 18113186 18343466 18685716 18944114
3158A8944114j43536N7339K20878M76077J6214P2485M30064N56158q9142L46794
$$ 18944114 18800578 18857917 19078795 19554872 19571086 19643571 20073635 20629793 20540651 20887445
3148B0887445M89378n09799J97082P26203L02891K87601J16863O14195L13331
$$ 20887445 21376823 20867024 21064106 21790309 22093200 22380801 22497664 23111859 23425190
3139B3425190L08579K09793k76674K39837K40639L52913J12258J47412j47950
$$ 23425190 23733769 23943562 23666888 23906725 24147364 24500277 24612535 24759947 24611997
3130B4611997N39589O4111k04797M92570L10872l68491N25895R10225n2944N89717
$$ 24611997 25151586 25215697 25010900 25503470 25814342 25445851 25971746 26881971 26829027 27418744
3120B7418744Q05282k20113l2120M87606k7508Q8593N43446n1118j26033M51419
$$ 27418744 28224026 28003913 27971793 28459399 28431891 28520484 29063930 29012812 28886779 29338198
3110B9338198O39410q3672K84390K01681R4753N4105M42090L55299j37933K48551
$$ 29338198 29977608 29893936 30178326 30380007 30474760 30528865 30970955 31326254 31188321 31436872
3100C1436872M85979M93599L81340k27822j18046L71880N98395K8353K12027M01289
$$ 31436872 31922851 32416450 32797790 32569968 32451922 32823802 33422197 33450550 33662577 34063866
3090C4063866j6396n33595R5383r7155j30662M89050N80927j14760k81239L93739
$$ 34063866 34047470 33513875 33609258 33512103 33381441 33870491 34451418 34336658 34055419 34449158
3080C4449158K17687q1976J83651n3377n31878O16123L99706j51408M60642K74985
$$ 34449158 34666845 34584869 34768520 34715143 34183265 34799388 35199094 35047686 35508328 35783313
3070C5783313n33674L58502J013010k27469l7089L48760P4045K49770l21973o87982
$$ 35783313 35249639 35608141 36621151 36393682 36356593 36705353 36779398 37029168 36707195 36019213
3060C6019213R0993N52860m32900j39574L45372O1556J06581L57841L44249l6658
$$ 36019213 36110206 36663066 36230166 36090592 36435964 36497520 36604101 36961942 37306191 37269533
3050C7269533J73373j37442k75122M8569m80148j068432q2303J52325m43851k17078
$$ 37269533 37442906 37305464 37030342 37078911 36598763 35530331 35448028 35600353 35156502 34939424
3040C4939424O86001k62570o32547N49511K06255j6995R1859l8634J56372l90384
$$ 34939424 35625425 35362855 34730308 35279819 35486074 35469079 35560938 35522304 35678676 35288292
3030C5288292J50630k10870q70592K09060J33805O9893j63072P4205J006808j44467
$$ 35288292 35438922 35228052 34357460 34566520 34700325 34770218 34607146 34681351 35688159 35543692
3020C5543692m64704m8847M37396j02402m51952l97257j2055M93502k3918r2714
$$ 35543692 35078988 35030141 35467537 35365135 34913183 34515926 34503871 34997373 34973455 34880741
3010C4880741k19226k28996l96751L09196L60281K93117K67235j113536r62684
$$ 34880741 34661515 34432519 34035768 34344964 34705245 34998362 35265597 34152061 33189377
3001C3189377K93700l38570k73007k3535j06105j87040N77392J41460o18260O18178
$$ 33189377 33483077 33144507 32871500 32847965 32741860 32554820 33132212 33273672 32655412 33273590
2991C3273590N16897q45646L7317j24930M4163J58393m82089n54182n1964L05624
$$ 33273590 33790487 32944841 32982158 32857228 32901391 33059784 32577695 32023513 31971549 32277173
2981C2277173m42145l97921J67516n74702r7390O03313k84720r23593J78017O97376
$$ 32277173 31835028 31437107 31604623 31029921 30932531 31535844 31251124 30327531 30505548 31202924
2971C1202924M36192N8164j52683l36749m49508r46947o86988m4715k20555p52001
$$ 31202924 31639116 31697280 31544597 31207848 30758340 29811393 29124405 29079690 28859135 28107134
2961B8107134N70795O90057p98250J06137J42797k02271j15253P22184K72829
$$ 28107134 28677929 29367986 28569736 28675873 28818670 28616399 28501146 29223330 29496159
2952B9496159o13892J00606K66814m38061J29241L84081L43414K92987P9988m5979
$$ 29496159 28882267 28982873 29249687 28811626 28940867 29324948 29668362 29961349 30041337 29995358
2942B9995358N94832J07833p5342K65326M05036j71638M43759J091504k5151K75911
$$ 29995358 30590190 30698023 30622681 30888007 31293043 31121405 31565164 32656668 32631517 32907428
2932C2907428O67058K28269P35060J541367O42763Q16418N72870K06666J26781
$$ 32907428 33574486 33802755 34537815 36079182 36721945 37538363 38111233 38317899 38444680
2923C8444680P43527K38155N4941K58131N349k8960m47290N02770O00257M58273
$$ 38444680 39188207 39426362 39481303 39739434 39744783 39715823 39268533 39771303 40371560 40829833
2913D0829833Q11332Q87676P56998J176431J072705J225921J94600j5648l14998
$$ 40829833 41641165 42528841 43285839 44462270 45534975 46760896 46955496 46939848 46624850
2904D6624850P7612j0773o56014j28540L1939K13608K44943K80149L11743L24297
$$ 46624850 46702462 46691689 46035675 45907135 45939074 46152682 46397625 46677774 46989517 47313814
2894D7313814O68810J046366O79579P37753O28259J305318M65722J90548N59091
$$ 47313814 47982624 49028990 49708569 50446322 51074581 52379899 52845621 53036169 53595260
2885E3595260J129622P42048Q11752J792732J787064Q74364J868325J842824K000707
$$ 53595260 54724882 55466930 56278682 58071414 59858478 60732842 62601167 64443991 66444698
2876F6444698J237864O57407J153536J204564R52590Q19104J566027R95634J195579
$$ 66444698 67682562 68339969 69493505 70698069 71650659 72469763 74035790 75031424 76227003
2867G6227003K368993J724658J286042J741650K714150L052018L117667L571231
$$ 76227003 78595996 80320654 81606696 83348346 86062496 89114514 92232181 95803412
2859I5803412L233508K791667J133745R5759n22094K7790N38978J918292J895686
$$ 95803412 99036920 101828587 102962332 103058091 102535997 102563787 103102765 105021057 106916743
2850A06916743J408360J594267K693942K348701K338711L280679L861652L790981
$$ 106916743 108325103 109919370 112613312 114962013 117300724 120581403 124443055 128234036
2842A28234036M732631M174634L175259K289143J689321M87480L24835J564572
$$ 128234036 132966667 137141301 140316560 142605703 144295024 144782504 145107339 146671911
2834A46671911L245145M720281P075572Q527304Q744111R077797P001749M245379
$$ 146671911 149917056 154637337 161712909 170240213 178984324 188062121 195063870 199309249
2826A99309249K329737J564836K299383L483684L608480J049781O9068J488423
$$ 199309249 201638986 203203822 205503205 208986889 212595369 213645150 213714218 215202641
2818B15202641K277377N509511Q522025O981014M443250M434757O087198Q639927
$$ 215202641 217480018 222989529 231511554 238492568 242935818 247370575 253457773 262097700
2810B62097700R491305J0731894J3517633J7207485J9210898J8512493J5565201
$$ 262097700 271589005 282320899 295838532 313046017 332256915 350769408 366334609
2803C66334609P763124j50798l121468l141343j721074j413606l95991O19261
$$ 366334609 374097733 373946935 370825467 367684124 365963050 364549444 364153453 364772714
2795C64772714J806576M043626O631010P239840J857175m003225m539864j175360
$$ 364772714 366579290 370622916 377253926 384493766 386350941 382347716 377807852 376632492
2787C76632492L999304O750517J771220p955309j0791542n574182o92945m15690
$$ 376632492 380631796 387382313 389153533 381198224 370406682 364832500 364139555 363723865
2779C63723865j600684r5642L66516J679409L909607L078677m721382j6718845
$$ 363723865 362123181 362027539 362394055 364073464 367983071 371061748 366340366 349621521
2771C49621521k1732714j9074101j4254155j2966341j1877754q534704n477374
$$ 349621521 327888807 308814706 294560551 281594210 269716456 261181752 255704378
2764B55704378n122525m880495m044044l256260m981057o344883n884011m154331
$$ 255704378 250581853 245701358 241657314 238401054 233419997 227075114 221191103 217036772
2756B17036772l409842m271756m151485m428914k577987k084095k278836l561869
$$ 217036772 213626930 209355174 205203689 200774775 198196788 196112693 193833857 190271988
2748A90271988o388329p231720p779047p510874o876169m876985l044942k664204
$$ 190271988 183883659 176651939 168872892 161362018 154485849 149608864 146563922 143899718
2740A43899718j511830j027185j681702l802436m566258m439657m122706l335729
$$ 143899718 142387888 141360703 139679001 135876565 131310307 126870650 122747944 119412215
2732A19412215l436001j974047j073825p72003j351849k042572k058994j914073
$$ 119412215 115976214 114002167 112928342 112156339 110804490 108761918 106702924 104788851
2724A04788851r13763m29574m57868n05721j17547j395321k941193l315062l098027
$$ 104788851 103875088 103445514 102987646 102481925 102364378 100969057 98027864 94712802 91614775
2715I1614775k240936j564303r55697j022984k112762j942054j227399j570213
$$ 91614775 89373839 87809536 86853839 85830855 83718093 81776039 80548640 78978427
2707G8978427j570837k167912j907153q43073l4712r37243q27765o30825j563142
$$ 78978427 77407590 75239678 73332525 72489452 72454740 71517497 70689732 70058907 68495765
2698F8495765j494785q27692j644795j855842q50027n96559r24553j395133j317772
$$ 68495765 67000980 66173288 64528493 62672651 61822624 61226065 60301512 58906379 57588607
2689E7588607n82103k06631p80044n29178l65059q14972q88732k76399J31q96655
$$ 57588607 57006504 56799873 56019829 55490651 55125592 54310620 53421888 53145489 53145620 52248965
2679E2248965j011036M19004l99560j104270k07838j45323q70185n05124J894
$$ 52248965 51237929 51656933 51257373 50153103 49945265 49799942 48929757 48424633 48426527
2670D8426527o77742n91034k50386k52662m7244j56456q71708r0460O8294n93860
$$ 48426527 47748785 47157751 46907365 46654703 46607459 46451003 45579295 45488835 45557129 44963269
2660D4963269q74473o1256k29958o55372O74291n4896n05200j47794K97695l60638
$$ 44963269 44088796 44027540 43797582 43142210 43816501 43761605 43256405 43108611 43406306 43045668
2650D3045668J8365l06303m9122j19731J69599j8860l61952l20278j83561j28720
$$ 43045668 43064033 42757730 42708608 42588877 42758476 42739616 42377664 42057386 41873825 41745105
2640D1745105K46701l86523L1567J119200J46429r0741L625M0702K42049K44409
$$ 41745105 41991806 41605283 41636850 42756050 42902479 42811738 42815363 42856065 43098114 43342523
2630D3342523K27894K59954L14743J22859k57446K54284P48976k53710m69445
$$ 43342523 43570417 43830371 44145114 44267973 44010527 44264811 45013787 44760077 44290632
2621D4290632P31602J46874L9925Q33563O66781L27807M17935L98887J89377j03326
$$ 44290632 45022234 45169108 45209033 46042596 46709377 47037184 47455119 47854006 48043383 47940057
2611D7940057M00279R18759L23632j23532M17088J95030K13537k0722L04690M46140
$$ 47940057 48340336 49259095 49582727 49459195 49876283 50071313 50284850 50264128 50568818 51014958
2601E1014958j83638J50457O43588M94555m88491k304L89355l40951k55752j60804
$$ 51014958 50831320 50981777 51625365 52119920 51631429 51629125 52018480 51677529 51421777 51260973
2591E1260973J83795q28088j16209K55437J80948l21428l15472L00169k25314
$$ 51260973 51444768 50616680 50500471 50755908 50936856 50615428 50299956 50600125 50374811
2582E0374811m35385m73631J54426q682k48263l88155n05638j070496n95576L33943
$$ 50374811 49939426 49465795 49620221 49611539 49363276 48975121 48469483 47398987 46803411 47137354
2572D7137354o4522j303287p84230j1025o97058k93669J88139L6353J29264j40526
$$ 47137354 47072832 45769545 44985315 44974290 44277232 43983563 44171702 44208055 44337319 44196793
2562D4196793n88494j28929m19722m55081q0918m364o11050m1592N10581R4641
$$ 44196793 43608299 43479370 43059648 42604567 42523649 42519285 41908235 41866643 42377224 42471865
2552D2471865j22233p19357l18219j39578M36378j32119j06739k6040n12371l81236
$$ 42471865 42349632 41630275 41312056 41172478 41608856 41476737 41369998 41343958 40831587 40450351
2542D0450351P21538m98639m90298M19626j46288j39044p1654j17814K0909k23459
$$ 40450351 41171889 40673250 40182952 40602578 40456290 40317246 40245592 40127778 40148687 39925228
2532C9925228N89456M24741K52203l12619o05775N11611L7766p43265p35472J26746
$$ 39925228 40514684 40939425 41191628 40879009 40273234 40784845 40822611 40079346 39343874 39470620
2522C9470620m03611o77234L25993L0967q54363k8957j82883n83412n53694j28428
$$ 39470620 39067009 38389775 38715768 38746735 37892372 37863415 37680532 37097120 36543426 36414998
2512C6414998n67371l35450l12729l54711o52586j036464o90144m34633j90830
$$ 36414998 35847627 35512177 35199448 34844737 34192151 33155687 32465543 32030910 31840080
2503C1840080j09815m66212J86021K86453r07886l92300N23762o88256j106217
$$ 31840080 31730265 31264053 31450074 31736527 30828641 30436341 30960103 30271847 29165630
2494B9165630n08412L25019q00025J4183L4817j244878N3355K49412m63665J84564
$$ 29165630 28657218 28982237 28182212 28196395 28231212 26986334 27039689 27289101 26825436 27010000
2484B7010000N52485j23004n97769n14132k15598J46894O67911r11570j070156
$$ 27010000 27562485 27439481 26841712 26327580 26111982 26258876 26926787 26015217 24945061
2475B4945061N47830L82150j28492J94392J30765p16034R9055j04680l20042k68439
$$ 24945061 25492891 25875041 25746549 25940941 26071706 25355672 25454727 25350047 25030005 24761566
2465B4761566j2778R4737j26806K50956l32288m43174K81307L07990j78133J31346
$$ 24761566 24748788 24843525 24716719 24967675 24635387 24192213 24473520 24781510 24603377 24734723
2455B4734723K04896o48644M33237Q8589k80645L09744j71407m47735J47064L25052
$$ 24734723 24939619 24290975 24724212 24812801 24532156 24841900 24670493 24222758 24369822 24694874
2445B4694874q51504k41777K5043M40659l79294k43395q23767k8762P68985L43966
$$ 24694874 23843370 23601593 23626636 24067295 23688001 23444606 22620839 22592077 23361062 23705028
2435B3705028j67504q5112L86991o1095n32880J34032L60427k03478M24724L71433
$$ 23705028 23537524 23452412 23839403 23778308 23245428 23379460 23739887 23536409 23961133 24332566
2425B4332566k25915n25553J80799L8254J13249K64845q9219K95178M99897O41657
$$ 24332566 24106651 23581098 23761897 23800151 23913400 24178245 24089026 24384204 24884101 25525758
2415B5525758o46109J02643K17900o82486P25587M16461o30866r816L61487J52941
$$ 25525758 24879649 24982292 25200192 24517706 25243293 25659754 25028888 25019072 25380559 25533500
2405B5533500j13803k7379j21908N31580N50328l04322K80590P21342L19239k06757
$$ 25533500 25419697 25392318 25270410 25801990 26352318 26047996 26328586 27049928 27369167 27162410
2395B7162410N55161P8104l42489L82132K01860n97733j19285j94350o83381N74044
$$ 27162410 27717571 27795675 27453186 27835318 28037178 27439445 27320160 27125810 26442429 27016473
2385B7016473n99578J76037m9865M12221M04571o54865L34643l56091j48199K99765
$$ 27016473 26416895 26592932 26543067 26955288 27359859 26704994 27039637 26683546 26535347 26835112
2375B6835112m36190k6969J37184o9967l28662L26258N27449r0016N87042M52895
$$ 26835112 26398922 26371953 26509137 26439170 26110508 26436766 26964215 26874199 27461241 27914136
2365B7914136k50701l92980m21879j19078K2870O1082l95328j055643j599Q85290
$$ 27914136 27663435 27270455 26848576 26729498 26752368 26813450 26418122 25362479 25360880 26246170
2355B6246170M11737j31144O52762J15596j83437O28811j27659k48837N0060J39718
$$ 26246170 26657907 26526763 27179525 27295121 27111684 27740495 27612836 27363999 27414059 27553777
2345B7553777L62669p6106l00985K81883O68076k02464L24310O72664J11480L23981
$$ 27553777 27916446 27840340 27539355 27821238 28489314 28286850 28611160 29283824 29395304 29719285
2335B9719285M14122L5355r5228O6406M79584L29426Q5416j054737l43095K77192
$$ 29719285 30133407 30168762 30073534 30139940 30619524 30948950 31034366 29979629 29636534 29913726
2325B9913726o41318j004434L43543k8097j01706N40172j802l9583M59580K70344
$$ 29913726 29272408 28267974 28611517 28583420 28481714 29021886 29020084 28980501 29440081 29710425
2315B9710425L81731Q88603K49786m01421K03986O16454j30793N30565K6430q08007
$$ 29710425 30092156 30980759 31230545 30829124 31033110 31649564 31518771 32049336 32075766 31267759
2305C1267759L60343R79549o8006r8591n32829r49122k42468k27793p02997o49686
$$ 31267759 31628102 32607651 32539645 32441054 31908225 30959103 30716635 30488842 29785845 29136159
2295B9136159J52810N0611j73602L76869J04157n36288O45568Q71003l68839n70973
$$ 29136159 29288969 29339580 29165978 29542847 29647004 29110716 29756284 30627287 30258448 29687475
2285B9687475K09981q1717K49436L73981j49383k59646m31552M9288M4721j90103
$$ 29687475 29897456 29815739 30065175 30439156 30289773 30030127 29598575 29647863 29692584 29502481
2275B9502481r46627k81895P24946k83103p51490J37097n99413q98710l9368o03021
$$ 29502481 28555854 28273959 28998905 28715802 27964312 28101409 27501996 26603286 26563918 25960897
2265B5960897m96638m33815L43562M92823M5451o15864l55169P92130O82623o0757
$$ 25960897 25464259 25030444 25374006 25866829 25912280 25296416 24941247 25733377 26416000 26355243
2255B6355243J01651K72280J37720L30600P1687p72690m26708l4942N64340K39969
$$ 26355243 26456894 26729174 26866894 27197494 27269181 26496491 26069783 26034841 26599181 26839150
2245B6839150R7799k72522m14106k16202j14064M21713Q5371M40451P84019Q02228
$$ 26839150 26936949 26664427 26250321 26034119 25920055 26341768 26427139 26867590 27651609 28453837
2235B8453837J0258l96212J89747P62720o35511n1419k88902j96763p35802k14447
$$ 28453837 28464095 28067883 28257630 29020350 28384839 28333420 28044518 27847755 27111953 26897506
2225B6897506m35006n08031n28045m1021M70001l71449k55527K7841P24910O32527
$$ 26897506 26462500 25954469 25426424 25385403 25855404 25483955 25228428 25256269 25981179 26613706
2215B6613706P01764L79330l07392r2101J98457N27276k97254o00773j24133l86519
$$ 26613706 27315470 27694800 27387408 27295307 27493764 28021040 27723786 27123013 26998880 26612361
2205B6612361k8611J50891j48974M25640R89349N37457K34416P92376J313088
$$ 26612361 26583750 26734641 26585667 27011307 28000656 28538113 28772529 29564905 30877993
2196C0877993J430672J945814J444504O56286O67752K51200m38056n77371j582404
$$ 30877993 32308665 34254479 35698983 36355269 37023021 37274221 36836165 36258794 34676390
2187C4676390j873143j183299r61451j101410j068123l69246j179962r79270K96936
$$ 34676390 32803247 31619948 30658497 29557087 28488964 28119718 26939756 25960486 26257422
2178B6257422k25781n89865M46166J314077M97495M96417j33522p19301q07653
$$ 26257422 26031641 25441776 25887942 27202019 27699514 28195931 28062409 27343108 26535455
2169B6535455j85977q06215r44333m29968p60564o81705J13832q96761j306250
$$ 26535455 26349478 25543263 24598930 24168962 23408398 22726693 22840525 21943764 20637514
2160B0637514j01769p52946j117605J52051k51519n38085j55219J51591M3856
$$ 20637514 20535745 19782799 18665194 18817245 18565726 18027641 17872422 18024013 18067869
2151A8067869k00285Q5852L77409J28310n6611M97606k9443K21017M51574P2512
$$ 18067869 17867584 17953436 18330845 18459155 18402544 18900150 18870707 19091724 19543298 19615810
2141A9615810j010980K05440j28471K70045M75176k39324J30123R45471R39765
$$ 19615810 18604830 18810270 18681799 18951844 19427020 19187696 19317819 20263290 21203055
2132B1203055O06720J139705J379492J218044J513294J544650k15170j029406
$$ 21203055 21809775 22949480 24328972 25547016 27060310 28604960 28389790 27360384
2124B7360384q77419j293067q29660p51389j409342j116996r5048K95299q99852
$$ 27360384 26482965 25189898 24360238 23608849 22199507 21082511 20987463 21282762 20382910
2115B0382910K1062L08155J09836Q37215J154618M07913N74053M57839n898O06008
$$ 20382910 20403972 20712127 20821963 21659178 22813796 23221709 23795762 24253601 24247703 24853711
2105B4853711k73647j431347q88041j213448j651795q74242p00730q74111l90621
$$ 24853711 24580064 23148717 22260676 21047228 19395433 18521191 17820461 16946350 16555729
2096A6555729k76963l26891n22156m99307K83139k86139m63766l59572j60719
$$ 16555729 16278766 15951875 15429719 14930412 15213551 14927412 14463646 14104074 13943355
2087A3943355j62240j38224l45475Q0501J03144l58787l07109k68414J53311J67825
$$ 13943355 13781115 13642891 13297416 13377917 13481061 13122274 12815165 12546751 12700062 12867887
2077A2867887J18137k18419K38641J27070l29344L4012L30039M60451M09624k31583
$$ 12867887 12986024 12767605 13006246 13133316 12803972 12837984 13168023 13628474 14038098 13806515
2067A3806515K1128K36990N68933L58846K11756N52112R11649N69910L50594n48851
$$ 13806515 13827643 14064633 14633566 14992412 15204168 15756280 16667929 17237839 17588433 17039582
2057A7039582r88773m4419n73514p30514o5831k06398k40934k65392k7601k02309
$$ 17039582 16050809 16006390 15432876 14702362 14636531 14430133 14189199 13923807 13896206 13693897
2047A3693897J20443O61040M11487N87226O41164R6723k21881o9614j032487k01316
$$ 13693897 13814340 14475380 14886867 15474093 16115257 16211980 15990099 15920485 14887998 14686682
2037A4686682l07892n84899m65509J44205r22670j386428N25408L48416n24093
$$ 14686682 14378790 13793891 13328382 13472587 12549917 11163489 11688897 12037313 11513220
2028A1513220l68978L61717n76700m32032P03059k45905n11189J67030r59331
$$ 11513220 11144242 11505959 10929259 10497227 11200286 10954381 10443192 10610222 9650891
2019I650891k30602O54756k7373n61786M45433j88148j75155P42915l70501r01418
$$ 9650891 9420289 10075045 10047672 9485886 9931319 9743171 9568016 10310931 9940430 9039012
2009I039012J40833N70321n10336m83345Q31059p1766n50616R57748k74665q92242
$$ 9039012 9179845 9750166 9239830 8756485 9587544 9515778 8965162 9922910 9648245 8756003
1999H756003L18418k47548j8181P77696l61020l87346M45727m0579o46901J77847
$$ 8756003 9074421 8826873 8808692 9586388 9225368 8838022 9283749 9243170 8596269 8774116
1989H774116K71858m79385j65139R59587p78718n23342R72648L7782m28334J97812
$$ 8774116 9045974 8566589 8401450 9361037 8582319 8058977 9031625 9069407 8641073 8838885
1979H838885q06396P1617M39907l32574r25129M97724N48814n46426L89472J78567
$$ 8838885 8032489 8104106 8544013 8211439 7286310 7784034 8332848 7786422 8175894 8354461
1969H354461m37609K07602Q88037p11149n05106K25517l94221j53097Q85752j94273
$$ 8354461 7916852 8124454 9012491 8301342 7796236 8021753 7627532 7474435 8360187 8165914
1959H165914j043141M39373J33459p23651J93801J57414p17981j42624N25786
$$ 8165914 7122773 7562146 7695605 6971954 7165755 7323169 6605188 6462564 6988350
1950F988350j48158K51458l04749k13227K8348L07100J75540L7464p8759k15798
$$ 6988350 6840192 7091650 6786901 6573674 6602022 6909122 7084662 7122126 7043367 6827569
1940F827569j67556K95307k18178m09604N21189L88386L0255m5092o0444l46462
$$ 6827569 6660013 6955320 6737142 6327538 6848727 7237113 7267368 7222276 7161832 6815370
1930F815370K2164N8406l92899L8614M02576O4871m45628l728K97204j36891M30468
$$ 6815370 6837534 6895940 6503041 6541655 6944231 7009102 6563474 6559746 6856950 6720059 7150527
1919G150527l39618n69586K84393j82572k07922p2780k16980K12692O11652J19244
$$ 7150527 6810909 6241323 6525716 6343144 6135222 6062442 5845462 6058154 6669806 6789050
1909F789050m06786j57298j82333K51549J24704L77831L93261j73825m18619K32232
$$ 6789050 6382264 6224966 6042633 6294182 6418886 6796717 7189978 7016153 6597534 6829766
1899F829766L92861j54987j98152N2589K5260l39071K14683l33025n92211K32055
$$ 6829766 7222627 7067640 6869488 6922077 6947337 6608266 6822949 6489924 5897713 6129768
1889F129768j93405l6809J31384m12532k05504J22582k13657q3268K89342m20944
$$ 6129768 5936363 5899554 6030938 5618406 5412902 5535484 5321827 5238559 5527901 5106957
1879E106957K4202j3269l18265l79440L60130K41594R7650l62939j33063n481
$$ 5106957 5131159 5117890 4799625 4420185 4780315 5021909 5119559 4756620 4623557 4618076
1869D618076J05234M40581j67955j43584J76521L84606m40231O2883N26764k31717
$$ 4618076 4723310 5163891 4995936 4852352 5028873 5413479 4973248 5036131 5562895 5331178
1859E331178o5915L98021o92378P0329R8730m391N7145J29692j13601k66754M8358
$$ 5331178 5265263 5663284 4970906 5041235 5139965 5135574 5192719 5322411 5208810 4942056 4990414
1848D990414P948l80520k79618M46448k86169J46286r6871l07597M02060N3921
$$ 4990414 4998362 4617842 4338224 4784672 4498503 4644789 4547918 4240321 4642381 4696302
1838D696302O8098L2629m38943N10419n9145o21284K02508O2023j52205j1427
$$ 4696302 4764400 4797029 4358086 4868505 4809360 4188076 4390584 4452607 4300402 4288975
1828D288975M80310k10268L1699k06124l04303J06879K03336k33881l26159k65064
$$ 4288975 4769285 4559017 4590716 4384592 4080289 4187168 4390504 4156623 3830464 3565400
1818C565400j17348q3399j56625J78012M88487K88084n46716l91901J003300k85491
$$ 3565400 3448052 3364653 3208028 3386040 3874527 4162611 3615895 3223994 4227294 3941803
1808C941803r07150L08940P17664k62403j0827J27511j36471r5426l50102K4878
$$ 3941803 3034653 3343593 4061257 3798854 3788027 3915538 3779067 3683641 3333539 3358417
1798C358417O09543K7626l91477O5865M22778l18686p62877K68195L17938m3968
$$ 3358417 3967960 3995586 3604109 3669974 4092752 3774066 3011189 3279384 3597322 3553354
1788C553354l6143J42571l48341j44643j67814Q77j04000K58870o03243L95161
$$ 3553354 3517211 3659782 3311441 3166798 2998984 2999861 2895861 3154731 2551488 2946649
1778B946649K58142m38099l03834K53827j88782N29466j7907m81683P9047M48579
$$ 2946649 3204791 2766692 2462858 2716685 2527903 3057369 3039462 2557779 2636826 3085405
1768C085405q1530j48030l23434k11001j79837k68454j36481M05446q1086l77185
$$ 3085405 3003875 2855845 2532411 2321410 2141573 1873119 1736638 2142084 2060998 1683813
1758A683813J20856N31424N669q51978q8713O75651l62934j37908K07696r9815
$$ 1683813 1804669 2336093 2341762 1489784 1401071 2076722 1713788 1575880 1783576 1683761
1748A683761j31000j45322J68306K33775p68937J01041O64143j07351j62770l3151
$$ 1683761 1552761 1407439 1575745 1809520 1040583 1141624 1805767 1698416 1535646 1502495
1738A502495O0139j19540K48394n92107K14934l22400L21639J45870M00411m55626
$$ 1502495 1562634 1443094 1691488 1099381 1314315 991915 1313554 1459424 1859835 1404209
1728A404209l65650K09960N28958m50738K20506M68774n27384R8576K01371o71807
$$ 1404209 1038559 1248519 1777477 1326739 1547245 2016019 1488635 1587211 1788582 1116775
1718A116775l79887L93135L35325L0325n54773j85097R01031K47456l83923p27339
$$ 1116775 736888 1130023 1465348 1495673 940900 755803 1656834 1904290 1520367 793028
1708G93028n8237J63914k07881K72006L16863n11048J95799N78847k58840l96239
$$ 793028 734791 898705 690824 962830 1279693 768645 964444 1543291 1284451 888212
1698H88212J24899N76778l20382o77281J09763K14719j79769M29048M0311k70424
$$ 888212 1013111 1589889 1269507 592226 701989 916708 736939 1165987 1206298 935874
1688I35874l52900K83460M82729J90816m80003p14214K04470O70436k21909m33455
$$ 935874 582974 866434 1349163 1539979 1059976 345762 550232 1220668 998759 565304
1678E65304J0997k67188k9700O88314K5253j079298O49986M81688j58361J06448
$$ 565304 576301 309113 279413 967727 992980 -86318 563668 1045356 886995 993443
1668I93443L5995m27922O54615L22612q41532K99961k09478o61311J53386Q80078
$$ 993443 1029438 601516 1256131 1578743 737211 1037172 827694 166383 319769 1199847
1658A199847m93948l84899P67586M45615n40464j97576k73435m502N90069j35014
$$ 1199847 705899 321000 1088586 1534201 993737 796161 522726 518224 1108293 973279
1648I73279M5833J73194k84906p45353O96989L61073r23770o5640M43717Q4467
$$ 973279 1019112 1192306 907400 162047 859036 1220109 296339 230699 674416 758883
1638G58883m56649K64468L31838p7335J71589l07380n38299L93527L06431N50430
$$ 758883 302234 566702 898540 821205 992794 685414 147115 540642 847073 1397503
1628A397503m5069q78943l38962P11710L9355p60532k93J63244M88982M87716
$$ 1397503 1352434 473491 134529 846239 885594 125062 124769 288013 776995 1264711
1618A264711R3375p40976m04882J0987k92553M75318N13930m06138k33069K10481
$$ 1264711 1358086 617110 212228 223215 -69338 405980 919910 513772 280703 491184
1608D91184m42337n4125O79058l85217J69707O35964k70280j39167K30931k68937
$$ 491184 48847 -5278 673780 288563 458270 1094234 823954 684787 915718 646781
1598F46781l17427L45852l55248L04632j46721p34330J75432O18965l71307m05308
$$ 646781 329354 675206 319958 624590 477869 -256461 -81029 537936 166629 -238679
1588b38679M62908O5468q3648m31950o3615L31015J20186j33919j38157J15785
$$ -238679 224229 289697 206049 -225901 -289516 41499 161685 27766 -110391 5394
1578E394K08065M6366q4910J67934m44147L54904N66797j3888p49227j41008N13721
$$ 5394 213459 259825 174915 342849 -101298 253606 820403 806515 57288 -83720 430001
1567D30001P04773j08923p50842l11153p4607O16652L80769m9021l76553j52968
$$ 430001 1134774 1025851 275009 -36144 -110751 505901 886670 837649 461096 308128
1557C08128M86362M69916N3703o22866l89315l12565P7281M46052k11670k16249
$$ 308128 794490 1264406 1318109 695243 305928 -6637 70644 516696 305026 88777
1547H8777J61007j04655J40272K9751k32682k3219L54889L98748j11657L11683
$$ 88777 249784 145129 285401 315152 82470 59251 414140 812888 701231 1012914
1537A012914K70696o56502J26823M41746m539Q6629l55745k14748Q3050M47724
$$ 1012914 1283610 627108 753931 1195677 1191138 1277767 922022 707274 790324 1238048
1527A238048K4569j12104m04181k37690k49593O40703Q643k02867M80305j03494
$$ 1238048 1262617 1150513 746332 508642 259049 899752 908395 705528 1185833 1082339
1517A082339o14688j0996N29638l39907m97186M29201m19143m06362Q13433J23203
$$ 1082339 467651 456655 986293 646386 149200 578401 159258 -247104 566329 689532
1507F89532k48454J53101k7216M1995L86394k85798j16413K75011j40151J57801
$$ 689532 441078 594179 566963 608958 995352 709554 593141 868152 728001 885802
1497H85802M66428l21339o82618J51645L71626L54922l20966p11912N1915N61681
$$ 885802 1352230 1030891 348273 499918 871544 1226466 905500 193588 245503 807184
1487H07184M70339M6378n66673j10920l79409j28017R98233K74218q78907m12670
$$ 807184 1277523 1323901 757228 646308 266899 138882 1137115 1411333 532426 119756
1477A19756O36285L96595m91841N7673J56738k16291Q0295L18891j21020k04461
$$ 119756 756041 1152636 660795 718468 875206 658915 739210 1058101 937081 732620
1467G32620L52079M8224l48991m94308J71421K48702j76661K49720K11385j82490
$$ 732620 1084699 1132923 783932 289624 461045 709747 533086 782806 994191 811701
1457H11701l8716k06922m2198L0264j13912J24862J98753J91530l77486J9451
$$ 811701 772985 566063 523865 554129 440217 565079 763832 955362 577876 597327
1447E97327L01106j1667n7042l37205n93797M74639L50853k05279Q6108o25345
$$ 597327 898433 886766 829724 492519 -101278 373361 724214 518935 605043 -20302
1437b0302n49581M29388J026061m66831p71365L29592O079J640n780k72837l64956
$$ -20302 -569883 -140495 885566 418735 -352630 -23038 -16959 -15319 -21099 -293936 -658892
1426f58892k1788M32056O3953k68630m06324k7273Q82676K49479j07991j16166
$$ -658892 -680680 -248624 -184671 -453301 -859625 -886898 -4222 245257 137266 21100
1416B1100J3075L09390k07482J2879l26436j48730L79869M7664l21025j33505
$$ 21100 34175 343565 136083 148962 -177474 -326204 53665 101329 -219696 -353201
1406c53201K47386L00608J5076P782N3792k46764k5151K37795L58931m74574k41159
$$ -353201 -105815 194793 209869 217651 271443 24679 -472 237323 596254 121680 -119479
1395a19479O01331J56862n19389j99711q0044P7879M41485m05307l62921l72033
$$ -119479 481852 638714 119325 -80386 -160430 -82551 358934 -46373 -409294 -781327
1385g81327K3134M10575P13049k01820o97952M00947N02927k69429n38428j63604
$$ -781327 -758193 -347618 365431 163611 -534341 -133394 369533 100104 -438324 -601928
1375f01928L15859m1220R6510P6861k18844l3742M61151K70394P5512L21918l55651
$$ -601928 -286069 -327289 -230779 -153918 -372762 -406504 54647 325041 400553 722471 366820
1364C66820l11671O15037n50863p30491j11957M78722K28045O9853l38146p08148
$$ 366820 55149 670186 119323 -611168 -723125 -244403 -16358 53495 -284651 -992799
1354i92799O73374K02294j6959j07239m9565M51195k52462p6255l91500j99321
$$ -992799 -319425 -117131 -134090 -241329 -290894 160301 -92161 -168416 -559916 -759237
1344g59237J29358K67867N42114M98492o34849m16675P51313l9492q77199L02399
$$ -759237 -629879 -362012 180102 678594 43745 -372930 378383 338891 -538308 -235909
1334b35909N60775m80432K79574o0337n03669P8212N44907j67145J52627K29630
$$ -235909 324866 -155566 124008 63671 -439998 -361786 183121 15976 168603 398233
1324C98233m14747k31663O46051k24940m61644P8425J16613M44823p8647J63189
$$ 398233 -16514 -248177 397874 172934 -288710 -210285 -93672 351151 272504 435693
1314D35693o74434L34674K26080q1060n5025m24925q8167J35952M23565P3736
$$ 435693 -238741 95933 322013 240953 185928 -238997 -327164 -191212 232353 306089
1304C06089j72525K30779m9733n47581N872Q2956L44388N037J19671K55017l80944
$$ 306089 133564 364343 314610 -232971 -227099 -144143 200245 205282 324953 579970 199026
1293A99026l55545N1875r9408K24764M81315l1818l46483M91600O6238k63997
$$ 199026 -156519 -104644 -204052 20712 502027 470209 123726 615326 681564 417567
1283D17567j54071l54204J95728L6693m11792J29355K14088k50098j45209Q71169
$$ 417567 263496 -90708 105020 141713 -270079 -140724 73364 -176734 -321943 549226
1273E49226J29848r54543J2583L68091N82526m3176Q254k05688j67510K57756
$$ 549226 679074 -275469 -262886 105205 687731 644555 652809 447121 279611 537367
1263E37367k29446M89960k23006o27026K99010Q88908p81871p6609K53183q6318
$$ 537367 307921 797881 574875 -52151 246859 1135767 353896 277287 530470 444152
1253D44152k72015M7789m00028j37584M58177j2739J40325O78615l7051k60449
$$ 444152 172137 219926 -180102 -317686 140491 127752 268077 946692 909641 649192
1243F49192J04573j27217m09290K2167K68682n31012j06959J60986J32384K18005
$$ 649192 753765 626548 217258 239425 508107 -22905 -129864 31122 163506 381511
1233C81511j78779k20066K14843r8619j70508N464R3234j74383j7925L94791L12008
$$ 381511 202732 -17334 197509 98890 -71618 -66154 27080 -147303 -165228 229563 541571
1222E41571l79622M5001q970m89567k66479M62513J35898n12906o5721L1791L02963
$$ 541571 161949 206950 197980 -291587 -558066 -95553 40345 -472561 -538282 -506491 -203528
1211b03528J16557Q5512K44335l55764L26373L31539o004m18959m17631P3239
$$ -203528 -86971 -1459 242876 -112888 213485 545024 539020 120061 -297570 -224331
1201b24331Q52730O7691k36892l9022O9894l35379L38981r6213m89794J01518
$$ -224331 628399 696090 459198 420176 490070 154691 493672 397459 -92335 9183
1191I183p5891M52311L33701J0553l25279N00170j76738m99425J1552L9849o91275
$$ 9183 -66708 385603 719304 729857 404578 904748 728010 228585 240137 279986 -411289
1180d11289P35623L01753m71986j54448K99027J0426j24393K05151k66393j07608
$$ -411289 324334 626087 154101 -347 298680 309106 184713 389864 123471 15863
1170A5863M03205K0180n78332J42610J16695k28988Q5113J98062l37613L90932
$$ 15863 419068 439248 -139084 3526 120221 -108767 -23654 174408 -163205 227727
1160B27727K98329m43335k27108K46245J67212l12227O04921J90666k34314J82389
$$ 227727 526056 82721 -144387 101858 269070 -43157 561764 752430 518116 700505
1150G00505k01894l3940O49992m36596p97273N02289k53925k71231J35343N07227
$$ 700505 498611 464671 1114663 678067 -119206 383083 129158 -142073 -6730 500497
1140E00497k9346o561O2209K7074p34812M58059K31677n28339M94130N0460J8457
$$ 500497 471151 464590 526799 553873 -180939 277120 508797 -19542 474588 525048 543505
1129E43505l7727n8174p2545K8355N64564m94224J61682J82341j0047n60318k7050
$$ 543505 505778 447604 375059 403414 967978 473754 635436 817777 807730 247412 220362
1118B20362K04350m5913k18185M46938P9716j15975K0695j45493K13137J73234
$$ 220362 424712 378799 160614 607552 687268 571293 591988 446495 659632 832866
1108H32866k83563r0670J25113m93859N12539Q04421n92165n35480N73409k72026
$$ 832866 549303 458633 583746 89887 602426 1406847 814682 279202 852611 580585
1098E80585j69189M51560j06988l63403L54417K80794l83108M78206R4707p32476
$$ 580585 411396 862956 755968 392565 746982 1027776 644668 1122874 1217581 485105
1088D85105M24740L73005l9313l28996q6326k74672r3873Q26432l2802P0692M84404
$$ 485105 909845 1282850 1243537 914541 828215 553543 459670 1286102 1253300 1323992 1808396
1077A808396l6223K89616L76740k7276k69160m38469l58657L20267M07441K56758
$$ 1808396 1772173 2061789 2438529 2411253 2142093 1703624 1344967 1665234 2072675 2329433
1067B329433j79054O9358M0137k79082M28165M65739K47059P5417j41167K56019
$$ 2329433 2150379 2219737 2259874 1980792 2408957 2874696 3121755 3197172 3056005 3312024
1057C312024r0019Q5688J41497m42491l17199P71193J68923j98407l15577J5544
$$ 3312024 3222005 3307693 3449190 3006699 2689500 3460693 3629616 3431209 3115632 3131176
1047C131176K54775N2788J73674l51019n73449L77065M32636J32079Q5329K17740
$$ 3131176 3385951 3438739 3612413 3261394 2687945 3065010 3497646 3629725 3715054 3932794
1037C932794o35468O33363O40912L7277j26297M4284n0645P1381O38668M70560
$$ 3932794 3297326 3930689 4571601 4608878 4482581 4526865 4476220 4547601 5186269 5656829
1027E656829O4529N6730j80778N42994P07640j30970j99562Q71693K24530l42298
$$ 5656829 5721358 5778088 5597310 6140304 6847944 6716974 6517412 7389105 7613635 7271337
1017G271337L20609J002410K26422L12751O69419M59901J69124L44980N86336
$$ 7271337 7591946 8594356 8820778 9133529 9802948 10262849 10431973 10776953 11363289
1008A1363289Q11403O06957J059811Q20989Q48030Q61201J096722O93468J218064
$$ 11363289 12174692 12781649 13841460 14662449 15510479 16371680 17468402 18161870 19379934
999A9379934J631297K332038K202383K474386J983516J430774J321661K166166
$$ 19379934 21011231 23343269 25545652 28020038 30003554 31434328 32755989 34922155
991C4922155K678176L689720M083181M973030O526566P703176J0241441J3697658
$$ 34922155 37600331 41290051 45373232 50346262 56872828 64576004 74817445 88515103
983H8515103J7582086K3670485L1195210M0602183J0117264m9426844m5461018
$$ 88515103 106097189 129767674 160962884 201565067 211682331 162255487 116794469
976A16794469k5218654j6100798j1473212q882717o659659n514564m712679l688873
$$ 116794469 91575815 75475017 64001805 55119088 48459429 42944865 38232186 34543313
968C4543313k330090j672138j253447j069726p82998j335033k654073k395164
$$ 34543313 32213223 30541085 29287638 28217912 27434914 26099881 23445808 21050644
960B1050644j327269j209956j244126j416067k47409j147113p13105m42921j296479
$$ 21050644 19723375 18513419 17269293 15853226 15605817 14458704 13745599 13302678 12006199
951A2006199j007189l89105l42927k52672o10812r34306K48349L24544K9864n9681
$$ 12006199 10999010 10609905 10266978 10014306 9403494 8469188 8717537 9042081 9071945 9012264
941I012264m65840p09400m9777M78489l70000r44400o27699M56377j98504m8965
$$ 9012264 8546424 7837024 7787247 8265736 7895736 6951336 6323637 6780014 6581510 6532545
931F532545m60885l35839j4995j63654m28328N526M36321n49364m10780N40643
$$ 6532545 6071660 5735821 5720826 5557172 5128844 5134370 5570691 5021327 4610547 5151190
921E151190k81292l98085M70452m23788k79697J28054K41636R1784j63696o07301
$$ 5151190 4869898 4471813 4942265 4518477 4238780 4366834 4608470 4700254 4536558 3929257
911C929257j26242o6296l7666K11602K79594k62323p06672P7251J99476n94027
$$ 3929257 3803015 3736719 3699053 3910655 4190249 3927926 3221254 3298505 3497981 2903954
901B903954J83065J09743o14372p839J83857l89954l61540N74520j53283J88452
$$ 2903954 3087019 3196762 2582390 2574551 2758408 2368454 2006914 2581434 2428151 2616603
891B616603L04840l34675p13835R91311M25952q11776k53633O0951m02115N62909
$$ 2616603 2921443 2586768 1872933 2864244 3290196 2478420 2224787 2285738 1883623 2446532
881B446532l8017o96591o80049L5273M1325O18166p5376n52603r1737N01659j87371
$$ 2446532 2408515 1711924 1031875 1067148 1108473 1726639 1651263 1098660 1006923 1508582 1321211
870A321211o6465M94758M65029m75426j32132N92408n45294m17652L42184p7252
$$ 1321211 1254746 1749504 2214533 1739107 1606975 2199383 1654089 1236437 1578621 1501369
860A501369N0628n90617q2607L5400K65546P7907l83050m5749N86901K46041k23295
$$ 1501369 1551997 961380 878773 914173 1179719 1257626 874576 828827 1415728 1661769 1438474
849A438474p79710n95224Q31224J34843l96763K19510L48958l50155k24428K70860
$$ 1438474 658764 63540 894764 1029607 632844 852354 1201312 851157 626729 897589
839H97589j02833p37598L01123L86170l8090j26555J98729j04599R5280Q5243
$$ 897589 794756 57158 358281 744451 706361 579806 778535 673936 769216 854459
829H54459p7918J14875J01890k57073k17431J87727m52966n7758L41755J78686
$$ 854459 776541 891416 993306 736233 518802 706529 253563 195805 537560 716246
819G16246m09979j92008Q52456j42903o96585J45718m12399L34135M40807n99230
$$ 716246 306267 114259 966715 823812 127227 272945 -139454 194681 635488 36258
809C6258N6290L4660K88234J46803N36629o91980k20933j91421K18688k40494
$$ 36258 92548 127208 415442 562245 1098874 406894 185961 -5460 213228 -27266
799b7266m36865j6198L18543R5745l8397K90820j17316Q8056N40166J12976r67
$$ -27266 -464131 -480329 -161786 -66041 -104438 186382 69066 157122 697288 810264 809297
788H09297L23139l77575l13689L16971j57929m55452J87689j7068j7454L06281
$$ 809297 1132436 754861 441172 758143 600214 144762 332451 315383 297929 604210
778F04210j27322l57407n2641N40706k90795m13496O9114j32853q1617K90081
$$ 604210 476888 119481 66840 607546 316751 -96745 -27631 -160484 -242101 47980
768D7980N0219l53263K69159o1842j40531M1041J77260N2560K7864J09551j63796
$$ 47980 98199 -255064 14095 -47747 -188278 -147237 30023 82583 110447 219998 56202
757E6202L5422J84909P1279k49872M19378k33508p5598k21622Q3254j98594j39625
$$ 56202 91624 276533 347812 97940 517318 283810 208212 -13410 69844 -128750 -268375
746b68375k44128J19691P5307J27714L47244m60354k59011L09676j50131K66979
$$ -268375 -512503 -392812 -317505 -189791 157453 -302901 -561912 -252236 -402367 -135388
736a35388M5470k03512j96600j68083K59640m13703P8991L07437L0528k16916
$$ -135388 -89918 -293430 -490030 -658113 -398473 -812176 -733185 -425748 -395220 -612136
726f12136P67920k51131k62266K31447o2593m15631O69565J66118o05617J42794
$$ -612136 155784 -95347 -357613 -126166 -188759 -604390 65175 231293 -374324 -231530
716b31530N34986j7151k58576l8766k89457n3834O66536p3716k56886L20403l90020
$$ -231530 303456 286305 27729 -11037 -300494 -354328 312208 238492 -18394 302009 -88011
705h8011J52871P14032o33074l79042M42907K53730j35978J53382N9109L0552
$$ -88011 64860 778892 145818 -233224 209683 463413 327435 480817 539926 570478
695E70478j44747J08987k723L34287J48983l06302o05507r0088r6323k14714N28273
$$ 570478 425731 534718 531995 866282 1015265 708963 103456 13368 -82955 -297669 230604
684B30604j6935p9691K02683J57430k76704l10934K98762j34217L3839k31076
$$ 230604 213669 133978 336661 494091 217387 -93547 205215 70998 104837 -126239
674a26239k39984N31691J65865n98123L28738K09017l94511m18170L10546K380
$$ -126239 -366223 165468 331333 -266790 61948 270965 -123546 -541716 -231170 -228790
664b28790k78079Q89340l29260p90762K95487O33390k76362l1123M29218j33738
$$ -228790 -506869 382471 53211 -737551 -442064 191326 -85036 -116159 313059 179321
654A79321o07167k5409L52875j81827l96599j16268m2207N62142m38001j76437
$$ 179321 -427846 -453255 -100380 -282207 -678806 -795074 -837281 -275139 -713140 -889577
644h89577Q44324l61436l68922N44723N70692j024861J93475L76544m158J12447
$$ -889577 -45253 -406689 -775611 -230888 339804 -685057 -491582 -115038 -119196 -6749
634f749l17885n4428M8487O989Q2803j95419N4357n843J85348N86148k54383n87013
$$ -6749 -324634 -379062 -330575 -323586 -240783 -436202 -381845 -387688 -202340 383808 129425 -457588
622d57588k4009N30692o64616q3582R0195L69156j32442M33720j91785p01281
$$ -457588 -481597 49095 -615521 -699103 -608908 -239752 -372194 61526 -130259 -831540
612h31540N1881O43380K9996p06027o0887J85436M24642M1232k85370Q1178O0973
$$ -831540 -779659 -136279 -106283 -812310 -873197 -687761 -263119 -221887 -507257 -426079 -365106
601c65106j68156k88066O82248m6901q29082Q95378O13883j014723J03786J2487
$$ -365106 -533262 -821328 -139080 -185981 -1015063 -119685 494198 -520525 -416739 -404252
591d04252m67174K49749J64208q29720k0271L00062M57860J58045K33010m24014
$$ -404252 -871426 -621677 -457469 -1287189 -1307460 -1007398 -549538 -391493 -158483 -582497
581e82497n34304K86565L22417o8731K71307K81712M1975J27659N6476l33089
$$ -582497 -1116801 -830236 -507819 -576550 -305243 -23531 18444 146103 202579 -130510
571a30510m08711J46424J9397n3998N7416k21164K93090p2746k92042j75348J07607
$$ -130510 -539221 -392797 -373400 -427398 -369982 -591146 -298056 -370802 -662844 -838192 -730585
560g30585M9911j26493N97057R860n54392j25304O16487J42745o47901k30974
$$ -730585 -680674 -807167 -210110 -200250 -754642 -879946 -263459 -120714 -768615 -999589
550i99589Q68766k41735m54299L53210K95878n30140P7922J10102O20234l18431
$$ -999589 -130823 -372558 -826857 -473647 -177769 -707909 -629987 -519885 100349 -218082
540b18082m19796l23037P56036k96239k41636j19817J97420r2622J85045J95720
$$ -218082 -637878 -960915 -204879 -501118 -742754 -862571 -665151 -757773 -572728 -377008
530c77008m7827m00477J85426M28540k46590R1884j01747m79708J23836Q09548
$$ -377008 -424835 -825312 -639886 -211346 -457936 -366052 -467799 -947507 -823671 -14123
520a4123k42300k86939L66297Q1315J34098K67988p53580l54819K80973k13369
$$ -14123 -256423 -543362 -177065 -95750 38348 306336 -447244 -802063 -521090 -734459
510g34459k75192O69633j6807m24908M26513j8746k08610p3297k24177M6618p2113
$$ -734459 -1009651 -340018 -356825 -781733 -355220 -373966 -582576 -655873 -880050 -833432 -905545
499i05545j25278L55160N02004K3141k85087k9349J84217j59715J6540J48589
$$ -905545 -1030823 -675663 -173659 -150518 -435605 -464954 -280737 -440452 -423912 -275323
489b75323L46596o56128k23319N65067K32819n60520m44817N92977P98310j54848
$$ -275323 71273 -584855 -808174 -243107 -10288 -570808 -1015625 -422648 375662 220814
479B20814n92129j66519J54846L66307P5496r4396j27718k74751k0400P19212
$$ 220814 -371315 -537834 -382988 -16681 58815 -35581 -163299 -438050 -458450 260762
469B60762l07355j573829N59304L49962k18951M19617J50743k73327N215M09838
$$ 260762 -46593 -1620422 -1061118 -711156 -930107 -510490 -359747 -633074 -627859 -218021
459b18021j8751q36138J23791N73492l35834L2884l40276j03787O01892J91014
$$ -218021 -236772 -1072910 -949119 -375627 -711461 -678577 -1018853 -1122640 -520748 -329734
449c29734o5813P3720P8249n22205M24911M54981o69749k62746K16741l5137M92998
$$ -329734 -395547 -321827 -243578 -765783 -340872 114109 -555640 -818386 -601645 -636782 -143784
438a43784j08047m89028j36621j03823L40141K73317k10808l79167K63901N66334
$$ -143784 -251831 -740859 -877480 -981303 -641162 -367845 -578653 -957820 -693919 -127585
428a27585J97978q16718M0570J65978k49281M58219k6671o34188j85777M11461
$$ -127585 70393 -746325 -705755 -539777 -789058 -330839 -357510 -991698 -1177475 -766014
418g66014L54332p255p1764R6996o3990J84076p6302p21771O1285R3398M35013
$$ -766014 -411682 -418937 -490701 -393705 -457695 -273619 -349921 -1071692 -1010407 -917009 -481996
407d81996Q8975K3911k21596j86546L45110k97549o42850O20933N72078N1250
$$ -481996 -393021 -369110 -590706 -777252 -432142 -729691 -1372541 -751608 -179530 -128280
397a28280K89238l73471n88851r8871P31147j88473n57026k14476J64791J83474
$$ -128280 160958 -212513 -801364 -900235 -169088 -357561 -914587 -1129063 -964272 -780798
387g80798M72566m98676r4858N61700K22928j02280L6488l97486n63356K99610
$$ -780798 -308232 -806908 -901766 -340066 -117138 -219418 -182930 -580416 -1143772 -844162
377h44162Q10565n34538j34373L62908n48275O05851O09488m58889l06843N0346
$$ -844162 -33597 -568135 -702508 -339600 -887875 -282024 327464 -131425 -438268 -387922
367c87922m2633J0436L42303o80055m07606N33078M31931k51780k59512j63172
$$ -387922 -430555 -420119 -77816 -757871 -1165477 -632399 -200468 -452248 -711760 -874932
357h74932K32811P01519l71939l72644R4473Q672j79738M01304L59755m52935
$$ -874932 -642121 59398 -312541 -685185 -590712 -582040 -761778 -360474 -719 -453654
347d53654j78644M70135n72396k71754J79957o58969M70874O03962m54568k25375
$$ -453654 -632298 -162163 -734559 -1006313 -826356 -1485325 -1014451 -410489 -865057 -1090432
337a090432M29490J04827k62422N75784l24978l58226K79648j35483j27616K34627
$$ -1090432 -660942 -556115 -818537 -242753 -567731 -925957 -646309 -781792 -909408 -674781
327f74781l16308M02604J35322j40922l24209K7370J45415J36562k20201R253
$$ -674781 -991089 -588485 -453163 -594085 -918294 -890924 -745509 -608947 -829148 -819895
317h19895k20302m84258L92120J67509j9854M72539l01124j53178O64865J91521
$$ -819895 -1040197 -1524455 -1132335 -964826 -984680 -512141 -813265 -966443 -301578 -110057
307a10057n83799k60857m21304M20769L53780O9390k88598j45838J51591L435
$$ -110057 -693856 -954713 -1376017 -955248 -601468 -532078 -820676 -966514 -814923 -811488
297h11488M81522j33882o12837M7214J91810R9798R9872k06088J21637N53425
$$ -811488 -329966 -463848 -1076685 -1029471 -837661 -737863 -637991 -844079 -722442 -169017
287a69017j28687j85964m92769J846K91875J19827k07236J08169j9247j69313
$$ -169017 -297704 -483668 -976437 -974591 -682716 -562889 -770125 -661956 -681203 -850516
277h50516j58467P6045P2762q6559L21238j96126J30600n31748J19042R1053L3800
$$ -850516 -1008983 -932938 -860176 -946735 -625497 -821623 -691023 -1222771 -1103729 -1012676 -978876
266i78876r7683K60569q2332j65328j85450o1801J00470L9564L83874L87303k00507
$$ -978876 -1076559 -815990 -898322 -1063650 -1249100 -1310901 -1210431 -1170867 -786993 -399690 -600197
255f00197l3603k56833K64807L50682j01316j36468J28634L2095k88186j83245
$$ -600197 -633800 -890633 -625826 -275144 -376460 -512928 -384294 -352199 -640385 -823630
245h23630J14580m52485L07430M55659l88459j0545R1111P8578j83599O8695n422
$$ -823630 -709050 -1161535 -854105 -398446 -786905 -797450 -706339 -627761 -811360 -742665 -748087
234g48087o987j20373J27720J71500j74504L21072q179J79617n50904j85977O98272
$$ -748087 -755074 -875447 -747727 -576227 -750731 -429659 -437838 -258221 -809125 -995102 -296830
223b96830k64839n22826L98187J55409m42958j11048k6626L49261M30547o09879
$$ -296830 -561669 -1084495 -686308 -530899 -973857 -1084905 -1111531 -762270 -331723 -941602
213i41602j52446k436N13959m55521j3340J41528j06369L12523J89430j56268
$$ -941602 -1094048 -1096484 -582525 -1038046 -1051386 -909858 -1016227 -703704 -514274 -670542
203f70542R996k70194j06690N1537K45641j24966k28370J68672L360N0836K46513
$$ -670542 -660546 -930740 -1037430 -985893 -740252 -865218 -1093588 -924916 -921556 -870720 -624207
192f24207K30672r36950M52319L07275m07876m49551j99310J99213J29043K48828
$$ -624207 -393535 -1330485 -878166 -570891 -978767 -1428318 -1627628 -1428415 -1299372 -1050544
182a050544l6926o0060k42508K5706M23981j09342m80188R4103P62912k11689
$$ -1050544 -1087470 -1147530 -1390038 -1364332 -940351 -1049693 -1529881 -1435778 -672866 -884555
172h84555m26758K36513N3140q8500K01382k07248M2325J98430q4533n19950O7000
$$ -884555 -1311313 -1074800 -1021660 -1110160 -908778 -1116026 -1073701 -875271 -959804 -1479754 -1412754
161a412754j65029K53655O83554M3754n91685P9420M20763m9980o74426K71278
$$ -1412754 -1577783 -1324128 -640574 -596820 -1188505 -1109085 -688322 -738302 -1412728 -1141450
151a141450K14981Q1254q1996m7995J88286r6823m63224J11541N83039j59222
$$ -1141450 -926469 -845215 -927211 -975206 -786920 -883743 -1346967 -1235426 -652387 -811609
141h11609Q6585l16773j39335P06109l52737q64052K88420L14409j84267J47957
$$ -811609 -725024 -1041797 -1181132 -475023 -827760 -1691812 -1403392 -1088983 -1273250 -1125293
131a125293L86868k60688l20877J49861k48823O66867K66245o63968j93158N47005
$$ -1125293 -738425 -999113 -1319990 -1170129 -1418952 -752085 -485840 -1149808 -1342966 -795961
121g95961k86102k59854J76146p2574o0891L93119J56958n74588j41852j04244
$$ -795961 -1082063 -1341917 -1165771 -1238345 -1299236 -906117 -749159 -1323747 -1465599 -1569843
111a569843Q2464L05480K51677p72108O6489Q67261j43843k75567K8564m11275
$$ -1569843 -1487379 -1181899 -930222 -1702330 -1635841 -768580 -912423 -1187990 -1159426 -1570701
101a570701K97616L14983k71976J65764N2239k59804L7535K90258M9166k61377
$$ -1570701 -1273085 -958102 -1230078 -1064314 -1012075 -1271879 -1234344 -944086 -894920 -1156297
91a156297K00767M35054j46799k66615K15552k15415J71715j2905m31478Q7790
$$ -1156297 -955530 -520476 -667275 -933890 -718338 -933753 -762038 -774943 -1206421 -1118631
81a118631J72515j5302K21741O2152o41764J63811l1982n791N7320J2195o6889
$$ -1118631 -946116 -961418 -739677 -677525 -1319289 -1155478 -1187460 -1193251 -1135931 -1123736 -1190625
70a190625O9252R2763l23638k51159L28266K28477j41403m3985q3227k28189M0601
$$ -1190625 -1121373 -1028610 -1352248 -1603407 -1275141 -1046664 -1188067 -1232052 -1315279 -1543468 -1502867
59a502867K09506J31690J0363l27684j92852J97437M68345K33586k93629q0361
$$ -1502867 -1293361 -1161671 -1151308 -1478992 -1671844 -1474407 -1006062 -772476 -1066105 -1146466
49a146466k42847p5788K31137Q5814J58172j38876K63409j23828K05149m82520
$$ -1146466 -1389313 -1465101 -1233964 -1148150 -989978 -1128854 -865445 -989273 -784124 -1266644
39a266644k65700R4459M13615j66249l88657J50965Q1331k4682L68146J26913
$$ -1266644 -1532344 -1437885 -1024270 -1190519 -1579176 -1428211 -1346880 -1371562 -1003416 -876503
29h76503l31959J24289J6246l97377K7857K38745k11811k2119M8106m17244l9307
$$ -876503 -1208462 -1084173 -1067927 -1465304 -1437447 -1198702 -1410513 -1432632 -1384526 -1801770 -1841077
18a841077M75137K5620R0411k0757j29467j06031J97516O6441j15168K03977N8867
$$ -1841077 -1365940 -1340320 -1249909 -1270666 -1400133 -1506164 -1308648 -1242207 -1357375 -1153398 -1094531
7a094531r1316N2001J79504m15340l3139J88995j75786
$$ -1094531 -1185847 -1133846 -954342 -1369682 -1402821 -1213826 -1389612
0a389612
$$ -1389612
$$ Imaginary data points
##PAGE= N=2
##DATA TABLE= (X++(I..I)), XYDATA
16383e406557O0125J31279O70251k85722k84255L54321k0077J88955P2673J56041
$$ -5406557 -5346432 -5215153 -4544902 -4830624 -5114879 -4760558 -4780635 -4591680 -4519007 -4362966
16373d362966J98868l56861K45960J95911k36091n4535J72548J72803K0226J00632
$$ -4362966 -4164098 -4520959 -4274999 -4079088 -4315179 -4369714 -4197166 -4024363 -4004137 -3903505
16363c903505q1762P4317K37792K2909P5824M93842k26276k81268K76565J21828
$$ -3903505 -3985267 -3910950 -3673158 -3650249 -3574425 -3080583 -3306859 -3588127 -3311562 -3189734
16353c189734J30215L12443K09050j76583j01006l51294K81032J10406K21070
$$ -3189734 -3059519 -2747076 -2538026 -2714609 -2815615 -3166909 -2885877 -2775471 -2554401
16344b554401J24515j69166M101n78N0968M77473k9179l94861R0813L38619K14441
$$ -2554401 -2429886 -2599052 -2594951 -2595529 -2544561 -2067088 -2096267 -2491128 -2400315 -2061696 -1847255
16333a847255J08425k96932j85603L82766M55324k02648k77879j55880k04105
$$ -1847255 -1738830 -2035762 -2221365 -1838599 -1383275 -1585923 -1863802 -2019682 -2223787
$$ [...]
##END NTUPLES=NMR SPECTRUM
##END=
