##TITLE=1H_CA-8816-1
 CDCl3,8 sc, 
 2.02.2021
##JCAMPDX= 6.0         $$ Bruker NMR JCAMP-DX V2.0
##DATA TYPE= NMR SPECTRUM
##DATA CLASS= NTUPLES
##ORIGIN= UXNMR, Bruker Analytische Messtechnik GmbH
##OWNER= root
$$ XWIN-NMR		Version 3.5
$$ Tue Feb  2 10:52:15 2021 Russian Standard Time (UT+4h)  she@DPX200
##.OBSERVE FREQUENCY= 200.1315066352
##.OBSERVE NUCLEUS= ^1H
##.ACQUISITION MODE= SIMULTANEOUS
##.ACQUISITION SCHEME= undefined
##.AVERAGES= 8
##.DIGITISER RES= 18
##SPECTROMETER/DATA SYSTEM= spect
##.PULSE SEQUENCE= zg30
##.SOLVENT NAME= CDCl3
##.SHIFT REFERENCE= (INTERNAL, CDCl3, 0, 15.9512)
##AUDIT TRAIL= $$ (NUMBER, WHEN, WHO, WHERE, WHAT)
$$ ##TITLE= Audit trail, XWIN-NMR		Version 3.5
$$ ##JCAMPDX= 5.01
$$ ##ORIGIN= Bruker BioSpin GmbH
$$ ##OWNER= she
$$ F:/spectra/data/she/nmr/H-F/1/pdata/1/auditp.txt
$$ ##AUDIT TRAIL=  $$ (NUMBER, WHEN, WHO, WHERE, WHAT)
(   1,<2021-02-02 10:50:01.18 +0400>,<she>,<DPX200>,
      <created by zg, POWCHK disabled, PULCHK disabled
       configuration hash MD5:
       00 E9 B6 7A A2 85 ED C7 34 08 36 98 17 FE 4E 26
       data hash MD5: 16K
       48 8E 7E 98 DB 04 70 E3 78 F2 46 E7 21 2A A8 FA>)
(   2,<2021-02-02 10:50:05.17 +0400>,<she>,<DPX200>,
      <Start of raw data processing
       efp BC_mod = 2 LB = 0.24 FT_mod = 6 PKNL = 1 PHC0 = -10766.04 PHC1 = 19.60095 SI = 16K 
       data hash MD5: 16K
       0F ED 8C 90 AE BC 42 C8 71 ED 94 42 57 DF C4 55>)
(   3,<2021-02-02 10:50:43.89 +0400>,<she>,<DPX200>,
      <pk PHC0 = -151.1039 PHC1 = -8.799998 
       data hash MD5: 16K
       B7 11 07 2C DA 9A DC 9A 46 8C 1C 3B 08 84 DF BD>)
(   4,<2021-02-02 10:50:47.43 +0400>,<she>,<DPX200>,
      <abs ABSG = 5 
       data hash MD5: 16K
       4D 14 AB 85 38 3E 52 B4 48 5D BC B1 24 F2 4B 58>)
$$ ##END=
$$ 
$$ hash MD5
$$ 28 35 B5 9F AE DB 2E 1E 01 72 E2 10 16 31 EA 85
##$RELAX= 
##$RELAX= 
##$RELAX= 
##$RELAX= 
##$RELAX= 
##$RELAX= 
$$ Bruker specific parameters
$$ --------------------------
##$DU= <F:/spectra>
##$EXPNO= 1
##$NAME= <H-F>
##$PROCNO= 1
##$TYPE= <nmr>
##$USER= <she>
##$AMP= (0..31)
100 100 100 100 100 100 100 100 100 100 100 100 100 100 100 100 100 100 
100 100 100 100 100 100 100 100 100 100 100 100 100 100 
##$AQSEQ= 0
##$AQ_mod= 1
##$AUNM= <au_zg>
##$AUTOPOS= <>
##$BF1= 200.13
##$BF2= 200.13
##$BF3= 200.13
##$BF4= 200.13
##$BF5= 200.13
##$BF6= 200.13
##$BF7= 200.13
##$BF8= 200.13
##$BYTORDA= 1
##$CFDGTYP= 0
##$CFRGTYP= 5
##$CHEMSTR= <none>
##$CNST= (0..31)
1 1 145 1 1 1 1 1 1 1 1 1 1 1 1 1 1 1 1 1 1 1 1 1 1 1 1 1 1 1 1 1 
##$CPDPRG= <>
##$CPDPRG1= <>
##$CPDPRG2= <>
##$CPDPRG3= <>
##$CPDPRG4= <mlev>
##$CPDPRG5= <mlev>
##$CPDPRG6= <mlev>
##$CPDPRG7= <mlev>
##$CPDPRG8= <mlev>
##$CPDPRGB= <>
##$CPDPRGT= <>
##$D= (0..31)
0 1.2 0 0 0 0 0 0 0 0.06 0 0.03 0 0 0 0 0.0002 0 0 0 0 0 0 0 0 0 0 0 0 
0 0 0 
##$DATE= 1612248600
##$DBL= (0..7)
120 120 120 120 120 120 120 120 
##$DBP= (0..7)
150 150 150 150 150 150 150 150 
##$DBP07= 0
##$DBPNAM0= <>
##$DBPNAM1= <>
##$DBPNAM2= <>
##$DBPNAM3= <>
##$DBPNAM4= <>
$$ [...]
##$SUBNAM3= <"">
##$SUBNAM4= <"">
##$SUBNAM5= <"">
##$SUBNAM6= <"">
##$SUBNAM7= <"">
##$SUBNAM8= <"">
##$SUBNAM9= <"">
##$SW= 16.9725356469052
##$SWIBOX= (0..15)
0 0 2 0 0 0 0 0 0 0 0 0 0 0 0 0 
##$SW_h= 3396.73913043478
##$TD= 16384
##$TD0= 1
##$TE= 0
##$TE2= 300
##$TE3= 300
##$TEG= 300
##$TL= (0..7)
0 120 120 120 120 120 120 120 
##$TP= (0..7)
150 150 150 150 150 150 150 150 
##$TP07= 0
##$TPNAME0= <>
##$TPNAME1= <>
##$TPNAME2= <>
##$TPNAME3= <>
##$TPNAME4= <>
##$TPNAME5= <>
##$TPNAME6= <>
##$TPNAME7= <>
##$TPOAL= (0..7)
0.5 0.5 0.5 0.5 0.5 0.5 0.5 0.5 
##$TPOFFS= (0..7)
0 0 0 0 0 0 0 0 
##$TUNHIN= 0
##$TUNHOUT= 0
##$TUNXOUT= 0
##$USERA1= <user>
##$USERA2= <user>
##$USERA3= <user>
##$USERA4= <user>
##$USERA5= <user>
##$V9= 5
##$VALIST= <valist>
##$VCLIST= <CCCCCCCCCCCCCCC>
##$VD= 0
##$VDLIST= <DDDDDDDDDDDDDDD>
##$VPLIST= <PPPPPPPPPPPPPPP>
##$VTLIST= <TTTTTTTTTTTTTTT>
##$WBST= 1024
##$WBSW= 4
##$XGAIN= (0..3)
0 0 0 0 
##$XL= 0
##$YL= 0
##$YMAX_a= 398998
##$YMIN_a= -489445
##$ZGOPTNS= <>
##$ZL1= 120
##$ZL2= 120
##$ZL3= 120
##$ZL4= 120
##$ABSF1= 15.9761
##$ABSF2= -0.996562
##$ABSG= 5
##$ABSL= 3
##$ALPHA= 0
##$AQORDER= 0
##$ASSFAC= 0
##$ASSFACI= 0
##$ASSFACX= 0
##$ASSWID= 0
##$AUNMP= <proc_1d>
##$AZFE= 0.1
##$AZFW= 0.1
##$BCFW= 0
##$BC_mod= 2
##$BYTORDP= 0
##$COROFFS= 0
##$CY= -3
##$DATMOD= 1
##$DC= 0
##$DFILT= <>
##$DTYPP= 0
##$F1P= 0
##$F2P= 0
##$FCOR= 1
##$FTSIZE= 16384
##$FT_mod= 6
##$GAMMA= 0
##$GB= 0
##$INTBC= 1
##$INTSCL= 2.992141e-10
##$ISEN= 128
##$LB= 0.24
##$LEV0= 0
##$LPBIN= 0
##$MAXI= 10000
##$MC2= 0
##$MEAN= 0
##$ME_mod= 0
##$MI= 1.114404
##$NCOEF= 0
##$NC_proc= -6
##$NLEV= 6
##$NOISF1= 3.799351
##$NOISF2= 2.8
##$NSP= 0
##$NTH_PI= 0
##$NZP= 0
##$OFFSET= 15.95124
##$PC= 1
##$PHC0= -10917.14
##$PHC1= 10.80095
##$PH_mod= 1
##$PKNL= yes
##$PPARMOD= 0
##$PSCAL= 0
##$PSIGN= 0
##$REVERSE= no
##$SF= 200.130012682968
##$SI= 16384
##$SIGF1= 3
##$SIGF2= 2
##$SINO= 5.538805
##$SIOLD= 16384
##$SREGLST= <1H.CDCl3>
##$SSB= 0
##$STSI= 16384
##$STSR= 0
##$SW_p= 3396.73913043478
##$SYMM= 0
##$S_DEV= 0
##$TDeff= 16384
##$TDoff= 0
##$TI= <>
##$TILT= no
##$TM1= 0
##$TM2= 0
##$TOPLEV= 0
##$USERP1= <user>
##$USERP2= <user>
##$USERP3= <user>
##$USERP4= <user>
##$USERP5= <user>
##$WDW= 1
##$XDIM= 16384
##$YMAX_p= 320623921
##$YMIN_p= -236134
$$ End of Bruker specific parameters
$$ ---------------------------------
##NTUPLES= NMR SPECTRUM
##VAR_NAME=  FREQUENCY,     SPECTRUM/REAL,   SPECTRUM/IMAG
##SYMBOL=    X,             R,               I
##VAR_TYPE=  INDEPENDENT,   DEPENDENT,       DEPENDENT
##VAR_FORM=  AFFN,          ASDF,            ASDF
##VAR_DIM=   16384,         16384,           16384
##UNITS=     HZ,            ARBITRARY UNITS, ARBITRARY UNITS
##FACTOR=    0.207333158178281, 1,           1
##FIRST=     3192.32178063052, 0,            0
##LAST=      -204.417349804262, 0,           0
##MIN=       -204.417349804262, -236134,     0
##MAX=       3192.32178063052, 320623921,    0
$$ Real data points
##PAGE= N=1
##DATA TABLE= (X++(R..R)), XYDATA
$$ [...]
$$ plain form
5499 -101468 -111764 -60679 -107907 -62926 -41502 32883 41245 82336 42391 28897 40063 -8789
5487 -8789 10924 -4028 -25802 -103027 -86569 -187496 -148740 -75577 -75610 -103794 -21697 -23934 -64334
5474 -64334 21041 223 82494 92849 74324 42176 58993 36507 8413 36722 15805 -48299
5462 -48299 -69782 -26675 -54079 40940 -46987 -3414 26603 -69813 29307 59628 -4244 -12974
5450 -12974 6182 -83940 -80303 -44469 -121020 -102602 -43271 -102926 -36513 25658 14983 40450
5438 40450 24649 -13759 19811 19726 12004 -13523 24108 235 3593 -10311 13346 61748 76462
5425 76462 135654 176590 183047 123252 116350 120678 122249 87353 15611 -7472 -28837 -122080 -185766
5412 -185766 -97188 -161392 -132278 -70660 -61255 10105 56631 66377 82607 132594 59598 85954
$$ packed form
5499a01468j0296N1085m7228M4981K1424P4385Q362M1091l9945j3494J1166m8852
5487h789J9713j4952k1774p7225J6458j00927L8756P3163l3k8184Q2097k237m0400
5474f4334Q5375k0818Q2271J0355j8525l2148J6817k2486k8094K8309k0917o4104
5462d8299k1483M3107k7404R5019q7927M3573L0017r6416R9120L0321o3872q730
5450a2974J9156r0122L637L5834p6551J8418N9331n9655O6413O2171j0675K5467
5438D0450j5801l8408L3570q5p722k5527L7631k3873L358j3904K3657M8402J4714
5425G6462N9192M0936O457n9795o902M328J571l4896p1742k3083k1365r3243o3686
5412a85766Q8578o4204K9114O1618R405P1360M6526R746J6230M9987p2996K6356
$$ plain form
5400 85954 76390 26218 22099 47695 -63819 -51545 -27344 -78118 -35809 -49304 18617 17970
5388 17970 10185 29216 67710 87135 74180 105777 114003 29809 55123 92571 -7658 82672
5376 82672 24091 -58732 13695 26221 -26691 12205 52097 5093 72583 56813 8951 32561
5364 32561 83308 -30589 -37525 -840 -57788 7312 -27532 -49739 -14273 -27741 -11356 52278
5352 52278 56045 51857 38818 60528 95663 50529 68983 101095 50075 -14994 -26732 53389
5340 53389 38795 42346 36953 16304 32230 53344 7405 69755 130189 55098 127158 103009
5328 103009 115939 153934 119121 127990 157086 146359 79352 112309 133346 118032 65639 55295
5316 55295 -12374 62803 -13089 -13862 38944 2064 29957 -3713 83869 81000 76195 105011 145815
$$ packed form
5400H5954r564n0172m119K5596j11514J2274K4201n0774M2309j3495O7921o47
5388A7970p785J9031L8494J9425j2955L1597Q226q4194K5314L7448j00229R0330
5376H2672n8581q2823P2427J2526n2912L8896L9892m7004O7490j5770m7862K3610
5364C2561N0747j13897o936L6685n6948O5100l4844k2207L5466j3468J6385O3634
5352E2278L767m188j3039K1710L5135m5134J8454L2112n1020o5069j1738Q0121
5340E3389j4594L551n393k0649J5926K1114m5939O2350O0434p5091P2060k4149
5328A03009J2930L7995l4813Q869K9096j0727o7007L2957K1037j5314n2393j0344
5316E5295o7669P5177p5892p73N2806l6880K7893l3670Q7582k869m805K8816M0804
$$ plain form
5303 145815 123422 137121 94036 118724 161770 64698 107178 40874 39810 25609 58548 101124
5291 101124 126211 99355 46281 146597 130737 212855 205453 220221 215003 259241 186652 132961
5279 132961 209406 209413 138738 114921 135562 42059 131582 56120 87796 176973 101859 94108 92504
5266 92504 149644 118700 126266 131396 86824 55825 51025 1073 51498 29689 19347 51227
5254 51227 -18457 40025 56124 85988 106623 143438 118135 113252 210181 191789 172292 291111
5242 291111 216464 156003 298809 110880 120888 275777 135333 108180 182369 61476 42951
5231 42951 124107 23579 39210 91370 14901 60248 103192 73069 112585 121374 103095 101245
5219 101245 90418 112664 86573 139649 128753 178664 208875 106182 169725 150752 62675
$$ packed form
5303A45815k2393J3699m3085K4688M3046r7072M2480o6304j064j4201L2939M2576
5291A01124K5087k6856n3074J00316j5860Q2118p402J4768n218M4238p2589n3691
5279A32961P6445Pp0675k3817K0641r3503Q9523p5462L1676Q9177p5114p751j604
5266I2504N7140l0944P566N130m4572l0999m800m9952N0425k1809j0342L1880
5254E1227o9684N8482J6099K9864K0635L6815k5303m883R6929j8392j9497J18819
5242B91111p4647o0461J42806j87929J0008J54889j40444k7153P4189j20893j8525
5231D2951Q1156j00528J5631N2160p6469M5347M2944l0123L9516Q789j8279j850
5219A01245j0827K2246k6091N3076j0896M9911L0211j02693O3543j8973q8077
$$ plain form
5208 62675 101371 129532 44782 4510 98750 30125 46826 154711 63748 160561 201560 71234
5196 71234 184466 155365 137432 241195 182398 167061 221464 208008 149334 135603 117315
5185 117315 120591 88081 72627 71419 101089 110906 124971 144917 112598 176319 122688 94834
5173 94834 149289 153933 128686 159173 170171 69755 145938 110796 92398 102758 83105 44336
5161 44336 73859 36558 64552 40017 59055 116814 56137 132121 101561 99866 126592 120160
5149 120160 133974 160068 143125 95339 164911 170197 63859 89233 112979 35527 46805 11386
5137 11386 53325 122487 84879 124181 126836 170182 254834 182142 248435 360734 176306 179327
5125 179327 243044 149419 125088 122881 -2869 24561 -26058 -139204 -91582 -20278 3711
$$ packed form
5208F2675L8696K8161q4750m0272R4240o8625J6701J07885r0963R6813M0999j30326
5196G1234J13232k9101j7933J03763n8797j5337N4403j3456n8674j3731j8288
5185A17315L276l2510j5454j208K9670R817J4065J9946l2319O3721n3631k7854
5173I4834N4455M644k5247L0487J0998j00416P6183l5142j8398J0360j9653l8769
5161D4336K9523l7301K7994k4535J9038N7759o0677P5984l0560j695K6726o432
5149A20160J3814K6094j6943m7786O9572N286j06338K5374K3746p7452J1278l5419
5137A1386M1939O9162l7608L9302K655M3346Q4652p2692O6293J12299j84428L021
5125A79327O3717r3625k4331k207j25750K7430n0619j13146M7622P1304K3989
$$ plain form
5114 3711 26221 61575 73120 153378 101547 148599 200312 172542 205386 231750 141372 138611
5102 138611 172556 48132 63342 62665 -9228 2058 110957 87013 49414 92819 124507 132023
5090 132023 175276 176216 120616 231654 124526 107390 224045 149948 82472 108847 115961 162616
5078 162616 173557 138469 133484 136333 106138 84627 128374 134884 154573 149377 103764 126124
5066 126124 146173 93897 183287 213571 118748 196006 237039 155946 203460 177762 98913 128135
5054 128135 99791 66094 113355 207222 122446 157788 194728 160046 211069 206630 179681 238204
5042 238204 223874 147699 195220 142703 124535 225763 137182 91710 274324 118885 130478
5031 130478 286936 217600 214841 321403 298959 273133 382385 291378 246827 355477 247040
$$ packed form
5114C711K2510L5354J1545Q0258n1831M7052N1713k7770L2844K6364r0378k761
5102A38611L3945j24424J5210o77p1893J1286J08899k3944l7599M3405L1688P516
5090A32023M3253R40n5600J11038j07128j7136J16655p4097o7476K6375P114M6655
5078A62616J0941l5088m985K849l0195k1511M3747O510J9689n196m5613K2360
5066A26124K0049n2276Q9390L0284r4823P7258M1033q1093M7514k5698p8849K9222
5054A28135k8344l3697M7261R3867q4776L5342L6940l4682N1023m439k6949N8523
5042B38204j4330p6175M7521n2517j8168J01228q8581m5472J82614j55439J1593
5031A30478J56458o9336k759J06562k2444k5826J09252r1007m4551J08650j08437
$$ plain form
5020 247040 257365 325807 244492 280993 277806 280643 297500 245195 285886 232889 288788 325604
5008 325604 255218 267967 282302 289514 293119 247298 269375 269104 288516 290406 332803 358261 390191
4995 390191 397289 374270 484219 476720 466806 477296 494595 456384 436858 471110 472671 448120
4983 448120 525249 433177 469006 516639 480304 499076 512965 578193 543394 572182 607027 624707
4971 624707 645448 656676 644335 695865 717326 738988 710625 754696 832872 736247 763648 828718
4959 828718 825994 814899 884767 882290 947531 888897 870204 987466 1034443 1087438 1069421 1163766
4947 1163766 1236123 1257830 1214461 1378478 1438450 1424413 1471180 1457726 1451548 1498267 1539086
4936 1539086 1538362 1632933 1640656 1608295 1690860 1798313 1785145 1872026 1985394 2051015 2108513 2162552
$$ packed form
5020B47040J0325O8442q1315L6501l187K837J6857n2305M0691n2997N5899L6816
5008C25604p0386J2749J4335P212L605m5821K2077k71J9412J890M2397K5458L1930
4995C90191P098k3019J09949p499r914J0490J7299l8211j9526L4252J561k4551
4983D48120P7129r2072L5829M7633l6335J8772J3889O5228l4799K8788L4845J7680
4971F24707K0741J1228j2341N1530K1461K1662k8363M4071P8176r6625K7401O5070
4959H28718k724j1095O9868k477O5241n8634j8693J17262M6977N2995j8017R4345
4947A163766P2357K1707m3369J64017N9972j4037M6767j3454o178M6719M0819
4936A539086p24R4571P723l2361Q2565J07453j3168Q6881J13368O5621N7498N4039
$$ plain form
4924 2162552 2245419 2364688 2517693 2606901 2679829 2946968 3105997 3264937 3504090 3776562
4914 3776562 4015103 4038381 4127473 4157707 3993126 3905995 3798384 3624212 3599461 3484498
4904 3484498 3355607 3420605 3433381 3420769 3485391 3581670 3647153 3881110 3976410 4199420 4470402
4893 4470402 4627897 4930988 5248883 5619173 6021566 6504227 6985444 7469899 7977726 8286249
4883 8286249 8368117 8337323 7945204 7523526 7079430 6615020 6289968 5983931 5739788 5571396
4873 5571396 5483605 5334569 5303480 5356461 5326885 5391890 5510831 5694818 5935250 6106028
4863 6106028 6439691 6823921 7161898 7642160 8184595 8691635 9361997 9967021 10385386 10671792
4853 10671792 10545155 10111188 9491955 8782301 8109474 7537869 7000424 6605262 6191270
$$ packed form
4924B162552Q2867J19269J53005Q9208P2928K67139J59029J58940K39153K72472
4914C776562K38541K3278Q9092L0234j64581q7131j07611j74172k4751j14963
4904C484498j28891O4998J2776j2612O4622R6279O5483K33957R5300K23010K70982
4893D470402J57495L03091L17895L70290M02393M82661M81217M84455N07827L08523
4883H286249Q1868l0794l92119m21678m44096m64410l25052l06037k44143j68392
4873E571396q7791j49036l1089N2981k9576O5005J18941J83987K40432J70778
4863F106028L33663L84230L37977M80262N42435N07040O70362O05024M18365K86406
4853A0671792j26637m33967o19233p09654o72827n71605n37445l95162m13992
$$ plain form
4844 6191270 5917725 5743651 5464157 5387392 5353729 5247184 5268888 5282240 5286031 5421793 5613931
4833 5613931 5779359 6051121 6306743 6627416 7038810 7426728 7841600 8265704 8427401 8424249
4823 8424249 8162040 7597340 7101606 6462852 5844546 5422261 4972664 4559856 4377010 4132516
4813 4132516 3932458 3861362 3711824 3617260 3638470 3531927 3482809 3504222 3420791 3412739 3408169
4802 3408169 3448874 3429721 3544921 3695785 3810831 3986818 4036654 4066530 4020536 3812980
4792 3812980 3583271 3316652 3028712 2886084 2638327 2440854 2354738 2210309 2112288 2000154
4782 2000154 1884136 1846520 1857710 1768981 1768361 1787912 1751073 1714882 1637278 1673161 1670735 1567900
4770 1567900 1536389 1580248 1512205 1498658 1497044 1437717 1424095 1376215 1297042 1279681 1268064 1169861
$$ packed form
4844F191270k73545j74074k79494p6765l3663j06545K1704J3352L791J35762J92138
4833E613931J65428K71762K55622L20673M11394L87918M14872M24104J61697l152
4823H424249k62209n64700m95734o38754o18306m22285m49597m12808j82846k44494
4813D132516k00058p1096j49538r4564K1210j06543m9118K1413q3431q052m570
4802C408169M0705j9153J15200J50864J15046J75987M9836K9876m5994k07556
4792C812980k29709k66619k87940j42628k47757j97473q6116j44429r8021j12134
4782B000154j16018l7616J1190q8729o20J9551l6839l6191p7604L5883k426j02835
4770A567900l1511M3859o8043j3547j614n9327j3622m7880p9173j7361j1617r8203
$$ plain form
4758 1169861 1189689 1136272 1098509 1120262 1054324 1017469 1044253 1009721 973330 986708 979742 964675
4746 964675 957367 982622 968453 1034492 994469 905045 1027621 1056860 945455 985997 1020791
4735 1020791 920653 961721 949221 876646 927148 879514 827171 909142 963826 916667 975271
4724 975271 1030857 1053471 1096784 1067282 1041874 1099261 1124394 1102331 1152414 1164445 1110722 1088390
4712 1088390 1121124 1149578 1224245 1275747 1250815 1322768 1334377 1319079 1359578 1405954 1409039 1430040
4700 1430040 1389821 1391550 1458756 1432735 1430968 1470921 1506312 1540972 1560201 1558585 1645342 1738831
4688 1738831 1723640 1821116 1905020 1919687 1986167 2098384 2120324 2160616 2275751 2269647 2330463
4677 2330463 2373081 2363575 2426132 2493351 2446589 2473538 2473664 2446400 2472886 2506559 2563092 2550897
$$ packed form
4758A169861J9828n3417l7763K1753o5938l6855K6784l4532l6391J3378o966j5067
4746I64675p308K5255j4169O6039m0023q9424J22576K9239j11405M0542L4794
4735A020791j00138M1068j2500p2575N0502m7634n2343Q1971N4684m7159N8604
4724I75271N5586K2614M3313k9502k5408N7387K5133k2063N0083J2031n3723k2332
4712A088390L2734K8454P4667N1502k4932P1953J1609j5298M0499M6376L085K1001
4700A430040m0219J729O7206k6021j767L9953L5391L4660J9229j616Q6757R3489
4688A738831j5191R7476Q3904J4667O6480J12217K1940M0292J15135o104O0816
4677B330463M2618r506O2557O7219m6762K6949J26k7264K6486L3673N6533j2195
$$ plain form
4665 2550897 2616090 2622198 2626114 2674214 2742369 2758530 2752397 2899743 2833648 2876060 2984137 2918911
4653 2918911 2936266 3001426 2928464 2933843 3006754 2966758 2989639 2983364 3019720 2979114 3019316 3066342
4641 3066342 3055582 3054467 3033786 3052242 3014695 3060907 2998038 2940494 2953569 2896625 2843213 2875702
4629 2875702 2839499 2821474 2834292 2727070 2765125 2734317 2696728 2703357 2767562 2675992 2648999
4618 2648999 2705542 2583830 2622954 2584424 2479704 2473718 2477306 2323836 2318804 2296468 2248297
4607 2248297 2227024 2168649 2120606 2071701 2041636 1975864 2054138 1998351 1921672 1967320 1869004
4596 1869004 1909092 1893089 1795045 1822704 1804477 1713173 1668640 1698124 1682254 1626357 1621393 1580548
4584 1580548 1553767 1570959 1468556 1486553 1504395 1521198 1515956 1526766 1570365 1510252 1545265
$$ packed form
4665B550897O5193O108L916M8100O8155J6161o133J47346o6095M2412J08077o5226
4653B918911J7355O5160p2962N379P2911l9996K2881o275L6356m0606M0202M7026
4641C066342j0760j115k0681J8456l7547M6212o2869n7544J3075n6944n3412L2489
4629B875702l6203j8025J2818j07222L8055l0808l7589O629O4205r1570k6993
4618B648999N6543j21712L9124l8530j04720n986L588j53470n032k2336m8171
4607B248297k1273n8375m8043m8905l0065o5772P8274n5787p6679M5648r8316
4596A869004M0088j6003r8044K7659j8227r1304m4533K9484j5870n5897m964m0845
4584A580548k6781J7192j02403J7997J7842J6803n242J0810M3599o0113L5013
$$ plain form
4573 1545265 1520615 1500507 1518586 1505650 1456604 1450538 1477775 1396502 1410864 1419120 1362854 1385290
4561 1385290 1456600 1418258 1492874 1503811 1472105 1537393 1493673 1445842 1438419 1440236 1401097 1384775
4549 1384775 1302189 1262133 1306541 1248997 1231413 1264436 1258326 1269956 1290135 1281461 1398896 1394973
4537 1394973 1315991 1390371 1335951 1285023 1270271 1283488 1304016 1315746 1284582 1253284 1334237
4526 1334237 1367418 1346060 1411066 1490929 1444304 1500586 1505595 1501884 1520561 1550518 1530631 1508924
4514 1508924 1595469 1503208 1489526 1518992 1519973 1447813 1422401 1580242 1530801 1525854 1640958 1595178
4502 1595178 1598846 1646930 1571654 1614552 1685347 1619167 1682661 1743425 1693810 1657088 1647460 1596295
4490 1596295 1632521 1566060 1484196 1501371 1445724 1402220 1420087 1345867 1329412 1364440 1303100
$$ packed form
4573A545265k4650k0108J8079j2936m9046o066K7237q1273J4362Q256n6266K2436
4561A385290P1310l8342P4616J0937l1706O5288m3720m7831p423J817l9139j6322
4549A384775q2586m0056M4408n7544j7584L3023o110J1630K0179q674J17435l923
4537A394973p8982P4380n4420n0928j4752J3217K0528J1730l1164l1298Q0953
4526A334237L3181k1358O5006P9863m6625N6282N009l711J8677K9957j9887k1707
4514A508924Q6545r2261j3682K9466R81p2160k5412J57841m9441m947J15104m5780
4502A595178L668M8084p5276M2898P0795o6180O3494O0764m9615l6722r628n1165
4490A596295L6226o6461q1864J7175n5647m3504J7867p4220j6455L5028o1340
$$ plain form
4479 1303100 1282477 1331224 1324115 1287511 1416688 1431552 1393586 1425854 1466482 1445275 1424475
4468 1424475 1487819 1410237 1438495 1478778 1366661 1391357 1517955 1487897 1510405 1595353 1583684
4457 1583684 1528677 1606072 1666794 1563958 1685835 1615395 1549266 1654459 1645822 1566420 1612087
4446 1612087 1622101 1559358 1658209 1669668 1726899 1843911 1847745 1874338 1970320 1954359 2064526
4435 2064526 2121103 2090015 2224743 2229954 2226213 2216390 2301040 2288338 2335035 2459172 2419894 2518976
4423 2518976 2522247 2551796 2662681 2695038 2784513 2850817 2912763 3030475 3061772 3186013 3321539
4412 3321539 3455420 3599872 3727690 4006903 4172931 4414108 4636834 4912229 5193593 5567371
4402 5567371 5965336 6284838 6766150 7157052 7615772 8105050 8517861 8926735 9287449 9427136
$$ packed form
4479A303100k0623M8747p109l6604J29177J4864l7966L2268M0628k1207k0800
4468A424475O3344p7582K8258M0283j12117K4696J26598l0058K2508Q4948j1669
4457A583684n5007P7395O0722j02836J21877p0440o6129J05193q637p9402M5667
4446A612087J0014o2743R8851J1459N7231J17012L834K6593R5982j5961J10167
4435B064526N6577l1088J34728N211l741r823Q4650j2702M6697J24137l9278R9082
4423B518976L271K9549J10885L2357Q9475O6304O1946J17712L1297J24241J35526
4412C321539J33881J44452J27818K79213J66028K41177K22726K75395K81364L73778
4402E567371L97965L19502M81312L90902M58720M89278M12811M08874L60714J39687
$$ plain form
4392 9427136 9509630 9485881 9366181 9083310 8865352 8593713 8223856 8032422 7706193 7492969
4382 7492969 7424845 7288169 7201426 7275571 7268725 7269676 7388271 7469906 7611793 7807005 7948474
4371 7948474 8005342 8139736 8181066 8116490 8059750 7935526 7617755 7247079 6901321 6495423
4361 6495423 6113127 5731651 5420795 4975630 4734589 4485130 4064937 3981742 3752543 3434629
4351 3434629 3341690 3227856 3014684 2989404 2916457 2777916 2794573 2769796 2641596 2574235 2559718
4340 2559718 2420791 2365766 2327045 2289741 2210323 2234787 2240300 2158184 2145347 2095369 2080366
4329 2080366 2058414 2119729 2014351 1975652 1913606 1839455 1867008 1773805 1690217 1655400 1537910
4318 1537910 1481896 1512815 1364471 1534735 1517842 1453307 1551809 1549685 1537785 1597388 1645371
$$ packed form
4392I427136Q2494k3749j19700k82871k17958k71639l69857j91434l26229k13224
4382G492969o8124j36676q6743P4145o846R51J18595Q1635J41887J95212J41469
4371G948474N6868J34394M1330o4576n6740j24224l17771l70676l45758m05898
4361F495423l82296l81476l10856m45165k41041k49459m20193q3195k29199l17914
4351C434629r2939j13834k13172k5280p2947j38541J6657k4777j28200o7361j4517
4340B559718j38927n5025l8721l7304p9418K4464N513q2116j2837m9978j5003
4329B080366k1952O1315j05378l8699o2046p4151K7553r3203q3588l4817j17490
4318A537910n6014L0919j48344J70264j6893o4535R8502k124j1900N9603M7983
$$ plain form
4307 1645371 1551317 1570893 1513651 1387207 1386152 1397848 1316503 1339076 1359492 1278715 1222616
4296 1222616 1212148 1225699 1205284 1143604 1121027 1107904 1029484 1095784 991835 1002411 1170176
4285 1170176 1110886 1084133 1210286 1247044 1238160 1328397 1334413 1331191 1301048 1265202 1130888 1220450
4273 1220450 1125456 1005599 1034670 922796 906153 797956 813140 911338 908431 883516 997668
4262 997668 1034353 1056179 1050751 1042129 1145046 1143883 1097598 1048281 1047272 1011650 940280 794702
4250 794702 882086 859115 782323 889404 838733 856032 923589 855277 918540 992122 930696
4239 930696 912544 940351 955599 927724 914842 911575 913963 880798 763153 816058 860339 761193
4227 761193 828457 740217 786630 762795 696040 796534 810241 866085 824262 830158 929003 860174
$$ packed form
4307A645371r4054J9576n7242j26444j055J1696q1345K2573K0416q0777n6099
4296A222616j0468J3551k0415o1680k2577j3123p8420O6300j03949J0576J67765
4285A170176n9290k6753J26153L6758q884R0237O016l222l0143l5846j34314Q9562
4273A220450r4994j19857K9071j11874j6643j08197J5184R8198k907k4915J14152
4262I97668L6685K1826n428q622J02917j163m6285m9317j009l5622p1370j45578
4250G94702Q7384k2971p6792J07081n0671J7299O7557o8312O3263P3582o1426
4239I30696j8152K7807J5248k7875j2882l267K388l3165j17645N2905M4281r9146
4227G61193O7264q8240M6413k3835o6755J00494J3707N5844m1823N896R8845o8829
$$ plain form
4215 860174 828222 962408 883215 898693 909558 888736 858117 838045 761098 688476 804833
4204 804833 669507 697301 743321 682071 764990 737290 716960 799728 806955 821032 804826 865774
4192 865774 881457 880397 914684 837812 957873 904729 826518 922773 844559 857009 827349 794344
4180 794344 863131 800067 748545 760867 771360 757862 745180 774956 696299 757556 734883 685378
4168 685378 771843 706686 692024 744960 711805 687157 738076 701805 700208 703557 682694 642365
4156 642365 687511 696257 658228 695529 745870 662813 658478 787571 700839 726461 795993 700325
4144 700325 733590 810949 629628 657407 767034 652979 784137 815777 765467 830463 837808
4133 837808 854425 917214 883059 827575 876267 863418 795110 830745 829050 766169 832355 743931
$$ packed form
4215H60174l1952J34186p9193J5478J0865k0822l0619k0072p6947p2622J16357
4204H04833j35326K7794M6020o1250Q2919k7700k0330Q2768P227J4077j6206O0948
4192H65774J5683j060L4287p6872J20061n3144p8211R6255p8214J2450k9660l3005
4180G94344O8787o3064n1522J2322J0493j3498j2682K9776p8657O1257k2673m9505
4168F85378Q6465o5157j4662N2936l3155k4648N0919l6271j597L349k0863m0329
4156F42365M5146Q746l8029L7301N0341q3057m335J29093q6732K5622O9532r5668
4144G00325L3265P7359j81321K7779J09627j14055J31158L1640n0310O4996P345
4133H37808J6617O2789l4155n5484M8692j2849o8308L5635j695o2881O6186q8424
$$ plain form
4121 743931 719522 756884 748471 797831 751725 818274 790315 752077 795863 755322 813043 869908
4109 869908 841596 832265 925609 916239 929294 1032203 1092423 1053216 1086172 998069 1118433 1162325
4097 1162325 1049582 1117785 1063715 1052708 1029153 1003118 1034836 1123483 1077580 1072601 1146290
4086 1146290 1180874 1158433 1189677 1245012 1261496 1290836 1253932 1325941 1357578 1344936 1380588
4075 1380588 1392214 1402995 1456777 1431766 1415282 1501774 1474422 1449281 1505803 1596475 1519171
4064 1519171 1568282 1556620 1562913 1693196 1669532 1641563 1754936 1823790 1756274 1773633 1852416
4053 1852416 1847468 1923544 1928802 1889467 2041199 2047288 2013189 2084084 2160349 2163430 2165679 2278920
4041 2278920 2267231 2308518 2384148 2399330 2520868 2563218 2563810 2645778 2728398 2734721 2744998 2752915
$$ packed form
4121G43931k4409L7362q413M9360m6106O6549k7959l8238M3786m0541N7721N6865
4109H69908k8312r331R3344r370J3055J02909O0220l9207L2956q8103J20364M3892
4097A162325j12743O8203n4070j1007k3555k6035L1718Q8647m5903m979P3689
4086A146290L4584k2441L1244N5335J6484K9340l6904P2009L1637j2642L5652
4075A380588J1626J0781N3782k5011j6484Q6492k7352k5141N6522R0672p7304
4064A519171M9111j1662O293J30283k3664k7969J13373O8854o7516J7359P8783
4053A852416m948P6076N258l9335J51732O089l4099P0895P6265L081K249J13241
4041B278920j1689M1287P5630J5182J21538M2350N92Q1968Q2620O323J0277P917
$$ plain form
4029 2752915 2811294 2864571 2869072 2881455 3024889 3049960 3111406 3222586 3286625 3473091 3546866
4018 3546866 3652910 3812268 3954943 4027713 4214932 4459138 4609715 4831050 5049563 5258812
4008 5258812 5589620 5824368 6125432 6571003 6957782 7309934 7702032 8089674 8294418 8485262
3998 8485262 8634601 8702516 8879179 9062153 9335447 9737181 10187849 10686362 11249392 11870475
3988 11870475 12457856 13016130 13515478 14006583 14521338 14876166 15123408 15207973 15175877 15066098
3978 15066098 14997399 15163180 15371145 15773774 16400193 17010393 17854177 18708259 19223265 19575905
3968 19575905 19559753 19393308 19146676 18950629 18735117 18477369 18281029 18112764 18141786 18324327
3958 18324327 18537507 18844455 19188427 19522333 19894493 20280804 20482045 20446247 19991112 19309885
$$ packed form
4029B752915N8379N3277M501J2383J43434K5071O1446J11180O4039J86466P3775
4018C546866J06044J59358J42675P2770J87219K44206J50577K21335K18513K09249
4008E258812L30808K34748L01064M45571L86779L52152L92098L87642K04744J90844
3998H485262J49339O7915J76663J82974K73294M01734M50668M98513N63030O21083
3988A1870475N87381N58274M99348M91105N14755L54828K47242Q4565l2096j09779
3978A5066098o8699J65781K07965M02629O26419O10200Q43784Q54082N15006L52640
3968A9575905j6152j66445k46632j96047k15512k57748j96340j68265K9022J82541
3958A8324327K13180L06948L43972L33906L72160L86311K01241l5798m55135o81227
$$ plain form
3948 19309885 18506763 17742063 17089128 16617476 16282217 16218260 16364809 16469429 16742450 16908993
3938 16908993 16839384 16509627 16169404 15611084 15022877 14544446 13792984 13023111 12399911 11679925
3928 11679925 11029324 10730517 10372186 10083496 9981698 9929935 9875445 9856969 9674996 9252914
3918 9252914 8907919 8366570 7729334 7249407 6844062 6390245 6106422 5783137 5515357 5333110
3908 5333110 5069256 4938244 4759752 4609154 4428872 4270661 4204180 4068132 3963553 3897972
3898 3897972 3846684 3832858 3745857 3692979 3713258 3645502 3669718 3648158 3527140 3531565 3534528 3427480
3886 3427480 3438438 3515868 3386143 3400882 3433918 3356004 3387484 3384334 3353913 3390976 3433747
3875 3433747 3353778 3410170 3411121 3392235 3405419 3426089 3456225 3520844 3542449 3552215 3662919 3606962
$$ packed form
3948A9309885q03122p64700o52935m71652l35259o3957J46549J04620K73021J66543
3938A6908993o9609l29757l40223n58320n88207m78431p51462p69873o23200p19986
3928A1679925o50601k98807l58331k88690j01798n1763n4490j8476j81973m22082
3918I252914l44995n41349o37236m79927m05345m53817k83823l23285k67780j82247
3908E333110k63854j31012j78492j50598j80282j58211o6481j36048j04579o5581
3898C897972n1288j3826q7001n2878K0279o7756K4216k1560j21018M425K963j07048
3886C427480J0958P7430j29725J4739L3036p7914L1480l150l0421L7063M2771
3875C433747p9969N6392R51j8886J3184K0670L0136O4619K1605R766J10704n5957
$$ plain form
3863 3606962 3675746 3645254 3707741 3743408 3708874 3783411 3751198 3815569 3846122 3827987 3878470
3852 3878470 3948931 3863355 3980571 3957575 4008955 4074967 4098524 4122874 4164632 4205857 4194088
3841 4194088 4283837 4317905 4338556 4347627 4452948 4481371 4574570 4582679 4637046 4727370 4760153 4846256
3829 4846256 4909505 5028985 5057264 5195300 5245072 5289410 5440760 5475225 5551431 5707357 5825593
3818 5825593 5937881 6141891 6226608 6410602 6640215 6831392 7064095 7362968 7560277 7944419
3808 7944419 8359996 8641148 9139417 9642637 10242250 11005573 11742776 12663002 13742868
3799 13742868 14952506 16156377 17146645 17667520 17582252 16988898 16148459 15256403 14398383
3790 14398383 13839403 13337912 13077582 12901475 12846986 13003976 13297616 13750694 14288735 15033872
$$ packed form
3863C606962O8784l0492O2487L5667l4534P4537l2213O4371L0553j8135N0483
3852C878470P0461q5576J17216k2996N1380O6012K3557K4350M1758M1225j1769
3841D194088Q9749L4068K0651R071J05321K8423R3199Q109N4367R0324L2783Q6103
3829D846256O3249J19480K8279J38036M9772M4338J51350L4465P6206J55926J18236
3818E825593J12288K04010Q4717J83994K29613J91177K32703K98873J97309L84142
3808G944419M15577K81152M98269N03220N99613P63323P37203R20226J079866
3799A3742868J209638J203871R90268N20875q5268n93354q40439q92056q58020
3790A4398383n58980n01491k60330j76107n4489J56990K93640M53078N38041P45137
$$ plain form
3780 15033872 15751200 16291695 16401074 16022233 15179985 14266553 13253676 12446325 11799382
3771 11799382 11120610 10648671 10232561 9940036 9597680 9514917 9339391 9227992 9252742 9197524
3761 9197524 9249618 9394572 9464877 9511918 9793703 9909724 10080021 10375863 10669679 10946513
3751 10946513 11381644 11783658 12210289 12902180 13572563 14301601 15168309 16226053 17280067
3742 17280067 18511937 20072311 21744090 23605499 25230389 26405633 26901813 26475678
3734 26475678 25396239 24107309 22937248 21998714 21173362 20604887 20372630 20304081 20396111
3725 20396111 20633275 21164264 21845676 22778708 23847439 24726613 25336984 25163188 24133644
3716 24133644 22716248 21256819 19661056 18388655 17309979 16313388 15541310 14746065 14163105
$$ packed form
3780A5033872P17328N40495J09379l78841q42248r13432j012877q07351o46943
3771A1799382o78772m71939m16110k92525l42356q2763j75526j11399K4750n5218
3761I197524N2094J44954P0305M7041K81785J16021J70297K95842K93816K76834
3751A0946513M35131M02014M26631O91891O70383P29038Q66708J057744J054014
3742A7280067J231870J560374J671779J861409J624890J175244M96180m26135
3734B6475678j079439j288930j170061r38534q25352n68475k32257o8549R2030
3725B0396111K37164N30989O81412R33032J068731Q79174O10371j73796j029544
3716B4133644j417396j459429j595763j272401j078676r96591p72078p95245n82960
$$ plain form
3707 14163105 13679959 13245792 12806219 12484670 12227893 12014105 11783090 11583289 11513418 11531381
3697 11531381 11415597 11321586 11417422 11438921 11444628 11565661 11719726 11889863 12107995 12280448
3687 12280448 12584069 12927654 13187049 13565279 13988572 14518569 15026545 15562359 16316338
3678 16316338 17111560 17976925 18993522 20135946 21515689 23062882 24664849 26265087
3670 26265087 27578765 28141518 27849456 27100261 26231469 25414649 24767830 24298594 24137004
3661 24137004 24175836 24340689 24794346 25381084 26227178 27277054 28524791 30129372 32025227
3652 32025227 33911913 35753271 37349802 38422238 39088305 39385626 39247956 38353437 36686643
3643 36686643 34609022 32518097 30593727 29005173 27733257 26794163 26179872 25815225 25606765
$$ packed form
3707A4163105m83146m34167m39573l21549k56777k13788k31015j99801o9871J7963
3697A1531381j15784r4011R5836K1499N707J21033J54065J70137K18132J72453
3687A2280448L03621L43585K59395L78230M23293N29997N07976N35814P53979
3678A6316338P95222Q65365J016597J142424J379743J547193J601967J600238
3670B6265087J313678N62753k92062p49195q68792q16820o46819m69236j61590
3661B4137004L8832J64853M53657N86738Q46094J049876J247737J604581J895855
3652C2025227J886686J841358J596531J072436O66067K97321j37670q94519j666794
3643C6686643k077621k090925j924370j588554j271916r39094o14291l64647k08460
$$ plain form
3634 25606765 25650652 26006352 26445862 27194798 28274046 29433061 30654857 31545445 31544438
3625 31544438 30770437 29442333 27758419 26219156 24915159 23864939 22926924 22268105 21748546
3616 21748546 21371490 21123838 20884417 20793012 20768660 20794058 20815423 20966806 21182549 21418707
3606 21418707 21675777 22043198 22393434 22818219 23298506 23736439 24325502 24884764 25334837
3597 25334837 26022850 26733623 27354149 28208548 29073817 29938806 30953400 31982192 33027385
3588 33027385 34303357 35644311 36921182 38333034 39787197 41176847 42554809 43998887
3580 43998887 45345262 46700516 48079077 49333280 50475951 51578879 52612686 53476444
3572 53476444 54388542 55361599 56209544 57184169 58339792 59506636 60839708 62353761 63922663
$$ packed form
3634B5606765M3887L55700M39510P48936J079248J159015J221796Q90588j007
3625C1544438p74001j328104j683914j539263j303997j050220r38015o58819n19559
3616B1748546l77056k47652k39421r1405k4352K5398K1365J51383K15743K36158
3606B1418707K57070L67421L50236M24785M80287M37933N89063N59262M50073
3597B5334837O88013P10773O20526Q54399Q65269Q64989J014594J028792J045193
3588C3027385J275972J340954J276871J411852J454163J389650J377962J444078
3580D3998887J346375J355254J378561J254203J142671J102928J033807Q63758
3572E3476444R12098R73057Q47945R74625J155623J166844J333072J514053J568902
$$ plain form
3563 63922663 65681697 67485727 69355144 71331446 73417049 75600877 77833490 80150910
3555 80150910 82464380 84735441 86865214 88925281 90756752 92271989 93667478 94772567
3547 94772567 95492373 96038820 96295696 96318766 96401904 96515074 96686191 97071414 97472580 97575260
3537 97575260 97283315 96341463 94982585 93632973 92324390 91443316 90971161 90890522 91282604
3528 91282604 91904851 92856717 94134502 95549874 96986451 98438006 99668666 100481615 101106208
3519 101106208 101486675 101557786 101551790 101230801 100625937 99809009 98939790 98034455 97243543 96928071
3509 96928071 96693716 96497220 96206523 95440525 94377952 93236737 92242514 91473578 90876567
3500 90876567 89919831 88342263 86483882 84459093 82505279 80894242 79492703 78405120
$$ packed form
3563F3922663J759034J804030J869417J976302K085603K183828K232613K317420
3555H0150910K313470K271061K129773K060067J831471J515237J395489J105089
3547I4772567P19806N46447K56876K3070Q3138J13170J71117L85223M01166J02680
3537I7575260k91945r41852j358878j349612j308583q81074m72155q0639L92082
3528I1282604O22247R51866J277785J415372J436577J451555J230660Q12949O24593
3519A01106208L80467P1111n996l20989o04864q16928q69219r05335p90912l15472
3509I6928071k34355j96496k90697p65998j062573j141215r94223p68936n97011
3500I0876567r56736j577568j858381k024789j953814j611037j401539j087583
$$ plain form
3492 78405120 77560141 76892662 76479815 76165197 75654090 74562641 72796772 70326303 67797146
3483 67797146 65623092 63876087 62845104 62370230 62143613 61969895 61246981 59568135 56955538
3474 56955538 53891497 50719449 47840140 45490344 43528025 42009279 41100298 40379092
3466 40379092 40039127 39953726 39564170 38868839 37674626 35917114 34115408 32455785 30846417
3457 30846417 29655570 28746461 27864982 27260215 26954599 26657642 26666069 26826744 26944949 27108883
3447 27108883 26911350 26174789 25065584 23737805 22296414 20896067 19642405 18538925
3439 18538925 17549329 16636633 15889528 15179052 14538258 14044387 13512685 13094831 12747751
3430 12747751 12304157 11960174 11703533 11402369 11051473 10745739 10540849 10239723 9980167
$$ packed form
3492G8405120q44979o67479m12847l14618n11107j091449j765869k470469k529157
3483F7797146k174054j747005j030983m74874k26617j73718p22914j678846k612597
3474E6955538l064041l172048k879309k349796j962319j518746r08981p21206
3466D0379092l39965q5401l89556o95331j194213j757512j801706j659623j609368
3457C0846417j190847r09109q81479o04767l05616k96957Q427J60675J18205J63934
3447B7108883j97533p36561j109205j327779j441391j400347j253662j103480
3439A8538925r89596r12696p47105p10476o40794m93871n31702m17854l47080
3430A2747751m43594l43983k56641l01164l50896l05734k04890l01126k59556
$$ plain form
3421 9980167 9803654 9533175 9391317 9208356 8997068 8844484 8743248 8560074 8325671 8291711
3411 8291711 8116268 7875726 7778591 7644194 7490067 7380009 7174513 7082177 7026634 6920897
3401 6920897 6824084 6752030 6747476 6680076 6597575 6501291 6478998 6435758 6305910 6248582 6201554
3390 6201554 6105450 5981246 5918980 5823433 5637205 5640292 5551663 5435520 5414865 5311465 5259044
3379 5259044 5228610 5218486 5136199 5047587 5088698 4974837 4896695 4877395 4798881 4808476 4748913
3368 4748913 4648456 4611577 4639089 4621958 4504875 4552915 4573809 4469770 4420385 4413601 4355024
3357 4355024 4268922 4283676 4169425 4135740 4168591 4065441 4030346 4088984 4065541 3958857 4008237
3346 4008237 4044225 3946655 3932621 3935756 3874820 3844499 3813400 3781381 3704760 3743980 3732472 3668492
$$ packed form
3421I980167j76513k70479j41858j82961k11288j52584j01236j83174k34403l3960
3411H291711j75443k40542r7135j34397j54127j10058k05496r2336n5543j05737
3401F920897r6813p2054m554o7400q2501r6284k2293m3240j29848n7328m7028
3390F201554r6104j24204o2266r5547j86228L087q8629j16143k0655j03400n2421
3379E259044l0434j0124q2287q8612M1111j13861p8142j9300p8514R595n9563
3368D748913j00457l6879K7512j7131j17083M8040K0894j04039m9385o784n8577
3357D355024q6102J4754j14251l3685L2851j03150l5095N8638k3443j06684M9380
3346D008237L5988r7570j4034L135o0936l0321l1099l2019p6621L9220j1508o3980
$$ plain form
3334 3668492 3822048 3766333 3738845 3833448 3806079 3794866 3832865 3879036 3847787 3867240 3811129
3323 3811129 3772848 3819797 3787541 3793326 3830979 3790992 3806203 3798367 3712142 3753720 3775472 3683955
3311 3683955 3620259 3794697 3648997 3568851 3710065 3576289 3655604 3682416 3659846 3686968 3830838
3300 3830838 3797865 3728625 3953712 3928525 3880633 4001951 3980143 4015464 4078888 3942069 4054519
3289 4054519 4049314 4030014 4070529 4048204 4076739 4128534 4184111 4119937 4299863 4283056 4226765
3278 4226765 4364279 4387039 4273540 4301768 4305728 4204629 4283820 4248813 4135954 4223327 4312246
3267 4312246 4158533 4299503 4377623 4348373 4411907 4408768 4493542 4512341 4636093 4607493 4667611
3256 4667611 4734158 4686961 4713285 4722364 4707187 4747108 4731286 4719813 4834195 4781197 4812835
$$ packed form
3334C668492J53556n5715k7488R4603k7369j1213L7999M6171l1249J9453n6111
3323C811129l8281M6949l2256N785L7653l9987J5211p836q6225M1578K1752r1517
3311C683955o3696J74438j45700q0146J41214j33776P9315K6812k2570K7122J43870
3300C830838l2973o9240K25087k5187m7892J21318k1808L5321O3424j36819J12450
3289D054519n205j9300M0515k2325K8535N1795N5577o4174J79926j6807n6291
3278D226765J37514K2760j13499K8228L960j01099P9191l5007j12859Q7373Q8919
3267D312246j53713J40970P8120k9250O3534l139Q4774J8799J23752k8600O0118
3256D667611O6547m7197K6324R079j5177L9921j5822j1473J14382n2998L1638
$$ plain form
3245 4812835 4900518 4988755 4956005 5009972 4992792 4921377 5029432 5005410 5009940 5065486 5036532
3234 5036532 4921021 5046148 5080992 5030382 5178568 5219972 5221550 5356490 5447116 5434547 5615111
3223 5615111 5648634 5667536 5709734 5705833 5722264 5793295 5750388 5719132 5850084 5783448 5831639
3212 5831639 5872301 5823563 5914662 6012526 6022034 6007636 6084154 6071112 6047103 6134419 6172604 6158550
3200 6158550 6216051 6201652 6162629 6253810 6326571 6389181 6411359 6483022 6488863 6514974 6642400
3189 6642400 6661524 6687739 6744624 6842861 6797053 6894869 6928516 6874233 6986154 7010451 7013689
3178 7013689 7059176 7137562 7159868 7219750 7205334 7316720 7343887 7406057 7496114 7540014 7563556
3167 7563556 7541852 7647465 7657168 7784475 7843015 7859826 7990906 8096441 8087961 8180643 8337802
$$ packed form
3245D812835Q7683Q8237l2750N3967j7180p1415J08055k4022M530N5546k8954
3234E036532j15511J25127L4844n0610J48186M1404J578J34940R0626j2569J80564
3223E615111L3523J8902M2198l901J6431P1031m2907l1256J30952o6636M8191
3212E831639M0662m8738R1099R7864R508j4398P6518j3042k4009Q7316L8185j4054
3200F158550N7501j4399l9023R1181P2761O2610K2178P1663N841K6111J27426
3189F642400J9124K6215N6885R8237m5808R7816L3647n4283J11921K4297L238
3178G013689M5487P8386K2306N9882j4416J11386K7167O2170R0057M3900K3542
3167G563556k1704J05613R703J27307N8540J6811J31080J05535q480R2682J57159
$$ plain form
3156 8337802 8368583 8453022 8595113 8706643 8727528 8865612 8899341 8963180 9074000 9106534 9183424
3145 9183424 9302683 9378730 9470602 9532426 9642900 9803689 9822428 9869811 9979106 10071687 10126675
3134 10126675 10271491 10317243 10400632 10559685 10585715 10686924 10839811 10951963 10988598 11151129
3124 11151129 11340514 11289935 11409971 11594094 11640979 11760941 11897215 11936058 12019863 12224938
3114 12224938 12210303 12288957 12512531 12513553 12567231 12735184 12771314 12899415 13062940 13110850 13233328
3103 13233328 13359124 13442667 13488435 13611267 13730500 13803853 13869785 13944189 14036996 14071263 14174890
3092 14174890 14276540 14332324 14413282 14442515 14542818 14620127 14765136 14796180 14919474 15100998
3082 15100998 15076214 15181097 15281146 15355213 15417631 15487894 15570080 15617847 15703495 15716871 15785242
$$ packed form
3156H337802L0781Q4439J42091J11530K0885J38084L3729O3839J10820L2534P6890
3145I183424J19259P6047R1872O1824J10474J60789J8739M7383J09295R2581N4988
3134A0126675J44816M5752Q3389J59053K6030J01209J52887J12152L6635J62531
3124A1151129J89385n0579J20036J84123M6885J19962J36274L8843Q3805K05075
3114A2224938j4635P8654K23574J022N3678J67953L6130J28101J63525M7910J22478
3103A3233328J25796Q3543M5768J22832J19233P3353O5932P4404R2807L4267J03627
3092A4174890J01650N5784Q0958K9233J00303P7309J45009L1044J23294J81524
3082A5100998k4784J04883J00049P4067O2418P0263Q2186M7767Q5648J3376O8371
$$ plain form
3071 15785242 15869080 15861470 15997291 16030851 16015923 16229808 16269129 16316495 16436248 16472685 16510436
3060 16510436 16582408 16653966 16663337 16775943 16759671 16822492 16907938 16905088 16973082 17048012 17032025
3049 17032025 17117870 17151371 17169971 17324259 17408311 17449324 17560510 17744011 17732088 17879473
3039 17879473 17966464 17972189 18150247 18226488 18291542 18415834 18599019 18678644 18860288 18950596 19062714
3028 19062714 19204464 19335436 19496385 19699854 19983576 20084768 20358992 20626166 20903479
3019 20903479 21122401 21520485 21854431 22195576 22651828 22998878 23455160 24008096 24498880
3010 24498880 24987092 25750503 26212410 26855180 27614177 28270126 29082558 29935497 30758372
3001 30758372 31735281 32781989 33696202 34927400 36055981 37266166 38629831 39909145
$$ packed form
3071A5785242Q3838p610J35821L3560j4928K13885L9321M7366J19753L6437L7751
3060A6510436P1972P1558R371J12606j6272O2821Q5446k850O7994P4930j5987
3049A7032025Q5845L3501J8600J54288Q4052M1013J11186J83501j1923J47385
3039A7879473Q6991N725J78058P6241O5054J24292J83185P9625J81644R0308J12118
3028A9062714J41750J30972J60949K03469K83722J01192K74224K67174K77313
3019B0903479K18922L98084L33946L41145M56252L47050M56282N52936M90784
3010B4498880M88212P63411M61907O42770P58997O55949Q12432Q52939Q22875
3001C0758372R76909J046708R14213J231198J128581J210185J363665J279314
$$ plain form
2993 39909145 41333967 42858218 44293470 45839655 47539636 49033882 50708694 52405649
2985 52405649 54032555 55816540 57618250 59346991 61218821 63181484 64926923 66864107
2977 66864107 68743444 70506217 72291985 74045973 75621387 77198574 78643820 79926918
2969 79926918 81290755 82441255 83503540 84477649 85424217 86274460 86973529 87651305 88178465
2960 88178465 88514941 88616045 88577162 88333116 87930152 87362772 86664261 85852687 84973334 83929610
2950 83929610 82864089 81783871 80538954 79338595 77815615 76297739 74754871 73016746
2942 73016746 71135054 69286076 67328713 65232925 63165335 61102340 59080164 57138601
2934 57138601 55199355 53232710 51395455 49545616 47693997 45838098 44155986 42436074
$$ packed form
2993C9909145J424822J524251J435252J546185J699981J494246J674812J696955
2985E2405649J626906J783985J801710J728741J871830J962663J745439J937184
2977F6864107J879337J762773J785768J753988J575414J577187J445246J283098
2969G9926918J363837J150500J062285R74109R46568Q50243O99069O77776N27160
2960H8178465L36476J01104l8883k44046m02964n67380o98511q11574q79353j043724
2950H3929610j065521j080218j244917j200359j522980j517876j542868j738125
2942G3016746j881692j848978j957363k095788k067590k062995k022176j941563
2934E7138601j939246j966645j837255j849839j851619j855899j682112j719912
$$ plain form
2926 42436074 40680189 39067151 37416272 35865928 34329852 32919044 31531808 30227437
2918 30227437 29062580 27839312 26743839 25838593 24810925 23921888 23117938 22322829 21616458
2909 21616458 20879335 20203559 19618974 19122176 18522491 17996416 17571709 17107785 16779862
2900 16779862 16462367 16122113 15905391 15600445 15379995 15178167 14964073 14797724 14606019
2891 14606019 14538624 14413032 14292150 14194137 14157356 14049960 13963029 13942505 13888235 13898583 13887703
2880 13887703 13818824 13937535 13951541 13956144 14093539 14080015 14229133 14294058 14351859 14444197 14609359
2869 14609359 14705584 14828012 15005960 15153004 15372991 15645986 15853311 16150248 16433439 16688665
2859 16688665 17106216 17340078 17668353 17994366 18237892 18554401 18900756 19203987 19385231
$$ packed form
2926D2436074j755885j613038j650879j550344j536076j410808j387236j304371
2918C0227437j164857j223268j095473r05246j027668q89037q03950p95109p06371
2909B1616458p37123o75776n84585m96798n99685n26075m24707m63924l27923
2900A6779862l17495l40254k16722l04946k20450k01828k14094j66349j91705
2891A4606019o7395j25592j20882r8013l6781j07396q6931k0524n4270J0348j0880
2880A3887703o8879J18711J4006M603J37395j3524J49118O4925N7801R2338J65162
2869A4609359R6225J22428J77948J47044K19987K72995K07325K96937K83191K55226
2859A6688665M17551K33862L28275L26013K43526L16509L46355L03231J81244
$$ plain form
2850 19385231 19765132 20106468 20396999 20751343 21158999 21520552 21949582 22429834 22920847
2841 22920847 23443072 23993100 24490553 24914446 25434092 25810087 26195378 26521587 26876507
2832 26876507 27187727 27510162 27985776 28439006 28919809 29438753 30032593 30624287 31276503
2823 31276503 32015307 32763146 33561988 34409656 35193169 36030910 36941600 37877057 38763797
2814 38763797 39858098 41016019 42207910 43598176 45029791 46442591 47767801 49065229
2806 49065229 50188037 51343159 52592239 53744452 54873616 56219952 57479297 58778753
2798 58778753 60252562 61810891 63418678 65086208 66901853 68730330 70792162 72989415
2790 72989415 75363517 78016759 80733402 83411662 85818629 87956704 89458031 90389161
$$ packed form
2850A9385231L79901L41336K90531L54344M07656L61553M29030M80252M91013
2841B2920847N22225N50028M97453M23893N19646L75995L85291L26209L54920
2832B6876507L11220L22435M75614M53230M80803N18944N93840N91694O52216
2823C1276503P38804P47839P98842Q47668P83513Q37741R10690R35457Q86740
2814C8763797J094301J157921J191891J390266J431615J412800J325210J297428
2806D9065229J122808J155122J249080J152213J129164J346336J259345J299456
2798E8778753J473809J558329J607787J667530J815645J828477K061832K197253
2790G2989415K374102K653242K716643K678260K406967K138075J501327R31130
$$ plain form
2782 90389161 91101280 91548737 91961474 92461344 92942975 93444422 94040513 94632267 95086526
2773 95086526 95463057 95757825 95770404 95862272 95901143 95671200 95407612 94874127 94246612 93469568
2763 93469568 92543023 91619826 90532909 89444198 88241177 87076685 85867911 84396746
2755 84396746 82733933 80612281 78094211 75440909 72592841 69864461 67336302 64934078
2747 64934078 62850226 60862324 59193949 57607179 56069448 54733432 53386959 52036092
2739 52036092 50718837 49470203 48118275 46952249 45783879 44623954 43598960 42475350
2731 42475350 41196798 39848591 38456760 37087312 35782665 34553369 33505759 32418298
2723 32418298 31538350 30656247 29790241 29025311 28174797 27394892 26599877 25960354 25284095
$$ packed form
2782I0389161P12119M47457M12737M99870M81631N01447N96091N91754M54259
2773I5086526L76531K94768J2579R1868L8871k29943k63588n33485o27515p77044
2763I3469568r26545r23197j086917j088711j203021j164492j208774j471165
2755H4396746j662813k121652k518070k653302k848068k728380k528159k402224
2747F4934078k083852j987902j668375j586770j537731j336016j346473j350867
2739E2036092j317255j248634j351928j166026j168370j159925j024994j123610
2731D2475350j278552j348207j391831j369448j304647j229296j047610j087461
2723C2418298q79948q82103q66006p64930q50514p79905p95015o39523o76259
$$ plain form
2714 25284095 24718670 24315519 23903047 23511971 23116930 22816453 22556935 22305824 22094455
2705 22094455 21900791 21623009 21439805 21091134 20732628 20450690 19932604 19535526 19207146
2696 19207146 18804020 18469836 18253647 17976890 17685446 17526209 17304729 17097603 16996087
2687 16996087 16811130 16624510 16555966 16376285 16213964 16159892 16030328 15888474 15806375 15720812
2677 15720812 15614287 15621992 15589652 15558838 15678008 15694088 15716076 15809762 15796368 15689561 15720749
2666 15720749 15712458 15693695 15777551 15773850 15853990 16020702 16179519 16269628 16486511 16716314 16916724
2655 16916724 17123615 17429068 17739722 17979250 18382853 18678116 19059181 19504680 19940075
2646 19940075 20380909 20910313 21472623 22046725 22704877 23355185 24064430 24734134 25517668
$$ packed form
2714B5284095n65425m03151m12472l91076l95041l00477k59518k51111k11369
2705B2094455j93664k77782j83204l48671l58506k81938n18086l97078l28380
2696A9207146m03126l34184k16189k76757k91444j59237k21480k07126j01516
2687A6996087j84957j86620o8544j79681j62321n4072j29564j41854q2099q5563
2677A5720812j06525P705l2340l0814J19170J6080K1988R3686j3394j06807L1188
2666A5720749q291j8763Q3856l701Q0140J66712J58817R0109K16883K29803K00410
2655A6916724K06891L05453L10654K39528M03603K95263L81065M45499M35395
2646A9940075M40834N29404N62310N74102O58152O50308P09245O69704P83534
$$ plain form
2637 25517668 26228229 27015317 27837482 28705716 29523434 30415759 31399912 32214251 33147265
2628 33147265 34066196 34857476 35649470 36564698 37337863 38206768 39117883 39937075 40822214
2619 40822214 41646224 42445301 43139929 43969146 44577275 45083932 45573800 45960594 46293561
2610 46293561 46650541 46941843 47237138 47599574 47902533 48277862 48666741 49056077 49421165
2601 49421165 49868045 50235108 50673039 51083071 51444405 51947063 52474844 53056327 53729063
2592 53729063 54473115 55312682 56197896 57312064 58508809 59838752 61372189 62960652 64690268
2583 64690268 66640531 68796341 71125305 73643214 76368865 79283404 82353306 85632982
2575 85632982 89041928 92601414 96238547 99975056 103648842 107364380 111155567 114828248
$$ packed form
2637B5517668P10561P87088Q22165Q68234Q17718Q92325R84153Q14339R33014
2628C3147265R18931P91280P91994R15228P73165Q68905R11115Q19192Q85139
2619D0822214Q24010P99077O94628Q29217O08129N06657M89868L86794L32967
2610D6293561L56980K91302K95295L62436L02959L75329L88879L89336L65088
2601D9421165M46880L67063M37931M10032L61334N02658N27781N81483O72736
2592E3729063P44052Q39567Q85214J114168J196745J329943J533437J588463J729616
2583F4690268J950263K155810K328964K517909K725651K914539L069902L279676
2575H5632982L408946L559486L637133L736509L673786L715538L791187L672681
$$ plain form
2567 114828248 118733721 122620599 126462055 130455384 134494901 138537033 142699887 147013970
2559 147013970 151230135 155466160 159695434 163746906 167899200 172007725 176072828 180350191
2551 180350191 184847431 189564678 194722096 200341902 206494023 213269772 220737288 228729693
2543 228729693 237437049 246735063 256466373 266629974 276701860 286488066 295397140 303182978
2535 303182978 309649062 314567895 317924043 319864922 320623921 320322471 319472214 318188597
2527 318188597 316709000 315310883 313782416 311922348 309910365 307225532 303535586 298622026
2519 298622026 292205345 284127179 274307421 263257601 250984184 238120332 225065427
2512 225065427 212105806 199684111 188038462 177099908 166841045 157471838 148736153
$$ packed form
2567A14828248L905473L886878L841456L993329M039517M042132M162854M314083
2559A47013970M216165M236025M229274M051472M152294M108525M065103M277363
2551A80350191M497240M717247N157418N619806O152121O775749P467516P992405
2543B28729693Q707356R298014R731310J0163601J0071886R786206Q909074P785838
2535C03182978O466084M918833L356148J940879P58999l01450q50257j283617
2527C18188597j479597j398117j528467j860068k011983k684833l689946m913560
2519B98622026o416681q078166r819758j1049820j2273417j2863852j3054905
2512B25065427j2959621j2421695j1645649j0938554j0258863r369207q735685
$$ plain form
2505 148736153 140548351 132965941 125774926 119006563 112719566 106669200 101081845 96021362
2497 96021362 91258725 86902372 82875656 79283431 76034831 73020534 70318982 67962970
2489 67962970 65804764 63896599 62188808 60671926 59336987 58150678 57037424 56107926
2481 56107926 55316015 54479991 53644501 52938786 52335831 51645109 51047792 50567665 50106768
2472 50106768 49776162 49423405 49094619 48960472 48702214 48447398 48214433 47880107 47541955
2463 47541955 47077792 46564263 46100663 45551642 44865699 44256212 43622568 42877699 42241247
2454 42241247 41578378 40876786 40249412 39527248 38646423 37911551 37055505 36102544 35074653
2445 35074653 34101661 33167435 32038483 31176905 30231707 29245454 28344243 27418482 26480007
$$ packed form
2505A48736153q187802p582410p191015o768363o286997o050366n587355n060483
2497I6021362m762637m356353m026716l592225l248600l014297k701552k356012
2489F7962970k158206j908165j707791j516882j334939j186309j113254r29498
2481E6107926p91911q36024q35490p05715o02955o90722n97317m80127m60897
2472E0106768l30606l52757l28786j34147k58258k54816k32965l34326l38152
2463D7541955m64163n13529m63600n49021o85943o09487o33644p44869o36452
2454D2241247o62869p01592o27374p22164q80825p34872q56046r52961j027891
2445C5074653r72992r34226j128952q61578r45198r86253r01211r25761r38475
$$ plain form
2436 26480007 25612745 24699146 23782271 22933451 22142385 21329394 20528532 19881710 19160094
2427 19160094 18527139 17963342 17505217 17028510 16586869 16180158 15724093 15387518 15026628
2418 15026628 14627726 14262172 13920593 13579614 13166261 12899663 12607496 12263618 12019266
2409 12019266 11766621 11473306 11282381 11045902 10824737 10685418 10558147 10329130 10155591
2400 10155591 10127215 9832253 9735737 9607713 9400658 9347728 9097927 8981165 8851318 8685119
2390 8685119 8577755 8482780 8361015 8226552 8025757 7917395 7836310 7738551 7660236 7597075
2380 7597075 7588040 7487316 7393832 7366804 7409318 7310484 7288498 7296581 7161853 7099329 7045486
2369 7045486 6938285 6898555 6828380 6745229 6691470 6692571 6650556 6604001 6595446 6589673 6616386 6481522
$$ packed form
2436B6480007q67262r13599r16875q48820p91066q12991q00862o46822p21616
2427A9160094o32955n63797m58125m76707m41641m06711m56065l36575l60890
2418A5026628l98902l65554l41579l40979m13353k66598k92167l43878k44352
2409A2019266k52645k93315j90925k36479k21165j39319j27271k29017j73539
2400A0155591k8376k94962r6516j28024k07055n2930k49801j16762j29847j66199
2390H685119j07364r4975j21765j34463k00795j08362q1085r7759p8315o3161
2380G597075r035j00724r3484k7028M2514r8834k1986Q083j34728o2524n3843
2369G045486j07201l9730p0175q3151n3759J101m2015m6555q555n773K6713j34864
$$ plain form
2357 6481522 6432423 6453095 6336631 6240348 6168509 6023284 6110411 6021587 5917368 5996663 5925252
2346 5925252 5799569 5635090 5580992 5379648 5281632 5187718 5094669 5035853 4932390 4712982
2336 4712982 4663813 4654741 4456749 4430086 4361869 4298327 4202591 4200909 4114525 4075759 4060499 4005676
2324 4005676 3969833 3977804 4020419 3922798 3976528 4006533 3957014 3975716 4042251 4015916 4022323 4004173
2312 4004173 4001675 3998969 4011095 3962917 3802658 3900620 3908524 3797404 3790774 3776616 3733614 3706525
2300 3706525 3683580 3654675 3653550 3657662 3564958 3611631 3631728 3511072 3554728 3538685 3519890 3525874
2288 3525874 3495086 3367854 3504044 3436848 3328981 3357716 3345097 3310610 3317695 3377143 3355283
2277 3355283 3409462 3390075 3398385 3368467 3541753 3473856 3472250 3564033 3520070 3541957 3516182 3636760
$$ packed form
2357F481522m9099K0672j16464r6283p1839j45225Q7127q8824j04219P9295p1411
2346E925252j25683j64479n4098k01344r8016r3914r3049n8816j03463k19408
2336D712982m9169r072j97992k6663o8217o3542r5736j682q6384l8766j5260n4823
2324D005676l5843P971M2615r7621N3730L0005m9519J8702O6535k6335O407j8150
2312D004173k498k706J2126m8178j60259R7962P904j11120o630j4158m3002k7089
2300C706525k2945k8905j125M112r2704M6673K0097j20656M3656j6043j8795N984
2288C525874l0788j27232J36190o7196j07867K8735j2619l4487P085N9448k1860
2277C355283N4179j9387Q310k9918J73286o7897j606R1783m3963K1887k5775J20578
$$ plain form
2265 3636760 3654410 3667834 3666324 3711415 3752216 3768851 3759983 3838023 3918183 3902320 4011285 4059955
2253 4059955 4163855 4150343 4219819 4362250 4407484 4452704 4504513 4562994 4713671 4830164 4834433
2242 4834433 4944863 5057185 5183848 5195965 5340769 5513363 5578299 5716761 5787970 5894262
2232 5894262 6027381 6050139 6139384 6250453 6283352 6303878 6363784 6401316 6512107 6610639 6685052
2221 6685052 6860599 6921974 7058055 7207592 7344546 7564479 7679585 7746787 7961585 8009335
2211 8009335 8106803 8193974 8275843 8485910 8610326 8689449 8744041 8955050 9028261 9103952 9273426
2200 9273426 9350246 9457868 9646197 9795868 10038152 10284484 10482952 10731562 10905371 11203417
2190 11203417 11465462 11732551 12096395 12395870 12677108 12961482 13256484 13647016 14049978
$$ packed form
2265C636760J7650J3424j510M5091M0801J6635q868P8040Q0160j5863J08965M8670
2253D059955J03900j3512O9476J42431M5234M5220N1809N8481J50677J16493M269
2242D834433J10430J12322J26663J2117J44804J72594O4936J38462P1209J06292
2232E894262J33119K2758Q9245J11069L2899K0526N9906L7532J10791R8532P4413
2221F685052J75547O1375J36081J49537J36954K19933J15106O7202K14798M7750
2211H009335R7468Q7171Q1869K10067J24416P9123N4592K11009P3211P5691J69474
2200I273426P6820J07622J88329J49671K42284K46332J98468K48610J73809K98046
2190A1203417K62045K67089L63844K99475K81238K84374K95002L90532M02962
$$ plain form
2181 14049978 14423104 14898097 15484832 15981662 16563254 17182034 17891868 18642504 19359352
2172 19359352 20222782 21120121 22173283 23250501 24464826 25969759 27593714 29307416
2164 29307416 31346528 33527614 36004074 38960632 42204879 45958197 50049381 54756465
2156 54756465 60103752 66669874 74781428 84497122 95464291 106211595 113326763 113412123
2148 113412123 107017136 97312687 87272312 78182836 70638395 64426541 59662509 55784655
2140 55784655 52723646 50530929 48866750 47721308 47004069 46760614 46895438 47588558 48679581
2131 48679581 50302526 52362962 55060257 58232234 61988377 66841095 72918171 80499978
2123 80499978 89601854 99229380 107137180 109785412 105000282 95367292 84143408 73393176
$$ packed form
2181A4049978L73126M74993N86735M96830N81592O18780P09834P50636P16848
2172A9359352Q63430Q97339J053162J077218J214325J504933J623955J713702
2164B9307416K039112K181086K476460K956558L244247L753318M091184M707084
2156E4756465N347287O566122Q111554R715694J0967169J0747304P115168Q5360
2148A13412123o394987r704449j0040375r089476p544441o211854m764032l877854
2140E5784655l061009k192717j664179j145442p17239k43455J34824O93120J091023
2131D8679581J622945K060436K697295L171977L756143M852718O077076P581807
2123H0499978R101876R627526P907800K648232m785130r632990j1223884j0750232
$$ plain form
2115 73393176 64136969 56348059 49967655 44624938 40038087 36438992 33332165 30577718
2107 30577718 28294557 26269242 24449280 22955846 21562312 20302171 19206579 18180224
2099 18180224 17248358 16404788 15629613 14799443 14160263 13447022 12836680 12315493 11768966
2090 11768966 11302881 10904492 10424213 10001451 9652851 9158826 8886489 8526175 8259462
2081 8259462 7998558 7826200 7683929 7453104 7369936 7203776 7060738 6945376 6859076 6617696
2071 6617696 6519948 6266200 6039879 5898397 5744093 5632996 5459506 5369944 5252042 5122395
2061 5122395 5045807 5011347 4738169 4722510 4648459 4416011 4354006 4258412 4149189 4034551 4078441
2050 4078441 3941182 3834524 3875134 3746705 3658650 3718466 3635680 3506762 3465023 3350496
$$ packed form
2115G3393176r256207p788910o380404n342717m586851l599095l106827k754447
2107C0577718k283161k025315j819962j493434j393534j260141j095592j026355
2099A8180224r31866q43570p75175q30170o39180p13241o10342n21187n46527
2090A1768966m66085l98389m80279m22762l48600m94025k72337l60314k66713
2081H259462k60904j72358j42271k30825q3168j66160j43038j15362q6300k41380
2071F617696r7748k53748k26321j41482j54304j11097j73490q9562j17902j29647
2061E122395p6588l4460k73178j5659p4051k32448o2005r5594j09223j14638M3890
2050D078441j37259j06658M0610j28429q8055N9816q2786j28918m1739j14527
$$ plain form
2040 3350496 3268973 3103802 3079288 2959705 2839373 2865538 2776395 2712138 2728324 2709463 2605489
2029 2605489 2682953 2663772 2545541 2513028 2520216 2486021 2422585 2435040 2266206 2260183 2275621
2018 2275621 2100888 2119629 2168866 2017783 1998333 1976564 1893754 1948062 1880298 1904739 1871232
2007 1871232 1835406 1791308 1735411 1730048 1771344 1726718 1716167 1694969 1730110 1669225 1647631 1756014
1995 1756014 1669489 1735945 1690204 1601494 1581193 1561158 1476927 1489080 1487651 1407295 1354917 1268535
1983 1268535 1300148 1286479 1295779 1215277 1318622 1289706 1198119 1234924 1236638 1217793 1280419 1233273
1971 1233273 1107125 1238356 1120056 1076133 1155122 1164561 1093968 1159359 1168772 1150624 1223461
1960 1223461 1209642 1148147 1115089 1184126 1036266 1079020 1148834 1019569 1061089 1076120 1045135
$$ packed form
2040C350496q1523j65171k4514j19583j20332K6165q9143o4257J6186j8861j03974
2029B605489P7464j9181j18231l2513P188l4195o3436J2455j68834o023J5438
2018B275621j74733J8741M9237j51083j9450k1769q2810N4308o7764K4441l3507
2007A871232l5826m4098n5897n363M1296m4626j0551k1198L5141o0885k1594J08383
1995A756014q6525O6456m5741q8710k0301k0035q4231J2153j429q0356n2378q6382
1983A268535L1613j3669R300q0502J03345k8916r1587L6805J714j8845O2626m7146
1971A233273j26148J31231j18300m3923P8989R439p0593O5391R413j8148P2837
1960A223461j3819o1495l3058O9037j47860M2754O9814j29265M1520J5031l0985
$$ plain form
1949 1045135 1053468 1058975 985897 1017198 1055477 1032607 999841 1072660 1021076 933938 942419 892484
1937 892484 986785 897188 858509 919572 884655 898830 914240 930451 957211 983739 920685 931704
1925 931704 997099 929148 894028 959226 890603 891744 928963 869276 929639 930303 878950 802519
1913 802519 883672 828366 765555 817126 756237 826854 803909 724097 784925 746426 678468 729197
1901 729197 762716 746896 773675 767578 741746 779619 792056 703045 744962 779550 660798 696269
1889 696269 703464 705489 692033 690592 627933 639816 646224 571461 545426 614654 614085 543579 542266
1876 542266 559894 568099 580499 578837 583955 589139 606974 575452 645671 647993 595152 672726 709769
1863 709769 695741 686281 650522 648576 682195 626018 605935 645627 654136 642202 658850 679299
$$ packed form
1949A045135Q333N507p3078L1301L8279k2870l2766P2819n1584q7138Q481m9935
1937H92484R4301q9597l8679O1063l4917J4175J5410J6211K6760K6528o3054J1019
1925I31704O5395o7951l5120O5198o8623J141L7219n9687O0363O64n1353p6431
1913H02519Q1153n5306o2811N1571o0889P0617k2945p9812O0828l8499o7958N0729
1901G29197L3519j5820K6779o097k5832L7873J2437q9011M1917L4588j18752L5471
1889F96269P195K025j3456j441o2659J1883O408p4763k6035O9228n69p0506j313
1876E42266J7628Q205J2400j662N118N184J7835l1522P0219K322n2841P7574L7043
1863G09769j4028r460l5759j946L3619n6177k0083L9692Q509j1934J6648K0449
$$ plain form
1851 679299 730280 831209 820912 964846 1055090 950864 1025401 967154 953592 879528 843144
1840 843144 713672 729596 716144 604453 685275 641215 609257 640413 553346 601073 668452
1829 668452 506930 607934 662969 601090 607157 627117 661844 723075 774906 752539 830812
1818 830812 884150 880372 928995 961451 919614 860091 767737 760230 758691 643049 592438 544327
1806 544327 492606 415622 309810 338292 315796 301450 283121 308995 327216 300190 391497
1795 391497 345521 395914 415665 360139 406176 416986 386790 328507 355294 329429 302619 261991
1783 261991 227774 204315 277268 187991 164684 216775 161832 208580 105408 194087 179760
1772 179760 161748 169257 180955 179889 248285 230326 203462 301032 244770 287730 266688 299063
$$ packed form
1851F79299N0981J00929j0297J43934R0244j04226P4537n8247j3562p4064l6384
1840H43144j29472J5924j3452j11691Q0822m4060l1958L1156q7067M7727O7379
1829F68452j61522J01004N5035o1879O067J9960L4727O1231N1831k2367P8273
1818H30812N3338l778M8623L2456m1837n9523r2354p507j539j15642n0611m8111
1806E44327n1721p6984j05812K8482k2496j4346j8329K5874J8221k7026R1307
1795C91497m5976N0393J9751n5526M6037J0810l0196n8283K6787k5865k6810m0628
1783B61991l4217k3459P2953q9277k3307N2091n4943M6748j03172Q8679j4327
1772A79760j8012P509J1698j066O8396j7959k6864R7570n6262M2960k1042L2375
$$ plain form
1760 299063 246902 266735 212557 156766 209474 149300 179967 183440 198250 180199 177743 150850
1748 150850 213044 136909 107276 193515 137527 147283 146050 97217 68605 72381 -8844 -10427
1736 -10427 50713 42785 53000 95704 91269 157862 196308 117093 131942 207841 128992 132288
1724 132288 139333 74917 96169 86717 67588 132673 113450 107995 125448 84960 151040 75368
1712 75368 106765 125189 86965 78890 37499 18512 3309 63413 46777 32866 111673 95650
1700 95650 47892 110862 122087 100782 90128 74225 85871 73180 22666 48752 23149 39564
1688 39564 53113 3393 -4734 50715 5111 61317 118229 88039 120305 132388 177310 106289
1676 106289 107104 66231 80884 10959 -33574 -45176 -35200 30012 -29549 16711 12893 48751
$$ packed form
1760B99063n2161J9833n4178n5791N2708o0174L0667L473J4810j8051k456k6893
1748A50850O2194p6135k9633Q6239n5988R756j233m8833k8612L776q1225j583
1736a0427O1140p928J0215M2704m435O6593L8446p9215J4849P5899p8849L296
1724A32288P045o4416K1252r452j9129O5085j9223n455J7453m0488O6080p5672
1712G5368L1397J8424l8224q075m1391j8987j5203O0104j6636j3911P8807j6023
1700I5650m7758O2970J1225k1305j0654j5903J1646j2691n0514K6086k5603J6415
1688C9564J3549m9720q127N5449m5604N6206N6912l0190L2266J2083M4922p1021
1676A06289Q15m0873J4653o9925m4533j1602R976O5212n9561M6260l818L5858
$$ plain form
1664 48751 61967 142042 126195 122350 139299 75352 80091 28606 60241 15617 52595 -5267
1652 -5267 18874 -72737 -415 45977 -47107 77704 65819 55111 31684 90052 56734 128027
1640 128027 90405 64232 61379 82381 11553 8479 47791 -42723 -22547 -87790 -21666 -41206
1628 -41206 -84677 -27354 4128 -32606 -44206 -71671 -31749 81662 32799 33502 82663 104576
1616 104576 76544 133908 147541 147584 185615 120216 178424 183687 168583 156871 98867 95307 92805
1603 92805 -5561 -6068 66 -12870 -34614 13199 -15356 14140 39364 10122 102184 89024
1591 89024 27727 71350 51822 25590 65701 41048 42455 57376 75082 24573 99766 114851
1579 114851 34363 113317 124452 159757 186185 191403 148022 151210 175356 91062 123846 121915
$$ packed form
1664D8751J3216Q0075j5847l845J6949o3947M739n1485L1635m4624L6978n7862
1652e267K4141r1611P2322M6392r3084J24811j1885j0708k3427N8368l3318P1293
1640A28027l7622k6173k853K1002p0828l074L9312r0514K0176o5243O6124j9540
1628d1206m3471N7323L1482l6734j1600k7465L9922J13411m8863P03M9161K1913
1616A04576k8032N7364J3633M3L8031o5399N8208N263j5104j1712n8004l560k502
1603I2805r8366n07O134j2936k1744M7813k8555K9496K5224k9242R2062j3160
1591H9024o1297M3623j9528k6232M0111k4653J407J4921J7706n0509P5193J5085
1579A14851q0488P8954J1135L5305K6428N218m3381L188K4146q4294L2784j931
$$ plain form
1567 121915 100967 68883 91373 36782 11435 8149 34255 8763 11716 21109 27715 53932
1555 53932 80132 131051 50765 138435 149552 107570 157392 140711 158880 164883 229397 169829
1543 169829 200401 204689 228723 238676 210651 221114 184262 166260 181487 130678 73631 107942
1531 107942 -8645 -14125 20798 -2744 -43124 32517 38591 -18308 104972 41363 86641 149848
1519 149848 100606 132443 160747 191221 177401 172525 183177 182642 171091 209446 184013 158325
1507 158325 204716 136603 115883 167963 91695 42415 95071 99238 111505 100391 23654 89319
1495 89319 63998 76990 82103 115500 72657 79786 95720 34530 134044 35797 17181 50597
1483 50597 7023 -47560 23559 52821 100955 149783 91535 80288 111730 100780 69413 153357
$$ packed form
1567A21915k0948l2084K2490n4591k5347l286K6106k5492K953R393O606K6217
1555E3932K6200N0919q0286Q7670J1117m1982M9822j6681J8169O003O4514n9568
1543A69829L0572M288K4034R953k8025J0463l6852j8002J5227n0809n7047L4311
1531A07942j16587n480L4923k3542m0380P5641O074n6899J23280o3609M5278O3207
1519A49848m9242L1837K8304L0474j3820m876J0652n35j1551L8355k5433k5688
1507A58325M6391o8113k0720N2080p6268m9280N2656M167J2267j1114p6737O5665
1495H9319k5321J2992N113L3397m2843P129J5934o1190R9514r8247j8616L3416
1483E0597m3574n4583P1119K9262M8134M8828n8248j1247L1442j0950l1367Q3944
$$ plain form
1471 153357 69989 93582 66519 15032 31916 8902 -20292 -25552 -32016 -73831 -31893 -67567
1459 -67567 -52719 73980 -22822 -18286 56108 31462 75537 109020 103746 97752 66022 16260
1447 16260 63241 55550 61171 37874 25176 51752 -40803 -59858 -41022 -32696 -41363 -16876 -69464
1434 -69464 -84193 -101442 -61545 -62447 -56987 -3064 -56364 -13095 12134 30532 8111 59620
1422 59620 -15985 -21059 31082 24094 -17280 -14692 -18117 -87250 -26901 -62622 -29393 -43592 57522
1409 57522 47246 -3411 69391 85391 63830 71359 134924 61083 23454 -13961 12721 -54057
1397 -54057 -39114 -49051 -97722 -106876 -112540 -160493 -94475 -14439 -144258 -39595 -16734 -82752
1385 -82752 -52639 -26555 25416 26269 -51657 -70501 -63603 -83811 -56218 -166410 -112815 -131380
$$ packed form
1471A53357q3368K3593k7063n1487J6884k3014k9194n260o464m1815M1938l5674
1459f7567J4848J26699r6802M536P4394k4646M4075L3483n274n994l1730m9762
1447A6260M6981p691N621k3297j2698K6576r2555j9055J8836Q326q667K4487n2588
1434f9464j4729j7249L9897r02N460N3923n3300M3269K5229J8398k2421N1509
1422E9620p5605n074N2141o988m1374K588l425o9133O0349l5721L3229j4199J01114
1409E7522j0276n0657P2802J6000k1561P529O3565p3841l7629l7415K6682o6778
1397e4057J4943r937m8671r154n664m7953O6018Q0036j29819J04663K2861o6018
1385h2752L0113K6084N1971Q53p7926j8844O898k0208K7593j10192N3595j8565
$$ plain form
1373 -131380 -167090 -148887 -87309 -63493 -84482 -44459 -104677 -59262 -56113 -57601 12697 73511
1361 73511 15724 -22306 44266 43441 25969 21700 104161 62882 59889 10769 -35002 -14893 -57367
1348 -57367 -147308 -162576 -69693 -180595 -162760 -163792 -136933 -183937 -193481 -154845 -159000 -116704
1336 -116704 -105577 -82739 -6832 -41939 -134202 12709 -35764 -50382 -866 -84051 -46805
1325 -46805 -31160 -74731 36822 92108 20450 60509 45998 46543 74190 26630 -15487 35757
1313 35757 -33466 -91865 -87867 -141128 -113550 -178197 -204108 -143193 -185267 -183538 -169654 -151289
1301 -151289 -71779 -65140 -112713 -7403 -5895 -97954 -6672 44752 -10285 42437 -29748 -63835
1289 -63835 35200 -73612 -86106 -64454 -73494 -73640 -140671 -129355 -59122 -101645 -139804 -107518
$$ packed form
1373a31380l5710J8203O1578K3816k0989M0023o0218M5415L149j488P0298O0814
1361G3511n7787l8030O6572q25j7472m269Q2461m1279k993m9120m5771K0109m2474
1348e7367q9941j5268R2883j10902J7835j032K6859m7004r544L8636m155M2296
1336a16704J1127K2838P5907l5107r2263J46911m8473j4618M9516q3185L7246
1325d6805J5645m3571J11553N5286p1658M0059j4511N45K7647m7560m2117N1244
1313C5757o9223n8399L998n3261K7578o4647k5911O0915m2074J729J3884J8365
1301a51289P9510O639m7573J05310J508r2059R1282N1424n5037N2722p2185l4087
1289f3835R9035j08812j2494K1652r040j46o7031J1316P0233m2523l8159L2286
$$ plain form
1277 -107518 -116998 -135034 -74289 -61685 -85838 5772 -55899 -68746 58662 18810 -40968 27092
1265 27092 45010 22785 -11548 -31119 59963 71174 55644 12845 11249 65347 36117 -14393
1253 -14393 31981 30565 -56534 -95883 -57060 -45902 -103529 -97598 -137035 -153553 -136657 -134188
1241 -134188 -188503 -133623 -91821 -138401 -81670 -39895 -57879 -58913 40562 -5137 -31770 -7131
1229 -7131 -49062 -70509 20544 -27450 -48259 36895 -51829 -34968 -6991 58910 45898 -8081
1217 -8081 3639 -31908 -42170 -35192 -31614 -40667 895 -28970 -99242 -68709 -3766 -114726
1205 -114726 -37627 16701 -76136 680 -73527 -67267 -19103 -24974 -38379 -93618 -68360 -46828
1193 -46828 -67356 -84984 -13315 -46385 -72776 -41735 -15292 10119 -4483 -38621 1568 48184
$$ packed form
1277a07518r480j8036O0745J2604k4153R1610o1671j2847J27408l9852n9778O8060
1265B7092J7918k2225l4333j9571R1082J1211j5530m2799j596N4098k9230n0510
1253a4393M6374j416q7099l9349L8823J1158n7627N931l9437j6518J6896K469
1241a34188n4315N4880M1802m6580N6731M1775j7984j034R9475m5699k6633K4639
1229g131m1931k1447R1053m7994k0809Q5154q8724J6861K7977O5901j3012n3979
1217h081J1720l5547j0262O978L578r053M1562k9865p0272L0533O4943j10960
1205a14726P7099N4328r2837P6816p4207O260M8164n871j3405n5239K5258K1532
1193d6828k0528j7628P1669l3070k6391L1041K6443K5411j4602l4138M0189M6616
$$ plain form
1181 48184 -53978 -34152 -65681 -2997 -6322 -53179 11868 -63802 -44641 -59557 -28569 -234
1169 -234 -17178 -61154 -31913 1379 -36895 -24290 -34352 2057 -15958 -13588 -50875 17286
1157 17286 -35209 -57403 13793 9999 52251 51271 24962 16376 119160 17175 -36844 75193
1145 75193 15144 -54386 -45592 -77661 -154451 -49218 -140785 -132906 -31104 -117876 -115277 -30318
1133 -30318 11825 45237 84249 46752 85174 29085 -646 37230 70929 16993 -17790 -26369
1121 -26369 -67676 -2046 -98364 -56363 43759 18075 12997 25259 51196 -1879 102321 121237
1109 121237 49274 106543 73808 -48270 28169 5317 -64800 -1371 11408 -54602 -66685
1098 -66685 -13346 -33309 7082 20679 -59631 -66550 -8019 -51304 -48490 41847 -682 -14185
$$ packed form
1181D8184j02162J9826l1529O2684l325m6857O5047p5670J9161j4916L0988K8335
1169b34j6944m3976K9241L3292l8274J2605j0062L6409j8015K370l7287O8161
1157A7286n2495k2194P1196l794M2252r80k6309q586J02784j01985n4019J12037
1145G5193o0049o9530Q794l2069p6790J05233r1567P879J01802q6772K599Q4959
1133c0318M2143L3412L9012l7497L8422n6089k9731L7876L3699n3936l4783q579
1121b6369m1307O5630r6318M2001J00122k5684n078J2262K5937n3075J04200J8916
1109A21237p1963N7269l2735j22078P6439k2852p0117O3429J2779o6010j2083
1098f6685N3339j9963M0391J3597q0310o919N8531m3285K814R0337m2529j3503
$$ plain form
1086 -14185 56309 57072 103920 168798 109095 155799 158549 111995 102277 129677 92708 113030 80633
1073 80633 -10044 38766 37720 5997 84328 103927 42183 144355 104362 131770 180704 214230
1061 214230 227673 278985 273822 218994 300547 279258 255733 209831 255485 201595 196541 164654
1049 164654 128489 137245 121513 155094 114362 143472 167235 180616 136795 206839 184791 230562
1037 230562 289058 234301 317967 292538 316434 325349 360189 421532 463474 456535 492215 534919
1025 534919 585328 634140 637495 632632 681232 676488 651044 792052 769813 773352 899808 893221
1013 893221 878103 1017045 987532 1061267 1196853 1201653 1251983 1421843 1449688 1584830 1745875
1002 1745875 1728062 1932335 2037231 2177672 2406251 2675693 2985454 3375008 3818554 4289970
$$ packed form
1086a4185P0494P63M6848O4878n9703M6704K750m6554r718K7400l6969K0322l2397
1073H0633r0677M8810j046l1723P8331J9599o1744J02172l9993K7408M8934L3526
1061B14230J3443N1312n163n4828Q1553k1289k3525m5902M5654n3890n054l1887
1049A64654l6165Q756j5732L3581m0732K9110K3763J3381m3821P0044k2048M5771
1037B30562N8496n4757Q3666k5429K3896Q915L4840O1343M1942o939L5680M2704
1025E34919N0409M8812L355m863M8600m744k5444J41008k2239L539J26456o587
1013H93221j5118J38942k9513P3735J35586M800N0330J69860K7845J35142J61045
1002A745875j7813K04273J04896J40441K28579K69442L09761L89554M43546M71416
$$ plain form
992 4289970 4973830 5820211 6961459 8307782 9660254 9793675 8792212 7428392 6136815
983 6136815 5107147 4287268 3765024 3199292 2732999 2388494 2102119 1851262 1790208 1663547
973 1663547 1548461 1542870 1441272 1338544 1252858 1141987 1070177 1021770 930392 877932 844071
962 844071 766226 698058 670922 699356 649671 629043 592103 523273 434705 439698 387657 307025
950 307025 386107 283868 235269 271062 262325 202940 233787 250038 279420 304188 242097 295698
938 295698 307435 332778 290620 251909 230237 244452 216643 191855 248457 255219 180955 140082
926 140082 200091 117208 165378 194059 192733 262641 194916 100856 182980 220309 218913 252307
914 252307 200316 210665 194335 135132 108283 167342 96383 66635 69799 34355 55324 71150
$$ packed form
992D289970O83860Q46381J141248J346323J352472J33421j001463j363820j291577
983F136815j029668q19879n22244n65732m66293l44505k86375k50857o1054j26661
973A663547j15086n591j01598j02728q5686j10871p1810m8407r1378n2460l3861
962H44071p7845o8168k7136K8434m9685k0628l6940o8830q8568M993n2041q0632
950C07025P9082j02239m8599L5793q737n9385L0847J6251K9382K4768o2091N3601
938B95698J1737K5343m2158l8711k1672J4215k7809k4788N6602O762p4264m0873
926A40082O0009q2883M8170K8681j326O9908o7725r4060Q2124L7329j396L3394
914B52307n1991J0349j6330n9203k6849N9059p0959k9748L164l5444K0969J5826
$$ plain form
902 71150 -12863 42387 100002 6450 40483 21910 42810 3549 28769 45158 63031 58358
890 58358 37360 74866 128148 111758 40634 91742 85796 57003 5704 60823 52693 46157 86736
877 86736 46755 42515 107766 88901 53609 164504 66519 -68642 6572 -7676 -21228 30306
865 30306 -19228 7509 46962 28496 34359 77674 117613 83034 57872 68985 58992 72138
853 72138 21064 8183 41927 -13698 -11786 -6401 -17344 -4854 8777 -36320 13050 61801
841 61801 53132 29702 68207 38599 -32947 2990 -54788 -13575 6379 -41449 14983 49305
829 49305 -15809 16381 54576 13518 63505 90481 48423 33507 43861 -86795 -85890 -32511
817 -32511 -102248 -114633 -68292 -87748 -92630 -8513 -29922 -33024 24940 29372 59166 87230 34145
$$ packed form
902G1150q4013N5250N7615r3552L4033j8573K0900l9261K5220J6389J7873m673
890E8358k0998L7506N3282j6390p1124N1108n946k8793n1299N5119q130o536M0579
877H6736l9981m240O5251j8865l5292J10895r7985j35161P5214j4248j3552N1534
865C0306m9534K6737L9453j8466N863M3315L9939l4579k5162J1113r993J3146
853G2138n1074j2881L3744n5625J912N385j0943J2490J3631m5097M9370M8751
841F1801q669k3430L8505k9608p1546L5937n7778M1213J9954m7828N6432L4322
829D9305o5114L2190L8195m1058M9987K6976m2058j4916J0354j30656R05N3379
817c2511o9737j2385M6341j9456m882Q4117k1409l102N7964M432K9794K8064n3085
$$ plain form
804 34145 37953 24601 16156 25275 -16238 13686 -33705 -33471 -42891 -33869 -29223 -71279 19186 3289
790 3289 -15586 -9731 -61658 -19246 25869 -35173 -49465 -35159 -57441 -46452 -53709 -42613 -42424
777 -42424 12851 -16013 18596 57054 -13373 838 -12399 6251 -10883 -25722 -75990 -29507
765 -29507 -53708 -71468 5639 17048 -22940 14741 3727 -30593 25325 29014 -35397 -28944
753 -28944 -48833 -131131 -113962 -72023 -120241 -62679 -44776 -88438 -36952 -35826 -122786 -52138
741 -52138 -10149 -107964 -8067 -39856 -61931 -20089 -38284 -39371 17432 38292 -22542 32845
729 32845 15872 -6501 60132 32182 -33324 -5136 -54250 -77743 -79021 -76700 -94962 -132618
717 -132618 -62646 -97919 -16150 -21758 -83423 -3643 -5430 -29415 -10726 -2939 -8753 -17208 -38665
$$ packed form
804C4145L808j3352q445R119m1513K9924m7391K34r420R022M646m2056R0465j5897
790C289j8875N855n1927M2412M5115o1042j4292J4306k2282J0989p257J1096J89
777d2424N5275k8864L4609L8458p0427J4211j3237J8650j7134j4839n0268M6483
765b9507k4201j7760P7107J1409l9988L7681j1014l4320N5918L689o4411O453
753b8944j9889q2298J7169M1939m8218N7562J7903m3662N1486J126q6960P0648
741e2138M1989r7815R9897l1789k2075M1842j8195j087N6803K0860o0834N5387
729C2845j6973k2373O6633k7950o5506K8188m9114k3493j278K321j8262l7656
717a32618O9972l5273Q1769n608o1665P9780j787k3985J8689P787n814q455k1457
$$ plain form
704 -38665 -82812 -678 13964 -67507 -6305 -1963 -38555 32271 -6937 14871 101951 50954
692 50954 -19127 14139 51666 -64302 -74332 -84954 -117097 -83891 -117508 -39822 -4865 -15104
680 -15104 -32940 27789 91701 81501 66142 58574 69073 75460 -19890 -40208 10542 -83594
668 -83594 -57616 -92208 -92917 -118649 -126392 -107195 -126249 -46350 -89531 -106716 8054 -17638
656 -17638 -74413 12 -22526 -53963 -22933 -56087 -78156 24204 -28931 -79920 47130 -12046
644 -12046 -45312 8863 -21371 -34795 81787 -10097 -25229 86525 12972 -22013 102072
633 102072 69061 4755 67894 2028 -43761 -59848 -68299 -141013 -80678 -112626 -220167 -164320
621 -164320 -130026 -178275 -112664 -1381 -34141 -7783 1645 64982 98297 84941 141089 83454
$$ packed form
704c8665m4147Q2134J4642q1471O1202M342l6592P0826l9208K1808Q7080n0997
692E0954p0081L3266L7527j15968j0030j0622l2143L3206l3617P7686L4957j0239
680a5104j7836O0729O3912j0200j5359p568J0499O387r5350k0318N0750r4136
668h3594K5978l4592p09k5732p743J9197j9054P9899m3181j7185J14770k5692
656a7638n6775P4425k2538l1437L1030l3154k2069J02360n3135n0989J27050n9176
644a2046l3266N4175l0234j3424J16582r1884j5132J11754p3553l4985J24085
633A02072l3011o4306O3139o5866m5789j6087q451p2714O0335l1948j07541N5847
621a64320L4294m8249O5611J11283l2760K6358R428O3337L3315j3356N6148n7635
$$ plain form
609 83454 38004 23968 -19748 -862 -11514 -90418 -99307 -97690 -76208 -128636 -128343 -49059 -136393
596 -136393 -85875 -33352 -96240 -25001 -4701 -29197 -7362 42368 -15972 -59094 4591 14023
584 14023 6519 -13720 359 45887 -995 -10550 -15176 -53538 -18358 -87909 -121064 -37877 -17466
571 -17466 -85986 -66826 29972 -35088 -22085 -6416 -24086 -15512 -29075 -17201 -92188 -72964
559 -72964 -83873 -185715 -122180 -108750 -189830 -128521 -136914 -80960 -38461 -47891 -7804 -29237
547 -29237 84035 107816 61686 97924 130151 34235 24551 91369 7215 -39336 -20224 -83331
535 -83331 -124942 -79545 -142281 -147554 -105932 -68087 -144012 -62729 -12927 -64272 -40029 -4364
523 -4364 -9451 -60784 -60526 -92357 -91541 -66693 -19089 -59005 -9558 -23655 -49825 -22164 13637
$$ packed form
609H3454m5450j4036m3716J8886j0652p8904q889J617K1482n2428K93P9284q7334
596a36393N0518N2523o2888P1239K0300k4496K1835M9730n8340m3122O3685R432
584A4023p504k0239J4079M5528m6882r555m626l8362L5180o9551l3155Q3187K0411
571a7466o8520J9160R6798o5060J3003J5669j7670Q574j3563J1874p4987J9224
559g2964j0909j01842O3535J3430q1080O1309q393N5954M2499r430M0087k1433
547b9237J13272K3781m6130L6238L2227r5916r684O6818q4154m6551J9112o3107
535h3331m1611M5397o2736n273M1622L7845p5925Q1283M9802n1345K4243L5665
523d364n087n1333K58l1831Q16K4848M7604l9916M9447j4097k6170K7661L5801
$$ plain form
510 13637 23941 13715 51959 18172 28412 44851 -3288 10851 -5499 -60099 -76615 -63144
498 -63144 -70675 -83398 -55527 -76063 -119683 -92101 -55975 -56884 9820 17896 -18349 -14245 28167
485 28167 6907 5784 -1386 5381 -49258 -81458 -34334 -112981 -108037 -23589 -52485 5115 -14869
472 -14869 -68063 5946 55310 80713 72545 56645 68807 17731 -38807 9049 9317 -84973 -53962
459 -53962 -76664 -111132 -65666 -120817 -141530 -33800 -59342 -104944 -31575 -905 -8386 -12332
447 -12332 60674 36689 36563 27429 5423 28721 39319 24464 -17228 17648 44099 -1472 8293
434 8293 61993 31888 -8570 62739 15240 -48098 10526 -33921 -109440 2943 -38334 -122603
422 -122603 -65455 -42833 -87698 -38299 25436 -47934 -33470 14470 -32944 -19138 60297 9811
$$ packed form
510A3637J0304j0226L8244l3787J0240J6439m8139J4139j6350n4600j6516J3471
498f3144p531j2723K7871k0536m3620K7582L6126r09O6704Q076l6245M104M2412
485B8167k1260j123p170O767n4639l2200M7124p8647M944Q4448k8896N7600j9984
472a4869n3194P4009M9364K5403q168j5900J2162n1076n6538M7856K68r4290L1011
459e3962k2702l4468M5466n5151k0713J07730k5542m5602P3369L0670p481l946
447a2332P3006k3985j26r134k2006K3298J0598j4855m1692L4876K6451m5571R765
434H293N3700l0105m0458P1309m7499o3338N8624m4447p5519J12383m1277q4269
422a22603N7148K2622m4865M9399O3735p3370J4464M7940m7414J3806P9435n0486
$$ plain form
410 9811 -23695 36290 -45962 -64978 26013 -21666 -76721 12794 19859 4429 10609 -16523 -8476
397 -8476 5251 -14817 -740 -26401 -41492 3812 -39466 -61601 -19762 -21419 -79348 29016
385 29016 -17338 -25655 46560 -42784 946 50581 30102 -12628 27691 67556 55987 60756
373 60756 18514 -5572 40623 16820 27918 16357 22825 16994 -32490 -33813 -76362 -56940 -119252
360 -119252 -129316 -73732 -103878 -87783 -74227 -37235 5699 -19837 17749 55023 75231 75926
348 75926 17422 98591 60035 42780 41577 -14063 24193 -21901 -30408 8487 -12119 -25600
336 -25600 -13321 -24663 43450 16505 -37286 22415 92879 39568 15597 6916 -26959 9407
324 9407 -13646 -57636 39310 10915 -116268 -65176 7267 -31640 -51114 -18942 -34686 54719
$$ packed form
410I811l3506N9985q2252j9016R0991m7679n5055Q9515P065j5430O180k7132Q047
397h476J3727k0068J4077k5661j5091M5304m3278k2135M1839j657n7929J08364
385B9016m6354q317P2215q9344M3730M9635k0479m2730M0319L9865j1569M769
373F0756m2242k4086M6195k3803J1098j1561O468n831m9484j323m2549J9422o2312
360a19252j0064N5584l0146J6095J3556L6992M2934k5536L7586L7274K0208O95
348G5926n8504Q1169l8556j7255j203n5640L8256m6094q507L8895k0606j3481
336b5600J2279j1342O8113k6945n3791N9701P0464n3311k3971q681l3875L6366
324I407k3053m3990R6946k8395j27183N1092P2443l8907j9474L2172j5744Q9405
$$ plain form
312 54719 -32877 -70995 21280 7419 -19221 -44714 -28915 564 -25038 -55204 30033 -45575
300 -45575 -39190 -46370 13567 6620 10834 17023 -14469 93229 20359 -24879 42994 -1885 -28115
287 -28115 -12632 -47918 27872 18307 -64877 -7626 44013 56806 -1408 23711 37240 47184
275 47184 23572 -11741 -2149 60 -46843 -57110 40850 -61403 -96301 -25397 -67265 -58379
263 -58379 -57368 -103762 -68676 -49691 -51878 -89016 52328 27240 -42572 54500 -20292 -21079 57195
250 57195 -37720 24656 92602 -16668 -6169 34437 4017 -41417 -3020 -37657 -16606 -3960
238 -3960 -60364 10769 31410 17578 -4305 83062 28300 90212 78720 -30344 109045 6186
226 6186 -114862 -6063 -9841 -120858 -48987 -116219 -100482 -47494 -83408 -34215 51619 25636
$$ packed form
312E4719q7596l8118R2275j3861k6640k5493J5799K9479k5602l0166Q5237p5608
300d5575O385p180N9937o947M214O189l1492J07698p2870m5238O7873m4879k6230
287b8115J5483l5286P5790r565q3184N7251N1639J2793n8214K5119J3529R944
275D7184k3612l5313R592K209m6903j0267R7960j02253l4898P0904m1868Q886
263e8379J011m6394L5086J8985k187l7138J41344k5088o9812R7072p4792p87P8274
250E7195r4915O2376O7946j09270J0499M0606l0420m5434L8397l4637K1051J2646
238c960n6404P1133K0641j3832k1883Q7367n4762O1912j1492j09064J39389j02859
226F186j21048J08799l778j11017P1871o7232J5737N2988l5914M9193Q5834k5983
$$ plain form
214 25636 -11735 59123 -5837 35963 39235 -24868 53303 21186 -101212 -92057 -32698 -112463
202 -112463 -48858 -57414 -73592 43100 -1047 36909 59564 84188 66343 11845 28802 52307
190 52307 -22802 38151 6593 -14799 -25686 -100272 -42903 -11416 6052 -10920 60124 54079
178 54079 -3194 -13394 -7323 39290 -29742 -40260 -63406 -63880 -93938 -99166 -21990 19170 11971
165 11971 51341 32138 126408 142331 58975 107623 35966 42226 -62122 -98706 -104550 -111106
153 -111106 -131685 -178374 -77927 -44682 -150036 -30183 36543 4508 103131 55135 115788
142 115788 142517 53871 49710 104836 102010 12291 19544 -18569 -25568 -48337 -30675 -20608 -15739
129 -15739 -10013 7416 -2590 30672 37732 -26557 7163 -5145 -13795 -73975 -691 -57765 -80687
$$ packed form
214B5636l7371P0858o4960M1800L272o4103P8171l2117j22398R155N9359p9765
202a12463O3605q556j6178J16692m4147L7956K2655K4624j7845n4498J6957K3505
190E2307p5109O0953l1558k1392j0887p4586N7369L1487J7468j6972P1044o045
178E4079n7273j0200O071M6613o9032j0518k3146m74l0058n228P7176M1160p199
165A1971L9370j9203R4270J5923q3356M8648p1657O260j04348l6584n844o556
153a11106k0579m6689J00447L3245j05354J19853O6726l2035R8623m7996O0653
142A15788K6729q8646m161N5126k826q9719P253l8113o999k2769J7662J0067M869
129a5739N726J7429j0006L3262P060o4289L3720j2308q650o0180P3284n7074k2922
$$ plain form
116 -80687 7237 -55450 -33619 -23227 -31464 -11564 21519 20283 -8788 -25895 49902 -30723
104 -30723 17368 27194 -33321 68592 3915 29366 54203 46962 61095 57119 69036 -4468
92 -4468 20503 -15668 -82651 -25120 -80133 -106636 -35515 -68264 -73568 -2103 -2209 -38469 25299
79 25299 17395 -37652 35818 17931 -3889 44691 -24269 1129 -26799 14898 25930 -26534
67 -26534 28584 -17512 57686 32237 16474 46585 -3593 -37391 -31523 -56313 -59903 -71375 -107860
54 -107860 -121211 -83893 -74881 -119919 34811 -29865 -34207 66704 -4200 26949 95143 25970
42 25970 -8448 87780 -23156 -31336 -5658 -49578 -48310 -37384 -39126 16425 -10139 -18977 64506
29 64506 44239 95794 94598 33316 46542 67146 4226 -44134 2604 -26699 -88811 -98367 -57140
$$ packed form
116h0687Q7924o2687K1831J0392q237J9900L3083j236k9071j7107P5797q0625
104c0723M8091R826o0515J01913o4677K5451K4837p241J4133l976J1917p3504
92d468K4971l6171o6983N7531n5013k6503P1121l2749n304P1465j06l6260O3768
79B5299p904n5047P3470j7887k1820M8580o8960K5398k7928M1697J1032n2464
67b6534N5118m6096P5198k5449j5763L0111n0178l3798N868k4790l590j1472l6485
54a07860j3351L7318R012m5038J54730o4676m342J00911p0904L1149O8194o9173
42B5970l4418R6228j10936q180K5678m3920J268J0926j742N5551k6564q838Q3483
29F4506k0267N1555j196o1282J3226K0604o2920m8360M6738k9303o2112r556M1227
$$ plain form
16 -57140 -47148 -77798 -63193 -44035 -74436 -28270 6274 -37333 60745 54995 -67569 32672
4 32672 77830 -13586 23130 91338
0 91338
$$ packed form
16e7140R992l0650J4605J9158l0401M6166L4544m3607R8078n750j22564J00241
4C2672M5158r1416L6716O8208
0I1338
$$ Imaginary data points
##PAGE= N=2
##DATA TABLE= (X++(I..I)), XYDATA
$$ plain form
16383 -2856918 -2793838 -2794014 -2781368 -2703017 -2707109 -2720156 -2632983 -2606514 -2590686 -2544289 -2433619 -2434257
16371 -2434257 -2437926 -2322198 -2320202 -2317184 -2241325 -2228805 -2244902 -2186358 -2185895 -2190643 -2126703 -2076252
16359 -2076252 -2100148 -2045626 -1980277 -1960366 -1931241 -1847643 -1751743 -1802834 -1707296 -1687222 -1730319
16348 -1730319 -1676674 -1666024 -1668280 -1670257 -1665396 -1683848 -1619438 -1567338 -1578291 -1548100 -1441362 -1458762
16336 -1458762 -1362122 -1290884 -1292573 -1226294 -1187905 -1166627 -1171198 -1096725 -1120187 -1133985 -1082738 -1084632
16324 -1084632 -1096439 -1059595 -1031303 -990994 -953230 -929880 -896326 -827444 -811517 -838608 -752764
16313 -752764 -752778 -739535 -734003 -730700 -673089 -699068 -680243 -611465 -549653 -497958 -511832 -424577
16301 -424577 -326419 -329516 -319622 -319748 -254855 -260307 -259990 -249389 -230824 -190952 -206894 -224367 -116858
$$ packed form
16383b856918O3080j76J2646P8351m092j3047Q7173K6469J5828M6397J10670o38
16371b434257l669J15728J996L018P5859J2520j6097N8544M63m748O3940N0451
16359b076252k3896N4522O5349J9911K9125Q3598R5900n1091R5538K0074m3097
16348a730319N3645J0650k256j977M861j8452O4410N2100j0953L0191J06738j7400
16336a458762R6640P1238j689O6279L8389K1278m571P4473k3462j3798N1247j894
16324a084632j1807L6844K8292M0309L7764K3350L3554O8882J5927k7091Q5844
16313g52764j4J3243N532L303N7611k5979J8825O8778O1812N1695j3874Q7255
16301d24577R8158l097R894j26O4893n452L17J0601J8565L9872j5942j7473J07509
$$ plain form
16288 -116858 -70198 -97616 -88415 -42960 -42406 -68937 10526 1401 -8390 -966 -17853 35308 90431
16275 90431 42950 65973 202418 184417 183383 245051 277039 366412 406123 343744 421384 448317
16263 448317 399722 439408 456895 485378 462849 516182 534839 554960 640878 587314 652770
16252 652770 721115 655310 654759 667080 648187 635363 659790 718130 657815 705638 774879 748879
16240 748879 840349 868908 921450 913272 914135 921435 850136 904184 941264 898556 909161 895413
16228 895413 854353 883746 954098 992902 987187 1092733 1041472 1069606 1201415 1178302 1242153
16217 1242153 1273409 1251377 1200970 1234281 1163770 1147811 1249420 1161549 1183014 1221030 1115838
16206 1115838 1199345 1235911 1235932 1364191 1300580 1305880 1327847 1320864 1351409 1367659 1400148 1367576
$$ packed form
16288a16858M6660k7418R201M5455N54k6531P9463r125r791P424j6887N3161N5123
16275I0431m7481K3023J36445j8001j034O1668L1988Q9373L9711o2379P7640K6933
16263D48317m8595L9686J7487K8483k2529N3333J8657K0121Q5918n3564O5456
16252F52770O8345o5805n51J2321j8893j2824K4427N8340o0315M7823O9241k6000
16240G48879R1470K8559N2542q178Q63P300p1299N4048L7080m2708J0605j3748
16228H95413m1060K9393P0352L8804n715J05546n1261K8134J31809k3113O3851
16217A242153L1256k2032n0407L3311p0511j5959J01609q7871K1465L8016j05192
16206A115838Q3507L6566K1J28259o3611N300K1967o983L0545J6250L2489l2572
$$ plain form
16194 1367576 1418307 1342667 1387712 1493430 1470867 1514369 1574521 1546296 1584791 1541650 1561986
16183 1561986 1652640 1544950 1538151 1476652 1439190 1451230 1439675 1413403 1454926 1525585 1430622
16172 1430622 1451422 1583546 1588084 1575645 1655711 1665767 1654201 1694382 1630979 1645503 1695046
16161 1695046 1651197 1618859 1661040 1693711 1697619 1707415 1762202 1814384 1789896 1764563 1751823 1838177
16149 1838177 1822021 1739851 1788917 1825314 1790852 1766318 1740342 1741262 1778062 1693987 1743432 1812735
16137 1812735 1745216 1774524 1762171 1805952 1784594 1792458 1722688 1816390 1883019 1738776 1806035
16126 1806035 1883225 1793825 1872723 1944200 1840051 1981805 1907555 1810211 1866079 1918449 1865262
16115 1865262 1841933 1879696 1860236 1875317 1823265 1851902 1937686 1949028 1882377 1934635 2036618
$$ packed form
16194A367576N0731p5640M5045J05718k2563M3502O0152k8225L8495m3141K0336
16183A561986R0654j07690o799o1499l7462J2040j1555k6272M1523P0659r4963
16172A430622K0800J32124M538j2439Q0066J0056j1566M0181o3403J4524M9543
16161A695046m3849l2338M2181L2671L908R796N4787N2182k4488k5333j2740Q6354
16149A838177j6156q2170M9066L6397l4462k4534k5976R20L6800q4075M9445O9303
16137A812735o7519K9308j2353M3781k1358P864o9770R3702O6629j44243O7259
16126A806035P7190q9400P8898P1477j04149J41754p4250r7344N5868N2370n3187
16115A865262k3329L7763j9460J5081n2052K8637Q5784J1342o6651N2258J01983
$$ plain form
16104 2036618 2023302 2004603 2037000 2104841 2092893 1987387 1930787 1973489 1923611 1894227 1889471
16093 1889471 1939638 1960518 1913595 1904742 1889909 1972768 1935754 1905924 1993501 1937023 1889552
16082 1889552 1933510 1944405 1923979 1997481 1944529 1894050 1988109 1963930 1946001 2039197 2109803
16071 2109803 2067864 2082063 2075759 2059808 2093417 2080123 2021590 2078246 2055197 1948521 1983277
16060 1983277 1953474 1949492 1924713 1912176 1939028 1976350 1953888 2008447 2028915 2016899 2035736
16049 2035736 2048611 2075214 2080960 2163086 2098812 2109837 2177445 2127656 2091603 2096479 2047662 2042915
16037 2042915 2040577 1991783 1964856 1999501 1947057 1891783 2006596 1912390 1929643 2001473 1932625
16026 1932625 1981180 2069011 1963546 1974633 2114781 2033234 2034821 2154463 2070737 2109319 2153582
$$ packed form
16104B036618j3316j8699L2397O7841j1948j05506n6600M2702m9878k9384m756
16093A889471N0167K0880m6923q853j4833Q2859l7014k9830Q7577n6478m7471
16082A889552M3958J0895k0426P3502n2952n0479R4059k4179j7929R3196P0606
16071B109803m1939J4199o304j5951L3609j3294n8533N6656k3049j06676L4756
16060A983277k9803l982k4779j2537K6852L7322k2462N4559K0468j2016J8837
16049B035736J2875K6603N746Q2126o4274J1025O7608m9789l6053M876m8817m747
16037B042915k338m8794k6927L4645n2444n5274J14813r4206J7253P1830o8848
16026A932625M8555Q7831j05465J1087J40148q1547J587J19642q3726L8582M4263
$$ plain form
16015 2153582 2010518 2139735 2154998 2045983 2099016 2108526 2132865 2086285 2098061 2121449 2146303
16004 2146303 2170189 2083680 2105002 2093202 2041227 2050494 2041082 2066174 2040452 2004521 2043133 2063592
15992 2063592 2076924 2017856 1985165 2050183 1978369 1957782 2019664 1998519 2018916 2040105 1997837
15981 1997837 2043506 2085099 1994385 2099843 2142681 2068509 2087601 2132413 2121051 2127694 2131764
15970 2131764 2046206 2097490 2045226 1948587 1988400 2006511 1954140 1977816 2001172 1951122 2042711
15959 2042711 2013805 2021602 2138688 2168442 2112129 2247846 2195199 2210705 2252002 2202689 2219580
15948 2219580 2128645 2115042 2015649 2055592 2062468 2012013 2021262 2023638 2008598 1968797 2011732 2074469
15936 2074469 2058629 2018618 2043855 1990747 2053629 1982037 1997941 2060071 2019607 2009789 1982010
$$ packed form
16015B153582j43064J29217J5263j09015N3033R510K4339m6580J1776K3388K4854
16004B146303K3886q6509K1322j1800n1975R267r412K5092k5722l5931L8612K0459
15992B063592J3332n9068l2691O5018p1814k0587O1882k1145K0397K1189m2268
15981A997837M5669M1593r0714J05458M2838p4172J9092M4812j1362O643M070
15970B131764q5558N1284n2264r6639L9813J8111n2371K3676K3356n0050R1589
15959B042711k8906P797J17086K9754n6313J35717n2647J5506M1297m9313J6891
15948B219580r0935j3603r9393L9943O876n0455R249K376j5040l9801M2935O2737
15936B074469j5840m0011K5237n3108O2882p1592J5904O2130m0464r818k7779
$$ plain form
15925 1982010 2051478 2031680 2062393 2094217 2101053 2103810 2066273 2070043 2109640 2124099 2075232 2061131
15913 2061131 2083702 2089829 2030265 2044606 2095962 2156529 2095707 2059925 2153487 2089186 2130189
15902 2130189 2122433 2106404 2130773 2122387 2045337 2074725 2072005 2009344 2002995 1989502 1983417 1997154
15890 1997154 1989940 1952311 2041921 2089280 2020420 2109452 2154448 2099519 2044300 2081231 2116323
15879 2116323 2062492 2085354 2055654 2058402 2113704 2033677 2005060 2091770 2073500 2073086 2092166 2097099
15867 2097099 2077335 2023350 2027597 2046569 2065946 2056518 2018567 2023472 2047060 2088045 2060789 2092723
15855 2092723 2129890 2086226 2034532 2130552 2148155 2107434 2197310 2127604 2085253 2124746 2067954
15844 2067954 2016609 2146700 2109454 2033738 2053421 2051108 2038147 2007383 2013788 2011265 2034361 1993203
$$ packed form
15925A982010O9468j9798L0713L1824O836K757l7537L770L9597J4459m8867j4101
15913B061131K2571O127n9564J4341N1356O0567o0822l5782R3562o4301M1003
15902B130189p756j6029K4369q386p7050K9388k720o2661o349j3493o085J3737
15890A997154p214l7629Q9610M7359o8860Q9032M4996n4929n5219L6931L5092
15879B116323n3831K2862k9700K748N5302q0027k8617Q6710j8270m14J9080M933
15867B097099j9764n3985M247J8972J9377r428l7951M905K3588M0985k7256L1934
15855B092723L7167m3664n1694R6020J7603m0721Q9876o9706m2351L9493n6792
15844B067954n1345J30091l7246p5716J9683k313j2961l0764O405k523K3096m1158
$$ plain form
15832 1993203 1961564 1913206 1926799 1962383 1921713 1982561 2040930 2023243 2016023 2112509 2096648
15821 2096648 2118563 2154172 2122812 2143907 2170045 2173507 2084469 2148004 2144297 2035962 2035869 2072660
15809 2072660 2045191 2036877 2129048 2034990 2090637 2114960 2043898 2131314 2155627 2081052 2068317
15798 2068317 2096732 2053694 2075497 2137928 2074576 2042612 2073705 1966095 1994729 2084132 1957690
15787 1957690 1970744 1964725 1918954 1939617 1967118 1945354 1985286 2057961 2065368 2117351 2134022 2170687
15775 2170687 2164826 2239679 2248318 2249861 2216748 2175635 2120843 2058176 2005484 1962670 1931112 1943327
15763 1943327 1935961 1890900 1968894 2026179 1991190 2134700 2130226 2097764 2185984 2205581 2159001
15752 2159001 2120116 2159196 2013263 2028471 2104133 1986073 1963899 2061673 1997645 2006103 2079221
$$ packed form
15832A993203l1639m8358J3593L5584m0670O0848N8369j7687p220R6486j5861
15821B096648K1915L5609l1360K1095K6138L462q9038O3535l707j08335r3L6791
15809B072660k7469q314R2171r4058N5647K4323p1062Q7416K4313p4575j2735
15798B068317K8415m3038K1803O2431o3352l1964L1093j07610K8634Q9403j26442
15787A957690J3054o019m5771K0663K7501k1764L9932P2675P407N1983J6671L6665
15775B170687n861P4853Q639J543l3113m1113n4792o2667n2692m2814l1558J2215
15763A943327p366m5061P7994N7285l4989J43510m474l2462Q8220J9597m6580
15752B159001l8885L9080j45933J5208P5662j18060k2174R7774o4028Q458P3118
$$ plain form
15741 2079221 2041905 2108490 2078498 2108874 2078082 2080680 2108537 2072220 2097550 2079285 2060730
15730 2060730 2003781 2080031 2064941 2076000 2100326 2099897 2084067 2094039 2084126 2021004 2119107 2065661
15718 2065661 1972806 1974794 2000864 1983299 2052816 2031093 2011941 2114237 2098553 2127352 2196447
15707 2196447 2180160 2169520 2171094 2201097 2157900 2119952 2137914 2064566 2061651 2019096 1901690
15696 1901690 1975118 2061019 2036309 2043735 2127008 2127685 2061153 2194065 2171603 2081427 2190162
15685 2190162 2059254 2023118 2122813 2017836 1963567 2057858 2020000 1924014 1974293 1973832 1998896
$$ packed form
15741B079221l7316O6585k9992L0376l0792K598K7857l6317K5330j8265j8555
15730B060730n6949P6250j5090J1059K4326m29j5830R972r913o3122R8103n3446
15718B065661r2855J988K6070j7565O9517k1723j9152J02296j5684K8799O9095
15707B196447j6287j0640J574L0003m3197l7948J7962p3348k915m2555j17406
15696A901690P3428Q5901k4710P426Q3273O77o6532J32912k2462r0176J08735
15685B190162j30908l6136R9695j04977n4269R4291l7858r5986N0279m61K5064
$$ [...]
##END NTUPLES=NMR SPECTRUM
##END=
