##TITLE=1H_CA-8815-3
 CDCl3,8 sc, 
 3.02.2021
##JCAMPDX= 6.0         $$ Bruker NMR JCAMP-DX V2.0
##DATA TYPE= NMR SPECTRUM
##DATA CLASS= NTUPLES
##ORIGIN= UXNMR, Bruker Analytische Messtechnik GmbH
##OWNER= root
$$ XWIN-NMR		Version 3.5
$$ Wed Feb  3 10:18:22 2021 Russian Standard Time (UT+4h)  she@DPX200
##.OBSERVE FREQUENCY= 200.1315066352
##.OBSERVE NUCLEUS= ^1H
##.ACQUISITION MODE= SIMULTANEOUS
##.ACQUISITION SCHEME= undefined
##.AVERAGES= 8
##.DIGITISER RES= 18
##SPECTROMETER/DATA SYSTEM= spect
##.PULSE SEQUENCE= zg30
##.SOLVENT NAME= CDCl3
##.SHIFT REFERENCE= (INTERNAL, CDCl3, 0, 15.9844)
##AUDIT TRAIL= $$ (NUMBER, WHEN, WHO, WHERE, WHAT)
$$ ##TITLE= Audit trail, XWIN-NMR		Version 3.5
$$ ##JCAMPDX= 5.01
$$ ##ORIGIN= Bruker BioSpin GmbH
$$ ##OWNER= she
$$ F:/spectra/data/she/nmr/H-F/1/pdata/1/auditp.txt
$$ ##AUDIT TRAIL=  $$ (NUMBER, WHEN, WHO, WHERE, WHAT)
(   1,<2021-02-03 10:17:24.71 +0400>,<she>,<DPX200>,
      <created by zg, POWCHK disabled, PULCHK disabled
       configuration hash MD5:
       00 E9 B6 7A A2 85 ED C7 34 08 36 98 17 FE 4E 26
       data hash MD5: 16K
       EB 27 A2 4E 15 86 A2 89 2D 75 37 7E CF 8A F8 9F>)
(   2,<2021-02-03 10:17:26.93 +0400>,<she>,<DPX200>,
      <Start of raw data processing
       efp BC_mod = 2 LB = 0.24 FT_mod = 6 PKNL = 1 PHC0 = -10757.72 PHC1 = 11.40095 SI = 16K 
       data hash MD5: 16K
       C3 7C AB 79 C8 E0 26 61 68 87 E0 81 E8 3A E8 2C>)
(   3,<2021-02-03 10:17:42.79 +0400>,<she>,<DPX200>,
      <pk PHC0 = -2.615303 PHC1 = 4.600001 
       data hash MD5: 16K
       82 F0 8F 5B 3B BE 39 6E 96 C8 FD 9F B7 6D 9D B5>)
(   4,<2021-02-03 10:17:45.87 +0400>,<she>,<DPX200>,
      <abs ABSG = 5 
       data hash MD5: 16K
       BA 40 C8 7B E8 FA F1 DC B2 74 9A 96 FF B6 57 BC>)
$$ ##END=
$$ 
$$ hash MD5
$$ A0 69 FB 7E FE C1 8C 7B 39 A7 D5 34 22 F1 66 A4
##$RELAX= 
##$RELAX= 
##$RELAX= 
##$RELAX= 
##$RELAX= 
##$RELAX= 
$$ Bruker specific parameters
$$ --------------------------
##$DU= <F:/spectra>
##$EXPNO= 1
##$NAME= <H-F>
##$PROCNO= 1
##$TYPE= <nmr>
##$USER= <she>
##$AMP= (0..31)
100 100 100 100 100 100 100 100 100 100 100 100 100 100 100 100 100 100 
100 100 100 100 100 100 100 100 100 100 100 100 100 100 
##$AQSEQ= 0
##$AQ_mod= 1
##$AUNM= <au_zg>
##$AUTOPOS= <>
##$BF1= 200.13
##$BF2= 200.13
##$BF3= 200.13
##$BF4= 200.13
##$BF5= 200.13
##$BF6= 200.13
##$BF7= 200.13
##$BF8= 200.13
##$BYTORDA= 1
##$CFDGTYP= 0
##$CFRGTYP= 5
##$CHEMSTR= <none>
##$CNST= (0..31)
1 1 145 1 1 1 1 1 1 1 1 1 1 1 1 1 1 1 1 1 1 1 1 1 1 1 1 1 1 1 1 1 
##$CPDPRG= <>
##$CPDPRG1= <>
##$CPDPRG2= <>
##$CPDPRG3= <>
##$CPDPRG4= <mlev>
##$CPDPRG5= <mlev>
##$CPDPRG6= <mlev>
##$CPDPRG7= <mlev>
##$CPDPRG8= <mlev>
##$CPDPRGB= <>
##$CPDPRGT= <>
##$D= (0..31)
0 1.2 0 0 0 0 0 0 0 0.06 0 0.03 0 0 0 0 0.0002 0 0 0 0 0 0 0 0 0 0 0 0 
0 0 0 
##$DATE= 1612333044
##$DBL= (0..7)
120 120 120 120 120 120 120 120 
##$DBP= (0..7)
150 150 150 150 150 150 150 150 
##$DBP07= 0
##$DBPNAM0= <>
##$DBPNAM1= <>
##$DBPNAM2= <>
##$DBPNAM3= <>
##$DBPNAM4= <>
$$ [...]
##$SUBNAM3= <"">
##$SUBNAM4= <"">
##$SUBNAM5= <"">
##$SUBNAM6= <"">
##$SUBNAM7= <"">
##$SUBNAM8= <"">
##$SUBNAM9= <"">
##$SW= 16.9725356469052
##$SWIBOX= (0..15)
0 0 2 0 0 0 0 0 0 0 0 0 0 0 0 0 
##$SW_h= 3396.73913043478
##$TD= 16384
##$TD0= 1
##$TE= 0
##$TE2= 300
##$TE3= 300
##$TEG= 300
##$TL= (0..7)
0 120 120 120 120 120 120 120 
##$TP= (0..7)
150 150 150 150 150 150 150 150 
##$TP07= 0
##$TPNAME0= <>
##$TPNAME1= <>
##$TPNAME2= <>
##$TPNAME3= <>
##$TPNAME4= <>
##$TPNAME5= <>
##$TPNAME6= <>
##$TPNAME7= <>
##$TPOAL= (0..7)
0.5 0.5 0.5 0.5 0.5 0.5 0.5 0.5 
##$TPOFFS= (0..7)
0 0 0 0 0 0 0 0 
##$TUNHIN= 0
##$TUNHOUT= 0
##$TUNXOUT= 0
##$USERA1= <user>
##$USERA2= <user>
##$USERA3= <user>
##$USERA4= <user>
##$USERA5= <user>
##$V9= 5
##$VALIST= <valist>
##$VCLIST= <CCCCCCCCCCCCCCC>
##$VD= 0
##$VDLIST= <DDDDDDDDDDDDDDD>
##$VPLIST= <PPPPPPPPPPPPPPP>
##$VTLIST= <TTTTTTTTTTTTTTT>
##$WBST= 1024
##$WBSW= 4
##$XGAIN= (0..3)
0 0 0 0 
##$XL= 0
##$YL= 0
##$YMAX_a= 328707
##$YMIN_a= -327202
##$ZGOPTNS= <>
##$ZL1= 120
##$ZL2= 120
##$ZL3= 120
##$ZL4= 120
##$ABSF1= 15.91395
##$ABSF2= -1.058712
##$ABSG= 5
##$ABSL= 3
##$ALPHA= 0
##$AQORDER= 0
##$ASSFAC= 0
##$ASSFACI= 0
##$ASSFACX= 0
##$ASSWID= 0
##$AUNMP= <proc_1d>
##$AZFE= 0.1
##$AZFW= 0.1
##$BCFW= 0
##$BC_mod= 2
##$BYTORDP= 0
##$COROFFS= 0
##$CY= -3
##$DATMOD= 1
##$DC= 0
##$DFILT= <>
##$DTYPP= 0
##$F1P= 0
##$F2P= 0
##$FCOR= 1
##$FTSIZE= 16384
##$FT_mod= 6
##$GAMMA= 0
##$GB= 0
##$INTBC= 1
##$INTSCL= 2.992141e-10
##$ISEN= 128
##$LB= 0.24
##$LEV0= 0
##$LPBIN= 0
##$MAXI= 10000
##$MC2= 0
##$MEAN= 0
##$ME_mod= 0
##$MI= 1.114404
##$NCOEF= 0
##$NC_proc= -7
##$NLEV= 6
##$NOISF1= 3.799351
##$NOISF2= 2.8
##$NSP= 0
##$NTH_PI= 0
##$NZP= 0
##$OFFSET= 15.98439
##$PC= 1
##$PHC0= -10760.33
##$PHC1= 16.00095
##$PH_mod= 1
##$PKNL= yes
##$PPARMOD= 0
##$PSCAL= 0
##$PSIGN= 0
##$REVERSE= no
##$SF= 200.130006050213
##$SI= 16384
##$SIGF1= 3
##$SIGF2= 2
##$SINO= 5.538805
##$SIOLD= 16384
##$SREGLST= <1H.CDCl3>
##$SSB= 0
##$STSI= 16384
##$STSR= 0
##$SW_p= 3396.73913043478
##$SYMM= 0
##$S_DEV= 0
##$TDeff= 16384
##$TDoff= 0
##$TI= <>
##$TILT= no
##$TM1= 0
##$TM2= 0
##$TOPLEV= 0
##$USERP1= <user>
##$USERP2= <user>
##$USERP3= <user>
##$USERP4= <user>
##$USERP5= <user>
##$WDW= 1
##$XDIM= 16384
##$YMAX_p= 283328593
##$YMIN_p= -1653346
$$ End of Bruker specific parameters
$$ ---------------------------------
##NTUPLES= NMR SPECTRUM
##VAR_NAME=  FREQUENCY,     SPECTRUM/REAL,   SPECTRUM/IMAG
##SYMBOL=    X,             R,               I
##VAR_TYPE=  INDEPENDENT,   DEPENDENT,       DEPENDENT
##VAR_FORM=  AFFN,          ASDF,            ASDF
##VAR_DIM=   16384,         16384,           16384
##UNITS=     HZ,            ARBITRARY UNITS, ARBITRARY UNITS
##FACTOR=    0.207333158178281, 1,           1
##FIRST=     3198.95611920042, 0,            0
##LAST=      -197.783011234359, 0,           0
##MIN=       -197.783011234359, -1653346,    0
##MAX=       3198.95611920042, 283328593,    0
$$ Real data points
##PAGE= N=1
##DATA TABLE= (X++(R..R)), XYDATA
$$ [...]
5358D907716m73959L34903J61284l00803J03192N09011Q1398o82523j48383L33721
5348D825557k93813j64010J17338L20032n396k57344M02526n21210m01906M71115
5338D492889M58292R1117k48478j76892K63854l0412j12906K69438k09154p80827
5328D016921M82190K12380N61146m51332k84090M66903o02990M9295m80348L20574
5318D290649Q14079k23652k3831n32482J1183l32332P18355P00411k28637o15285
5308D578458l04944L06832N4073J49980J19562j00488q75969N47067M44511j46652
5298D772430n5886k14185l09184N95913L68271J95768m66613m70557j92344O2537
5288D286150o5125J40906j62210j92266M28910L23715K36130p42060L84379l490
$$ y = [4907716, 4433757, 4768660, 4929944, 4629141, 4732333, 5241344, 5322742, 4640219, 4491836, 4825557, 4531744, 4367734, 4485072, 4805104, 4799708, 4542364, 4944890, 4423680, 4021774, 4492889, 4951181, 5042298, 4793820, 4616928, 4880782, 4850370, 4737464, 5006902, 4797748, 4016921, 4499111, 4711491, 5272637, 4821305, 4537215, 5004118, 4401128, 4450423, 3970075, 4290649, 5104728, 4881076, 4857245, 4324763, 4335946, 4003614, 4721969, 5422380, 5193743, 4578458, 4273514, 4580346, 4634419, 4784399, 4903961, 4803473, 3927504, 4474571, 4919082, 4772430, 4716544, 4502359, 4193175, 4789088, 5157359, 5353127, 4886514, 4415957, 4223613, 4286150, 4221025, 4361931, 4199721, 4007455, 4436365, 4760080, 4996210, 4254150, 4638529, 4635039]
5278D635039k81118j88481M23269L32752J32948n10009l62675K05131p3826L08968
5268D621998L67549L75376r91272o344J96149L88935j20136k38841Q27520j74597
5258E246337m60979P5636O4461p6474J25312J12193K99345j05110o52038L39278
5248D967961M80323n36304l01477K65720J24276K77012J47514L00887n6167o08214
5238E061531J7670N69590J05067j85644j012158J244456J75971l48320J9766j83299
5228E464630j87174p7092P16982J6704q84056j93168K88044j75386L24395j12296
5218E181583J8829M24853j35641o7981j27206K1632Q96495p50074M31426l39987
5208E553929k69851J30978M08499l07303K71711m22931n1508k64598M9658J214937
$$ y = [4635039, 4353921, 4165440, 4588709, 4921461, 5054409, 4544400, 4181725, 4386856, 4313030, 4621998, 4989547, 5364923, 4373651, 4367307, 4563456, 4952391, 4832255, 4593414, 5420934, 5246337, 4785358, 4860994, 4925455, 4848981, 4974293, 5086486, 5385831, 5280721, 4628683, 4967961, 5448284, 4911980, 4610503, 4876223, 5000499, 5277511, 5425025, 5725912, 5669745, 5061531, 5079201, 5648791, 5753858, 5568214, 4556056, 5800512, 5976483, 5628163, 5647929, 5464630, 5277456, 5200364, 5917346, 5934050, 5049994, 4856826, 5144870, 4969484, 5293879, 5181583, 5200412, 5625265, 5489624, 5421643, 5294437, 5316069, 6212564, 5462490, 5893916, 5553929, 5284078, 5415056, 5823555, 5516252, 5787963, 5365032, 5313524, 5048926, 5098584, 6313521]
5198F313521j022549j58560K7548M09495l95454l42397P79618J94969q50245l0894
5188D925052m27678N37011l9660N51864N8113o93898L54892m61762K51579j13978
5178D941535J91737j44476N78156k49216l63540n58680P3087N46655J1229j8347
5168E008140j72570j12531r2456l99092K99094N05021k38739k85790P948L026
5158D522051p28626K91780L61866M2575J46364j77745l57222j58500J66896M52550
5148D561989P4028p62383O08306m19307K5387M28430n42177K10880K01472O56932
5138E043557m56402l61841q864l54321o08087M52173P08542J02309j888m31832
5128D083346j163105J70940M17450O14004n5874j98228N6142m68598m21534L21759
$$ y = [6313521, 5290972, 5132412, 5159960, 5569455, 5174001, 4831604, 5611222, 5806191, 4955946, 4925052, 4497374, 5034385, 4994725, 5546589, 5604702, 4910804, 5265696, 4803934, 5055513, 4941535, 5133272, 4988796, 5566952, 5317736, 4954196, 4395516, 4468603, 5015258, 5026487, 5008140, 4835570, 4723039, 4630583, 4231491, 4530585, 5035606, 4796867, 4511077, 4519025, 4522051, 3793425, 4085205, 4447071, 4489646, 4636010, 4458265, 4101043, 3942543, 4109439, 4561989, 4636017, 3873634, 4481940, 4062633, 4088020, 4516450, 3974273, 4185153, 4386625, 5043557, 4587155, 4225314, 4216450, 3862129, 3254042, 3706215, 4414757, 4517066, 4515178, 4083346, 2920241, 3091181, 3508631, 4122635, 4066761, 3868533, 3924675, 3456077, 3034543, 3356302]
5118C356302L3168J23589P36844Q3949l84235j037622J82031k17474Q96327J12153
5108C885032L74434n10311o07930M75200k75945N11893L17908o00894k85713K34410
5098C518084M67492J6836o08711j36796M32922K34444l19324O1558Q8284Q066
5088C762855j44015K6729J87328m1370l33511O84017l62399l3698M29620r9722
5078D075834k83137O3028M01860J93001k58579q6170o3088k42295N74891M06125
5068D781470n11635K9978m38282n5406J33742Q11409O08221r56795m4675L17903
5058D675930m22425o43987K84195Q97087L82364m61340J24644m94788n82843M31420
5048D190257L50826K85630J27717M22116m24758j071160K57540O69658M14811
$$ y = [3356302, 3389470, 3513059, 4249903, 4333852, 3949617, 2911995, 3094026, 2876552, 3772879, 3885032, 4259466, 3749155, 3141225, 3616425, 3340480, 3852373, 4170281, 3569387, 3283674, 3518084, 3985576, 4002412, 3393701, 3256905, 3689827, 3924271, 3604947, 3666505, 3754789, 3762855, 3618840, 3645569, 3832897, 3791527, 3458016, 4142033, 3779634, 3745936, 4175556, 4075834, 3792697, 3855725, 4257585, 4450586, 4192007, 4105837, 4042749, 3800454, 4375345, 4781470, 4269835, 4299813, 3861531, 3806125, 3939867, 4751276, 5359497, 4402702, 4358027, 4675930, 4253505, 3609518, 3893713, 4790800, 5173164, 4711824, 4836468, 4341680, 3758837, 4190257, 4541083, 4826713, 4954430, 5376546, 4951788, 3880628, 4138168, 4807826, 5222637]
5039E222637j16636j39405L99479K39939n16721l62190j22419j4325L62076K08873
5029E161308L7894L12650p91926j42134N72245O6708K54948J27539J31843m37216
5019E293859P805L81995k71693r6086l27196M27913J69957K12263L24181n30935
5009E592063n68468r5574L47292K58494m15317J82808K9511J11673L59233m6679
4999E755036K8996n34376N82174k23330j27513N07718N83549n69200n98010O20630
4989F025674K4176o77012L2382R04293Q9582q27408k42340K20288p5488m06397
4979E067750N66938L57288M6334k28644k11238k38767j57241N35070K25945O7781
4969F031216n89529m05633K92902L25931Q6401Q2261j4622p1369l33072J34520
$$ y = [5222637, 5106001, 4966596, 5366075, 5606014, 5089293, 4727103, 4604684, 4590359, 4952435, 5161308, 5199202, 5511852, 4719926, 4577792, 5150037, 5216745, 5471693, 5599232, 5731075, 5293859, 5301664, 5683659, 5411966, 5315880, 4988684, 5416597, 5586554, 5798817, 6122998, 5592063, 5023595, 4928021, 5275313, 5533807, 5118490, 5301298, 5330809, 5442482, 5801715, 5755036, 5784032, 5249656, 5831830, 5608500, 5480987, 5988705, 6572254, 6003054, 5405044, 6025674, 6049850, 5372838, 5405220, 6309513, 6399095, 5571687, 5329347, 5549635, 5474147, 5067750, 5634688, 5991976, 6038310, 5809666, 5598428, 5359661, 5202420, 5737490, 5963435, 6031216, 5441687, 5036054, 5328956, 5654887, 5741288, 5823549, 5808927, 5737558, 5404486, 5539006]
4959E539006L63274q75905J258J08810K66785O27943l95920j2391m60870k17940
4949D944050P2604M75814k20209L64604J6153R4716n61933p77845L30323J007825
4939E746102p1560k6314l01011m25342M11070n1997M19954r81391N435N99188
4929E324134l90849K35728o46337K01048O62246l30073L34964r01690k21368N48823
4919D816626j54562K83969N74653O00950l40819r83826J57480M09717J30517m73187
4909E021518K35892R51362p47669m85408k05238J87282J29252j2550Q27551k69078
4899E632914m85297k35509m1235l9394k96759M3433R76661l5104n1690k54429
4889E213591P4308K81444l19733j74398J9074K81557M37899J14294j009171m53854
$$ y = [5539006, 5902280, 5026375, 5027633, 5136443, 5403228, 6031171, 5635251, 5622860, 5161990, 4944050, 5016654, 5492468, 5272259, 5636863, 5653016, 5747732, 5185799, 4407954, 4738277, 5746102, 5674542, 5648228, 5347217, 4921875, 5332945, 5280948, 5700902, 4719511, 4724946, 5324134, 4933285, 5169013, 4522676, 4723724, 5385970, 5055897, 5390861, 4489171, 4267803, 4816626, 4662064, 4946033, 5520686, 6121636, 5780817, 4796991, 4954471, 5364188, 5494705, 5021518, 5257410, 6208772, 5461103, 4975695, 4770457, 4957739, 5086991, 5074441, 5901992, 5632914, 5147617, 4912108, 4870873, 4831479, 4534720, 4578153, 5554814, 5519710, 5468020, 5213591, 5287899, 5569343, 5249610, 5075212, 5094286, 5375843, 5813742, 5928036, 4918865, 4465011]
4879D465011J28139L82105L70819m22935O2392n75301j19106O93986Q1861j0385
4869E056586l29748J11855l54660M1570q1755K20532l63666O09587O96014p19747
4859D886568m82301k92180Q33224P43476p68178k32900o91072J16893M62782j0875
4849D565437O4285k41793J49891l39m1651P3416m87164l12057O19913J39213p3426
4838D455725k31656N24420o80593j90242n8174N81706j056k72017O11423n70332
4828D169204J75421r4174K76903L33622l38705q8625j22305j70060N29724J6803
4818D687808k89734n7177J38795K23801j04261K44396n1665m81350L30689R8492
4808D739794m76495j40755M2010P49603m01594q5852k34946J07363j01739L01925
$$ y = [4465011, 4593150, 4975255, 5346074, 4923139, 4985531, 4410230, 4291124, 4985110, 5066971, 5056586, 4726838, 4838693, 4484033, 4525603, 4443848, 4664380, 4300714, 4910301, 5606315, 4886568, 4404267, 4112087, 4945311, 5688787, 4920609, 4687709, 3996637, 4113530, 4576312, 4565437, 4629722, 4387929, 4537820, 4537481, 4495830, 4569246, 4082082, 3770025, 4389938, 4529151, 4455725, 4224069, 4748489, 4067896, 3877654, 3819480, 4401186, 4400130, 4128113, 4739536, 4169204, 4344625, 4250451, 4527354, 4860976, 4522271, 4433646, 4311341, 4141281, 4671005, 4687808, 4398074, 4340897, 4479692, 4703493, 4599232, 4843628, 4791963, 4310613, 4641302, 4739794, 4263299, 4122544, 4164554, 4914157, 4512563, 4426711, 4191765, 4299128, 4197389, 4499314]
4798D499314K49555p22474J87483N41221j5602n43981j01872R60208k7807k07736
4788D818309L10414L62241l91256j81240J40343J34880k42847r933Q92155L3119
4778E866185r2514l65714j60419o5011Q333N13805L68098p85555r6783R76141
4768F166566J41484K19104n58704j02622K01055N84794O25134l13893M49670j04158
4758G308430l14056q1141N92773K83813P19968l58429M38244O1817j75966K78052
4748H753505N76458J130877M87839n89875k90754L26990O31376P24778P8387K53169
4738A2082750O06209l28752j76179J37437J98546J096618P08002L77381l64776
4729A4337236L93557J014680M42324J21591J26984N17721R29665N27000M00210
$$ y = [4499314, 4748869, 4026395, 4213878, 4755099, 4739497, 4195516, 4093644, 5053852, 5026045, 4818309, 5128723, 5490964, 5099708, 4918468, 5058811, 5193691, 4950844, 4940911, 5833066, 5866185, 5773671, 5407957, 5247538, 5182527, 5190860, 5704665, 6072763, 5287208, 5190425, 6166566, 6308050, 6527154, 5968450, 5865828, 6066883, 6651677, 7276811, 6962918, 7412588, 7308430, 6994374, 6913233, 7506006, 7789819, 8509787, 8151358, 8589602, 8651419, 8475453, 8753505, 9329963, 10460840, 10948679, 10358804, 10068050, 10395040, 11026416, 11751194, 11829581, 12082750, 12688959, 12360207, 12184028, 12321465, 12520011, 13616629, 14324631, 14702012, 14337236, 14730793, 15745473, 16187797, 16309388, 16436372, 16954093, 17883758, 18410758, 18810968]
4720A8810968N86722r2014P38468K67650P24510n7880Q940O59233R8618O22806
4710B2368021o5459k17952K71429L22625O59527J319389L65593m7820P7084J041227
4700B6093664J190426K27409J46439K18550N61695K0856J30429Q36133L35396
4691B9760997m22647m73646J77991k86465m77738L98571O16009N816j36915N34955
4681B9696928L75550J1466O32948P57981R25140P47962k92020L55864N16561N326
4671C3733706J10124o6736Q6754p08141l95051l23595m96528m34597l59418j53067
4661C0993451k69750K29730O57771J76447p06812k00069q5581K52765J146361
4652C2194313j89277l02245o86981J64508j2808n07433q5430l02518n27578j595542
$$ y = [18810968, 19397690, 19305676, 20044144, 20311794, 21036304, 20978424, 20987364, 21646597, 21745215, 22368021, 22302562, 22084610, 22356039, 22678664, 23338191, 24657580, 25023173, 24975353, 25052437, 26093664, 27284090, 27511499, 27657938, 27876488, 28438183, 28459039, 28589468, 29425601, 29760997, 29338350, 28864704, 29042695, 28756230, 28278492, 28677063, 29293072, 29298888, 29161973, 29696928, 30072478, 30083944, 30716892, 31474873, 32400013, 33147975, 32855955, 33211819, 33728380, 33733706, 33843830, 33777094, 33863848, 33155707, 32760656, 32437061, 31940533, 31505936, 31146518, 30993451, 30723701, 30953431, 31611202, 31787649, 31080837, 30880768, 30795187, 31047952, 32194313, 32005036, 31702791, 31015810, 31180318, 31167510, 30660077, 30574647, 30272129, 29744551, 28149009]
4642B8149009o90088o56408o78270n46417o7376l05836n39453K26913K01766M18018
4632B5511858j024128q525O30980m93081j100364m66053j02938n17641j083273
4623B1346835o6726n74913j333631m54746L75555r51847o45556o76783O0400m62682
4613A6615906j338237N97152m09929m80428r18335L98070N41952l09947m48393
4604A4247811L97479l31385l60970J41091k76410j019488k68307K44118j46862
4595A2627077o26059j059163M55814n43812k54119J98871K25957j47277k59535
4586A0617754n0031r8463q09508N99060j5975q06027M22225k24963L71951m19862
4576I586161L2838o7382J24669o40J01830k76508q6732K62125K97400J53791m47489
$$ y = [28149009, 27458921, 26802513, 26124243, 25577826, 25510450, 25204614, 24665161, 24892074, 25093840, 25511858, 24487730, 24479205, 25110185, 24617104, 23516740, 23050687, 22947749, 22430108, 21346835, 21280109, 20705196, 19371565, 18916819, 19292374, 18340527, 17694971, 17018188, 17078588, 16615906, 15277669, 15874821, 15464892, 14984464, 14066129, 14464199, 15006151, 14696204, 14247811, 14645290, 14313905, 13952935, 14094026, 13817616, 12798128, 12529821, 12773939, 12627077, 12001018, 10941855, 11397669, 10853857, 10599738, 10798609, 11024566, 10877289, 10617754, 10567723, 10469260, 9659752, 10258812, 10242837, 9436810, 9859035, 9634072, 10006023, 9586161, 9618999, 9551617, 9676286, 9675646, 9777476, 9500968, 9414236, 9676361, 9973761, 10127552, 9680063]
4565I680063K99610K65884j49525j04464M48737j74431L67470L01944J126217
4556A2061505J31076o98644L48471O28240J029895o43162K48555M98102N83982
4547A4188020n28247J11706P76680N66886K88793P6013O42183M13444J51307P34278
4537A7421063N68543l16961r87840J92292J15784r74333p7829l52399n00984m50570
4527A4636766P07767P55612k70588j076071M49128M33499M01290J19938l94606
4518A5762735J270374j17654R30492k71135l66903n8851J93617j82221p58687
4509A6401767j93921n97903q2533q94075n42093j81893n27556j06783M37942K93787
4499A4006739l03306j038828J66203J025201J03594k1043l5263m31567J35469
$$ y = [9680063, 9979673, 10245557, 10096032, 9991568, 10440305, 10265874, 10633344, 10935288, 12061505, 12192581, 11493937, 11842408, 12470648, 13500543, 12857381, 13105936, 13604038, 14188020, 13659773, 13771479, 14548159, 15115045, 15403838, 15479851, 16122034, 16535478, 16686785, 17421063, 17989606, 17672645, 16684805, 16877097, 16992881, 16018548, 15940719, 15588320, 15087336, 14636766, 15344533, 16100145, 15829557, 14753486, 15202614, 15636113, 16037403, 16157341, 15762735, 17033109, 16915455, 17845947, 17574812, 17207909, 17149058, 17342675, 17160454, 16401767, 16207846, 15609943, 15527410, 14633335, 14091242, 13909349, 13381793, 13275010, 13712952, 14006739, 13703433, 12664605, 12830808, 13856009, 13959603, 13938560, 13903297, 13471730, 13607199]
4490A3607199L03365M54399m40182n91713P02300N57802j89188m56328N32935
4481A4480589N35595o00587L58119l16207M33339L28008M02024P0576o78423j02324
4471A4910709P30322P16904O50361k35764k46605n6565l4545Q25691L2947l51180
4461A6942275M63131j73792m5547L48872j33841N25084L52645O06882l2965k90510
4451A8562234M39817N37825k80564L61777J40060K31103P6048o26443Q31076Q37958
4441B1110891L69254M20767K6081k9182O21447M02825Q6469L94305P01787K38351
4431B4342995N83440j4292L51254L91403l3507L74285N09244J32956K30272M05543
4421B7273593M55946J104404M04886N30004M85993O76247J028819J431810J743789
$$ y = [13607199, 13910564, 14364963, 13924781, 13333068, 14035368, 14593170, 14403982, 13947654, 14480589, 15016184, 14415597, 14773716, 14457509, 14890848, 15218856, 15620880, 15691456, 15013033, 14910709, 15641031, 16357935, 17008296, 16772532, 16525927, 16469362, 16434817, 17260508, 17293455, 16942275, 17405406, 17231614, 17186067, 17534939, 17401098, 17926182, 18278827, 18885709, 18852744, 18562234, 19002051, 19539876, 19259312, 19621089, 19761149, 19992252, 20068300, 19441857, 20272933, 21110891, 21480145, 21900912, 21926993, 21897811, 22519258, 22922083, 23008552, 23402857, 24104644, 24342995, 24926435, 24912143, 25263397, 25654800, 25621293, 25995578, 26504822, 26637778, 26868050, 27273593, 27729539, 28833943, 29238829, 29768833, 30254826, 30931073, 31959892, 33391702, 35135491]
4412C5135491R53674N90592J211707J933948J456932K084966K164844K254345
4404D7786499K580441L063198K844956L104515L256092L812426M297354K964045
4396G3709526L239802J713922J892254J886194L042829K130641K314403K121445
4388I2051016J938813J182793K21006R66110k35615j095807j562039k112349k430515
4379H8923413j156053j727849q04308j145149N8099l78406l34969m21059n24499
4370H2489220n84038j455585K11190J79119J378481M24232P44377j56389q06688
4361H2423919j521315k404247k885444k898703k450245k738042l296676m938886
4353E9290361l672385k292087k802375l790386k820238j871591j685012k114981
$$ y = [35135491, 36089165, 36679757, 37891464, 39825412, 41282344, 43367310, 45532154, 47786499, 50366940, 53430138, 56275094, 59379609, 62635701, 66448127, 70745481, 73709526, 76949328, 78663250, 80555504, 82441698, 85484527, 87615168, 89929571, 92051016, 93989829, 95172622, 95393628, 96359738, 96124123, 95028316, 93466277, 91353928, 88923413, 87767360, 86039511, 85235203, 84090054, 84148153, 83769747, 83434778, 83013719, 82489220, 81905182, 80449597, 80660787, 80839906, 82218387, 82642619, 83386996, 83230607, 82423919, 80902604, 78498357, 75612913, 72714210, 70263965, 67525923, 64229247, 59290361, 55617976, 53325889, 50523514, 46733128, 43912890, 42041299, 40356287, 38241306]
4345C8241306j450757j013326k285082j649962l72179m87020q83209p30585k14131
4336B9155055j112839j889018j24730l42982q44399r85273q23496n17014q05331
4327B1709973j34290j024419k50088k78318o60676n17410o43336j74976m75049
4318A7551411o2381p69109k84060k54425M37868l39988p40853o18095J19005L65564
4308A5404937m6709q00741m11503j59721O360n66700j240477K90835L19014p08828
4298A2086467q17695J22637j05009o6821q01443N54293m25922n79718j70374j44795
4288I651620k54584m58158L33464j60766j97727K0169k68632j43469j033857j36173
4278G351887J40243K62783M28186m81331q55713m55446j22618M80318R85240o72899
$$ y = [38241306, 36790549, 35777223, 33492141, 31842179, 31470000, 30982980, 30099771, 29369186, 29155055, 28042216, 26153198, 26028468, 25685486, 24841087, 23855814, 23032318, 22515304, 21709973, 21575683, 20551264, 20301176, 20022858, 19362182, 18844772, 18201436, 18026460, 17551411, 17489030, 16719921, 16435861, 16181436, 16619304, 16279316, 15538463, 14920368, 15039373, 15404937, 15358228, 14557487, 14145984, 13986263, 13992623, 13425923, 12185446, 12476281, 12795295, 12086467, 11268772, 11391409, 11286400, 11219579, 10418136, 10972429, 10546507, 9966789, 9796415, 9651620, 9397036, 8938878, 9272342, 9111576, 8913849, 8934018, 8665386, 8521917, 7488060, 7351887, 7492130, 7754913, 8183099, 7701768, 6846055, 6390609, 6267991, 6748309, 7733549, 7060650]
4268G060650k62409j18568l23463o18388L39783M64475m5491p64040m75790N92110
4258E848869k43382M8103K1614J32219k36829p97855j73190O27214r4368j31331
4248E001064J28079l23140k97617K26862K66105P603l17138n63760K32754k28022
4238D132790k17512J73696K24970K02138o24311j2292M41756j45181n89308q263
4228C578483K79551k25557J44823O62821P4617m36474m45875M57997Q3867M4556
4218D218809M23747l95350l95946L43654N6337n49093k85046N1882N26208l94634
4208C600568l21964L95491m75806L80139j26311n87233R9887j7024K99823k34250
4198C013320N04983J05704n64306j39694J87696K02614m91187J04623M53439K81739
$$ y = [7060650, 6798241, 6679673, 6356210, 5737822, 6077605, 6542080, 6496589, 5732549, 5256759, 5848869, 5605487, 5653590, 5675204, 5807423, 5570594, 4772739, 4599549, 5226763, 5132395, 5001064, 5129143, 4806003, 4508386, 4735248, 5001353, 5008956, 4691818, 4128058, 4360812, 4132790, 3915278, 4088974, 4313944, 4516082, 3891771, 3879479, 4321235, 4176054, 3586746, 3578483, 3858034, 3632477, 3777300, 4440121, 4514738, 4078264, 3632389, 4090386, 4174253, 4218809, 4642556, 4247206, 3851260, 4194914, 4251251, 3702158, 3417112, 3468994, 3995202, 3600568, 3278604, 3674095, 3198289, 3578428, 3452117, 2864884, 2964771, 2947747, 3247570, 3013320, 3518303, 3624007, 3059701, 2920007, 3107703, 3310317, 2819130, 2923753, 3377192, 3658931]
4188C658931l113l25545l18147l60847k41951P45377J63776N1512O0316m14520
4178C015789l02666K64883O0901j0369J48452k16156j03326j13407j40202k85337
4168B318562N29037K31486M52779q02658P05570l16926m68038J30079J91992K6432
4158B998315j47636r5576N23811m1258m24777o2802K1971O02634m78059j19869
4148B776754R5335O17700o69921P7007j24833k22648l2093N22906J37965j16355
4138C061817r113K88123J13064p09722M95878K27763Q2773l4105R5015l49031
4128C262462L89803K19860l39819j54424L69698O13677o9573m84740M35428L29866
4118D572238n25391j08288J29515O15038k23468M82918Q6179l48763l94919K96262
$$ y = [3658931, 3655818, 3330273, 3012126, 2651279, 2409328, 3154705, 3318481, 3369993, 3430309, 3015789, 2713123, 2978006, 3038907, 3028538, 3176990, 2960834, 2857508, 2744101, 2603899, 2318562, 2847599, 3079085, 3531864, 2729206, 3434776, 3117850, 2649812, 2779891, 2971883, 2998315, 2850679, 2755103, 3278914, 3237656, 2812879, 2750077, 2772048, 3374682, 2896623, 2776754, 2872089, 3489789, 2819868, 2896875, 2772042, 2549394, 2517301, 3040207, 3178172, 3061817, 3052704, 3340827, 3453891, 2744169, 3240047, 3467810, 3550583, 3516478, 3611493, 3262462, 3652265, 3872125, 3532306, 3377882, 3747580, 4361257, 4291684, 3806944, 4242372, 4572238, 4046847, 3938559, 4068074, 4683112, 4459644, 4942562, 5028741, 4679978, 4285059, 4581321]
4108D581321L43909m51406M6593j38458Q9075j5581j45631j43192q7801k73625
4098C805204P30159N058o2968l07702j21311Q4704j50334P48123j48674l54621
4088D227638k89273m5347L11538j48455N00882L13261m99049q6011j1610K94014
4078D567588j20024J25628O60917J59417o29725K07585l52026N54175r7024M74935
4068E551446M76992L3179K49415l96859J45238r334M61490K016O61920l30322
4058F845181L0168N37141L4625o43124K19736K56387K93380R9924K18127l75131
4048G516414p93157Q83331M03308J04851p68439K19568m76548L08556j48396L63420
4038G612908L8033p28465N2040l039j71525n92571M56449J63773N93710n83250
$$ y = [4581321, 4925230, 4473824, 4520417, 4381959, 4471034, 4455453, 4309822, 4166630, 4078829, 3805204, 4535363, 4540421, 4477453, 4169751, 4048440, 4133144, 3982810, 4730933, 4582259, 4227638, 3938365, 3893018, 4204556, 4056101, 4556983, 4870244, 4371195, 4285184, 4273574, 4567588, 4447564, 4573192, 5234109, 5393526, 4763801, 4971386, 4619360, 5173535, 5076511, 5551446, 6028438, 6061617, 6311032, 5914173, 6059411, 6050077, 6511567, 6513583, 7175503, 6845181, 6875349, 7412490, 7447115, 6803991, 7023727, 7280114, 7573494, 7673418, 7891545, 7516414, 6723257, 7606588, 8009896, 8114747, 7346308, 7565876, 7089328, 7397884, 7249488, 7612908, 7650941, 6922476, 6974516, 6971477, 6799952, 6207381, 6663830, 6827603, 7421313, 6838063]
4028F838063k71237R7915m14115J34705N75626L28084l74076n69800M79626J88306
4018G013097j63697o28400M87670N96471M180K16068m49262K58241J60699K11474
4008G706541J47344L41488J26606j60321l53420O42144K06931l20482J46141L81062
3998H864034j92252K54110K85322N68518P8144n80283l36047L00480O64087P01882
3988A0607995M6117l58777K14329n12735L31011L19032K33828q7906L49410L89447
3978A1531751O12855q7023P5854P31304L20432R50212M45949J08132P08922J220149
3968A6618537M64898J67741k26279L76753l3237m25401K41445m76802l81734m05779
3958A5920142j80051p11985R7120K88875P71644j57150J98278N46627L15095J18599
$$ y = [6838063, 6566826, 6664741, 6250626, 6385331, 6960957, 7289041, 6914965, 6345165, 6824791, 7013097, 6849400, 6221000, 6708670, 7305141, 7309321, 7525389, 7076127, 7334368, 7495067, 7706541, 7853885, 8195373, 8321979, 8161658, 7808238, 8450382, 8657313, 8336831, 8482972, 8864034, 8671782, 8925892, 9211214, 9779732, 9857876, 9277593, 8941546, 9242026, 9906113, 10607995, 10654112, 10295335, 10509664, 9996929, 10327940, 10646972, 10880800, 10792894, 11142304, 11531751, 12144606, 12057583, 12133437, 12864741, 13185173, 14135385, 14581334, 14689466, 15398388, 16618537, 17083435, 17251176, 17024897, 17401650, 17368413, 16943012, 17184457, 16707655, 16325921, 15920142, 15740091, 15028106, 15125226, 15414101, 16185745, 16028595, 16226873, 16773500, 17088595, 17207194]
3948A7207194K5902J08063o8646r9513o35306k86170j205713j097491n03278j55718
3938A3289324p3227k08630k44890p97632p88082j99003L8554K56229o83816j57881
3928A0430946K61721J78240J88114n64731K325P8929J17824M43786l36116o42747
3918A0158291K91722R34207N148n92545k86594J91765J128052L55549K38882j87437
3908A2237040N37675N19415J42015M78734Q43809J554146J81193M48024Q54420
3899A7796471J251287R82480L28989R51848L79409m44117j51571m97271j98207
3890B0399318n92093m52914N522j51771J39497N05912K9814J62977j75501M54983
3880B0325744L45077j0204M15578M57376P0930l71881k46821n55553o44073j499514
$$ y = [17207194, 17233096, 17341159, 17272513, 17173000, 16537694, 16251524, 15045811, 13948320, 13445042, 13289324, 13216097, 13007467, 12762577, 11964945, 11176863, 10977860, 11016414, 11272643, 10588827, 10430946, 10692667, 10870907, 11059021, 10494290, 10496615, 10575544, 10693368, 11137154, 10801038, 10158291, 10450013, 11384220, 11389368, 10796823, 10510229, 10701994, 11830046, 12185595, 12424477, 12237040, 12774715, 13294130, 13436145, 13914879, 14758688, 16312834, 16494027, 16942051, 17796471, 19047758, 20030238, 20359227, 21311075, 21690484, 21246367, 21094796, 20597525, 20399318, 19807225, 19354311, 19359833, 19208062, 19347559, 19853471, 19883285, 20046262, 19870761, 20325744, 20670821, 20660617, 21076195, 21533571, 21604501, 21232620, 20985799, 20430246, 19786173, 18286659]
3870A8286659n78449K5351l97176o40377o41050m25581r65728K855m4204R2134
3860A4714434k398r33895l84517j83889K9087J79226j5402L07388j77461p13706
3850A2818867P2196K13803J62872k19486O11369j74511m51446k08593J12751q5531
3840A2852291k30468K6689N41046K88141n79557L02036o35711K08935j04556J70312
3830A2839158k3789L49164j21307l31035J97597j23581K86457J8318P35445L13897
3820A4140324p2810l2806k93391J66185J086416M62704M69264k0316o35069L88807
3810A5659308l35840Q80710L47216n06175M66340P8062J8568q9744M59411L50657
3800A7328513o736q892Q59265j7131P1477L60211N25212K33256N60971l2180P93225
$$ y = [18286659, 17708210, 17733561, 17336385, 16696008, 16054958, 15629377, 14663649, 14666504, 14622300, 14714434, 14712036, 13778141, 13393624, 13209735, 13238822, 13418048, 13402646, 13710034, 13532573, 12818867, 12891063, 13104866, 13267738, 13048252, 13659621, 13485110, 13033664, 12825071, 12937822, 12852291, 12621823, 12648512, 13189558, 13477699, 12898142, 13200178, 12564467, 12773402, 12668846, 12839158, 12815369, 13164533, 13043226, 12712191, 12909788, 12786207, 13072664, 13090982, 13826427, 14140324, 14067514, 14034708, 13741317, 13907502, 14993918, 15456622, 15925886, 15905570, 15270501, 15659308, 15323468, 16204178, 16551394, 16045219, 16511559, 16589621, 16608189, 16518445, 16977856, 17328513, 17321777, 17312885, 18172150, 18155019, 18226496, 18586707, 19111919, 19345175, 19906146, 19873966, 20667191]
3789B0667191L63209R07089J096624L45572J212810k47715O92465M21223M33053
3780B5891521K33850q8917l86268j258502n9965O4315l53219M0296M03234J65790
3770B4652135R1007L62501P70355r3056p80236l91149m31215m90340r26953j241398
3760B1521651p70150m5931k30291p12309q66890k04471k73406N54854o44597m58223
3750A7870237J2398K44008K12238p97260J20215M00221m28868L65300K39710l08389
3740A7929810J89088o46246J071911m12215l71927N36731j9558K08270Q2634O8958
3730A8637456N38267O43500p06321M08991J008666Q29527L42481N74514O47372
3721B2924453L56948J000388J565950Q97957J800349J093568N43329Q12939K46603
$$ y = [20667191, 21030400, 21937489, 23034113, 23379685, 24592495, 24344780, 25037245, 25458468, 25891521, 26125371, 26036454, 25650186, 24391684, 24331719, 24396034, 24042815, 24083111, 24486345, 24652135, 24743142, 25105643, 25875998, 25782942, 25002706, 24611557, 24180342, 23690002, 22763049, 21521651, 20751501, 20705570, 20475279, 19762970, 18896080, 18691609, 18418203, 18973057, 18328460, 17870237, 17882635, 18126643, 18338881, 17541621, 17661836, 18062057, 17633189, 17998489, 18238199, 17929810, 18118898, 17472652, 18544563, 18132348, 17760421, 18297152, 18277594, 18485864, 18568498, 18637456, 19175723, 19819223, 19112902, 19521893, 20530559, 21360086, 21702567, 22277081, 22924453, 23281401, 24281789, 25847739, 26745696, 28546045, 29639613, 30182942, 30995881, 31242484]
3712C1242484M79859l95684m12292j52811j22249m89610p2336m56562l02136R0542
3702B9409205N34954N58322j1239K09530m3105o58888j309188q28686j173005
3693B6687900q22005n74052j636359j034847q25552m90600r94542j40329M81932
3684B0651546j136329j046673l8074m44596L4942k88028J8804p4227q54673K50031
3674A7072723n38178L167k2926r80278Q28940P7076m67335l88334l80104J9900
3664A5224651K82095j09046M67971K94103r64084j20083l78105Q42810j0285K4913
3654A5554940m9917r1510m07472O798L98839L32555j36503k18191J091435l49167
3644A6131807o01406J77588J088505L20442k87265K2068L84266l88396n15277
$$ y = [31242484, 31722343, 31326659, 30914367, 30761556, 30639307, 30149697, 30077361, 29620799, 29318663, 29409205, 29944159, 30502481, 30491242, 30700772, 30657667, 29998779, 28689591, 27860905, 26687900, 25865895, 25291843, 23655484, 22620637, 21795085, 21304485, 20309943, 20169614, 20651546, 19515217, 18468544, 18430470, 17985874, 18020816, 17732788, 17751592, 17677365, 16822692, 17072723, 16534545, 16537712, 16514786, 15534508, 16363448, 16440524, 15973189, 15584855, 15204751, 15224651, 15506746, 15397700, 15865671, 16159774, 15195690, 15075607, 14697502, 15540312, 15530027, 15554940, 15505023, 15413513, 15006041, 15012839, 15411678, 15744233, 15607730, 15389539, 16480974, 16131807, 15530401, 15707989, 16796494, 17116936, 16829671, 16851739, 17236005, 16847609, 16332332]
3635A6332332J170984N15055j64056n9931J63052N49864p8436O4928M32316J83388
3625A9109496N29305N46403N84710J00394j34089J708L79312L59330K66324N84431
3615B2327324N41390M52842j40769J56895k82035K40997J532295M67775j43248
3606B5153466K82668L45405l97651J50568R23481J57978J13489j48897L62502
3597B6943009M8291m08329Q25187m0579n24030L76626O66140j54434l3465M49610
3587B8148026N29888K9696Q8557P85180k68173J33982M53718q6880L10472n91970
3577B9532496J02942N42047J09025J28199j95050M11217p56063k62097r8423j778
3567B9512515m20213p33223j75861k41554n77667l45461N65393O25946M419L01827
$$ y = [16332332, 17503316, 18018371, 17854315, 17794384, 17957436, 18507300, 18428864, 18493792, 18926108, 19109496, 19638801, 20185204, 20769914, 20870308, 20736219, 20737927, 21117239, 21476569, 21742893, 22327324, 22868714, 23321556, 23180787, 23337682, 23055647, 23296644, 24828939, 25296714, 25153466, 25436134, 25781539, 25383888, 25534456, 26457937, 26615915, 26729404, 26580507, 26943009, 26991300, 26582971, 27408158, 27367579, 26843549, 27220175, 27886315, 27731881, 27698416, 28148026, 28677914, 28707610, 28796167, 29581347, 29313174, 29447156, 29900874, 29813994, 30124466, 29532496, 29635438, 30177485, 30286510, 30414709, 30219659, 30630876, 29874813, 29612716, 29514293, 29512515, 29092302, 28359079, 28183218, 27941664, 27363997, 27018536, 27583929, 28209875, 28214294, 28516121]
3557B8516121J17893q3445O37958L08589J38553P8906J071927K51622m24876n54567
3547C0058681n20242Q4743m7942O3057Q2925p23425k99648N54960o43438K6206
3537B8635877m50164K93489N88487m06668K10356L08139L06764k97117Q57231
3528C0046394J033695J099083n58108J432480J554003R45479Q30020Q60616J750603
3519C8994265R13874J391000J510002Q97306m12403K78071N13755n17020j052503
3510D2516347j439066j787877m79595j311039j233242m40212m84200q83385q94240
3501C3563491m84186l21654p81966J85836N05796n24722n99976Q2251M03332p38485
3491C1289717l51733K2627j66135J84664k85946J24617j93448m28568M51481M05290
$$ y = [28516121, 28634014, 28550569, 29188527, 29497116, 29635669, 29714575, 30786502, 31038124, 30613248, 30058681, 29538439, 29623182, 29575240, 29638297, 29721222, 28997797, 28698149, 29253109, 28609671, 28635877, 28185713, 28479202, 29067689, 28661021, 28871377, 29179516, 29486280, 29189163, 30046394, 31080089, 32179172, 31621064, 33053544, 34607547, 35553026, 36383046, 37243662, 38994265, 39908139, 41299139, 42809141, 43706447, 43294044, 43572115, 44085870, 43568850, 42516347, 41077281, 39289404, 38809809, 37498770, 36265528, 35825316, 35341116, 34457731, 33563491, 33079305, 32757651, 31975685, 32161521, 32667317, 32142595, 31542619, 31624870, 32028202, 31289717, 30937984, 30960611, 30794476, 30979140, 30693194, 30817811, 30624363, 30195795, 30647276, 31052566]
3481C1052566O27236L8310j28443J143530J363179R79091J062094R44185J469143
3472C8550891J699589J979673J677627R28677M49635J249502N39750j008961o49790
3463D5416593k410523j905452k180655k427240j186526j323520j117368p05127
3455C2160182m89867k73081p69657o27417L70633j86306J60325P79603K01034
3446C1325449o36264k80931j050992l48179j133750l12318O52851j040442j054804
3437B6120620o05110K10448q8487L41027r6929M23797M39427L60835M03060J08490
3427B7617178M34449R47131O14189l45592N8489k44147p60562n30172k19559j05603
3417B7465801n97839j199204J8632j24716n52413J30275N3338P40616J67896k69922
$$ y = [31052566, 31679802, 31718112, 31589669, 32733199, 34096378, 35075469, 36137563, 37081748, 38550891, 40250480, 42230153, 43907780, 44836457, 45286092, 46535594, 47075344, 46066383, 45416593, 43006070, 41100618, 38919963, 36492723, 35306197, 33982677, 32865309, 32160182, 31670315, 31397234, 30627577, 30000160, 30370793, 30184487, 30344812, 31124415, 31325449, 30689185, 30408254, 29357262, 29009083, 27875333, 27563015, 28215866, 27175424, 26120620, 25515510, 25725958, 25637471, 25978498, 25881569, 26305366, 26744793, 27105628, 27508688, 27617178, 28051627, 28998758, 29612947, 29267355, 29325844, 29081697, 28321135, 27790963, 27571404, 27465801, 26867962, 25668758, 25687390, 25562674, 25010261, 25140536, 25193874, 25934490, 26102386, 25832464]
3407B5832464N16681M86133Q15604R07896J231189L98174j67712J2509K55787
3398C0288725l56315k93885q75635q76021j314069j233628r76157r27747p52326
3389B2682942r27108r56896j129951m59970r17610k87127o15182k57007k89924
3380A6842167j28127n30345K51310k79797o12608N5041l0503O48501q87900m78264
3370A4849475J24541N70716k60016M81510M87575M56904m22507k12368J107068
3361A7182898k5231L06472Q13986N97186K02314J085352P0072K41417k44951O1878
3351B0291393K59078j188627r13250n64406l91594J21228k44834n47625q25186
3342A5996177m28078J86091k65095k08862p14669J38032j83669m19357k14277
$$ y = [25832464, 26349145, 26835278, 27650882, 28558778, 29789967, 30188141, 30020429, 30032938, 30288725, 29932410, 29638525, 28762890, 27886869, 26572800, 25339172, 24363015, 23435268, 22682942, 21755834, 20798938, 19668987, 19209017, 18291407, 18004280, 17389098, 17132091, 16842167, 16714040, 16183695, 16435005, 16155208, 15542600, 15597641, 15567138, 16215639, 15327739, 14849475, 14974016, 15544732, 15284716, 15766226, 16253801, 16710705, 16288198, 16075830, 17182898, 17157667, 17464139, 18278125, 18875311, 19077625, 20162977, 20233049, 20474466, 20229515, 20291393, 20550471, 19361844, 18448594, 17884188, 17492594, 17613822, 17368988, 16821363, 15996177, 15568099, 15754190, 15489095, 15280233, 14565564, 14703596, 14519927, 14100570, 13886293]
3333A3886293k91579q8894m24510k95546r659l32668m34282M86674l9360J19606
3323A2576075n75179j4897l42256k84739o5924M38617k58119j010599M77216n35884
3313A0404311L29496j66632L6797J19277J54005l33382o33867O7630N06121N76278
3303A1060034j89801n07459n69137Q2104L58759O8281l41227J2348k22978N50674
3293A0301598l18348O8563j69069k93149K79419k75561k87901j9747K78136J28801
3283I692742L12551m97809l39861o44910L89255N27632N5365K63925m2638l42421
3273I373831m52377k8188K36517L72941j63284O41441m11857m76285J34028m18819
3263H807948O15503L75864j28977Q4767l18328k8392n883K39240J43525l89734
$$ y = [13886293, 13594714, 13505820, 13081310, 12785764, 12776105, 12443437, 12009155, 12495829, 12456469, 12576075, 12000896, 11985999, 11643743, 11359004, 11293080, 11731697, 11473578, 10462979, 10940195, 10404311, 10733807, 10567175, 10603972, 10723249, 10877254, 10543872, 9910005, 9977635, 10483756, 11060034, 10870233, 10362774, 9793637, 9875741, 10234500, 10302781, 9961554, 9973902, 9750924, 10301598, 9983250, 10051813, 9882744, 9589595, 9869014, 9593453, 9305552, 9285805, 9563941, 9692742, 10005293, 9507484, 9167623, 8522713, 8911968, 9439600, 9494965, 9758890, 9716252, 9373831, 8921454, 8893266, 9129783, 9502724, 9339440, 9980881, 9569024, 9092739, 9226767, 8807948, 9423451, 9799315, 9670338, 9755105, 9436777, 9408385, 9402502, 9641742, 9785267, 9395533]
3253I395533l39745l01108J17876J86224R5923j03165M3302l91789O746j50013
3243H559784N2717K04686K01698m0517J37107n27599q4154k61230L04735K81447
3233H828674M88322J41611r31168K12772k97274R8778M96483P86402l92208p19158
3223H713234L17282L5473l31609P9820L06558j991k71760p1983l88958J3131L5440
3212H434637L54116j48027p4484N34815p4413l63271m73897L7109J71133L77693
3202H775411L93009l95798j08193j82355l36402K45144M42590Q19665j34877m73277
3192I044917l8962L1095q8089K99771Q04622L9534l71282m80104q8266J34717
3182I287953N2051K48455Q64081L09910p07988j48310L5240J56574M28847O65701
$$ y = [9395533, 9055788, 8754680, 8872556, 9058780, 9154703, 9051538, 9094840, 8703051, 8709797, 8559784, 8612501, 8817187, 9018885, 8978368, 9115475, 8587876, 8503722, 8242492, 8547227, 8828674, 9316996, 9458607, 8527439, 8740211, 8442937, 8541715, 9038198, 9824600, 9432392, 8713234, 9030516, 9065989, 8734380, 8814200, 9120758, 9118767, 8847007, 8775024, 8386066, 8399197, 8434637, 8788753, 8640726, 8566242, 9101057, 9026644, 8663373, 8189476, 8226585, 8397718, 8775411, 9168420, 8772622, 8664429, 8482074, 8145672, 8390816, 8833406, 9653071, 9518194, 9044917, 9005955, 9037050, 8948961, 9248732, 10053354, 10092888, 9721606, 9241502, 9153236, 9287953, 9340004, 9588459, 10452540, 10762450, 10054462, 9906152, 9941392, 10097966, 10526813, 11192514]
3172A1192514K16075p59938j72693r455O9722N14898M01515K99814p5505o21833
3162A1055114J73797M28760O22464K43352l36016K00481l39900L81609n48611
3153A1881050L75465M7331K06709Q15967j13137j50106k16718M41344K25838M68616
3143A3982359J62735J91841j03114M87444M26553r3716n75365P38701M54918J68191
3133A5840547k20766L07073N24969l67208L28356N664J008093k85283N30484J41146
3123A7813075N35964l67961p1200Q54172l1212O09301k9412K38545K5694Q2285
3113A9659251L74678O76987R97431Q32025m59441j9517M29924R94427N60529M70056
3103B4516350J478573k55926o5866O18898N16409J373677M25554J107688K76818
$$ y = [11192514, 11408589, 10648651, 10475958, 10466503, 10536225, 11051123, 11452638, 11752452, 11676947, 11055114, 11228911, 11657671, 12280135, 12523487, 12187471, 12387952, 12048052, 12429661, 11881050, 12256515, 12303846, 12510555, 13326522, 13213385, 13063279, 12846561, 13287905, 13513743, 13982359, 14145094, 14336935, 14233821, 14721265, 15147818, 15054102, 14478737, 15217438, 15672356, 15840547, 15619781, 15926854, 16451823, 16084615, 16412971, 16418635, 17426728, 17141445, 17671929, 17813075, 18349039, 17981078, 17909878, 18764050, 18732838, 19342139, 19312727, 19551272, 19576966, 19659251, 20033929, 20710916, 21708347, 22540372, 22080931, 22061414, 22491338, 23485765, 24046294, 24516350, 25994923, 25738997, 25673131, 26292029, 26808438, 28182115, 28607669, 29715357, 29992175]
3094B9992175J21230J207043P23161R40309O96731J056853J034537R44236O10484
3085C7326759L67873J736200Q70526P43149L06488R13485J394438O82236J312944
3076D5654098L41632J263822J173809L33169J537067J510025J371830M28627K64308
3067E3878387J114500J003739J316837J243660Q71700M46945L01497P70006R62037
3058F1909308N29356J502814P84120K67762Q67715N75637M34743K29320L84558
3049F7485333P81651L39220P26321N00439p0094J09088J25226K35317O02548M98302
3039G1333351K91633K19097j44828L44048N34929K00736O05935O15516Q72114
3030G4872531N99806J36654R20940J113629Q83905J80551M09782J449405J254519
$$ y = [29992175, 30113405, 31320448, 32043609, 32983918, 33680649, 34737502, 35772039, 36716275, 37326759, 37694632, 39430832, 40301358, 41044507, 41350995, 42264480, 43658918, 44341154, 45654098, 45995730, 47259552, 48433361, 48766530, 50303597, 51813622, 53185452, 53614079, 53878387, 54992887, 55996626, 57313463, 58557123, 59428823, 59875768, 60177265, 60947271, 61909308, 62438664, 63941478, 64725598, 64993360, 65861075, 66436712, 66871455, 67100775, 67485333, 68266984, 68606204, 69332525, 69832964, 69762870, 69871958, 69997184, 70232501, 70835049, 71333351, 71624984, 71844081, 71699253, 72043301, 72578230, 72778966, 73384901, 74000417, 74872531, 75472337, 75608991, 76529931, 77643560, 78527465, 78708016, 79117798, 80567203, 81821722]
3021H1821722J208009J474270J003220L01324J423516J764808J551851J524894
3013I2073614J590781J318542J435478J567591J855817J468619J671076J768044
3005A04749562J302989J597199J511366J450161R83506J934247R04583J165833
2997A15599446R14741Q95309J312996Q86641Q50326R28280K86135Q99982O55665
2988A23229521o9826J51003K16351k84597k59316k31342n53146J73490r21372
2979A21450766l11665n84528j149395n96265r09545l53689j569992j809788j009597
2970A13156302j420829k041967j342112j485498j550004j544680j983642p79718
2962A01007852k129338k189853j707706j159405q74148j603083j854387k075458
$$ y = [81821722, 83029731, 84504001, 85507221, 85808545, 87232061, 88996869, 90548720, 92073614, 93664395, 94982937, 96418415, 97986006, 99841823, 101310442, 102981518, 104749562, 106052551, 107649750, 109161116, 110611277, 111594783, 113529030, 114433613, 115599446, 116514187, 117409496, 118722492, 119609133, 120459459, 121387739, 121673874, 122573856, 123229521, 123159695, 123310698, 123527049, 123242452, 122983136, 122751794, 122198648, 122372138, 121450766, 121139101, 120554573, 119405178, 118808913, 117899368, 117545679, 115975687, 114165899, 113156302, 111735473, 109693506, 108351394, 106865896, 105315892, 103771212, 101787570, 101007852, 98878514, 96688661, 94980955, 93821550, 92947402, 91344319, 89489932, 87414474]
2954H7414474k122934j324623j037271j513314q76076j354974j291368j315751
2946G6578163j966497j073986p20332J4174q42799j022936q49186o59504j229828
2937F8227269o78407n09733l53371N1978n95785m21744m50836J71315k91531j072853
2927F4076302J84535P39544M6943k93089l46142l58060Q2400K26378N15552K64425
2917F5138788l60868K29338J42437K78069L4650R47126P47446N13914k09635N71322
2907F8032587R84220P17105N47651J207021N07842k56668J11493J108148L44115
2898G3303514K64761J60920N23138O65928M27792J066176N45693J21798R069M24755
2888G7513544L25699R43076n0303J172110k5441l37611k70137K64354P65942m89513
$$ y = [87414474, 85291540, 83966917, 82929646, 81416332, 80540256, 79185282, 77893914, 76578163, 74611666, 73537680, 72817348, 72831522, 71988723, 70965787, 70116601, 69457097, 68227269, 67548862, 67039129, 66685758, 66737736, 66141951, 65720207, 65269371, 65440686, 65149155, 64076302, 64260837, 65000381, 65047324, 64754235, 64408093, 64050033, 64132433, 64358811, 64874363, 65138788, 64777920, 65007258, 65149695, 65427764, 65462414, 66409540, 67156986, 67670900, 67461265, 68032587, 69016807, 69733912, 70281563, 71488584, 71996426, 71739758, 71851251, 72959399, 73303514, 73568275, 73729195, 74252333, 74918261, 75346053, 76412229, 76957922, 77079720, 77088789, 77513544, 77839243, 78782319, 78732016, 79904126, 79878685, 79541074, 79270937, 79535291, 80301233, 79811720]
2878G9811720k07143R7649l14477o90101k92951J34158p47968n22324o16278m65922
2868G6186363m50619j686321n94962j533505k47362n64276j106848o87265j475513
2859F7839692j111003l23183l16429j360248j675890m76039k16362j990824p66676
2850E9603038p14579p90808r22055n50935m50573j058570n06972J5662k00260
2841E4423948n35804n53265n58416J96595k76928q05451M30773Q152j51554o06206
2831E1571844m24446M60498m41264N0637n18726k94371J6752k09358r2064l32412
2821D9787090k79988j38511m54160J48936l11264K44278L52137o08974o1613j222528
2811D7455403L12476K16471j40283m03844k76977M21408n82641o22041N42302
$$ y = [79811720, 79604577, 79702226, 79387749, 78697648, 78404697, 78538855, 77790887, 77268563, 76652285, 76186363, 75735744, 74049423, 73454461, 71920956, 71673594, 71109318, 70002470, 69315205, 67839692, 66728689, 66405506, 66089077, 64728829, 63052939, 62576900, 62360538, 60369714, 59603038, 58888459, 58097651, 57175596, 56624661, 56174088, 55115518, 54608546, 54624208, 54423948, 53888144, 53334879, 52776463, 52973058, 52696130, 51890679, 52321452, 52329604, 52178050, 51571844, 51147398, 51607896, 51166632, 51217269, 50698543, 50404172, 50420924, 50211566, 50119502, 49787090, 49507102, 49368591, 48914431, 49063367, 48752103, 48996381, 49348518, 48739544, 48677931, 47455403, 47767879, 47984350, 47844067, 47440223, 47163246, 47584654, 47002013, 46379972, 46922274]
2802D6922274l68168J04878P42574k35205K70815l83327L97023J29892K60215
2793D7840971L95059R0380N58366O90720J60942J73605j7620Q36496K6570P56219
2783E1511708M39903P9335n47000o71068O10138L35553M5215k97170L66801l8745
2773E1834670N85624j33050n39128p261k29169J53773J186602l75614n24623k53687
2763E1698137k10954j0371k94615k06975N14982q18545J58320l41751p78053n35066
2753D9175109n99436J05876j82556p37146j218454k42369p44027L66886n88458
2744D5335425o8385Q58946l97136j90086j85585J02096N29953l26254Q53041K09639
2734D6721654k91927M18145P07367J9545O38739J008634R33695O30380K30236
$$ y = [46922274, 46554106, 46658984, 47401558, 47166353, 47437168, 47053841, 47450864, 47580756, 47840971, 48236030, 48326410, 48884776, 49575496, 49736438, 49910043, 49892423, 50728919, 50755489, 51511708, 51951611, 52030946, 51483946, 50812878, 51423016, 51758569, 51803784, 51506614, 51873415, 51834670, 52420294, 52287244, 51748116, 51740855, 51511686, 51665459, 52852061, 52476447, 51951824, 51698137, 51487183, 51476812, 51182197, 50975222, 51490204, 50671659, 50829979, 50488228, 49710175, 49175109, 48575673, 48681549, 48498993, 47761847, 46543393, 46301024, 45556997, 45923883, 45335425, 45267040, 46125986, 45728850, 45538764, 45353179, 45455275, 45985228, 45658974, 46512015, 46721654, 46429727, 46847872, 47555239, 47574784, 48213523, 49222157, 50155852, 50786232, 51016468]
2725E1016468N41206L33652N57480P69073J280082L57882P7209n5571M6165R44688
2715E5868334N92836P8613O73021O6425J11640j37723l70820J04631K76280P44146
2705E8007383o19690k49418m07143m32203J68097n06812j14668p74654R9692O58631
2695E5829215o54750n26393l92177L9245Q28766k23399M97037K24959k63048k70865
2685E5088590L603M75990J277959O38040R83318P63673j08845P09864Q62491J296194
2675F1990877J013128J297178J106211J417838N91569J629389J314622J232090
2667G1592902J853315J143397J242551R21636J137800J229849J282413J583618
2659H1987481J771987P86788P53537J206933N60598J695021O74470P09423Q29906
$$ y = [51016468, 51557674, 51891326, 52448806, 53217879, 54497961, 54855843, 54933052, 54877481, 54923646, 55868334, 56461170, 56539783, 57212804, 57279229, 57390869, 57253146, 56882326, 56986957, 57263237, 58007383, 57387693, 57138275, 56731132, 56298929, 56467026, 55960214, 55845546, 55070892, 55170584, 55829215, 55174465, 54648072, 54255895, 54295140, 55123906, 54900507, 55397544, 55622503, 55359455, 55088590, 55092193, 55568183, 56846142, 57484182, 58467500, 59231173, 59122328, 59832192, 60694683, 61990877, 63004005, 64301183, 65407394, 66825232, 67416801, 69046190, 70360812, 71592902, 73446217, 74589614, 75832165, 76753801, 77891601, 79121450, 80403863, 81987481, 83759468, 84546256, 85299793, 86506726, 87067324, 88762345, 89436815, 90146238, 90976144]
2650I0976144P47418R05298j19670J99194K55172R74862O20825J20587n25250
2641I4154580K63382N33497J233845K68671k6787J03062J115232J430517r7454
2632I8978545J052078J69623J437665Q21117J211714J598129J505131J273684
2624A08047686K216870K594791K108816K829879K691176L503272K579528M233195
2616A30805213L851760L805149M324927N304347M864539M592108M579327M512299
2608A66639669M847301M835563N258896N594177N443469N638059O668395O777438
2600B11702967P512505P014611P436349P103370O003653N955870N027083N215392
2592B62971800K765620J573460J958223J982934J898234J572794J794312O65531
$$ y = [90976144, 91723562, 92628860, 92509190, 92708384, 92963556, 93938418, 94559243, 94679830, 94154580, 94417962, 94951459, 96185304, 96453975, 96427188, 96530250, 97645482, 99075999, 98978545, 100030623, 100200246, 101637911, 102459028, 103670742, 105268871, 106774002, 108047686, 110264556, 112859347, 114968163, 117798042, 120489218, 123992490, 126572018, 130805213, 134656973, 138462122, 142787049, 148091396, 152955935, 157548043, 162127370, 166639669, 171486970, 176322533, 181581429, 187175606, 192619075, 198257134, 204925529, 211702967, 219215472, 226230083, 233666432, 240769802, 246773455, 252729325, 257756408, 262971800, 265737420, 267310880, 269269103, 271252037, 273150271, 274723065, 276517377, 277182908]
2584B77182908P76044J547199K582369R48423K91650n90907j079370j246779k601626
2575B77809911k844245k507831l404457k959062l538183l369493k459637l101528
2567B53625475j821692j525946j835971j295857j956613r91328Q4414o83540M7966
2558B43646908l87401L6417j95763J04404l14923l09519n73320L80048J100540
2549B43487391k7652p5229M2723L62741J004810J011595R31939J249851k15705
2540B47772464R93585J36760P26231L79076j98928Q09561j60581k53413l76389
2531B49828366N70598Q3000n99406r39565k75634q4681R7544n4709q27388j505216
2521B46292909n20069o75934j097635j017176j586995j245206k566241k097474
$$ y = [277182908, 277958952, 279506151, 282088520, 283036943, 283328593, 282737686, 281658316, 280411537, 277809911, 274965666, 272457835, 269053378, 266094316, 262556133, 259186640, 256727003, 253625475, 251803783, 250277837, 248441866, 247146009, 245189396, 244198068, 244282482, 243598942, 243646908, 243259507, 243295924, 243100161, 243204565, 242889642, 242580123, 242006803, 242386851, 243487391, 243459739, 243384510, 243427233, 243789974, 244794784, 245806379, 246738318, 247988169, 247772464, 248766049, 248902809, 249629040, 250008116, 249809188, 250618749, 250458168, 250204755, 249828366, 250398964, 250481964, 249882558, 248942993, 248667359, 248582678, 248680222, 248625513, 247798125, 246292909, 245772840, 245096906, 243999271, 242982095, 241395100, 240149894, 237583653, 235486179]
2513B35486179k214028k751619k706972k148647l594962l447748l735579l488910
2505B11397714l035851l674699l619871m720739m875074m032169l555448l808849
2497A80075014m460527n620222m539818m044592m379877n129519m836348m278691
2489A42785420l658448m434904l699086l852842m322023l306070l380063l562387
2481A12569597l580745k438967k697466k735541k762447k735418k162440j917825
2473I1538748j942891j511583j666254j588602j499566j470893j597380j503854
2465G8757725j320446n14078r99682q71936j314735j215805j175567q09909l31707
2456G0203860l79137n40569p39022j031480j433371j121953p53912o89206j256937
$$ y = [235486179, 233272151, 230520532, 227813560, 225664913, 222069951, 218622203, 214886624, 211397714, 208361863, 204687164, 201067293, 196346554, 191471480, 187439311, 183883863, 180075014, 175614487, 169994265, 165454447, 161409855, 157029978, 151900459, 147064111, 142785420, 139126972, 134692068, 130992982, 127140140, 122818117, 119512047, 116131984, 112569597, 108988852, 106549885, 103852419, 101116878, 98354431, 95619013, 93456573, 91538748, 89595857, 88084274, 86418020, 84829418, 83329852, 81858959, 80261579, 78757725, 77437279, 76923201, 75923519, 75051583, 73736848, 72521043, 71345476, 70535567, 70203860, 69824723, 69284154, 68545132, 67513652, 66080281, 64958328, 64204416, 63515210, 62258273]
2447F2258273J15623j051400j773316j328544o90469m62102j077919j336187p12362
2438E3941597j267720K3084j114462j314730j322409q50717l86437r18319o54717
2429D6135170j136382n48185r55174m02996j291798j146458r25094m1243J488
2420C9689328j477403j017118n04438k32852o53570j080558n19329j73989o4430
2411C3965641J11151r10342j617573n84229m73727O6933J92331o70484M18322
2402C0498023j317888j115953l20594J32370o9132p80265P24146J65617o98143
2393B7218181j231298l88079K35021N39415l10191l83593k72350m28443l95938
2384B4582725q0298l76113p47318L92556L11665o1579j028711p09957O02069J68217
$$ y = [62258273, 62373896, 61322496, 59549180, 58220636, 57530167, 57068065, 55990146, 54653959, 53941597, 52673877, 52696961, 51582499, 50267769, 48945360, 48094643, 47708206, 46789887, 46135170, 44998788, 44450603, 43495429, 43092433, 41800635, 40654177, 39729083, 39687840, 39689328, 38211925, 37194807, 36690369, 36457517, 35803947, 34723389, 34204060, 34030071, 33965641, 34076792, 33166450, 31548877, 30964648, 30490921, 30557854, 30750185, 30079701, 30498023, 29180135, 28064182, 27743588, 27875958, 27806826, 27026561, 27750707, 27916324, 27218181, 25986883, 25598804, 25833825, 26373240, 26063049, 25679456, 25407106, 24978663, 24582725, 24502427, 24126314, 23378996, 23771552, 24083217, 24021638, 22992927, 22282970, 22885039, 23053256]
2374B3053256l52366L2232k06386N3131p5964m82495j51105m42252K28796J01233
2364B1758080J7330j074409P3812N37849o8980j24605k70835K8406o48664L8708
2354B0266692O55638k8823q20968l56134o32821O03220m9256K19580m29280l51195
2344A9076653M4546j18309M32968k43235o26752J87454N56437m65692q44561K73548
2334A8273057O41783o75338n48187m04950N18984l11362k82569O08049k55536
2325A7563931J02251l0228P3184l491j76053M24082n95748K32404J78571o50695
2315A7118208j67678K77927j68635K65238m37413K43950j35690r45408K94564
2306A6345063k3127k1091J62594k30728L10140l83800j35987M58200j82111K1025
$$ y = [23053256, 22700890, 22733122, 22526736, 22579867, 22503903, 22021408, 21870303, 21428051, 21656847, 21758080, 21775410, 20701001, 20774813, 21312662, 21243682, 21119077, 20848242, 20876648, 20227984, 20266692, 20922330, 20893507, 20072539, 19716405, 19083584, 19686804, 19637548, 19857128, 19427848, 19076653, 19121199, 19002890, 19435858, 19192623, 18565871, 18753325, 19309762, 18844070, 17999509, 18273057, 18914840, 18239502, 17691315, 17286365, 17805349, 17493987, 17211418, 17819467, 17563931, 17666182, 17635954, 17709138, 17705647, 17529594, 17953676, 17357928, 17590332, 17768903, 17118208, 16950530, 17228457, 17059822, 17325060, 16887647, 17131597, 16995907, 16050499, 16345063, 16321936, 16300845, 16463439, 16232711, 16542851, 16159051, 16023064, 16481264, 16299153, 16320178]
2296A6320178k72554o4286o4834m77339m6324P68531O4063k66939O3800K89664
2286A6313960j48493o37430J32729M50097K76318o99909l25519J15323K19520
2277A5696596j95881M1857N80302n73445j68579J0301J53420J41221l81964L68919
2267A5672747K01338j006449j9919N92553K42695n31180k22644K98613L45947
2258A5573701q03445P6455p4997J33329N98418K21230Q13879p31225m79859K75152
2248A5602638m05521j90443K96961J51821L20084l29606n13358l07133K2122O59400
2238A5306965K72380k50737M91233j11031j69608k85288M66266J71695m19554
2229A5472321M24288N16134J3905l47444K11088K90005l21215M26874M98406l75586
$$ y = [16320178, 16047624, 15983338, 15918504, 15441165, 15394841, 16163372, 16227435, 15960496, 16024296, 16313960, 16165467, 15528037, 15660766, 16110863, 16387181, 15687272, 15361753, 15477076, 15696596, 15500715, 15542572, 16122874, 15549429, 15380850, 15391151, 15544571, 15685792, 15303828, 15672747, 15874085, 14867636, 14847717, 15440270, 15682965, 15151785, 14929141, 15227754, 15573701, 14770256, 14846711, 14771714, 14905043, 15503461, 15724691, 16538570, 15807345, 15327486, 15602638, 15197117, 15006674, 15303635, 15455456, 15775540, 15445934, 14932576, 14625443, 14647565, 15306965, 15579345, 15328608, 15819841, 15708810, 15539202, 15253914, 15720180, 15891875, 15472321, 15896609, 16412743, 16426648, 16079204, 16290292, 16580297, 16259082, 16685956, 17184362, 16808776]
2219A6808776J13416J80355m4894j59002L85399N53872K7833J38100n1954j14821
2209A7837080J52168J154866N06014m43800N31536o71398K0466N19265P10615
2200B0316812n51240j45820j50239K83551K03096P44325K82293k72383M55246
2191B1165641O84495M67195L3531N28998P23070J03838n65127M57917R86508J114461
2181B5700527l15471K4669J21710R16608R93667j70761J83734R30646Q27724Q66834
2171C0079887J214052J305005L31702O59591J189913O83820N94630N88374K79324
2162C6926298o94753j294366j326809j274593j311200m50979j56102n58502k068093
2153B7790901j314722j133162j77485o93593m8942m43845n81635o41413j180960
$$ y = [16808776, 16922192, 17102547, 17057653, 16898651, 17284050, 17837922, 17865755, 18003855, 17951901, 17837080, 17989248, 19144114, 19650128, 19206328, 19737864, 19066466, 19086932, 19606197, 20316812, 19765572, 19619752, 19469513, 19753064, 19956160, 20700485, 20982778, 20710395, 21165641, 21850136, 22317331, 22350862, 22879860, 23602930, 23706768, 23141641, 23599558, 24586066, 25700527, 25385056, 25409725, 25531435, 26448043, 27441710, 27270949, 27454683, 28385329, 29213053, 30079887, 31293939, 32598944, 32930646, 33590237, 34780150, 35463970, 36058600, 36646974, 36926298, 36231545, 34937179, 33610370, 32335777, 31024577, 30573598, 30417496, 29858994, 27790901, 26476179, 25343017, 25165532, 24471939, 24422997, 23979152, 23397517, 22756104, 21575144]
2144B1575144M79439p30816k05939j449128J87317n72287o86396l42178q07654
2135A7447502m95155j51529m46319o98892J50472m3811k51508j048301M52254
2126A4914713m2390j08522k01976Q479j44212L35466L50968p2702n45715j302879
2116A3191230R63621q4304R0436j070441m09084O5074o80362l87676P76342k65260
2106A2189576o95935m16564J40897K64564j156557L36433N16391J68260r0537
2097A1256528J1589m54546p57964n4140O3734Q3847j98983r5466J19078k37116
2087I736561k23447J693j00802L75135m6800r5753K69848k60093p42664k23743
2077H689935N55356L92317M79461m8659j13996n5632p55166n88801n64477R46685
$$ y = [21575144, 22054583, 21323767, 21117828, 19668700, 19856017, 19283730, 18597334, 18255156, 17447502, 16952347, 16800818, 16354499, 15655607, 15806079, 15762268, 15510760, 14462459, 14914713, 14872323, 14763801, 14561825, 14570304, 14426092, 14761558, 15112526, 15039824, 14494109, 13191230, 14154851, 14070547, 14160983, 13090542, 12681458, 12746532, 12066170, 11678494, 12454836, 12189576, 11493641, 11077077, 11217974, 11482538, 10325981, 10662414, 11178805, 11347065, 11256528, 11268117, 10813571, 10055607, 10001467, 10065201, 10149048, 9950065, 9854599, 9973677, 9736561, 9513114, 9514807, 9414005, 9789140, 9742340, 9646587, 9916435, 9656342, 8913678, 8689935, 9245291, 9637608, 10117069, 10068410, 9954414, 9898782, 9143616, 8554815, 7990338, 8937023]
2067H937023Q51854n17347j23556o97107m38839l89910K00615O31751J04116K2472
2057H581072J16255j174253j02383k33157Q01949J05711p40207K91616n11227
2048G135376k12526K24513P6763j42757o22022j54735J34265J08261j28697k53074
2038F165367m4048K66355k23986o13307J09210M66877J85831L1782j44832m81637
2028E717612n78281j37160R83106M96554q86056j01564j2345L93690m76294j64797
2018E234465M68619n15973P1952O62340r2488q33083n51774Q62022K98444q86085
2008D718439P47742O03235o44641q81126J27950j672r5855Q7048N44579k53140
1998D952559o96089O4329q4000J25241L05422m54198N97800L29062o57095M4642
$$ y = [8937023, 9788877, 9271530, 9147974, 8450867, 8012028, 7622118, 7822733, 8454484, 8558600, 8581072, 8697327, 7523074, 7420691, 7187534, 7989483, 8095194, 7354987, 7646603, 7135376, 6922850, 7147363, 7224126, 7081369, 6459347, 6304612, 6438877, 6547138, 6418441, 6165367, 6121319, 6387674, 6163688, 5550381, 5659591, 6126468, 6312299, 6344081, 6199249, 5717612, 5139331, 5002171, 5985277, 6481831, 5595775, 5494211, 5481866, 5875556, 5399262, 5234465, 5703084, 5187111, 5259063, 5921403, 5828915, 4995832, 4444058, 5306080, 5604524, 4718439, 5466181, 6069416, 5424775, 4543649, 4671599, 4669927, 4574072, 4661120, 5205699, 4952559, 4256470, 4320799, 4236799, 4362040, 4667462, 4213264, 4811064, 5140126, 4483031, 4527673]
1988D527673m76795k54595l23219M54442Q19796l21210r08806l49404P72001q9201
1978C850682J21759L144O15275m66645q54480Q070K23148Q69094j23883o45230
1968C600934k71520q4831K95974J17127K59688l02495J3748j07845m13191K47319
1958C354908k9511k4618L03710k34849l58438K93086M5486k8974j90611J72618
1948C302807l2611m3697k33108J68885N7112K47627n66800n38267O72891P35166
1938C770005J05268n46602n04475j21078m2875M1724M55342P5082J72767l63303
1928C041855L82137o1460n10302K74031K82713j41001k64507K61377O27241p41445
1918C150639n29745M63562m4009K01215N73099N56165l49648j160211J09169O67674
$$ y = [4527673, 4050878, 3796283, 3473064, 3927506, 4747302, 4426092, 3517286, 3167882, 3939883, 3850682, 3972441, 3975585, 4590860, 4124215, 3269735, 3277805, 3500953, 4370047, 4246164, 3600934, 3329414, 3244583, 3540557, 3657684, 3917372, 3614877, 3628625, 3520780, 3107589, 3354908, 3325397, 3300779, 3604489, 3369640, 3011202, 3304288, 3349774, 3320800, 3130189, 3302807, 3270196, 3226499, 2993391, 3162276, 3219388, 3467015, 2900215, 2361948, 3034839, 3770005, 3875273, 3328671, 2824196, 2703118, 2660243, 2701967, 3157309, 3232391, 3405158, 3041855, 3423992, 3362532, 2852230, 3126261, 3408974, 3267973, 3003466, 3264843, 3892084, 3150639, 2620894, 3084456, 3040447, 3241662, 3814761, 4370926, 4021278, 2861067, 2970236, 3637910]
1908C637910l95417K36034L64223P3454m58273k5088J31971j59155n1861L5201
1898C388999n3313j17967L09856k4937j49334K02226k2941r7132k69903L89464
1888C555018R0266m91001K85676k74425N22192l68998L89610L26098p51585M69264
1878C752115j72122R0599m4997j22014M9122l58899j9118K11840p2407L90367
1868C704486j20257k97775L60955J95663J62410m87499J78032L9803l71703N4734
1858C418849J30853M4985N5020k2004m28196q02349O72818J007542k62641M14392
1848D229269j87371n47703m60522K68472R52216L13289k58363l44333J39030r0669
1838D013315k07855L88982k98389L31854L67262Q16879m13679j423057j31722
$$ y = [3637910, 3242493, 3478527, 3842750, 3916204, 3457931, 3432843, 3564814, 3405659, 3353798, 3388999, 3335686, 3217719, 3527575, 3502638, 3353304, 3555530, 3532589, 3435457, 3165554, 3555018, 3645284, 3154283, 3439959, 3165534, 3687726, 3318728, 3708338, 4034436, 3282851, 3752115, 3579993, 3670592, 3625595, 3503581, 3552703, 3193804, 3174686, 3386526, 3314119, 3704486, 3584229, 3286454, 3647409, 3843072, 4005482, 3517983, 3696015, 3735818, 3364115, 3418849, 3549702, 3594687, 3649707, 3627703, 3199507, 2397158, 3069976, 4077518, 3814877, 4229269, 4041898, 3494195, 3033673, 3302145, 4254361, 4567650, 4309287, 3964954, 4103984, 4013315, 3805460, 4194442, 3896053, 4227907, 4595169, 5412048, 4998369, 3575312, 3443590]
1829C443590M80393M46010L0347K83491Q3866k16243l28007k59344m91609Q92235
1819D364729O09962O7510m762o55498M73228q52643L39458O3426Q1773O74253
1809E161436l48460J68313k75321P94618M12847m37367P94732l41226m30476l1262
1799E467834o72218J00011o35015P40107k28167j181219M41082M25814r1453n86166
1789C780610K09055L78371j63330o88362J54928N0277N69118J08356K55788M4834
1779D699645p61768L96549K4583N21417n64796K17382l13672l14314N46712K19573
1769D671311j44646n71108m1964q9520k42170L00138k66004J08670j82833k14683
1759C327191J78543k28384J93285k47630n16728j56051L47611M32709n436k85764
$$ y = [3443590, 3923983, 4369993, 4400340, 4683831, 4767697, 4551454, 4223447, 3964103, 3472494, 4364729, 4974691, 5042201, 5037439, 4381941, 4855169, 4002526, 4341984, 4405410, 4487183, 5161436, 4812976, 4981289, 4705968, 5500586, 5913433, 5476066, 6270798, 5929572, 5499096, 5467834, 4795616, 4895627, 4260612, 5000719, 4772552, 3591333, 4032415, 4458229, 4366776, 3780610, 3989665, 4368036, 4204706, 3516344, 3671272, 3721549, 4290667, 4399023, 4654811, 4699645, 3937877, 4334426, 4359009, 4880426, 4315630, 4533012, 4219340, 3905026, 4451738, 4671311, 4526665, 3955557, 3913593, 3824073, 3581903, 3882041, 3616037, 3724707, 3541874, 3327191, 3505734, 3277350, 3470635, 3223005, 2706277, 2550226, 2897837, 3330546, 3325110, 3039346]
1749C039346l6121n41695n05866M23716M42730L82114m08355l33479l74463j81760
1739A906167L00468M41423J98006j97497j83888l03951n46404K73360P41799m38868
1729B190615n18557K3035L05117m3359m30284n18613L35922M09704N25189j081641
1719A197128J29236L4030m01277N90920N30030j34646m29055m19505P92532j4206
1709A875187r02417N05189k07127K09809k43087r730j77382n78722K25352N63141
1699A260213J0161o7999k25826j23311M11353j93161M3065r9222k38536N77449
1689A354186K4577O07667p09868o93547P34454l736p2995j79540L8116J3127k2606
1678A089835l70530P26185o77142l3211L27377n34849K14075L34294l9734j51934
$$ y = [3039346, 3003225, 2461530, 1955664, 2379380, 2822110, 3204224, 2795869, 2462390, 2087927, 1906167, 2206635, 2648058, 2846064, 2648567, 2464679, 2160728, 1614324, 1887684, 2629483, 2190615, 1672058, 1695093, 2000210, 1956851, 1526567, 1007954, 1343876, 1753580, 2278769, 1197128, 1326364, 1360394, 959117, 1550037, 2080067, 1945421, 1516366, 1096861, 1889393, 1875187, 972770, 1477959, 1270832, 1480641, 1237554, 1227824, 1050442, 471720, 697072, 1260213, 1270374, 1202375, 976549, 853238, 1264591, 1071430, 1114495, 1015273, 776737, 1354186, 1378763, 1986430, 1276562, 583015, 1317469, 1313733, 1240738, 1061198, 1099314, 1112441, 1089835, 719305, 1445490, 768348, 735137, 1062514, 527665, 741740, 1076034, 1036300, 884366]
1668H84366Q7781J21507l2350o18174P51030l29529m3752K06801J2845K8648Q2878
1657A152051j38884M20017n39774K65070N67677m74775o48662n28142J128608
1648A203186M90535p15458j61480L04893J30522l2319o70107l33450K77414O46548
1638A140284M27985o48703p66412K01495O37295J02827l04655p9548l05726K98953
1628G03795J6906N16517m9018r583m98180l55420L15984Q5297K49017m66108n0711
1617D58496M30681J24369j8311q01846r5742P78768K02250l92201n88962N51466
1607F48968L93672l98801N6747j3760k4514l58744L6673J28020k72241k60849
1597f4829P85265O77470o28969m31372r4141M27338n56002J59283n7767O68444
$$ y = [884366, 972147, 1093654, 1061304, 443130, 1194160, 864631, 820879, 1027680, 1040525, 1069173, 1152051, 1013167, 1433184, 893410, 1158480, 1726157, 1251382, 602720, 74578, 1203186, 1693721, 978263, 816783, 1121676, 1252198, 1219879, 549772, 216322, 493736, 1140284, 1568269, 919566, 153154, 354649, 991944, 1094771, 790116, 710568, 404842, 703795, 720701, 1237218, 1188200, 1178617, 680437, 325017, 641001, 726298, 975315, 509207, 458496, 889177, 1013546, 995235, 193389, 97647, 876415, 1078665, 686464, 97502, 648968, 1042640, 643839, 700586, 686826, 662312, 303568, 340241, 468261, 196020, -64829, 720436, 1397906, 768937, 337565, 243424, 670762, 114760, 274043, 216276, 884720]
1587H84720P4453n76012n51998L75161M47438R9680J44882J94923l89557q20782
1577a17092m5634M49719O23264j50133L33086j149475J17959L98289L67211n83836
1567B43358o58792M41401R49150k74733m51071N0507M17510m37954p47806R12098
1557D43668J88281k22396K61217J46269l71865m65379l8952N08670j24203l4189
1547B91121Q2391j18036l44616k87310O93252K04713l17731J03715j13560R06056
1537A099995k34832p45808n27404P09552L99737k74638k43642L88104L24289l41311
1527E54042j97614l10623J61253N32295L90857j39623o87106k12294O28964k59390
1517D60761Q6324j42485n4337K09822m24051L96665k35135j30848j83903j15047
$$ y = [884720, 959173, 383161, -168837, 206324, 653762, 753442, 898324, 1093247, 703690, -117092, -162726, 286993, 910257, 760124, 1093210, -56265, 61694, 459983, 827194, 243358, -415434, 25967, 975117, 700384, 249313, 299820, 717330, 279376, -468430, 443668, 631949, 409553, 670770, 817039, 445174, -20205, -59157, 449513, 325310, 291121, 373512, 255476, -89140, -376450, 316802, 521515, 203784, 307499, 193939, 1099995, 865163, 119355, -408049, 301503, 701240, 426602, 182960, 571064, 895353, 554042, 356428, 45805, 207058, 739353, 1130210, 990587, 303481, 91187, 720151, 460761, 547085, 404600, 350263, 560085, 136034, 532699, 297564, 166716, -17187, -132234]
1507a32234R76604N95639j57810j005477r35651N10213O37707P69665K98288q43969
1497G12975j13209m70812k46553L81709J05595K26251L19669k24670m77998j11005
1487A01952N76896L21073n58063r9296P44468j94581n58185p0883j645L2089j23650
1476A70175j4464J006340r94388j61689M3179k53039N82226n28222P11163M60861
1466A022142k89869o3392j023291L93267J22335j5541O12025q4641m73633k28261
1456b8859L32586q2195L22355n07515L39441k09691l7677K05832k95731o51432
1446f12886L85161R7405L84392j3530K22165m58684k80668Q98108k5995j94894
1436D00574l22157J69371k26225n4704K93905M35738m54402k17620J78332J68384
$$ y = [-132234, 844370, 1440009, 1282199, 276722, -658929, -148716, 488991, 1258656, 1556944, 712975, 599766, 128954, -117599, 264110, 369705, 595956, 915625, 690955, 212957, 101952, 678848, 999921, 441858, 342562, 1087030, 892449, 334264, 263381, 261736, 293825, 170175, 155711, 1162051, 167663, 5974, 49153, -203886, 378340, -149882, 561281, 1022142, 732273, 668881, -354410, 38857, 161192, 145651, 757676, 673035, 199402, -28859, 303727, 221532, 543887, 36372, 375813, 166122, 128445, 334277, 38546, -612886, -227725, -130320, 254072, 240542, 462707, 4023, -276645, 621463, 595468, 400574, 78417, 247788, 21563, -33141, 260764, 696502, 242100, 24480, 202812, 371196]
1426C71196L65263q16580q1098R31794K89859n87421r43916O92887J08222m085
1416C26121J60371K30723r25090k80077M68269J103271m70817p68538R2379K63352
1406A99964L65811k93299M55683j16037n0167k20508n15392L66545k39964J33760
1396H6396M05743r5942K9178m01376M44601J05649p5954j92480J92286k85700
1386B12401j45469L93241o0042k55146n16445L72445L26436J05523J21596k81845
1376B72695k97418j13324K18711j98340J21608K24600P47763q42228r66974Q89755
1366E6848N8314M36530k8665m45518j74060p41211P96328K16793m12344N10566
1356B73581j14234j73428k72122J22700Q4673R3393J42881Q5486K85775o07910
$$ y = [371196, 736459, -80121, -161219, 770575, 1060434, 473013, -470903, 221984, 330206, 326121, 486492, 717215, -207875, -487952, -19683, 1083588, 612771, -155767, -63388, 199964, 565775, 272476, 728159, 612122, 561955, 341447, -173945, 192600, -47364, 86396, 492139, 396197, 425375, 23999, 468600, 574249, 498295, 305815, 498101, 212401, 66932, 460173, 400131, 144985, -371460, 985, 327421, 432944, 554540, 272695, -24723, -138047, 80664, -117676, 3932, 228532, 976295, 134067, -832907, 56848, 115162, 551692, 523027, 77509, -96551, -837762, -41434, 175359, -236985, 273581, 159347, -14081, -286203, -163503, -78830, 14563, 157444, 242930, 528705, -79205]
1346g9205k73165k28792K39276Q09486k63167j39694L66330K61937o89910n41779
1336e38683L89679K29314l8539R6227J15772n21005m81894O03024N13129k71286
1326I5738K40383j85841o27405K12369M04304K5936Q4968k58358J25054K29976
1316C47124k93608r1452k6760M689J24833J43825K20664m35055M7499J25055k01073
1305c4259k71546L11219P93691R7406p92374m26221J15834k55389L38991L43846
1295B21198K23244M3057j44988K5313n00889j04538m1440N97064L56622m95252
1285A79391J2790l5853K97070o15663K401O05442r2498j01955k58957L45929j71203
1274A66894l47952k20721m06508Q94525k04455l31251N97217m88108p097K81842
$$ y = [-79205, -352370, -581162, -341886, 467600, 204433, 64739, 431069, 693006, 3096, -538683, -149004, 80310, 41771, 137998, 253770, -267235, -749129, -146105, 367024, 95738, 336121, 150280, -477125, -264756, 139548, 165484, 250452, -7906, 117148, 347124, 53516, -37936, -64696, -60007, 64826, 208651, 429315, -5740, 41759, 166814, -34259, -305805, 5414, 799105, 896511, 104137, -322084, -206250, -461639, -122648, 221198, 444442, 487499, 342511, 367824, -133065, -237603, -279043, 318021, 674643, 179391, 192181, 156328, 453398, -162265, -159864, 445578, 353080, 251125, -7832, 338097, 166894, -181058, -401779, -808287, 86238, -118217, -449468, 147749, -340359, -347456, -65614]
1264f5614l9140M22318p82871R18711p3855Q15K05678p66037m19618O9728O61769
1253A31884K11792L2668J79430r5339q95233n81038J103966J29369j74996M14831
1243D57334m06070N26510p10651K02875m523k99979P88087J73759p4685n39501
1233A13156m63265K42601J75366K5034Q503n4355M40151k68970k82016J8386O891
1222c8518J06485j89412K57657L60731l35881J26009m57405J62599M48650p27095
1212b86180M81259l70301j57534M04635k48157L60239k85795m55323L28651p5925
1202c04431K05079J89861L19339o47494j44034m01113P21409M22395n75639L13075
1192I8447n67967N93814o3101N2189P7744k20075K68325k79663k34460j38142
$$ y = [-65614, -104754, 317564, -465307, 453404, 379549, 380364, 586042, -179995, -599613, -529885, 131884, 343676, 376344, 555774, 460435, -434798, -1015836, 88130, 217499, 42503, 457334, 51264, 577774, -132877, 69998, 65475, -234504, 553583, 727342, 652657, 113156, -350109, -107508, 67858, 92892, 101395, 47040, 487191, 218221, -63795, -45409, -38518, 67967, -121445, 136212, 496943, 161062, 287071, -170334, -7735, 440915, -286180, 195079, -175222, -332756, 71879, -176278, 183961, -101834, -557157, -228506, -304431, -99352, 90509, 409848, -237646, -381680, -782793, -61384, 361011, -214628, 98447, -469520, 124294, 61193, 113382, 191126, -28949, 239376, -40287, -274747, -412889]
1182d12889K29611L50418m6707o2880n43098j68935M56817N09281J4240k48991
1172G6867m7907k24778j71953K34193M10788q7027m71563J21212M46895k72445
1162A4282k51329K34P64518r2464k05782j75208l46301j76841P59703J65198j16456
1151C39554o26131M8436K64774P306j81558m8996O66820J38723m25862r92958
1141h09892K70085J93074R05382p587J9571n62975m41369N4854N07363R0104J75890
1130C94500J22929m00991o39105K22275O20167k33430r3829L96467R26661p46983
1120E68661p40100o43408J371911j98830J01290m27090q320q377l02889P70611
1110D83459j012966k58881N95501R89925l22780l41108m31080R65945k30326r8401
$$ y = [-412889, -183278, 167140, 120433, 57553, -485545, -654480, -197663, 311618, 325858, 76867, 28960, -195818, -367771, -133578, 277210, 190183, -281380, -160168, 286727, 14282, -237047, -236813, 527705, 435241, 229459, 54251, -292050, -468891, 290812, 456010, 339554, -286577, -238141, 26633, 33939, -147619, -196615, 470205, 608928, 183066, -809892, -539807, -346733, 558649, 551062, 570633, 7658, -433711, -378857, 128506, 218610, 394500, 517429, 116438, -522667, -300392, 319775, 86345, -7484, 388983, 1315644, 568661, -171439, -814847, 557064, 358234, 459524, 32434, 24114, 15737, -287152, 483459, -529507, -788388, -192887, 797038, 474258, 133150, -297930, 668015, 437689, 339288]
1100C39288j83202l67132N52613q2776J36875k4209l69547r5079K1895L9338L38740
1089C06804j56288L26151m00070n94437j00765L63162M08590j99822N2654K3787
1079B9766J77234l99912L82358M08129k49836l32343p40520J106166M01716L39624
1069A122382p63567p72681N13548k04253M81826J98397n5749O4850M0259O001
1059F31013J25149p21688M27810M34353K20481k28972n30678N90695r7420m59989
1049C90754N51038k03957L41747R4337k73396J64972p06532K26021K85723P26384
1039A597091l9506k04851p3659k40305N49523l3945q5058J4525J13402M64746
1029B061963j8847r54493K3922L45043P57945Q9956K9341R2774l52234o4783j38845
$$ y = [339288, 156086, -211046, 341567, 258791, 395666, 371457, 1910, -93169, -71274, -31936, 306804, 150516, 476667, 76597, -517840, -618605, -255443, 153147, -46675, 5979, 29766, 207000, -192912, 189446, 597575, 347739, 15396, -725124, 381042, 782758, 1122382, 358815, -413866, 99682, -104571, 377255, 575652, 519903, 584753, 625012, 631013, 756162, 34474, 462284, 896637, 1117118, 888146, 357468, 948163, 850743, 390754, 941792, 737835, 1079582, 1173919, 900523, 1065495, 358963, 584984, 870707, 1597091, 1557585, 1352734, 1279075, 1038770, 1588293, 1554348, 1469290, 1483815, 1597217, 2061963, 2043116, 1088623, 1112545, 1457588, 2215533, 2305489, 2334830, 2427604, 2075370, 2010587, 1871742]
1018A871742L80683K11961J76666K17320n9515O1581k63362L8184k32032j08779
1008B294449Q89694K01106p5404m7241J71849j37059j78437o6537O89560O44189
998D386169J78313P9626n16413o32528K4107R11002N86159L46087K59819L48279
988E970620N15266n28982k3272n7560R68735J051088O08764m16318r6562K92757
978H284536O37804Q72864O24722J248545R00590J513210J178205N43012N27416
969A6330904J091011J216572J879743J189050J167015K940948K694929L512750
961C2022922N066338O156598O867265Q649221J2389604J5531835J1047203J8579
953I7749565j2358710j5666765j2180147r798498p023473n250899m210814l233811
$$ y = [1871742, 2252425, 2464386, 2641052, 2858372, 2798857, 2860438, 2597076, 2635260, 2403228, 2294449, 3184143, 3385249, 3309845, 3262604, 3434453, 3297394, 3118957, 3052420, 3741980, 4386169, 4564482, 4644108, 4127695, 3495167, 3519274, 4430276, 5016435, 5362522, 5622341, 5970620, 6485886, 5956904, 5933632, 5876072, 6844807, 7895895, 8504659, 8088341, 7991779, 8284536, 8922340, 9795204, 10419926, 11668471, 12569061, 14082271, 15260476, 15803488, 16330904, 17421915, 18638487, 20518230, 21707280, 22874295, 25815243, 28510172, 32022922, 37089260, 43245858, 50113123, 58762344, 71151948, 86683783, 97730986, 97749565, 85390855, 69724090, 57543943, 47745445, 40721972, 35471073, 31260259, 28026448]
945B8026448k288870k773564l146717j404090l38293q84387j999390q68987k0530
936A4301620j012968j250815j398569o78753n23110m65908n4618o86666k16539
927H013674n84928j66538j35074m30392j91402j087631K24316k7599j95266l6452
917E382708l88906m1202l03848P3563j65586n54856L49122N9387K5274p89242
907C646414k88372P5882R8994l18286J63103l23946K29576j27691K84838l00877
897C139635q01741K06046L52642M77190l87621r61542M35344J19364k21670O48030
887C005677l81220l19231n61892M55087J60790l12748m69370M6687L01460J24335
877B049575l31226J9673K24986l04430l73171O60564K49464m20337l63021R59816
$$ y = [28026448, 25737578, 22964014, 19817297, 18413207, 18074914, 17190527, 15191137, 14322150, 14301620, 13288652, 12037837, 10639268, 9960515, 9437405, 8971497, 8916879, 8230213, 8013674, 7428746, 7262208, 7127134, 6696742, 6505340, 5417709, 5642025, 5614426, 5419160, 5382708, 4993802, 4952600, 4648752, 4722315, 4556729, 4001873, 4350995, 4410382, 4435656, 3646414, 3358042, 3433924, 3532918, 3214632, 3377735, 3053789, 3283365, 3155674, 3440512, 3139635, 2337894, 2543940, 2896582, 3373772, 2986151, 2024609, 2459953, 2579317, 2357647, 3005677, 2624457, 2305226, 1743334, 2198421, 2359211, 2046463, 1577093, 1623780, 1925240, 2049575, 1718349, 1738022, 1963008, 1658578, 1285407, 1945971, 2195435, 1775098, 1412077, 2371893]
867B371893J9907j666063J78737Q10154J49653n72648M56238N0922m88794l1759
857A278240J12321o21118Q0437K1549O37921J87836p94451l26149n4749P10761
847A232598o48334l26805P73094L7062l70590J755O66184p37866k82497N86420
837I31021M33054l95701n92245M69635k43033m05887j41015P40331L73854q58672
827C11342l38040M80200R0287K82520J07507J62623n17516o64773j93961O50579
817C70768K89749O1777L27192q06684J52333J50118j10512r1690r0358M86365
807G39058n33606M24730l02381j44828M18394l009o57662k32532R03440L4008
797F45612k8378K06396k43043m84696n09744M33176O32293k77294j11780J7906
$$ y = [2371893, 2391800, 725737, 904474, 1714628, 1864281, 1291633, 1747871, 1798793, 1309999, 1278240, 1390561, 769443, 849880, 871429, 1509350, 1697186, 902735, 576586, 521837, 1232598, 584264, 257459, 1030553, 1067615, 697025, 698780, 1364964, 627098, 344601, 931021, 1364075, 968374, 376129, 845764, 602731, 196844, 55829, 796160, 1170014, 311342, -26698, 453502, 543789, 826309, 933816, 1096439, 578923, -85850, -279811, 370768, 660517, 722294, 1049486, 242802, 395135, 545253, 434741, 343051, 252693, 739058, 205452, 630182, 327801, 182973, 601367, 598358, -59304, -291836, 611604, 645612, 617234, 823630, 580587, 95891, -413853, 19323, 651616, 374322, 262542, 280448]
787B80448m01308j36223M01581R6154R5436j48169L14608p7304l63716K12547
777B74054p75635m299p4961L75001M59274P59883m91265j035429k0695O33315
767I9243K66876k30195N43599m22607K69253o75980L71695J14781j00106J739
757B38298k3884j00512j65045l37072N25619L31749l84941J9223L96505k51343
747B48597o7245l35208M00456r9946q39114Q59173M22524m1606n98830K64369
737B13170n196Q2568q8051L16612q5263l70182r5204n1180p6992J10812M69841
726D20935o9791l50056l35691J4537L36387J02758K42068n03745k93233m7315
716d83146N36129r2036J54099p3086j82331J30717k59898M36238o00607L51739
$$ y = [280448, -120860, -257083, 144498, 240652, 336088, 187919, 502527, 425223, 61507, 274054, -501581, -505880, -580841, -205840, 253434, 1013317, 522052, -513377, -534072, 99243, 366119, 135924, 679523, 256916, 526169, -149811, 221884, 336665, 236559, 238298, 214414, 113902, -51143, -388215, 137404, 469153, 84212, 103435, 499940, 248597, 181352, -153856, 246600, 146654, -692460, 166713, 589237, 547631, -51199, 213170, 207974, 290542, 202491, 519103, 433840, 63658, -31546, -82726, -159718, -48906, 420935, 351144, 1088, -334603, -320066, 16321, 119079, 361147, -142598, -435831, -483146, 52983, -39053, 115046, 41960, -140371, -9654, -269552, 166686, -433921, -82182]
706h2182O98684j82703m96703j20045j28272j14335K20659K09864Q0122L7628
696A22717N4030o29472k44401L27515R24414l66760J74823j37096m92417o2519
686c29166k04461N41073P5247J13763m29127j88262J67718J88083J33083J5499
676H3450J24396K09336j65073m10515l00688K45059L28764K95822k88260j7678
666A04613p0437k78888j21510N46629k83816L08355m95792M8096J00244J83250
656D0744M03579q11993J51382K98969J83721k35659n75163M89916J10448l7309
646A8635p01215J40427O22981k74834K70669m59219N47191r35044j6788N73021
636b14176N72327r87261l42867M34251l7026K43784m40900J210224j096955m43930
$$ y = [-82182, 616502, 433799, -62904, -182949, -311221, -425556, -204897, 4967, 85089, 122717, 176747, -452725, -697126, -369611, 554803, 188043, 362866, 225770, -266647, -329166, -533627, 7446, 82693, 196456, -232671, -420933, -253215, -65132, 67951, 83450, 207846, 417182, 252109, -158406, -459094, -214035, 114729, 410551, 122291, 104613, 34176, -244712, -366222, 180407, -103409, 204946, -290846, -242750, -142506, 40744, 444323, -367670, -216288, 82681, 266402, 30743, -544420, -54504, 55944, 18635, -682580, -542153, 80828, -194006, 76663, -382556, 164635, -770409, -787197, -214176, 358151, -629110, -971977, -537726, -574752, -330968, -771868, 438356, -658599, -1102529]
626a102529P00916K61494k0789n69552K88940J73897l68294l47259N23935K70603
616a88638k05960l42480N59532j8798o5155k76736N40732j26127l37431N2446
606d08615j08769K50446j018484P88983P46425j99055l44120n71980R01703J073
596C7607n41036M50957m60132L46135J34813k30399j03125j19744K69777j29761
586c44908j74895N15541n6228n5511l61423j04717k29422M27361j48641j39983
576f72826O02904k02325k77535m93751P11705J06042q559p0862P2869k40099K97121
565a75316O9859k96561m04691O04225N76447l28425o67147m70164L01779l5787
555h25781P33917L80316m58669n06677k53606N11348K74216K77669m23122l21813
$$ y = [-1102529, -401613, -140119, -160908, -730460, -441520, -267623, -635917, -983176, -459241, -188638, -394598, -737078, -177546, -196344, -261499, -538235, 2497, -123630, -461061, -408615, -517384, -266938, -1285422, -496439, 249986, 50931, -293189, -865169, 36534, 37607, -503429, -52472, -512604, -166469, -31656, -262055, -365180, -484924, -215147, -344908, -519803, -4262, -60490, -116001, -477424, -582141, -811563, -384202, -532843, -672826, -69922, -272247, -549782, -1043533, -331828, -225786, -234345, -305207, -232338, -472437, -175316, -105457, -402018, -806709, -202484, 373963, 45538, -621609, -1091773, -789994, -825781, -91864, 288452, -170217, -676894, -930500, -419152, -144936, 132733, -290389, -612202]
545f12202L06390L43808m81697n8609L1843J11868k76720J35923K00080l70821
535f70137N1698K34518P9982j99081o4920N70M47350q2171l83020J4197L40697
524b30317j72500L72810J47868J33181p91569k39086O49621q91585L43488P46021
514F7932N16579m71448r60601L19057O234O9944O05148K92895j63516l95713p89763
503i03252R36854m3701m17950l95976N63600O83761j65882l30873j05916m62656
493f41991m04207M70326J283737K03510q59934l99480m05931M60618L96027J78848
483B81523j26057j6309k66087m17067j7859J74714J21346j13745k407j58471M84068
472e6351l63962m0843N6535k19242L95241L40170M36141p70931k44411L36277
$$ y = [-612202, -305812, 37996, -443701, -502310, -470467, -358599, -635319, -499396, -299316, -670137, -618439, -383921, -303939, -503020, -567940, -567370, -120020, -202191, -585211, -571014, -230317, -402817, -30007, 117861, 251042, -540527, -779613, -129992, -1021577, -678089, 67932, 584511, 113063, -847538, -528481, -522247, -452303, 152845, 445740, 282224, -113489, -903252, 33602, -10099, -428049, -824025, -260425, 423336, 257454, -73419, -179335, -641991, -1046198, -575872, 707865, 911375, 51441, -348039, -753970, -293352, 102675, 281523, 155466, 139157, -126930, -543997, -561856, -387142, -265796, -379541, -381948, -540419, -56351, -420313, -461156, -404621, -623863, -228622, 111548, 547689, -223242, -467653, -131376]
462a31376m91417O0368N02777L67785l4053j047770K77289j80735P0557P47972
452A41397M69997k49545j263101k21336J7459N50081J001904j4614p03374r95814
442a266946N0515M36295J012473M54j98963n85801j56713L4333L50105N32858
432B08610P1712o03425p18492L12792j59291O32323l87320K3772L11874k97102
422f04547M71970J95933k68413l74260J52921n893k79711R9755P87594k32864
412e7515j20882q2128K123M54544k04381M09329l12392L09613m13317r4340L8458
401g0888J21925K98439m93921l94884Q22404k2071k10772j20427j1349L58937
391B77393p48294L77193m85580K55684L94186J42315q1920k44879K10902j54110
$$ y = [-131376, -622793, -562425, -59648, 308137, 274084, -773686, -496397, -677132, -606575, 141397, 611394, 361849, -901252, -1122588, -1105129, -555048, 446856, 432242, -271132, -1266946, -1216431, -780136, 232337, 232791, 33828, -551973, -708686, -674353, -324248, 208610, 280322, -323103, -1041595, -728803, -888094, -255771, -643091, -619319, -307445, -604547, -132577, 63356, -205057, -579317, -426396, -432289, -712000, -612245, 175349, -57515, -178397, -260525, -258402, 196142, -8239, 401090, 88698, 398311, -15006, -109346, -70888, 51037, 349476, -144445, -539329, 283075, 261004, 50232, -70195, -81544, 277393, -470901, -93708, -579288, -323604, 70582, 212897, 130977, -113902, 97000, -57110]
381e7110j36052J67034l832Q1648O17821m72785j91384L8702q9908j17214k65243
370d28323J040230J1519p75991l3713q8287J7673K452P24885j15183p46781q4363
359d75882N70960O0971Q8467L64988j43852p20001j88930N81870L84284l26373
349A96502k18212R481m67104l72720K55245K28457L52625L11472o65128q8114
339d57496j77572L41984L71605K70765k16160j05479j021520R16977L93246j11504
329B04846m07018n56960M51204j47086J54150p5628N52581l25679L95110r22867
319f77347k8571N96967J05088J94630N3860n08372J80564q51653K39207Q84112
309A88485m92056L42293n61616K34798K55646k6432j6359L19401l12100K8344
$$ y = [-57110, -193162, -26128, -29960, 51688, 669509, 196724, 5340, 44042, -45866, -163080, -428323, 611907, 623426, -152565, -186278, -274565, -256892, -254440, 470445, 355262, -391519, -475882, 95078, 156049, 244516, 609504, 465652, -254349, -443279, 138591, 522875, 196502, -21710, -12229, -479333, -852053, -596808, -368351, -15726, 295746, -369382, -457496, -635068, -293084, 78521, 349286, 133126, 27647, -993873, -76896, 316350, 204846, -202172, -759132, -307928, -455014, -300864, -376492, 176089, -149590, 245520, -677347, -705918, -108951, -3863, 190767, 244627, -263745, -83181, -934834, -695627, 188485, -303571, 38722, -522894, -288096, -32450, -58882, -75241, 244160, -67940, -39596]
299c9596j90678L16951K66675p24642N09581j21091O4009j2509m2597K64441k0220
288B70324l27223O0655J20025J68813l60683m85867M16688l29884L05074N42741
278C80663j37193l04429n01496N75256l3089m57015M75709J43452L53490m75377
268A9971j99919J3838k360m6753l6289J45588L43650k77411l80279L52755M51854
257C84645m41078q4230k57290L3473J08571P6269N03693r04630J27489j4942L88068
246g9962m93345K7393O72095l36912R936j14483K15111J52325o81510J34911O69133
235A74692m72358k5246n13419J48201J17461m33202Q04514J5314k1636N44014
225C38335j64037m05182o49736o6031P79447J65710m88163m11171K39660O50059
$$ y = [-39596, -230274, 86677, 353352, -371290, 138291, 17200, 81209, 68700, 26103, 290544, 270324, -56899, 3756, 123781, 292594, -68089, -553956, -137268, -467152, -162078, 380663, 243470, -60959, -562455, 12801, -20288, -477303, -1594, 141858, 495348, 19971, -179948, -166110, -168470, -215223, -251512, -105924, 237726, -39685, -419964, -67209, 384645, -56433, -140663, -397953, -364480, -255909, -179640, 324053, -580577, -453088, -468030, -79962, -573307, -545914, 126181, -210731, -200795, -315278, -100167, 52158, -629352, -494441, 174692, -297666, -322912, -836331, -688130, -570669, -1003871, -199357, -184043, -205679, 338335, 174298, -230884, -880620, -946651, -167204, -1494, -489657, -900828, -661168, -11109]
215a1109j38176k66476J00563R3001R834n2106N7638N8192j19408L08585L7431
204G7969m65922j23448N46075M5854l99450J30538J34236p48261l39498M85278
194f56629l8818K09660P3961L30059N7608j71079m49047J63651K15218M03680
184A38264l35626l4439K19630q4046q7913p3772M71666r82388L44306L26990M44535
173C47207o90693p14729J080022j93683l39946J33864Q5514K04560k39080L55575
163B8611L08743q89519J25487J24194q0182r7588k46917M53276k2999o41175N88378
152c49691j98596M3356J43729n0070k14298j06816K60184J57605j36071K2645
142d28023L94390k00304m76943L39753M57251p1528j86982j65067M60287k42850
$$ y = [-11109, -149285, -415761, -315198, -222197, -212363, -264469, -206831, -148639, -268047, 40538, 77969, -387953, -511401, 34674, 80528, -318922, -188384, -54148, -802409, -1141907, -656629, -695447, -485787, -411826, -81767, -24159, -195238, -644285, -480634, -265416, 138264, -197362, -231801, -12171, -96217, -184130, -257902, 213764, -768624, -424318, -97328, 347207, -343486, -1058215, 21807, -171876, -511822, -377958, -292444, -87884, -326964, 28611, 337354, -552165, -426678, -302484, -382666, -480254, -727171, -273895, -296894, -938069, -349691, -548287, -504931, -361202, -411272, -625570, -732386, -472202, -314597, -450668, -428023, -33633, -233937, -710880, -371127, 86124, 14596, -172386, -337453, 122834, -120016]
132a20016m78369O7902J52782M39838k30026k68701J95393m32057J82403M9970
122d40881O20353p72529J4378M17572n27157J61888O258N11569j53686j067805
112a230040O74237J87116K28862O1117k10852J42383n65297q8539K8607K62011
102e10395N51426l33215o54025L87068k06900J41974k49945K10905K29699P4487
92c58921L8782j33492l09190L17554K02834l57150k0365P1082O0618J6281j10542
81e82509m0692N1513k48035L08752j06977L36062k46052j43703L45522k82400
71f08519l56885J47622L87543K67775m7125l9822j9838l18521m88870N27506K35776
60c13358J81645J34382j47529R3735r10568k4579N62100J65008k24765R2128J02302
$$ y = [-120016, -598385, -530483, -377701, 62137, -167889, -436590, -241197, -673254, -490851, -440881, 179472, -593057, -578679, -161107, -688264, -526376, -520118, -8549, -162235, -1230040, -555803, -368687, -139825, -78708, -289560, -147177, -712474, -801013, -772406, -510395, 41031, -292184, -946209, -559141, -766041, -624067, -874012, -663107, -433408, -358921, -320139, -453631, -762821, -445267, -242433, -599583, -619948, -548866, -488248, -471967, -582509, -623201, -571688, -819723, -510971, -617948, -281886, -527938, -671641, -326119, -608519, -965404, -817782, -430239, -162464, -209589, -249411, -269249, -587770, -1076640, -549134, -313358, -131713, 2669, -144860, -51125, -961693, -986272, -424172, -259164, -483929, -391801, -289499]
49b89499L0082l99806l66284L31003J15693L4059J66332K12628L91913p63343
39e37222l5770j63778K54515L27029K30342N7346j061248K49187K45906m5131
29d78824k49194N85961n1727q1591n94521Q4483J65146j95884N56733r810l83369
18f52597j75715N9371J5620M4795J14412K32997k26708j75536k47421O67552m3943
7c87173k45100j48301K80245M1381m83156K07964J67289
0e66851
$$ y = [-289499, -259417, -659223, -1025507, -694504, -578811, -544752, -378420, -165792, 226121, -537222, -572992, -736770, -482255, -155226, 75116, 132462, -928786, -679599, -433693, -478824, -728018, -142057, -193784, -275375, -869896, -785413, -620267, -816151, -259418, -269228, -652597, -828312, -768941, -753321, -708526, -594114, -361117, -587825, -763361, -1010782, -343230, -387173, -632273, -780574, -500329, -458948, -942104, -734140, -566851]
$$ Imaginary data points
##PAGE= N=2
##DATA TABLE= (X++(I..I)), XYDATA
16383d987030K80577l02603R6468n40961K48972N56262j09259L75357m47027J64004
16373d665240j5668K69203J95805M32614L7378k02916l11843r8752M3549J06274
16363d209596L99695L44158l07159J17069K02042j73084L61630o6655J88607k03633
16353c346926J25778J5028j68270K43951L43231l15452l8225M86750J39727k47878
16343b762286j57764L83288M6771Q0716k93773L31727K6967Q6009N45021l11705
16333b025029j21259J67970L37776r6140j83107K5620J13613r2130J37393o1351
16323a796644M17900K98350k87954o7546m86097L52446M50013J55295L30692m60306
16313a093851k47209M780o9557L46288M93326l3151k07009l79979L91056J6963
$$ y = [-4987030, -4706453, -5009056, -4912588, -5453549, -5204577, -4648315, -4757574, -4382217, -4829244, -4665240, -4680908, -4411705, -4215900, -3783286, -3745908, -3948824, -4260667, -4359419, -4315870, -4209596, -3809901, -3465743, -3772902, -3655833, -3453791, -3626875, -3265245, -3331900, -3143293, -3346926, -3221148, -3206120, -3374390, -3130439, -2787208, -3102660, -3140885, -2654135, -2514408, -2762286, -2920050, -2536762, -2489991, -2409275, -2703048, -2371321, -2344354, -2258345, -1713324, -2025029, -2146288, -1978318, -1640542, -1736682, -1919789, -1894169, -1780556, -1872686, -1735293, -1796644, -1378744, -1080394, -1368348, -1435894, -1921991, -1569545, -1119532, -964237, -633545, -1093851, -1341060, -1336280, -1405837, -1059549, -566223, -599374, -806383, -1186362, -795306, -778343]
16303g78343k06821L48409L31014j63879K70986k48485n2685J28013P4916N15696
16293B18821o33065o100O22554L12569p82983j59374M7438M01725M9651J23796
16283A95032k9025J53857j72968J05878L23509m37422K92886J9348J905l15884
16273A37116L11589K46604J84644q84788m662M81913R7209M06017n68901K49233
16263F55974K49100j92501K46894J204M23364L32544k76167l66005k46499q2123
16253G45785P87641O7993Q2048l18440p08218Q59749P2328K42459k22392l00351
16243A308602K78203J63449M12385n5029m90496Q853j05415k4672K80966M941
16233A781787M07547J30257k32579k09029m16674N38444J74249K05971N5543n54381
$$ y = [-778343, -985164, -636755, -305741, -469620, -198634, -447119, -499804, -371791, -296875, 218821, -414244, -420344, 202210, 514779, -268204, -427578, -380140, 21585, 71236, 195032, 166007, 319864, 146896, 252774, 576283, 138861, 431747, 451095, 453000, 137116, 448705, 695309, 879953, -4835, -9497, 472416, 569625, 975642, 406741, 655974, 905074, 712573, 959467, 960671, 1384035, 1716579, 1440412, 1074407, 827908, 745785, 1533426, 1601419, 1683467, 1365027, 656809, 1516558, 1588886, 1831345, 1608953, 1308602, 1586805, 1750254, 2162639, 2107610, 1617114, 1625967, 1520552, 1495880, 1776846, 1781787, 2189334, 2319591, 2087012, 1877983, 1461309, 1999753, 2174002, 2379973, 2435516, 1881135]
16223A881135p01930N16981P94135m1909n00511l8392P58383q5669k69973k17262
16213B094988K2855J70685O50450P51642n31337n73771j26051N10999m7837o24434
16203B298189M27984J93004k47287q0787k83285m6268L98880r8399O34694k73469
16193B923256j72652k39250m17334J099477J01433K00631l27561n74295P87025
16184C380730K93644l70087j5953o5611p3221K66997j76627K8629J54083k95732
16174C126852M44791k54814l15641O16087j80452N41248r51552j64915L11868
16165C173472N1265R06746k22843p31996M999K17976k49345M72817M1207K67486
16155C931784o35975j82758N16496j76555k71255J14039P40056K55286o50713
$$ y = [1881135, 1179205, 1696186, 2490321, 2448412, 1947901, 1909509, 2667892, 2582223, 2312250, 2094988, 2117843, 2288528, 2938978, 3690620, 3159283, 2585512, 2459461, 2970460, 2922623, 2298189, 2726173, 2919177, 2671890, 2591103, 2307818, 2261550, 2660430, 2562031, 3196725, 2923256, 2750604, 2511354, 2094020, 3193497, 3294930, 3495561, 3168000, 2593705, 3380730, 3674374, 3304287, 3288334, 3222723, 3149502, 3416499, 3239872, 3268501, 3422584, 3126852, 3571643, 3316829, 3001188, 3617275, 3436823, 3978071, 3026519, 2861604, 3173472, 3224737, 4131483, 3908640, 3176644, 3181643, 3399619, 3150274, 3623091, 3664298, 3931784, 3295809, 3113051, 3629547, 3452992, 3181737, 3295776, 4035832, 4291118, 3640405]
16146C640405n99237L34664P6286j66637J26696J004K02884k41249l51614N96843
16136C620045l26075n64660M55897O47441M42022m57594n90543K11662k10804
$$ y = [3640405, 3041168, 3375832, 3452118, 3285481, 3412177, 3413181, 3616065, 3374816, 3023202, 3620045, 3293970, 2729310, 3185207, 3832648, 4274670, 3817076, 3226533, 3438195, 3227391]
$$ [...]
##END NTUPLES=NMR SPECTRUM
##END=
