##TITLE=1H_CA-8815-2
 CDCl3,8 sc, 
 3.02.2021
##JCAMPDX= 6.0         $$ Bruker NMR JCAMP-DX V2.0
##DATA TYPE= NMR FID
##DATA CLASS= NTUPLES
##ORIGIN= UXNMR, Bruker Analytische Messtechnik GmbH
##OWNER= root
$$ XWIN-NMR		Version 3.5
$$ Wed Feb  3 10:36:13 2021 Russian Standard Time (UT+4h)  she@DPX200
##.OBSERVE FREQUENCY= 200.1315066352
##.OBSERVE NUCLEUS= ^1H
##.DELAY= (6, 6)
##.ACQUISITION MODE= SIMULTANEOUS
##.ACQUISITION SCHEME= undefined
##.AVERAGES= 8
##.DIGITISER RES= 18
##SPECTROMETER/DATA SYSTEM= spect
##.PULSE SEQUENCE= zg30
##.SOLVENT NAME= CDCl3
##.SHIFT REFERENCE= (INTERNAL, CDCl3, 0, 15.7039)
##AUDIT TRAIL= $$ (NUMBER, WHEN, WHO, WHERE, WHAT)
$$ ##TITLE= Audit trail, XWIN-NMR		Version 3.5
$$ ##JCAMPDX= 5.01
$$ ##ORIGIN= Bruker BioSpin GmbH
$$ ##OWNER= she
$$ F:/spectra/data/she/nmr/H-F/1/audita.txt
$$ ##AUDIT TRAIL=  $$ (NUMBER, WHEN, WHO, WHERE, WHAT)
(   1,<2021-02-03 10:35:10.98 +0400>,<she>,<DPX200>,
      <created by zg, POWCHK disabled, PULCHK disabled
       configuration hash MD5:
       00 E9 B6 7A A2 85 ED C7 34 08 36 98 17 FE 4E 26
       data hash MD5: 16K
       1C D3 23 91 66 FC 03 8A FE EE 80 07 1C F2 98 3E>)
$$ ##END=
$$ 
$$ hash MD5
$$ 87 F8 0A 85 D5 C1 B3 CE F3 46 AC EB AE AE 0C 40
##$RELAX= 
##$RELAX= 
##$RELAX= 
##$RELAX= 
##$RELAX= 
##$RELAX= 
$$ Bruker specific parameters
$$ --------------------------
##$DU= <F:/spectra>
##$EXPNO= 1
##$NAME= <H-F>
##$PROCNO= 1
##$TYPE= <nmr>
##$USER= <she>
##$AMP= (0..31)
100 100 100 100 100 100 100 100 100 100 100 100 100 100 100 100 100 100 
100 100 100 100 100 100 100 100 100 100 100 100 100 100 
##$AQSEQ= 0
##$AQ_mod= 1
##$AUNM= <au_zg>
##$AUTOPOS= <>
##$BF1= 200.13
##$BF2= 200.13
##$BF3= 200.13
##$BF4= 200.13
##$BF5= 200.13
##$BF6= 200.13
##$BF7= 200.13
##$BF8= 200.13
##$BYTORDA= 1
##$CFDGTYP= 0
##$CFRGTYP= 5
##$CHEMSTR= <none>
##$CNST= (0..31)
1 1 145 1 1 1 1 1 1 1 1 1 1 1 1 1 1 1 1 1 1 1 1 1 1 1 1 1 1 1 1 1 
##$CPDPRG= <>
##$CPDPRG1= <>
##$CPDPRG2= <>
##$CPDPRG3= <>
##$CPDPRG4= <mlev>
##$CPDPRG5= <mlev>
##$CPDPRG6= <mlev>
##$CPDPRG7= <mlev>
##$CPDPRG8= <mlev>
##$CPDPRGB= <>
##$CPDPRGT= <>
##$D= (0..31)
0 1.2 0 0 0 0 0 0 0 0.06 0 0.03 0 0 0 0 0.0002 0 0 0 0 0 0 0 0 0 0 0 0 
0 0 0 
##$DATE= 1612334110
##$DBL= (0..7)
120 120 120 120 120 120 120 120 
##$DBP= (0..7)
150 150 150 150 150 150 150 150 
##$DBP07= 0
##$DBPNAM0= <>
##$DBPNAM1= <>
##$DBPNAM2= <>
##$DBPNAM3= <>
##$DBPNAM4= <>
##$DBPNAM5= <>
##$DBPNAM6= <>
##$DBPNAM7= <>
##$DBPOAL= (0..7)
0.5 0.5 0.5 0.5 0.5 0.5 0.5 0.5 
##$DBPOFFS= (0..7)
0 0 0 0 0 0 0 0 
##$DE= 6
##$DECBNUC= <off>
##$DECIM= 32
##$DECNUC= <off>
##$DECSTAT= 4
##$DIGMOD= 1
##$DIGTYP= 9
##$DL= (0..7)
0 120 120 120 120 120 120 120 
##$DP= (0..7)
150 150 150 150 150 150 150 150 
##$DP07= 0
##$DPNAME0= <>
##$DPNAME1= <>
##$DPNAME2= <>
##$DPNAME3= <>
##$DPNAME4= <>
##$DPNAME5= <>
##$DPNAME6= <>
##$DPNAME7= <>
##$DPOAL= (0..7)
0.5 0.5 0.5 0.5 0.5 0.5 0.5 0.5 
##$DPOFFS= (0..7)
0 0 0 0 0 0 0 0 
##$DQDMODE= 0
##$DR= 18
##$DS= 0
##$DSLIST= <SSSSSSSSSSSSSSS>
$$ [...]
##$SUBNAM2= <"">
##$SUBNAM3= <"">
##$SUBNAM4= <"">
##$SUBNAM5= <"">
##$SUBNAM6= <"">
##$SUBNAM7= <"">
##$SUBNAM8= <"">
##$SUBNAM9= <"">
##$SW= 16.9725356469052
##$SWIBOX= (0..15)
0 0 2 0 0 0 0 0 0 0 0 0 0 0 0 0 
##$SW_h= 3396.73913043478
##$TD= 16384
##$TD0= 1
##$TE= 0
##$TE2= 300
##$TE3= 300
##$TEG= 300
##$TL= (0..7)
0 120 120 120 120 120 120 120 
##$TP= (0..7)
150 150 150 150 150 150 150 150 
##$TP07= 0
##$TPNAME0= <>
##$TPNAME1= <>
##$TPNAME2= <>
##$TPNAME3= <>
##$TPNAME4= <>
##$TPNAME5= <>
##$TPNAME6= <>
##$TPNAME7= <>
##$TPOAL= (0..7)
0.5 0.5 0.5 0.5 0.5 0.5 0.5 0.5 
##$TPOFFS= (0..7)
0 0 0 0 0 0 0 0 
##$TUNHIN= 0
##$TUNHOUT= 0
##$TUNXOUT= 0
##$USERA1= <user>
##$USERA2= <user>
##$USERA3= <user>
##$USERA4= <user>
##$USERA5= <user>
##$V9= 5
##$VALIST= <valist>
##$VCLIST= <CCCCCCCCCCCCCCC>
##$VD= 0
##$VDLIST= <DDDDDDDDDDDDDDD>
##$VPLIST= <PPPPPPPPPPPPPPP>
##$VTLIST= <TTTTTTTTTTTTTTT>
##$WBST= 1024
##$WBSW= 4
##$XGAIN= (0..3)
0 0 0 0 
##$XL= 0
##$YL= 0
##$YMAX_a= 464362
##$YMIN_a= -327923
##$ZGOPTNS= <>
##$ZL1= 120
##$ZL2= 120
##$ZL3= 120
##$ZL4= 120
##$ABSF1= 10
##$ABSF2= 0
##$ABSG= 5
##$ABSL= 3
##$ALPHA= 0
##$AQORDER= 0
##$ASSFAC= 0
##$ASSFACI= 0
##$ASSFACX= 0
##$ASSWID= 0
##$AUNMP= <proc_1d>
##$AZFE= 0.1
##$AZFW= 0.1
##$BCFW= 1
##$BC_mod= 2
##$BYTORDP= 1
##$COROFFS= 0
##$CY= 11.3945322036743
##$DATMOD= 1
##$DC= 2
##$DFILT= <>
##$DTYPP= 0
##$F1P= 15.9154993809931
##$F2P= -4.1035820241983
##$FCOR= 0.5
##$FTSIZE= 0
##$FT_mod= 4
##$GAMMA= 1
##$GB= 0.15
##$INTBC= 1
##$INTSCL= 1
##$ISEN= 128
##$LB= 0.24
##$LEV0= 0
##$LPBIN= 0
##$MAXI= 10000
##$MC2= 0
##$MEAN= 0
##$ME_mod= 0
##$MI= 1.114404
##$NCOEF= 0
##$NC_proc= 0
##$NLEV= 6
##$NOISF1= 3.799351
##$NOISF2= 2.8
##$NSP= 1
##$NTH_PI= 0
##$NZP= 0
##$OFFSET= 15.70392
##$PC= 1
##$PHC0= -10765.7
##$PHC1= 20.40095
##$PH_mod= 1
##$PKNL= yes
##$PPARMOD= 0
##$PSCAL= 0
##$PSIGN= 0
##$REVERSE= no
##$SF= 200.130013532006
##$SI= 16384
##$SIGF1= 3
##$SIGF2= 2
##$SINO= 400
##$SIOLD= 16384
##$SREGLST= <1H.CDCl3>
##$SSB= 0
##$STSI= 0
##$STSR= 0
##$SW_p= 3612.71676300578
##$SYMM= 0
##$S_DEV= 0
##$TDeff= 0
##$TDoff= 0
##$TI= <>
##$TILT= no
##$TM1= 0
##$TM2= 0
##$TOPLEV= 0
##$USERP1= <user>
##$USERP2= <user>
##$USERP3= <user>
##$USERP4= <user>
##$USERP5= <user>
##$WDW= 1
##$XDIM= 8192
##$YMAX_p= 0
##$YMIN_p= 0
$$ End of Bruker specific parameters
$$ ---------------------------------
##NTUPLES= NMR FID
##VAR_NAME=  TIME,          FID/REAL,        FID/IMAG
##SYMBOL=    X,             R,               I
##VAR_TYPE=  INDEPENDENT,   DEPENDENT,       DEPENDENT
##VAR_FORM=  AFFN,          ASDF,            ASDF
##VAR_DIM=   8192,          8192,            8192
##UNITS=     SECONDS,       ARBITRARY UNITS, ARBITRARY UNITS
##FACTOR=    0.0002944,     1,               1
##FIRST=     0,             0,               0
##LAST=      2.4114304,     0,               0
##MIN=       0,             -327923,         0
##MAX=       2.4114304,     464362,          0
$$ Real data points
##PAGE= N=1
##DATA TABLE= (X++(R..R)), XYDATA
0@%%%%%%%%%%qJ6j6K4l2L7m5N6p2Q8j04J20j39J63j92K27k64L04l50M01m59N23
32B78n91O69p57Q50r53J070j196J331j480J643j823K022k234K463k716K995l302
49a731L637m004M411m864N366n929O566p290Q122r089J0232j1605J3289j5413
63h302J8179k1945K7389l5954N1373q7228L08452J35220o56543M93048J73282
74C96971m52426J20748K45573k59879P799M4034m0051N1643j37526m4109K19705
85A52482j61260k35269L50273o950m27199L03449J95048m23066P2047L48197k93527
96a25775q7915K76444j02232r0622Q2735P700J2227k5918p8700J59058M110k48313
108b17201K18417J23753l16729Q7008K85951k62951r1665L31014j21816j69234
$$ plain form
0 0 0 0 0 0 0 0 0 0 0 0 -8 8 -8 16 -16 21 -24 32 -40 48 -56 64 -75 88 -104 123 -141 163 -187 214 -245 278
32 278 -313 356 -401 449 -504 566 -630 701 -779 864 -959 1063 -1171 1292 -1424 1571 -1731
49 -1731 1906 -2098 2313 -2551 2815 -3114 3452 -3838 4284 -4805 5427 -6178 7111 -8302
63 -8302 9877 -12068 15321 -20633 30740 -56488 251964 387184 -269359 223689 396971
74 396971 -55455 65293 310866 50987 58786 102820 62769 114412 -23114 -67223 152482
85 152482 -8778 -244047 106226 99276 -327923 -24474 170574 -252492 -180445 167752 -125775
96 -125775 -213690 62754 -39478 -130100 -47365 -39665 -27438 -53356 -132056 27002 31112 -217201
108 -217201 1216 124969 -191760 -104752 181199 -81752 -173417 157597 35781 -133453
118a33453K11846K6681j42644Q3577L5151l1008M2623r3288P5111Q5241j91480
129c1643L2984K01509k03766j06248K90665j34875j99437K33809N167k18735J12027
140a8543R3446j57182M2092M2788l9391K9069m2493P904Q9979q4400n9645J85226
152H8850p8461j36596J94454J614j79246J15122R7875j75473M2904J02069r3794
163b0682m459M2409j3849k926j48k6107O7501k6577p8495J15738k398j17432Q1654
176A4229P8300j45479K8578J16881j15644j3878Q7851m2642m5621N3347j8907
187b985j4472K0595m1922L8347L378n8320L4466M8026q1402N731R3626q5005j6530
200e6467Q8032l5200m9949P0107r41n2916N2694q655j3101K2167j4894q82K8428
$$ plain form
118 -133453 78393 105074 -37570 46007 81158 50150 92773 -515 74596 159837 -31643
129 -31643 1341 202850 -916 -107164 183501 48626 -150811 82998 88165 -130570 -18543
140 -18543 74903 -82279 -40187 2601 -36790 -7721 -50214 -42310 47669 -36731 -96376 88850
152 88850 10389 -126207 68247 69861 -109385 5737 103612 -71861 -28957 73112 -20682
163 -20682 -25141 17268 3419 493 345 -25762 41739 15162 -63333 52405 50007 -67425 14229
176 14229 92529 -52950 -24372 92509 -23135 -37013 50838 8196 -37425 15922 -2985
187 -2985 -17457 3138 -38784 -437 2941 -55379 -20913 27113 -54289 -48558 45068 -39937 -56467
200 -56467 31565 -3635 -53584 16523 15582 -37334 15360 6705 -6396 15771 877 -5 28423
213B8423k7499j5915O4216m8775k1597O4729k7596m1198N1968P068o1303M8339
225B0860N942m0455K5239P367k3254J0800J2109l5579L4058o150l2101L9705q444
238A0097l2672K8143J4958n1240L4660J4686m5433K7687Q809k5799P561K2575
250A4032l4190J4047J6977l3165K0095Q994k0571K505K4466k9543N012K6826l3915
263a8430J4148J3517k0516K146K4150k7455L195L0112l6645J1754J8550j9082
275d556m514K4675j3597j3479K8258j7893p46J0263m505o457J2109o194j1994
288h630K8160k4216k667K2477j6160j2806K4133l782k8155L1746r126j5008J3748
301b86R41q383K742Q485j4977J6767q380m708J8125r688p464J5454N623k8024
$$ plain form
213 28423 924 -14991 49225 450 -21147 43582 15986 -25212 26756 33824 -27479 20860
225 20860 26802 -13653 11586 18953 -4301 6499 18608 -16971 17087 10937 -21164 18541 10097
238 10097 -22575 5568 20526 -30714 3946 18632 -26801 886 9695 -16104 -8543 14032
250 14032 -20158 -6111 10866 -22299 -2204 6790 -13781 -11276 13190 -16353 -11341 15485 -18430
263 -18430 -4282 9235 -11281 -9135 15015 -12440 -9245 20867 -15778 -4024 14526 -4556
275 -4556 -9070 15605 2008 -11471 16787 -1106 -1852 8411 3906 -2551 9558 3364 -8630
288 -8630 19530 -4686 -7353 15124 -1036 -13842 10291 6509 -21646 10100 974 -14034 -286
301 -286 655 -7728 -4986 3499 -11478 5289 -3091 -7799 10326 638 -6826 8628 14251 -13773
315a3773K6969L720k4922J6905N880j3248k256J6586j6769L676L103q640Q864
328F095q664m3L757K711j6773J4369O295k3178J6073N136j2340m018K0027j4223
342d776o556J6910j2022Q63j338L281n122K808m275M77P390j5707J2331J683o058
357a0111J65J2112m495p791K0409p491m5O753M239m797L751O094o636R070r800
372A1427N234l57p211J071M38k827j2133J1780r867n660M518j002n225k879R594
387c099j0506N355r1J480J391l093O739k836M186n569R351l311o026Q472k839
402c96k537k333R468j1682K566M324m645L086l589P723n303L780O70L706J579
417F417l704J0006m309J691j214P669o962l057R216j0706J09j922K368r648M26
$$ plain form
315 -13773 13196 16916 -8006 8899 14779 1531 -725 15861 -908 2768 5871 -2769 6095
328 6095 -2569 -2612 1145 3856 -12917 1452 7747 -15431 642 5778 -6562 -10580 9447 -4776
342 -4776 -11332 5578 -6444 -5581 -6919 -3638 -8760 -5952 -10227 -9750 -2360 -18067 -5736 -4053 -10111
357 -10111 -9946 2166 -2329 -10120 10289 2798 2753 9506 13745 8948 12699 18793 12157 21227 11427
372 11427 16661 16304 9093 10164 10602 7775 -4358 7422 -2445 -8105 -3587 -4589 -9814 -12693 -3099
387 -3099 -13605 -8250 -8341 -6861 -5470 -8563 -1824 -4660 -474 -6043 3308 -3 -6029 2443 -396
402 -396 -2933 -5266 4202 -7480 -4914 -590 -5235 -2149 -5738 1985 -3318 462 1132 4838 6417
417 6417 2713 12719 8410 10101 8887 16556 9594 6537 15753 5047 5156 3234 5602 -4046 -3620
432c620j9o179J121o459O942o736l04J954L014k538j237J2935q119L904M291M103
448C053l275K052R766q623M442m54L696n219J91L058l835j054m647R712j0994
463b131k18O683m476l305R01R011j1117M471L966l18m588K445P588r814M190p23
479B565L451p367q98Q031q932j919J102N510j3437L430P394p996j614M010N686
494i84j1587P109N643l053k662M745Q052j1277O244M308q25p393M461P507j1601
509a313J605N107L92j2899P757N326j2111L228K817K810j1772O085O555q187o80
524e280O325N556j3991P526N733l826m648P025N787j4753O853O024l106j0223
538d998J0667L634j5035N910N744k005j1730J1255L083j2204K683P083K95j3854
$$ plain form
432 -3620 -3639 -9818 -8697 -15156 -8214 -14950 -15254 -13300 -10286 -12824 -14061 -1126 -9245 -5341 -1050 3053
448 3053 -222 1830 11596 2973 7415 6961 10657 5438 5629 8687 4852 3798 -849 8863 -2131
463 -2131 -2349 4334 -142 -3447 -2546 6465 -4652 -181 3785 3467 -1121 1324 8912 -902 3288 2565
479 2565 6016 -1351 -2249 5782 -3150 -5069 -3967 1543 -11894 -8464 -1070 -9066 -10680 -6670 -984
494 -984 -12571 -5462 181 -2872 -5534 -789 7263 -4014 2230 6538 5713 -1680 2781 10288 -1313
509 -1313 292 5399 5791 -7108 649 5975 -6136 -2908 -91 2719 -9053 -2968 3587 -4600 -5280
524 -5280 1045 6601 -7390 136 5869 2043 -2605 4420 10207 -4546 2307 8331 5225 -4998
538 -4998 5669 9303 -5732 178 5922 3917 -7813 3442 6525 -5679 -2996 4087 4382 -9472
552i472J1627L514r460j763Q894K182j6310J0479N706r927m930J3539k029j4090
566a2040J1023K243m781o589J2483Lj2034P302M706k094r739J3057K348j0951
580e063K171J0974l486j4121J8559j225j1900M136R302n547r184J3112k202n358
594A68k935R594j682j1314Q735L209n529q352J5466l297j3400J0827M702r516
608c324n043J6539q690o166P731J378l373n174J0007j896m334j393R599l292j0747
623h178J3796k50q681k48J3795j0443o536J4896n757n422K123O951q496M25L355
638A330p56j5p917J0478k597p022L462Q056r361n262J5901r344m339P178L097
653B889r052K395Q276q331L268l66L220j956k292L242K990l038n417J3865q051
$$ plain form
552 -9472 2155 5669 -3791 -5554 3340 5522 -10788 -309 5397 -4530 -9460 4079 2050 -12040
566 -12040 -1017 1226 -3555 -10144 2339 2342 -9692 -2390 2316 222 -9517 3540 5888 -5063
580 -5063 -2892 8082 4596 -9525 9034 7809 -4091 45 9347 3800 -5384 7728 5526 168
594 168 -2767 6827 5145 -6169 2566 5775 246 -8106 7360 4063 -9337 1490 6192 -3324
608 -3324 -8367 8172 -518 -6684 1047 2425 -948 -6122 3885 1989 -2345 -3738 5861 2569 -8178
623 -8178 5618 5368 -3313 -3561 10234 -209 -6745 8151 2394 -3028 -905 6046 -2450 -2025 1330
638 1330 574 559 -7358 3120 523 -6499 -3037 5019 -4342 -9604 6297 -3047 -7386 -208 2889
653 2889 -6163 -3768 4508 -3823 -555 -921 2299 343 -1949 1293 4283 1245 -4172 9693 1642
668A642n350J0455j105p812L913P645j2674N206K857m032R6K00P61k524K499n606
684c829O902k838n926P404j981m513J221P861j1529L506O286q196K386K725r85
699a506l636O658n115J289M250o323N462m61j284j006O643n517m72Q046p939K957
715B046K157o11l715O505k772m007P783o596R99J805m30m290M403n95o171P547
731D058m996n57J447r84k567K368J93n644P394n303r25L433q09l245K920L562
747C45q604O791J08k129J306J729n23j523M779m587N327j713j525M587j708j169
763A491J276N367q572N025K510n217J518J648L31n165N773l435l96Q25k322K750
779C407l292P51j462L132n732J540L671p127K008N59J71n672N033o20m966L617
$$ plain form
668 1642 -3708 6747 5642 -2170 1743 9388 -3286 1920 4777 745 841 1041 1802 -722 1777 -3829
684 -3829 3073 235 -5691 1713 -268 -4781 -3560 4301 -7228 -3722 2564 -5632 -3246 -521 -1506
699 -1506 -5142 1516 -3599 -2310 1940 -4383 1079 618 -666 -1672 4971 -546 -1018 7028 -911 2046
715 2046 4203 3592 -123 6382 3610 -397 7386 790 1789 3594 3164 -1126 3277 2682 -3489 4058
731 4058 -938 -1495 -48 -1032 -3599 -1231 -1038 -6682 712 -4591 -5516 -2083 -2892 -6137 -3217 345
747 345 -8259 -1468 -1360 -3489 -2183 -454 -977 -2500 2279 -2308 3019 1306 -219 4368 2660 1491
763 1491 2767 8134 -438 4587 7097 1880 3398 5046 5377 212 5985 2550 2154 2979 657 3407
779 3407 115 866 -596 2536 -3196 -1656 2015 -5112 -3104 -2545 -2374 -8046 -3013 -3633 -8599 -4982
795d982j185J043l104L705j730Q48j20q56N727n623L830K379n00j956M745J482
811C703l950N995j460J255j899M016l57k747L530k853J980l221J788n69r20j587
827B704L9K306p054N416j851k409O00N17r19k972M202l833J038j831R99q92j960
844e900K603k742K603l980K309O69k441J509O47J093l673O345k890N99L152q58
860i55K186r74L750j694L017o00J218J221k208K986j868K002l217K463r28l153
876C246K553k493L91k391K586m032K54Q32k730K129l357K552k799R88j098K0J007
893b342k919L521k813J573j489J648k62j608L052k867K681j819K239j006O95J427
909b89j812L434k401K995j168J911k59Q2K474k593L491k456K110j668P09O1j895
$$ plain form
795 -4982 -6167 -5124 -8228 -4523 -6253 -5405 -5525 -6381 -654 -6277 -2447 -68 -568 -2524 2221 3703
811 3703 -247 5748 4288 5543 3644 7660 7303 4556 8086 5233 7213 3992 5780 5211 4291 2704
827 2704 2743 5049 -2005 3411 1560 -849 -249 268 -651 -3623 579 -3254 -2216 -4047 -3048 -3940 -5900
844 -5900 -3297 -6039 -3436 -7416 -5107 -4438 -6879 -5370 -4723 -3630 -7303 -958 -3848 -3249 -97 -955
860 -955 1231 257 4007 2313 5330 4730 5948 7169 4961 7947 6079 8081 4864 7327 6399 3246
876 3246 5799 3306 3697 1306 3892 -140 114 946 -1784 345 -3012 -460 -3259 -2271 -3369 -3349 -2342
893 -2342 -5261 -1740 -4553 -2980 -4469 -2821 -3083 -4691 -1639 -4506 -1825 -3644 -1405 -2411 -1716 -289
909 -289 -2101 1333 -1068 1927 759 2670 2411 2493 4967 2374 5865 3409 5519 3851 4560 4621 2726
926B726K561l704K037k199L65j094M5j41l122L665m402J635r41K21j063J00J746
943a565l958L739k378J086j43P2L60l49K134l614M821k223l53K065l30j43l97
960a176L864n041L710k04q90J379o26J106j580K520l235L133p06j684K428j290
976A708j5j702M088m577R91K506l756J562N7P71l398M378l352j59K609l816L055
993I50j369k24j246K917k729q31M344m671J011Q21P38l575L634J10m131N100l145
1010b296Q72M67P85k465L424n64l822O551m449N15K167m92k107J694J914m775
1026b581N048k016l87M85R65j150m54L718n426M026n51k046J973M16j930K38L686
1043D014o586M735j72l273K569o37o17j586L772m043J539Q35j878P13m5O22l124
$$ plain form
926 2726 5287 1583 3620 1421 1786 692 737 596 -2526 1139 -3263 -1628 -2569 -2348 -3411 -3311 -1565
943 -1565 -5523 -1784 -4162 -3076 -3219 -3147 -2787 -3136 -1002 -4616 205 -2018 -2371 -306 -636 -779 -1176
960 -1176 2688 -2353 1357 1153 263 1642 1016 2122 542 3062 -173 2960 2254 570 2998 1708
976 1708 1693 -9 4079 -498 493 2999 -757 805 862 1633 -1765 2613 -739 -898 1711 -2105 950
993 950 -419 -643 -1889 1028 -1701 -2532 1812 -2859 -1848 -1027 -289 -3864 -230 -120 -4251 849 -2296
1010 -2296 -1424 -957 -172 -2637 787 223 -3599 2952 -1497 -982 1185 693 -1414 280 2194 -2581
1026 -2581 2467 451 64 549 1514 364 -90 3628 -1798 2228 1677 -369 1604 2020 90 328 4014
1043 4014 -2572 2163 1991 -1282 1287 650 33 -1553 2219 -1824 -285 550 -1328 -615 -660 -38 -3162
1060c162M493l399K07K562l201J502N37R9k758M766l042l87M031l395J373M82
1076G08Q95k612L292l05j806L322k492J045p32J220k202J771p01k835L850l674
1092a256N85K08J73k455J236J127l962L895k070M80l72J361p15r4K579k887L199
1109A032j811J029P93Q8m35N6K020m450L726j249j138O59L81l57j890L532l204
1126a218J660j22O7R73j231J966j227K279k680K422k09j730J825j006M20k799
1142f10L283l558l29J472k633M54j621J827k655J817j376O87J335k466L499p04
1158a578R45p02L624j046p68L647k057J136o65K050k533M30N34k425J528k873
1174g53J706j997n55n14P09l42k805M581k985L15J399J148j647R62L031l285K905
$$ plain form
1060 -3162 1331 -2068 -1861 701 -2500 -998 -461 -362 -3120 1646 -1396 -1783 2248 -1147 226 708
1076 708 1603 -1009 2283 1978 172 3494 1002 2047 1315 2535 333 2104 1403 -1432 2418 -1256
1092 -1256 -671 -463 -290 -2745 -1509 -382 -4344 -449 -2519 -2039 -2411 -1050 -1765 -1859 720 -2167 1032
1109 1032 -779 250 1043 1131 696 752 2772 -1678 2048 799 -339 320 701 344 -1546 1986 -1218
1126 -1218 442 320 387 1360 129 2095 868 3147 467 2889 2680 950 2775 1769 2189 -610
1142 -610 2673 -885 -1214 258 -2375 -1921 -3542 -1715 -4370 -2553 -3929 -3242 -1907 -4373 -874 -1578
1158 -1578 -633 -1335 2289 1243 475 4122 2065 3201 2536 4586 2053 2483 3017 592 2120 -753
1174 -753 953 -1044 -1599 -2113 -1404 -1746 -4551 30 -2955 -2640 -1241 -93 -1740 -778 2253 -1032 1873
1191A873q07R64l96k09M79r83P32l272L525k443j325J182l41j781n77L971m359
1208c767K131J071p24P26N16J958j592L023k045K338k2j737K705j006q53j464
1224A258L508m580j79K294l156m84J27Q90l776K746j164n26J513k177K863r88
1240a831N37l28L071k302n77M697l845N89J386L72l602K575P98l864K946j587
1256i65p2p85R11j187J321N5k279M727l132L71K393K08k448K677K222m839L852
1273C030l52j073p1J179j121r57K110l633K740j487j602J560l43j724P9L477n377
1290c565K816J563k445O09J493n8k374L905k859J177M79k114K022n47p87j121
1306a806L618m092O39K465l503Q91J306O8l276M165j408j479K826j686J160k72
$$ plain form
1191 1873 1066 2030 1634 1425 1904 921 1653 -1619 1906 -537 -1862 -680 -1021 -2802 -3379 592 -3767
1208 -3767 -1636 -565 -1289 -563 -47 1911 319 3342 1297 3635 3613 1876 4581 3575 2722 1258
1224 1258 4766 186 7 2301 -855 -1339 -1212 -322 -4098 -1352 -2516 -3042 -1529 -3706 -843 -1831
1240 -1831 -1294 -1622 1449 -853 -1430 3267 -578 11 1397 1769 -1833 742 1540 -2324 622 -965
1256 -965 -1037 -1822 -911 -2098 -777 -722 -3001 1726 -1406 -1035 1358 1566 -882 1795 4017 -822 3030
1273 3030 2678 1605 1534 2713 1592 635 2745 -888 1852 365 -1237 323 -20 -1744 -1665 1812 -3565
1290 -3565 -749 814 -1631 -1022 471 413 -1961 1944 -915 262 741 -1373 649 102 -685 -1806
1306 -1806 1812 -2280 -1641 824 -2679 -1788 -482 -414 -3690 475 -933 -2412 414 -1272 -112 -384
1322c84Q48j363K516j867n44L814l552J164J036J96k616K886L76l377L555j636
1338A052J44k41J092j912P55M95k380K682k461M01N67l87j406R57J141m053L111
1355d43q35j251O98O82q67r9K422k822K599q09M7P13J00L23o21K443k832K234
1373A682R8j429J109L0L7j636K439k176Q35L6q91R77j246J180j733K084j679J56
1391a27J177j910J371o95N97j836J831j293l47J357j814J322j552J094j178R62
1407a041j19o44J342j695J817j054J412o49P58P13j216K328j569J821r75Q83k92
1424A820l61J228j544J733j588J323j732N75K23j183R66j515J080k051J100j092
1440a018j96N97j343J228j774J368j407J130n50l72J663j754J393p47J801j237
$$ plain form
1322 -384 464 -899 1617 -250 -794 3020 -532 632 1668 1864 -752 2134 2510 -867 2688 1052
1338 1052 1196 955 2047 135 890 1385 -995 1687 -774 -373 194 -193 -1599 -642 499 -3554 -443
1355 -443 -1278 -2529 -1831 -1149 -2016 -2115 307 -2515 84 -725 -678 35 135 458 -163 2280 -552 1682
1373 1682 1780 351 1460 1490 1527 -109 2330 154 989 1025 134 1111 -135 1045 -688 1396 -283 -127
1391 -127 1050 -860 511 -184 413 -1423 408 -885 -1232 125 -1689 -367 -1919 -825 -2003 -1041
1407 -1041 -1160 -1804 -462 -2157 -340 -1394 18 -631 127 840 -376 1952 383 2204 1229 2112 1820
1424 1820 1459 2687 1143 2876 1288 2611 879 1454 1677 494 1460 -55 1025 -1026 74 -1018
1440 -1018 -1214 -617 -1960 -732 -2506 -1138 -2545 -1415 -1965 -2337 -674 -2428 -1035 -1782 19 -1218
1456a218J260N47j434K443j584J210n00J054p94M70Q05j894J771j414L47k67K28
1473A030j000l1J256k953K508j318r9K02j9j99m88J672k362J912q76j28L79j57
1491f71j64p49K200l112J604L8j429P10L43K11j585L117k241J067J498j428J771
1508A180K11N66o80K932k009O38K031k129R46J80J59k378K543j668j739J252j994
1525D1k93q31K86k318J485j338j354K686k580M72J137M21j982K747L94k224L264
1542A3r22K03k12J621j500M51J119k453K974k045k89J034L84j876J601J671l904
1559b130L720n4j099R85J995j283n28L078k668J683q3q60N28m27j177l56J856
1576C180m546J337Q79l533N08R57j510k456L880k931J52J841j305R22K51M00m43
$$ plain form
1456 -1218 42 589 -845 1598 14 1224 724 1778 984 1454 2259 365 2136 722 1069 802 1030
1473 1030 30 -1 1255 -1698 810 -508 -607 -405 -424 -623 -1111 561 -1801 111 -765 -893 -514 -671
1491 -671 -835 -1584 616 -2496 -892 -854 -2283 -1573 -1230 -1019 -2604 513 -1728 -661 837 -591 1180
1508 1180 1391 1957 1277 4209 2200 2838 4869 2740 3686 3866 4025 1647 4190 2522 783 2035 41
1525 41 -252 -1083 -797 -3115 -1630 -2968 -4322 -1636 -4216 -3744 -2607 -2186 -4168 -1421 -1027 -3251 13
1542 13 -909 -706 -918 703 -797 -346 773 -1680 1294 -751 -1040 -6 378 -1498 103 1774 -2130
1559 -2130 1590 1536 437 1422 3417 2134 1606 4684 2016 3699 3616 2756 3284 2857 1680 1324 3180
1576 3180 -1366 -29 850 -2683 -2175 -1218 -2728 -5184 -1304 -4235 -4083 -2242 -3547 -2625 -2374 -1974 -2417
1593b417K613j986J293K381k548R42J781m94k492L913j788k246L454j544p10M37
1609E89Q72j736J581o27q30K581k664P53J341k76j884K746l31k855L357j253j360
1626DM00J232k554L6J516l181J961j491k61K35n4j547J515R47l465L582l18j358
1644b801J410J529j458j17L534k928J707K62j54J2M18K01l71J624k852K351J05
1661B472j992J266O55r31j368L118k522j11J687j315J07j14M91j734J698j549
1677a42L07P86k103J081k17m21j371K275k036n40J923j672R3J31J050j962J588
1694a230k5q87J666j430Q41k50R18q41J545p9j589K619j540N31l9J001j313J158
1712A056P70j816K137j170N96N6K56n35n1J133j958J636j211o6j98K66n74p12
$$ plain form
1593 -2417 196 -1790 -497 1884 -664 278 2059 1565 -927 2986 1198 -1048 2406 862 152 589
1609 589 1461 -275 1306 679 -151 2430 -234 519 1860 1584 -300 2446 2115 -740 2617 1364 4
1626 4 404 1636 -918 -882 634 -2547 -586 -2077 -2338 -2103 -2157 -3704 -2189 -1242 -4707 -1125 -1443 -2801
1644 -2801 -1391 138 -1320 -1437 2097 -831 876 1138 984 996 1414 1615 1244 2868 16 2367 2472
1661 2472 480 1746 2401 1470 102 3220 698 587 2274 959 1066 952 1443 -291 1407 -142
1677 -142 165 951 -1152 -71 -288 -709 -2080 195 -1841 -2381 -458 -2130 -2037 -1906 -856 -2818 -1230
1694 -1230 -1255 -2142 -476 -1906 -1065 -1315 -397 -1238 307 228 -1361 1258 -282 249 210 1211 -102 1056
1712 1056 1826 10 2147 977 1573 1629 1885 1350 1299 2432 474 2110 899 833 635 901 327 -385
1730c85J341k347J697r92l32K32K83l73q29K000k210J081J44n64N60J71O41j553
1748a435J832j105O20r3r24J324o31M82q38J974k104N18J106j149L90J81J045
1765A193k005J963j55r22R46o26R94j141R24j155J274j127m68J742k084L35M58
1782A46K68j940J260O47k697K011l83J76j237J466j51o51J048j073J685j440Q74
1799IL65L93j157J053J345l078K201M99j042p57J533L1j969K126j322O15p71L37
1817D11R5l81k74j45J690l240J731R26k052J22J675n90k473L549j662n84Q17j38
1835e23K95r23J083p22J083j416P91J313k027N32J175o10j979L363p90k206K528
1852I67j99j044k93J941j769N26J06k65J117j695J037M16Pj751J795K51k721K603
$$ plain form
1730 -385 956 -1391 306 -686 -1018 -786 -503 -876 -1705 295 -1915 -834 -690 -1254 -694 -523 118 -1435
1748 -1435 397 -708 -88 -181 -1105 219 -412 70 -768 1206 -898 -380 726 -423 -33 148 1193
1765 1193 -812 1151 996 74 1020 394 1388 247 1171 16 1290 163 -305 1437 -647 -312 146
1782 146 414 -1526 -266 381 -2316 -305 -688 -512 -1749 -283 -434 -1085 -37 -1110 575 -865 9
1799 9 374 767 -390 663 2008 -1070 1131 1630 588 -169 1364 1395 -574 1552 230 845 74 411
1817 411 506 125 -149 -294 1396 -1844 -113 813 -1239 -1117 558 -32 -2505 1044 -618 -1202 -385 -523
1835 -523 -228 -1151 -68 -790 293 -1123 -332 981 -1046 -514 661 51 -1928 1435 645 -1561 967
1852 967 768 -276 -569 1372 -397 129 235 -30 1087 -608 429 845 852 -899 896 1147 -1574 1029
1870A029n99r02l23K234k205r7J755j759N58m67P13m00J34m10Q80N59k399K775
1888A076n30j365J345J042j240j338K956j905M20L04L93q32l52R24j209Q87j612
1905a036J511l30j311R15J95m41j013K742k119J5J255m67o74J12J659k140J264
1922A37l77J28j36l67R63o36L18j063J552j133m06J520j232M00o9J486j987Q34
1940f8Q58r51P26o40J407j261N35O4J01j25n09J619j644L08l5N00j092k0J511
1959A284k128J177p32P37r10O30R2r23Q73p13J386j562O51K24m74K53k66R46j454
1978i09J237m36j02k27J8O77j379J459r69O82q24M31P32j301J143p33J054j220
1996f67J130r6n69N17o59J175j630J476n88L40l38N1N18j472J188l05K49l95M76
$$ plain form
1870 1029 430 -472 -795 1439 -766 -863 892 -867 -309 -776 -63 -463 -329 -739 141 700 -1699 1076
1888 1076 546 -819 526 1568 328 -1010 1946 41 461 765 1158 326 -26 898 -311 576 -1036
1905 -1036 475 145 -1166 -251 -56 -497 -1510 1232 -887 -872 383 -84 -758 -646 1013 -1127 137
1922 137 -240 -112 -248 -615 348 -288 30 -1033 519 -614 -1020 500 -732 -332 -401 1085 -902 -68
1940 -68 790 -161 565 -75 1332 71 606 670 771 646 137 1756 112 420 385 885 -207 -227 1284
1959 1284 -844 333 -399 338 -572 58 150 -773 100 -613 773 -789 -138 86 -388 -135 -401 545 -909
1978 -909 328 -108 -210 -437 -419 258 -1121 338 -631 51 -773 -342 390 -911 232 -501 553 -667
1996 -667 463 367 -202 315 -344 831 -799 677 89 429 91 142 660 -812 376 71 320 -75 401
2015D01M4r89J252q64Q15j040P38J26n70N27m42R63j603J394k79o29J59J65P02
2034H70j740J683r54L5J03N3o4n88J397j218Q97q49K55L23r75J066p02P01j352
2053a059J522o53m15P06n82M42p12J052j108P16L0m17R00j074Q71o67P59o83M90
2072A18L00j236J611q55N27o82Q08o66k02J151j106O82o12O63p17N16j93l33P26
2091E00j236J212q85J18j93P00j84r38J752j280Q37n54K50m07K53N98j177J655
2109A021j298P03l88J06J22M2O21j218J321j154J77M04m62K53m25J031j287R36
2127E05n79J68N0l69N65p32Q66j109R95o21k4O97p80M75p34J028j332Q62O1o83
2147f91Q27r87Q61q95J117p32N7K71m83Q51n97P46j029J105l88J07N79r77J161
$$ plain form
2015 401 445 -544 708 -156 659 -381 357 483 -87 440 -2 961 -642 752 473 -156 3 168 870
2034 870 -870 813 -141 -106 -3 50 -14 -602 795 -423 474 -375 -120 203 -772 294 -408 293 -1059
2053 -1059 463 -190 -605 101 -481 -39 -751 301 -807 -91 -61 -478 422 -652 219 -448 311 -372 118
2072 118 418 -818 793 -62 465 -217 591 -75 -277 874 -232 450 -162 501 -216 300 107 -226 500
2091 500 -736 476 -409 -291 -484 216 32 -906 846 -434 403 -151 99 -308 -55 543 -634 1021
2109 1021 -277 426 38 144 266 308 929 -289 1032 -122 55 459 -3 250 -175 856 -431 505
2127 505 -74 94 144 -225 340 -392 474 -635 360 -261 -285 412 -368 107 -627 401 -931 -69 -8 -691
2147 -691 136 -851 10 -885 232 -500 -443 -172 -655 196 -401 345 -684 421 33 140 719 -258 903
2166I03p92N08o08N78J49q94J222j158N90o71Q30n66j43L91o59Q92r88P73o88
2185c31N06r2J22K53j200J507r54K06j2J57l06m22J254j360O55j76J49m64o0R40
2205C72j034R17q45Q36m65M1K84j85J87r37J520j113L15K51J41n42l15J329j635
2224h78J061j44j91m3j99O73j020R00p66P71n94M0O94l99J23q93J826j510M23
2243a26P60p72P8K18O86j431J446o33K27J03r6O43q84O45m59R22j211J25Q39j314
2263b34N91k18O98j953J255K15j103N05k74Q23j126O25m52O8r5l57J499j478N81
2282d30q9O93j013N90Q48j694J345m15Q3j010J219k01q04J232q06P57p04N23K26
2301C50j04k42J18J075j811J445M89o55n12J033j37j376J599r16K99n00K45K43
$$ plain form
2166 903 111 619 11 589 738 -156 1066 -92 498 -173 657 91 -52 339 -320 572 -416 357 -331
2185 -331 175 83 205 458 -742 765 -189 17 5 162 -144 -566 688 -672 -17 -193 -44 -508 -568 372
2205 372 -662 255 -590 246 -219 -178 106 -79 108 -829 691 -422 -107 144 285 -257 -572 757 -878
2224 -878 183 39 -152 -195 -394 279 -741 159 -607 164 -430 -390 304 -95 28 -865 961 -549 -126
2243 -126 634 -138 -60 158 844 -587 859 226 453 556 460 1103 219 864 405 1327 116 241 1080 -234
2263 -234 357 139 837 -1116 139 354 -749 -244 -518 305 -821 -196 -648 -580 -675 -1032 467 -1011 -430
2282 -430 -519 174 -839 -249 599 -1095 250 -165 -82 -1092 127 -74 -878 354 -452 305 -399 124 350
2301 350 246 4 122 1197 -614 831 1320 665 153 1186 1049 -327 1272 356 655 155 400 643
2319F43q88M48q63Q51j274Q99l8r99O04O8L19j436J754m33n53N99Q8J67p18J365
2339F03o63K22k03K78K16p28Q68p87P83j058J154n4j117J054k43K03p82J185m70
2358D61k87O60m62M50j201J226p71K48k76l3K93j186J311q05n6o00R55n77p21
2377a371J320r51M50l24P47o63p0O81m02M92n67J057n06J70K54J18J21p74J272
2396A054j119M70p9M02j27j02Q90j417R39m79M07L4n15N57p35N56j059J135r49
2415a37%M30l66R3o97J215j723R18j50k31L28m39O72j238J115o78P23k70j45P37
2435A57p96J55l32Q93q16L71N25p74R15q12O71p38P49r2m90R21q59O84m02O83
2455F13j26K79j6l53R68j143P44l67P2m40L79J15p98Q68j006M15n75M14m49q4
$$ plain form
2319 643 -245 203 -660 191 -1083 -184 -222 -1221 -617 -549 -230 -1666 88 -345 -898 -299 -211 -44 -762 603
2339 603 -60 162 -41 237 453 -275 593 -194 589 -469 685 631 -486 568 325 528 -254 931 461
2358 461 174 834 372 822 -379 847 76 324 48 15 308 -878 433 -372 -428 -1028 -73 -650 -1371
2377 -1371 -51 -1002 -552 -876 -129 -792 -862 -181 -583 -91 -658 399 -107 63 317 435 556 -218 1054
2396 1054 -65 405 326 728 601 499 1389 -28 911 432 839 873 358 915 180 736 -323 812 -137
2415 -137 -137 293 -73 20 -677 538 -1185 -267 -417 -648 -320 -759 -87 -1325 -210 -888 -165 -435 -580 157
2435 157 -639 -484 -816 77 -739 -368 157 -617 298 -514 157 -581 168 76 -414 507 -352 332 -70 613
2455 613 487 766 750 397 1365 222 966 599 671 231 610 725 -73 795 -211 204 -371 43 -406 -490
2475d90O49j098J178p90K28k6lJ22k5P57j046J026l97J68j04o1L41o22R92j240
2495d41O93n14K34K1k84J94n21J012j105O87k92j39N15k62M49k92Q61q19L68L66
2515G31q07P48n06L92p08Q08n92j96K21p31O78p42M56n65N84o31R1R01r75P28
2535a15k14L57n10O46R4l42O30o00Q54n51M35k92N9P2p25R31r39K44P4l4l96L02
2557b0L63j088J086n99K46j17L8K10k67N07q43R98n44M9K43p4n77R8O57j222J041
2578A85m22n0N3m8J38p76R92n89O25l50k66O71o74N21j55N25q83O85K23j023J038
2599D20j69qj028J500q50K56L11p15P53p12M00l78M29n65K54P29j389Q71j8p6
2619A5n45R92m31q41J351p58L42j82L72m16L31L65q19J060r82K11J84M3n45M96
$$ plain form
2475 -490 159 -939 239 -551 -323 -349 -352 -230 -255 502 -544 482 85 253 149 88 429 -193 799 -441
2495 -441 252 -262 -28 -7 -291 -97 -618 394 -711 -24 -316 -455 60 -202 247 -45 816 -3 365 731
2515 731 -76 672 166 558 -150 658 66 -130 91 -640 38 -704 -248 -813 -229 -860 -769 132 -843 -115
2535 -115 -329 28 -482 164 258 -84 546 -54 800 249 684 392 451 523 -202 729 -210 34 108 74 -322 -20
2557 -20 343 -745 341 -258 -12 -129 -91 119 -148 359 -484 514 -30 19 262 188 -389 -291 366 -856 185
2578 185 -237 -287 -234 -282 -144 -920 72 -517 108 -242 -508 163 -511 10 -145 380 -503 182 405 -618 420
2599 420 251 243 -785 715 -135 121 432 -283 470 -242 158 -220 209 -356 -102 627 -762 109 91 15
2619 15 -530 462 31 -810 541 -217 125 -57 315 -101 230 595 -224 836 -146 65 249 292 -253 243
2639B43J04j078J528q39k14K13K00m90J38N55j066J001k75l96M42l27NO9P16j457
2659i28J344k48o60Q52R3o33m0Q44j202M83K19n16K33k93K70m21O03o56N94K24
2679A62r72J140m40j1n9R60j074K49R13q46N11l5M3l92O12n51j97J000j486R81
2699E08l32m41p7Q92j161RJ112r30J40J80L93q66P47J76p92J008o98K19Q0k80
2719a13l06O91j95j104J679j065l6O58m10l01K03M68j442J593k03o98M42K18j61
2738h2j64R23j216J066l67m46R02l51m02MJ091j613R30L34j195R83j63m76k54
2757d96J164j112N28M01j164R88j93j03m6P15j499P09Q56j092L06O75o85n06J194
2776F40m60n28J204j214L98J01L6l02P66n69l55J271j486M51N88m20p78J091j77
$$ plain form
2639 243 347 -731 797 -42 -256 -43 157 -333 -195 360 -706 295 20 -376 66 -261 -256 -187 529 -928
2659 -928 416 168 -492 360 453 -180 -220 624 -578 -95 124 -392 -159 -452 -182 -603 0 -656 -62 162
2679 162 -810 330 -110 -121 -180 780 -294 -45 868 22 533 498 541 149 761 210 13 1013 -473 508
2699 508 176 -265 -342 550 -611 -602 510 -420 -280 -100 293 -573 174 350 -442 566 -132 87 167 -113
2719 -113 -419 272 77 -1027 652 -413 -449 209 -201 -502 -299 169 -1273 320 117 -581 -139 79 -82
2738 -82 -246 677 -539 527 160 -286 616 265 -137 -133 958 -655 275 609 -586 397 234 -242 -496
2757 -496 668 -444 84 485 -679 309 116 13 -33 682 -817 -108 748 -344 -38 637 -48 -554 640
2776 640 180 -348 856 -358 40 141 177 -125 641 72 -283 988 -498 -47 541 121 -657 434 257
2795B57j283J587p44n51O50J66n29K58L91j125J409q90J13O21k36n40Q31J85j469
2814h99J716o76p62Q01o9m66j42J032j344Q27j37o75O93M8k90R9R09j870J610
2833D05J6r27Q39J47m3n14J244j257M02M23q38K75J6P1k76N76p74j3P37j198M38
2854b51K13Kn68Q59j79o75J394r73M06K24J10r43P89K63j023J259r87J89r1M7
2874F5n76M12l9q46J061p07n0L05K14o14L46O15j113J223o29K33K03J73k42J16
2894A50N40j060R53l13m56N25m6m21k34Q15j383Q82j35k22K78q7K22l59O80p19
2914c90O16J1l94N93n3k0m97R17p10K33L92o07K13j22N1o60Q05m52n9J89n21L84
2936h1m79O03n99P16m08J89N71q90O84m19M72n80P36k95m91O73p17N17m14M03
$$ plain form
2795 257 -1026 561 -183 -734 -84 82 -447 -189 202 -923 486 -404 -291 330 94 -446 385 570 -899
2814 -899 817 141 -621 180 111 -355 -497 535 -809 18 -119 -794 -101 -53 -343 -244 665 -1205 405
2833 405 421 -506 333 480 437 -77 1167 -90 312 735 -103 172 188 259 -17 559 -215 -228 509 -689 -251
2854 -251 -38 -36 -604 255 76 -599 795 -178 228 452 562 -381 408 671 -352 907 -80 109 18 65
2874 65 -511 -99 -138 -984 77 -630 -680 -375 -161 -775 -429 186 -927 296 -333 -100 103 276 34 150
2894 150 690 -370 583 270 -186 339 293 -128 -362 453 -930 -48 -183 -405 -127 -214 8 -351 329 -390
2914 -390 226 237 -157 436 383 363 -134 783 73 306 698 91 304 182 233 -427 378 -74 -133 56 -465 -81
2936 -81 -560 43 -556 160 -248 -59 512 -378 306 -113 359 -221 515 220 -271 402 -315 202 -212 191
2956A91m92K77K52p72Q20l60J34m04J29k01K85J97q61J069l68K15J9q7m2j37P13
2977E77p19N15m88L17r3j69P4j54P87j282J238n14j79J37j07J75m57R31q06L70
2997A53J75m20L18j31K48l97L20r8J07j46k69M16n05M27o21Q82p52K1O53q16P80
3018C45o44L42j51o0r9M5J62o28Q32o49L78j87L63nm17P23n15M39m78M71l04o8
3040a05M28o55O42o86P72p67M48Qk22J01l40R56r07M98o2j47L5j75N23n71L33
3061A07k32K45j88j72M71m99P62o78N95m65m3J58j24L08o24R01o20J92j16j77
3081a99N87n04O36p48O18n68J13J55k25O22m32K80l39K0k5K59J9o37P91q37O47
3102B33k15K3j96k18O18n56M94n97O43l40l1n0k01M74m15O88l98j24n0J01L24
$$ plain form
2956 191 -301 -24 228 -544 276 -84 50 -354 -225 -426 -141 56 -805 264 -104 111 130 43 1 -136 577
2977 577 -142 373 -115 202 109 -60 14 -140 647 -635 603 89 -90 47 -60 115 -342 589 -217 153
2997 153 328 -92 226 95 343 -54 266 168 275 129 -140 276 -229 198 -423 459 -293 -272 381 -435 345
3018 345 -299 43 -108 -168 -267 -222 -60 -688 144 -505 -127 -314 49 44 -373 350 -165 274 -204 267 -37 -105
3040 -105 323 -332 310 -376 396 -371 77 85 -137 -36 -376 580 -327 171 109 -38 -3 -178 345 -226 107
3061 107 -125 120 -68 -240 231 -268 494 -184 411 -54 -97 61 -63 245 -379 522 -98 94 -22 -199
3081 -199 388 -116 520 -228 390 -178 -65 90 -135 487 55 335 -4 16 -9 250 269 -368 423 -414 233
3102 233 18 41 -155 -373 245 -311 183 -414 229 -111 -142 -192 -393 81 -334 354 -44 -168 -218 -117 207
3123B07o39R10p52M46l10Q6J34n4p7k72O58o83P51m67J70L34l58j6l25P16p01
3144b42K23M47n47M44m92M04m35N95n20K72j6m13N29l76M8k74L51l00q3O73m81
3165a93M01l16J37l49J48K26l93L16n50P81n25M90j78j27J85l71N06m63K20j01
3185a56K42k30j6N54m86O28n04L45n11M68L2l88M7l58O72l44Q1k41K14N3l13L07
3207I6m77L85Q2j14J04j51M33n09N09m41J91j86K59j13m1K43m46Q03n84J28N1
3228B22l59K41k92N55n68M70k97o0J69q9L49o40M87l35L88l03o8L33m80O32o65
3249c10O13o50P01j80m56M08k79K47n86N29k56j20K34j93M25m31K41Q4j33k70
3269c82O9M12o54P10j66K14l45K48k01k70P30n27N84l74R8o9j62M63o36O36m31
$$ plain form
3123 207 -432 478 -274 172 -138 -52 82 28 -49 -321 337 -346 405 -62 108 442 84 68 -257 459 -242
3144 -242 -19 428 -119 325 -167 237 -198 397 -123 149 133 -280 249 -127 -79 -353 -2 -302 -385 288 -193
3165 -193 208 -108 29 -320 -172 54 -339 -23 -573 208 -317 173 -5 -132 53 -318 188 -275 -55 -156
3185 -156 86 -144 -160 394 -92 536 32 377 -134 334 366 -22 25 -333 339 -5 76 -165 49 102 -211 96
3207 96 -381 4 86 -28 76 -75 358 -151 358 -83 108 -78 181 68 27 270 -176 627 43 171 222
3228 222 -137 104 -188 367 -201 269 -28 -88 81 -8 341 -299 188 -147 241 -62 -130 203 -277 355 -310
3249 -310 303 -347 354 174 -282 126 -153 94 -492 37 -219 -339 -105 -298 127 -304 -63 21 -112 -382
3269 -382 -313 99 -555 155 -11 203 -142 106 -95 -365 365 -162 422 48 146 77 -85 378 -258 378 -53
3290e3J61J43l83J16P0K09n05O04m61N90n34L16m4l77M00n43N94m11J30k83J98
3311f3K51n03M78l17K70j27k50M21j64rj65K86l24K31K12m63L88n12P39m60K49
3332A68l03OJ86j01L48m69K63q3N5l21P6N88p78N26n07P13k48J5L3j24J98n22
3354b81O32m65L38l64J66Qj72N61m84J70l02O60n71L3M50j29Rl28L07m69K65J20
3376A54j93L87m58M57n16K27k22J78J11r5M8l20N34l29j28J14RK72o12M10k89
3397b61L45j89j4K17k05M45o92M01l23L42j57l9J60l30L67m11N34m18L69p5j00
3418c4K33n38O16l54K69k53J00J03m15N75o77N50l28K73k5k12L06m03M67k20K69
3439C02l60j32J72j10M84m90L95l33K62k28k6J73l33K34j07Q1j05L68j28j81M57
$$ plain form
3290 -53 108 251 -132 -16 54 263 -242 362 -99 491 -43 273 229 -148 252 -291 303 -108 22 -261 -63
3311 -63 188 -315 163 -154 116 -11 -261 160 -4 -13 -178 108 -216 15 227 -236 152 -360 379 -81 168
3332 168 -135 -129 57 -44 304 -165 98 15 70 -251 -175 413 -365 161 -346 367 119 134 167 43 241 -281
3354 -281 351 -114 224 -140 26 34 -138 423 -61 109 -193 467 -104 -71 379 250 259 -69 238 -231 34 154
3376 154 -39 348 -110 347 -169 58 -164 14 125 30 78 -242 292 -37 -165 -51 -42 230 -382 28 -261
3397 -261 84 -105 -119 98 -107 338 -354 47 -276 66 -91 -130 30 -300 67 -344 190 -228 141 66 -34
3418 -34 199 -339 277 -77 192 -61 39 142 -273 302 -375 175 -153 120 95 -117 189 -214 253 33 302
3439 302 -58 -190 -18 -128 356 -134 261 -72 190 -38 -64 109 -224 10 -97 -16 -121 247 119 -62 395
3460C95p03M14j6O1Rj50j03J9K46n95P14j67j68q0J3K98o01M77m47L78O2j22K52
3483A86j74J29l47M28n03M37j34o9m0q3L75m94O20j53m72P40l09J88m80N71o41
3504b25M09k44j2L41m76M56l99M05l91K57j13l64O49l71K20n4L20n04J03J16l89
3525b66P68m93L74n05O9L9R8J45j80J64m40M93m82K85M1m99M94n36L50N8q2r3
3547a98P8K82l51N37n56M76l27J26l33J02K13l60N39n42L80k49j16n4P0P9j37
3568c41L60j32K25j46N4j8j28L64l08M12k95J18j51j0L5N8L76k44R7m04J95J60
3590B77l99J95k25M68l41J94j58l25M19l64K40j03M57k03J75q3m76L81l00K15
3610D4j02J43k78N2J78l67N20m78K75k99L3L21j69J67j22K11l30K22l07J66K71
$$ plain form
3460 395 -308 106 90 151 160 10 -93 -74 172 -423 291 124 -44 -124 -111 187 -414 63 -384 -6 56 -66 186
3483 186 12 141 -206 222 -281 156 22 -47 -87 -170 205 -289 331 178 -294 446 137 325 -155 416 -225
3504 -225 184 -60 -72 269 -207 249 -150 255 -136 121 8 -356 293 -78 142 88 408 -96 7 123 -266
3525 -266 502 9 383 -122 -53 -14 84 229 49 213 -227 266 -216 69 110 -389 105 -431 -81 -23 -105 -198
3547 -198 -120 162 -189 348 -208 268 -59 67 -266 -164 49 -311 228 -314 66 -183 -299 -353 -283 -204 -341
3568 -341 19 -113 112 -34 20 2 -126 238 -70 342 47 165 14 4 39 97 473 229 326 -78 117 277
3590 277 -122 73 -152 316 -25 169 11 -314 105 -259 -19 -122 335 132 307 224 -252 129 -171 44
3610 44 -58 85 -193 -141 37 -330 190 -288 -13 -312 -279 42 -127 40 -82 129 -201 21 -286 -120 151
3631A51m37M26l87M20n6J95k79j72N47n80K04k2j85K85k18j10K8L22m19M74k48
3652f1K22l01J81j8m1K47m77L95k8j8N7n3J22k30J90k24jN0r1J82j58n8N6N65
3676E08q64M92j4l40K43k2J53m5J65k18l2K47l12P6p4K78l17J63k03J27N6k75
3698b08J65m7J30m24K74j61jL21k75L43k45K94k65J81rl56L98l87L59k69K99k00
3720h3J31N7n25N48k72M6J3K0R0k42L26l82O54m60j26J78J91j7k81O18p25M25
3742A84l9R2j04J4o1j72N23n89M06k06k73M33l58N3K05k2m46L18j0k81J96m3Q8
3765i2k37K78q9l8K94m43L37j80K84m58L65j34J70P0l31J72J43j33L4J3j09j26
3787b10M44o45N99n55K07N4q6P7p1O65q70M73O8p2q8p5J21m37O12m18O7J86K00
$$ plain form
3631 151 -286 140 -247 173 117 312 33 -139 408 -172 32 10 -175 110 -108 -218 -190 132 -287 187 -61
3652 -61 161 -140 41 23 -18 229 -248 147 119 101 158 105 227 -3 187 -37 -38 12 -79 103 -55 -113 -57 508
3676 508 -356 136 122 -218 25 3 156 111 276 58 26 273 -39 37 -37 241 -76 87 -116 11 67 -208
3698 -208 -43 -90 40 -384 -110 -271 -272 49 -226 117 -128 166 -99 82 73 -283 115 -272 87 -182 117 -83
3720 -83 48 105 -420 128 -144 -98 -85 -65 25 -217 109 -273 381 -79 -205 -27 164 147 -134 484 -241 184
3742 184 145 237 133 147 86 -86 437 -152 254 48 -225 208 -150 -97 108 86 -360 -42 -52 -333 -137 -180 -92
3765 -92 -329 -51 -140 -178 116 -327 10 -170 114 -344 21 -113 57 127 -204 -32 111 -22 12 25 -84 -210
3787 -210 234 -411 188 -367 -160 -106 -192 -115 -186 479 -391 82 150 78 -10 -85 36 -401 211 -207 -140 46 246
3810B46l2l6P6m57O27k65p3nj44K54j16R0j58K43j50j3K18r2J3l49M19m62M31
3833B65Q0m84L22k62J19r6J57j48K25j20m02N08p06L37N8Q4k87K03PQ6k8o9J08
3856d3l09L69o5L2O0k11N07k24j20J9R0j08L0O7j98M05l15K54p6o7L1j74L33l38
3880e1K15K6k49J27J53j39l75O44n76R6K10j94q4j7L13pJ67n44J21K21l06L39
3902I0j41J04l01L15j92J92Q2M2n3r3K50l94L68k87J29J74k56Nj49L32l06J53
3924F4Mk18L89m37K87M4J75l09J16q6m71O07l27J65Pq6j90R4J44l90L94k97K88
3947c3k68J96j04Q4L68k17n2kO0k15J66k1P4J69l87L38r8l9p6J21j9J18J82l24
3971B1R3P6k49j37K84K38l58L56k74j59j16J48K62l07o3j87M25O2k98K22l11O21
$$ plain form
3810 246 214 178 254 -203 424 159 86 81 -63 191 75 165 7 250 100 87 305 213 226 -123 296 -166 265
3833 265 345 -139 183 -79 40 -56 101 -47 178 58 -344 164 -542 -205 -147 -63 -350 -147 -140 -54 -82 -151 -43
3856 -43 -352 17 -48 -16 44 -167 340 116 -4 15 105 -3 27 94 -104 301 -14 240 164 97 128 -46 287 -51
3880 -51 164 190 -59 68 221 82 -293 351 -225 -129 81 -113 -197 -214 99 92 259 -285 -164 57 -249 90
3902 90 -51 53 -248 67 -125 67 149 191 138 45 295 -99 269 -18 111 285 29 34 -115 217 -89 64
3924 64 68 -150 239 -198 89 133 308 -1 115 29 -442 165 -162 3 10 -76 -266 -172 -28 -418 -24 -321 -33
3947 -33 -301 -105 -209 -125 243 26 -26 -28 32 -183 -17 -38 36 205 -182 156 58 19 -57 64 45 163 345 21
3971 21 114 190 -59 -196 88 326 -32 324 50 -109 -225 -77 185 -122 -185 -372 53 115 -183 39 -272 349
3993C49m26K24L4P0n69O09p01j5M34m02J027j305k26N18K07n2r11J214r48M65
4013d04qP94M5j572J516r82P95m14J46O5L14m44n83K30O02l81L82r95N44J042
4033F92o06o55J366j256L29J98k0n73J093m95n55N49k83J32J42j04J8R7K5k20
4053a26L9J04p9j13J4J52l18M32m02K90J79l10L00j3r4n8n5K82j27R2m36K03K53
4076B09j09k32J53j98J89K70m45L90m95L16k23j35J7M32j28n12J275l57K93k82
4096D28q59O46p81P08k28k05K82p1J45j40l9j50K90j95J42r7n5N2J73J12n9J98
4118B97m57M08o4j32M23m38L88m44K47l90J18N30n02J44q7k3q3L31k97qJ35k80
4140a84J49P5j13J5j41K81j56Q2k61K62r7K01l58K30O7j69K58k62L35j84J94l22
$$ plain form
3993 349 -77 147 181 251 -318 291 -410 -425 9 -393 634 -671 -897 -379 -172 -224 -1135 79 -869 -404
4013 -404 -412 382 427 -1145 371 -611 184 -230 -84 -19 295 -149 -732 -502 100 -281 101 -894 -350 692
4033 692 86 -569 797 -459 -130 68 48 -525 568 73 -482 67 -216 -84 58 -46 -28 69 94 -126
4053 -126 -87 17 -62 -175 -161 -9 -327 105 -297 -7 172 -138 162 149 55 -3 -58 224 97 189 -247 -44 209
4076 209 100 -132 21 -177 12 282 -163 227 -268 48 -175 -310 -293 139 11 -501 774 417 710 428
4096 428 -431 215 -566 142 -86 -291 -9 -80 65 -75 -114 -264 26 -169 -27 -124 -179 -127 46 158 99 297
4118 297 -160 248 184 52 475 37 425 -19 228 -162 -44 486 -16 128 41 18 -65 266 -31 -39 96 -184
4140 -184 -35 40 -73 -58 -199 82 -74 8 -253 9 -88 113 -245 -15 52 -117 141 -121 214 30 224 -98
4162i8K1K82n06L68r5K00l50K06j88K37N7k73K74k76O2N1L0K0j35N2O7M6j97J19
4186b6J94j48K60j87j53j74J15m3N4J80LJ5m3m3j60K66J07m10K89j72L29k15L98
4209D36o54L50J31n01M76j47L2j90K18j83r8J10j14K82l30L93n62K37K21j17o7
4230g7M1J54l85L66l05L24k8lo7l28N76k89p8K60j65k8J82K3j01L15l57K05j20
4253A15j43P0r0J46j58J43k87J66L10k94K23k69L39l24J3P2j44l0J19P7l29M26
4275A51r5m38O01l66L40r9j0j88L65l37j5p4K77j22k27L03Q2o5n5j62L90o02M17
4298G1j2Q4k80J6J59k49K16j63M01n86M31m22K28K7l2K22k24j9J7L1o3j32M10
4321A31l40K66l1J89m90J13K32m44O12l31L33j46k0J04P0k88n1J90K05m33L08
$$ plain form
4162 -98 -77 205 -301 67 -28 172 -178 28 -160 77 134 -139 135 -141 -79 -28 2 22 -113 -61 6 52 -145 -26
4186 -26 168 20 280 93 -60 -234 -119 -162 -108 72 75 90 47 4 -156 110 217 -193 96 -76 253 38 436
4209 436 -218 132 263 -238 238 91 123 -67 151 -32 -130 -20 -134 148 -182 211 -351 -114 107 -10 -77
4230 -77 -36 118 -267 99 -206 118 90 87 20 -308 268 -21 -99 161 -4 -32 150 173 72 387 30 235 115
4253 115 -28 42 -48 98 -60 83 -204 -38 272 -22 201 -68 271 -53 -40 32 -112 -142 -23 54 -275 151
4275 151 56 -382 219 -147 193 94 84 -104 261 -76 -91 -165 112 -10 -237 66 148 83 28 -134 256 -346 71
4298 71 59 143 -137 -121 38 -211 5 -158 243 -343 88 -334 -106 -79 -111 111 -113 -132 -115 -84 -147 -279 131
4321 131 -209 57 26 215 -275 -162 70 -374 238 -93 240 94 74 178 248 -40 -91 99 304 -129 179
4342A79p8J13n0j96O2j10J94J92l30j3N66n34l21k9O19j41l18K94p70L77M71m58
4364b81J02K79K42o15N98m78K3K61j58k10L86m92M78n45P10r12M15L35J8l17L55
4385A94j86p1M42K6o26L69k17Q8O23q94O76m01Q6n7j73j70L32l5j48Q5p0P7j08
4408a58J73J81k84L02l76K16k80J94o3M31n3n9o6j99K60k99K47l9R2j48n5K07
4430B24k30j98L17p8J00j19L88o34M81k15j29J67k1j98q0M56l86M66n38O2N41
4451C76l78J09j06K29k74J00k66mJ05n3k9r8J97p4J11l4j43J07L5L34k54J09k04
4474a05K97j67Q3L08j96j66LJ7j51J43J10k67J77j63K65q7K9J21m30M07l66L86
4496B48j77j01P2n2P5k30K29j9k86K30j51J79j11L5k29K85r8Q7j27L49k77q4K50
$$ plain form
4342 179 101 214 164 -32 30 -80 114 306 -24 -37 529 -5 -326 -355 264 123 -195 99 -671 -294 177 -281
4364 -281 -179 100 342 -273 325 -153 -130 131 -27 -237 149 -343 135 -410 300 -612 -197 138 156 -161 194
4385 194 8 -63 379 405 -221 148 -69 19 642 -252 424 23 109 52 -121 -291 41 6 -142 -57 -127 -50 -158
4408 -158 15 196 -88 214 -162 54 -226 -32 -95 336 283 224 158 -41 219 -80 167 128 220 72 17 224
4430 224 -6 -204 113 35 135 16 404 -230 251 36 -93 74 53 -145 -225 231 -155 311 -227 -165 376
4451 376 -2 107 1 230 -44 56 -210 -214 -109 -162 -191 -289 -92 -166 -55 -89 -232 -125 -90 244 -10 99 -105
4474 -105 192 25 108 416 220 54 57 74 -77 66 176 -91 86 -77 188 101 130 251 -179 228 -138 248
4496 248 71 -30 42 -10 65 -165 64 45 -241 -11 -162 17 -94 -59 -288 -3 -101 -14 -141 208 -69 -153 97
4519I7j04K7k63J69J5RN1o9Q6M0j10J92k59Q8p0R5q0J17j01j69M36p3L9j70J40
4544A33l70J54J73n4N9j60J21q7J05m78L27q9r3K90l02K42o3J34k67K84K3j85
4566a03L05j25J11k22L0O6j61K11j30J54j77N8j26K00j70J87n3q5O3K3L6p9n5
4589d2q3J43L1j99K21r1j53L43k78K51j63K50r9k19J83k16J66K6O2l9R4l08J29
4612Ij15k0K70k24J77k8N2j00K01k22N1k7k95O12o03L73j09j54J49R1P1k49K6
4635f4J86J5j83j54M01k25K5l10L08k08J85J27j83J82k05Q5j34K25j32m9L22j47
4657F7M1k24M33l41J93n2r5L20m07L76k16Pj62l8K76l40J35j57L72p6l58L40k00
4680a06K06m21M07k94Q4J01j12O8r1J49K2J4k01P7J0J23m4k55P1P1P0N2P7q9k7
$$ plain form
4519 97 -7 20 -243 -74 -59 -50 1 -68 18 58 -52 140 -119 -31 -101 -6 -86 31 -70 -239 197 124 163 -7 133
4544 133 -237 -83 90 36 95 -65 56 -31 74 -404 -77 -166 -259 31 -271 -29 -92 42 -225 59 82 -103
4566 -103 202 77 188 -34 -4 62 -99 112 -18 136 -41 17 -109 91 -79 108 55 -30 33 56 92 13 -42
4589 -42 -125 18 49 -150 71 -20 -173 170 -108 143 -20 230 131 -88 95 -121 45 71 133 94 188 -120 9
4612 9 -106 -126 144 -80 97 69 121 21 222 0 51 24 -271 341 -262 111 2 -152 -3 88 159 -90 -64
4635 -64 122 137 -46 -200 201 -24 1 -309 -1 -209 -24 103 -80 102 -103 -18 -152 73 -59 -108 214 67
4657 67 108 -116 317 -24 169 117 22 342 -65 311 95 102 -60 -98 178 -162 -27 -184 188 112 -246 94 -106
4680 -106 100 -321 86 -208 -124 -23 -135 -67 -158 -9 13 27 -174 -97 -87 36 -8 -263 -192 -121 -51 1 78 -11 -38
4705c8K31q8j64J15K8N2o5L2N1j91k4J26K52l84J43J01J8j35J02o8j19Oj92J31
4729h0J9N7k95O11o10K63r9nk32jJ15rj2j01J78O5J06P8l58N82l30J90k12m5Q9
4754c6j03L54l58K07o8jO2k49J82J5K70l05J1J11l75N63n4j65O8Q4k89l1o5J5
4778a57M27k44j23O9O5L7J37j61j66j28J77L13m85M4K27k34J76k76L91j99J54
4799D4k55M8rK43J93k55Pj50K07n5l7K04O9k48K05m0j89J47j42j1K35k72J34o0
4823A3J36j32Q9k23m5j30K19K9n5J36k75L32p6k35K03M1m7L49l96L1J04M5j10
4846Cp9k55L55j03%K17q7J08j53n8K36q0R3k33J87p5k02K10qk13K49n3j48K95
4870B06j69P2l14M30l60J09J99j73j12Q2P8j52k5m4K39j77j78O4O7R8j50p5k5
$$ plain form
4705 -38 193 105 -59 56 84 136 71 103 154 -37 -61 65 317 -67 76 177 195 60 162 94 -25 -19 -211 -80
4729 -80 -61 -4 -299 312 -298 -35 -134 -139 -371 -372 -257 -266 -278 -379 -201 -136 -30 48 -310 272 -58 132 -80 -125 -36
4754 -36 -139 215 -143 64 -4 -5 57 -192 -10 5 275 -30 -19 92 -283 280 226 61 129 213 -76 -107 -172 -157
4778 -157 270 26 -97 -28 37 74 211 50 -116 -244 -67 246 -239 -195 32 -202 -26 -302 89 -110 44
4799 44 -211 -163 -172 71 264 9 16 -134 73 18 -19 185 254 6 211 171 -18 129 -13 -24 211 -61 73 13
4823 13 149 17 106 -117 -162 -292 -73 -44 -99 37 -238 94 18 -217 -14 27 -20 329 -67 -36 68 113 3
4846 3 -76 -331 24 -79 -79 138 51 159 6 -52 184 104 197 -36 151 76 -126 84 76 -137 112 59 -89 206
4870 206 37 109 -205 225 -135 -26 173 0 -112 -30 48 -104 -129 -173 66 -111 -289 -225 -158 -60 -210 -285 -310
4893c10R6J42j50O3l1O9R6Q0l6l65K44K16m4k55k0K68m30M80o6Q8Q9o5J80m30
4917i1L21k88K47l50L18j96J33qj53K70l79M53k33k44K01P5l5J59k80J44k15l
4939a54J18J47j26p5P2K15k35K03l74J49o9J21L01k14J00p6j08k37L05l67K33
4960g1J26j5jn0J20q5n0J7J06j68p6l6J36Q3O2j28K81k94J61k39J66q8J7J14l6
4985E2j75j83M40j17Kk85M07j24j45m4M34k19O8o3j40J27M6Mj64J28L4J17m9j15
5009C6L4j53J96j59L41n68M68j15k47J41j7L2J10L41n64q9K48L4k13L57k71J28
5031G0N7l39R4J60k3l2J83m82L99L9j68K8l0K43j25o3j43L32j95k62K17M5J63
5054A68k33K53q1j66K78j07j7k26P6J75q6j18J69j11O1j90L5J20N4k43L36n00
$$ plain form
4893 -310 -214 -72 -222 -159 -190 -121 -25 55 19 -346 -102 114 70 -185 -205 63 -367 113 47 135 224 159 339 -91
4917 -91 230 -58 189 -161 157 -39 94 86 -67 203 -176 277 44 -200 1 76 41 200 -80 64 -151 -154
4939 -154 -36 111 -15 -90 -18 197 -38 165 -209 -60 -129 -8 293 79 179 103 -5 -242 63 -304 -71
4960 -71 55 40 39 -11 109 24 -26 -9 97 -71 -147 -183 -47 36 98 -30 251 -43 118 -121 45 -43 -26 88 52
4985 52 -123 -306 134 17 19 -266 141 17 -128 -172 262 43 111 48 -92 35 81 85 -79 49 83 200 151 36
5009 36 70 -83 113 -46 295 -273 195 80 -167 -26 -43 -11 99 440 -124 -213 35 69 -144 213 -58 70
5031 70 127 -212 -118 42 19 -13 170 -312 87 126 -42 -14 -44 199 74 11 -132 200 5 -257 -40 5 168
5054 168 -65 188 107 -59 219 112 95 -131 -55 120 34 -84 85 -26 35 -155 -120 0 54 -189 147 -353
5076c53M18J9j8j10J28M6k69L16j97J89k37J79J36l33K01o9J3l79L91K7l43K22
5098b3k25K99k17J59K45n8m1r4K4qN0k97J76K46l91J08N5j96O0P2j17K37j45k54
5122c35N08j77K53j79k4q2k6j65L08j60J52l9K5p8N2J02k53J51j73K1J94k45N9
5145a11L4J83j08j21J07R2m2j18j4q1j76N36l51j40K13p1L12N5j92J38j61p2o7
5168a55R4M2LJ96j33J81l07mJ39Q0j39J35nk14J82J2r1J4m2r3O4r7J54mm1J84
5194A55j60j17q6K56j43j1j03J92J5k07J93j44j17K30K07j21m3p1Q6o2k06L76
5216A19k98J65m0j8K00p7l5o6q7O9J38j29j47M75k62K57ol17%J58k4k41K29j19
5240e6N1j09j3O5O6j8O0J24l11L6J64Q8k31l3L03j50k20O4O7Q8L9k10O8J17J7
$$ plain form
5076 -353 65 84 66 -44 84 130 -139 177 -20 169 -68 111 247 -86 115 46 59 -320 71 98 -245 -23
5098 -23 -248 51 -166 -7 238 180 139 45 69 61 111 -186 -10 236 -155 -47 8 -188 -128 -56 -173 64 -81 -335
5122 -335 173 -4 249 70 46 -36 -62 -227 81 -79 73 34 59 -19 33 135 -118 33 -140 -119 75 -170 -111
5145 -111 -77 106 -2 -123 -16 76 34 -84 -98 -179 -355 181 -170 -310 -97 -168 144 199 7 145 -16 -88 -155
5168 -155 -61 -19 -16 180 47 228 -79 -83 56 136 -3 132 127 -87 95 107 16 30 -12 -105 -41 -138 16 12 -29 155
5194 155 -5 -122 -208 48 -95 -106 -209 -17 -2 -209 -16 -160 -277 -47 160 39 -4 -75 11 -51 -257 119
5216 119 -179 -14 -54 -72 128 51 16 -50 -137 -68 70 -59 -206 269 7 264 258 -59 -59 99 75 -166 63 -56
5240 -56 -5 -114 -127 -62 4 -14 46 170 -141 -105 59 147 -84 -117 186 36 -184 -120 -53 35 74 -136 -68 49 66
5265F6M1j91Q8j31J71l9p9Q1l06L42r9J43m1J04j56J67l58J22K06J19k46J25m6
5288H3m5k27J75m0j07L5J65Q4l36K43l4m9k8r3J26k19J90j34L35k77kK06n7N7
5312E1JJ32l58K49j94K18qr8J76k85K23j06J03j52J66%NN2j21m6j07L47k35j91
5336a78P2Q5L79j34n0k48j60K21M5j83J1K80j31k0J76o0j76K95m16R9J42k33L51
5359A67k96m7K04m5K44N0j04j07j51K11q9K19m54j02M75o3j41K8L6k46L08j16
5381a9PK96m31K76n79L62k24L00R9j49J7j06Q6K80k06n4K47j73j09J25K9j77K46
5404A43j8k77M74k05O8j63j1p9J26j0j6J98l76J41l3l3M8J38m15K61o6LJ39j35
5428i8K02k11L49k40M9j08R7r1K40k70m8n5J57R1N5k54j40L32n6j66P6J54m7Q6
$$ plain form
5265 66 107 -84 4 -127 44 5 -74 7 -299 43 -56 87 46 150 -6 161 -197 -75 131 250 4 129 83
5288 83 38 -189 -14 -54 -161 -126 39 123 -213 30 -4 -53 -81 -174 -48 -267 -77 -211 124 -153 -155 51 -6 51
5312 51 52 184 -174 75 -119 99 91 -7 169 -116 107 1 104 -48 118 118 123 175 54 8 -99 248 13 -178
5336 -178 -106 -21 358 224 174 -74 -234 -13 32 -151 -140 140 9 -11 165 105 -71 224 -192 -93 49 -184 167
5359 167 -129 -176 28 -17 227 277 173 66 -85 126 37 256 -198 -300 175 112 -29 -1 35 -211 97 -19
5381 -19 -12 284 -147 129 -450 -88 -312 -12 87 -62 -45 -151 -65 215 9 -45 202 29 -80 45 74 -103 143
5404 143 125 -152 322 117 185 22 11 -68 58 48 32 230 -146 -5 -38 -71 -23 115 -300 -39 -105 -102 37 -98
5428 -98 104 -107 242 2 51 -57 40 -51 189 -81 -129 -184 -27 64 119 -135 -275 57 1 -165 -89 65 18 104
5452A04J36j23j2J47j72K7k81P0r3M83k4l00K42n8P7k27J86om05K12J40k72J11
5475c8j08P3j07K74o7j03j0J54j34j24K80l64R1OJ73R7j73J25O0l01L82j76q8
5498g8k2j54K08L3O1k40J68J37MJ3N6k13j10K34j10o0P4j01M30m99K74Qr1o1Q4
5523D5j70J67J51k41J52k82Q0j17K29j57L89m74j6J44O9L57k66l76O18k22J33
5544B13k42j26J89m2j0Q2K1j45K47l38N2K22j4jJ0p8j20J2Q2J14J86o24L99j19
5568c0r0J52k43L53j08O9j94K13r7j18J9J65k23k54K43J97k50J28r8L4L1J40j50
5591a11l8r9J46K48k50R9J26l5j74K73k44J8J41J7j77J4J07j09J38o8l2qn5J4
5615e9K6J53j38J37m1L5N7PO4j11j80Q1k1m0qJ35j14p3J15N1j43r8J48o8Q9n4
$$ plain form
5452 104 240 117 105 252 80 107 -174 -104 -197 286 262 -38 204 146 223 -4 182 176 -229 -17 123 -149 -38
5475 -38 -146 -73 -180 94 27 -76 -86 68 -66 -190 90 -274 -183 -177 -4 93 -80 45 105 -196 186 10 -78
5498 -78 -100 -254 -46 -13 48 -192 -24 113 117 130 186 -27 -137 97 -13 -73 1 -100 330 -169 105 113 22 -39 45
5523 45 -125 42 193 -48 104 -178 -98 -215 14 -143 246 -228 -244 -100 -31 326 60 -316 302 80 213
5544 213 -29 -155 34 -8 -18 64 85 -60 187 -151 -99 123 109 108 118 40 -80 -68 14 128 314 -310 89 -30
5568 -30 -120 32 -211 142 34 103 -91 122 25 -93 -74 91 -132 -386 -143 54 -196 -68 -166 -132 -101 39 -111
5591 -111 -149 -248 -102 146 -104 -5 121 86 -88 185 -59 -41 100 117 -60 -46 61 -48 90 22 -10 -18 -73 -59
5615 -59 -33 120 -18 119 78 113 170 177 241 130 -50 31 10 -30 -38 97 -17 -90 25 76 -67 -165 -17 -85 4 -50
5641e0j07J41L2qo4r0n8K98l1j09J01j84R8J33j92K00Qo2n9M1KK23j19o4k27K37
5667I0k45J88p4J16J2j3j18m3L12k19m4k5J55N4r5Qk2q9K7r0k4K96k30J05K23
5692B55l60j12K79M6J8j99J24k4j05J76o5j77RpJ05J16k8m3J6p2K10j90P6j72
5716a24N9kR5%l09L62j65J51M5k13LR1Q0q1Kj56L28nj2p3k83K11m2J76p1jj82
5743a16J22j57K01K0o6m8K1N2Q6R6l55q6K55O9j16N7O6NJ03k17NJ94q9j22k15
5768b35J64j02K10j44L8M6K01l43KK61o7K8J39l03J35k51J01k6O9J76l6L2j09
5791a4K7J38j24jl34L19j88L96k86k01L14l86L58j7j97J74N9r9k08K70P4Rl00
5814b17J88J52o7K22k47j51r2J66j15M10l27P9k8j43L52l51K17j86N3J87rj24
$$ plain form
5641 -50 -157 -16 16 8 -56 -146 -204 94 63 -46 55 -129 -31 102 -90 110 118 56 -3 38 40 263 144 80 -147 90
5667 90 -155 33 -41 75 87 74 -44 -87 225 6 -38 -63 92 146 51 59 37 -52 -25 -115 -139 157 -73 32 255
5692 255 -105 -217 62 108 126 -73 51 27 -78 98 33 -144 -135 -142 -37 79 51 8 24 -48 162 -28 48 -124
5716 -124 -65 -67 28 28 -281 81 -84 67 112 -101 -98 -7 73 -8 -6 -162 166 161 149 76 -207 4 -38 138 67 66 -116
5743 -116 6 -151 50 70 4 -44 -23 29 115 211 -144 -230 25 94 -22 35 101 106 209 -8 -3 191 102 -20 -235
5768 -235 -71 -173 37 -107 -69 -23 178 -165 -163 98 31 59 198 -105 30 -221 -120 -146 -77 99 63 95 -14
5791 -14 13 151 27 26 -308 11 -177 219 -67 -268 46 -340 18 1 -196 -22 37 -62 -270 0 74 83 -217
5814 -217 -29 123 56 278 31 -120 -212 -46 -161 249 -78 1 -27 -170 182 -169 48 -138 -85 102 93 -31
5836c1j89L15q3r1K78l29J49j14R4K58k00k1k40K33j24K89K3l57RO7r2J57L0K14
5860B45k64j94R4l7J24K87l10p8JJ19k4J72j52q4N5QR8O0j26k58J68L19l07j80
5884b64N1K56n0j38RK06k92J30J26n5o1mJ0m7P9j58L05J3j52P3m3K5M5j81K13
5909I6j58J52j24N2K29k36L3o7J03o2J54j52K05k69j17N2l28M52O8j00L28k37
5931G4p7m5K03k27j7K60k08J12q3J63k27K08l84L40l7k47L23n47M71k0O8o2O1
5954A02j88l5L6Q2j21J18J4l54L06l1l9L02k34J68k52L03j59n5J07mr2n8N7M9
5978B2k7J4K34l52K42r0j34O0M9j13J28K39j65j84J05L6k49K20J75J01l50j00
6000a39j27RK6J31N7J88n4j09k3No8P8K06l34Q2j11K38o2j1K63N3l30k77L75K8
$$ plain form
5836 -31 -220 95 12 -79 199 -130 19 -95 -1 257 57 36 -204 29 -95 194 217 -140 -131 -64 -156 1 31 245
5860 245 -19 -213 -119 -156 -32 255 -55 -133 -132 -13 -37 135 -17 -101 -46 -38 60 120 -6 -264 -96 223 -84 -264
5884 -264 -213 43 -7 -145 -136 70 -222 -92 34 -21 -82 -86 -76 -123 -44 -202 103 116 -36 37 -6 19 64 -117 96
5909 96 -62 90 -34 18 247 11 44 -23 80 18 172 20 225 -44 -161 -109 -437 15 83 -17 311 74
5931 74 -3 -48 155 -72 -89 171 -37 75 -8 155 -72 136 -248 92 55 -192 131 -416 55 35 103 41 102
5954 102 -86 -121 -85 -3 -124 -6 8 -346 -40 -71 -110 192 -42 126 -126 177 18 -37 70 66 -26 -84 -27 22
5978 22 -5 9 243 -109 133 43 -91 -31 18 -95 33 272 107 -77 28 64 -185 35 210 311 -39 -139
6000 -139 -266 -257 -231 -100 -43 145 91 -18 -41 -36 -104 -26 180 -154 -72 -183 55 -7 -18 245 298 -32 -309 66 94
6025I4k50K34M1J2l48L52J36k94J74j13J80n69L52K83l20Q8p0O6l9j20j70K43
6047c8P4k10J39P3j70J81J82m73j33L73O9N1r5M9q8J7OL3J7J12J23k69J91j83
6071C1n0j83J32J74l8N8j18K5R7n74N60j92P9j4r3k3oL35k47Q3L6J15j59J40j74
6096fq8J31j30K1L05m99J04n8K60l2r0J27pJ57k25j28K41m1nj76J10J01j54J82
6120A00J54j87J38k82K42l56O0P6K20k06q5J33q3R6l4M7j56l5J94j84O0n0Q3m1
6144i6J68J6P1n5j17K60l18J61k48J57L2k4q2K49j66O0l43L35j88K7r7j06K17
6167h7K10l20J85J07k63K58J47j11j71L15l26L6P2j00J44j04k26N8J6K1rK4J19
6190en4J15q5k46L16P6Pj32n8o6K38N6k75l0P7j3J52q4J64P2l06J95j67o4K53
$$ plain form
6025 94 -156 78 119 131 -217 135 271 -23 151 38 218 -351 1 284 -36 52 -18 48 9 -111 -281 -38
6047 -38 36 -174 -35 38 -132 49 231 -242 -375 -2 67 118 23 72 -16 1 7 40 57 169 292 23 214 31
6071 31 -19 -202 -70 104 66 124 6 31 128 -446 114 -78 1 -13 -106 -129 -135 200 -47 36 72 187 28 168 -6
6096 -6 -94 37 -93 -72 233 -266 -162 -220 40 8 -82 45 38 195 -30 -158 83 42 37 -139 -29 72 -82 100
6120 100 254 67 205 -77 165 -191 -131 -55 165 -41 -126 7 -76 20 -14 33 -123 -158 36 -148 -88 -138 -55 -96
6144 -96 72 88 159 104 -13 247 -71 90 -158 -1 31 7 -75 174 8 68 -275 60 -128 -101 -198 -304 -87
6167 -87 123 -197 -12 95 -168 90 237 126 -45 270 -56 -20 52 -48 96 -8 -234 -176 -160 -139 -148 -124 -5
6190 -5 -59 56 -29 -275 41 117 124 -8 -66 -132 106 162 -113 -143 -66 -79 73 -11 153 225 -81 114 -53 -117 136
6215A36p3o0J7J33l22K72J68l09O7J57j86o7QK11j74o3J98L6j89N1m3J08j69L22
6239B29k22j11K74m62L56j80M9J07l8K9K1j39R2K6q2Q8LP0j03J65l67K37k43J56
6263d5K13l21R5M8j91L17n2QJ18k21P4j22P1j80M6k7J73k03L2J93q4j4K19k37
6287i0j49J09J49J4o0R8k86J18J99m7J07q2n5n5r4K71R5j19o2R4j65J76q8L0j40
6312c2R9j40P4OK2M1J17k01r5K78J6l90J9K42l2l66K08Q7O6L1j94K24q4J5k19
6337b08L31j22j13K09k51J89p7j30K18r2J77j31j90nkM36j44qj82n4K07n9r9J83
6361H3N1p3J8k65O9K62j61J10j38P9j22j9J93j03J68j5k4j41m3m5K21j50J95l89
6385b39J90oP8j86P5k7P3J18k47J63Rj76j49J38K51j97J59j24K4J03o3N6L02k93
$$ plain form
6215 136 63 3 20 153 -169 103 271 -38 29 186 0 -67 -59 152 -22 -85 113 149 -40 11 -32 76 -93 229
6239 229 7 -104 170 -292 64 -116 -67 40 2 31 52 -87 5 31 -51 37 40 110 7 172 -195 42 -201 -45
6263 -45 168 -153 -58 -10 -201 116 64 72 190 -31 43 -79 -8 -188 -142 -169 4 -199 -167 26 -58 -72 147 -90
6287 -90 -239 -130 19 33 -27 71 -215 -97 102 55 162 80 25 -30 -124 147 242 123 61 155 -10 166 78 108 -32
6312 -32 67 -73 1 7 29 70 187 -14 -109 169 185 -205 -186 56 24 -342 -134 -47 19 50 -144 80 -4 11 -208
6337 -208 123 1 -112 97 -154 35 -42 -172 46 -46 131 0 -190 -195 -197 239 95 87 -95 -149 58 -1 -100 83
6361 83 134 61 79 -186 -117 145 -16 94 -44 35 -87 -106 87 -16 152 137 113 -28 -71 -116 105 -45 150 -239
6385 -239 -49 -55 23 -163 -88 -115 -42 76 -171 -8 1 -175 -324 -186 65 -132 27 -97 -73 30 -33 23 325 32
6409C2l4k1K9O9j83J76j55j16Q5M9o1J59M1k05J23p1j5j62N67j45k53m2K72p2
6433F7k38P9j01j2M43m32M5J06m0k33L28Mq0J20L3j69q4K16l7j67P7j9J39o9R
6458a5j6K21o6j09j41Q5L4M4P3j82J89nj01j87M0P5Q1Kj05K73q8O1J9k90J41j46
6484a13J49Q6N0j56K0L7j63J74j06J15K4j66J69j63k4N7m4l8K55j32m7J70j24
6507C0J39l10K1M0K13k77J74L3j57Pn2Q7l1Pm3K3J68j05q4K38Nj40K83l02n7K93
6533B03l55J79j59RJ48K00k07j66J47o0K14k56P6j10J16M3j47N6l5j11N3L9R0
6556c3q5J31j61K45j72J02j22k7K46r5Q0j48J61nl73K87j0j41R9K5O3j51m5K08
6580G9K6q5Q2J51l03M3N7n5Nj7r7k17N33k30l5O7k53L07j18L6R8k4q9P3j80J61
$$ plain form
6409 32 -2 -23 6 75 -108 68 -87 -203 -118 -69 -130 29 70 -135 -12 -83 -98 -260 307 162 -91 -133 139 67
6433 67 -171 -92 -193 -205 238 -194 -149 -43 -83 -316 12 16 -64 56 89 -80 -164 52 15 -152 -75 -94 45 -24 -15
6458 -15 -31 190 124 15 -126 -41 -7 37 110 -72 117 112 11 -176 -136 -61 20 22 -83 190 102 163 182 -108 33 -113
6484 -113 36 122 172 16 36 73 -90 84 -22 93 117 -49 120 -43 -67 -10 -54 -92 163 31 -16 154 30
6507 30 169 -141 -120 -80 133 -144 30 63 -94 -87 -139 -52 -83 -76 -119 -96 72 -33 -117 121 126 -14 269 -33 -90 203
6533 203 -152 27 -132 -123 25 225 18 -148 -1 -61 153 -103 -27 -137 -21 22 -125 -69 -104 -215 -162 -123 -33
6556 -33 -118 13 -148 97 -75 27 -95 -122 124 29 109 -39 122 117 -256 31 21 -120 -21 4 67 -84 -129 79
6580 79 105 20 102 253 -50 -7 50 -5 0 -17 -114 -331 202 -28 -63 4 -249 58 -60 -24 74 50 -39 34 -146 15
6606A5j04M5j1K6R0K37k75N6J90k38O5m4j93K85r9p0k35Q6J47p8M2j9L4J13M0
6631A05L9j93Q4k33K54J37m14J85J38j97K04j10J23r1j42K86k21J10R9l8j56j25
6653a56J30j05M25k44N8M5j38J86k62k42K46j5m2K27k4k3k11L12l90J03J78J29
6675A87k45K19j08r9Mk49K27J80j32q9J42k55K78K03k87Q8k33K42j5J8l3l11L05
6698C7o9k02L02j49L9qK0J16j71J85l4j91l4J74j28K16M8p7qj75J50j28K03r5
6722B1p2l0O7k2QK07l78K73J5j92J54L0k97J90Pl5M9p0K84l73K14j05J99k51K70
6747A63l40J86R3j84m8L1J17jr6j35nJ96J63j89kK68l03L80m89J98P9mj23Q2p6
6772c9l5L7J28o4M7j49P4q6p2M37k15k0j39jK88k58j08J28j70J38J55j56K59l2
$$ plain form
6606 15 -89 -44 -55 -29 61 298 23 79 269 31 96 52 -141 144 45 -25 -260 -174 -27 -105 -63 -82 -48 65 105
6631 105 144 -49 35 -198 56 193 -221 -36 102 -95 109 -1 122 31 -111 175 -46 64 163 125 -31 -156
6653 -156 -26 -131 294 50 108 153 15 201 -61 -303 -57 -72 -114 113 89 66 -145 167 -223 -120 58 187
6675 187 -58 161 53 -46 -42 -291 -64 116 -16 -105 37 -218 60 263 -24 64 -169 73 58 76 43 -268 37
6698 37 -32 -234 68 -81 -42 -50 -30 86 -85 100 66 -125 -159 15 -113 103 151 74 66 -109 41 -87 116 21
6722 21 -51 -81 -14 -36 -28 179 -199 74 89 -103 51 81 -216 -26 -19 -54 -5 -75 209 -164 50 -55 144 -107 163
6747 163 -177 9 102 -82 -130 -99 18 17 -79 -214 -219 -23 140 -49 -51 217 -86 294 -195 3 82 78 -45 37 -39
6772 -39 -74 -37 91 27 74 -75 -1 -87 -159 278 63 43 -96 -97 191 -67 -175 -47 -217 -79 76 -80 179 147
6796A47j73J1l2J37p8k5J22n0k22m9J74k5K69j63j27K19k3j06n3o5J61n1o8Qq2
6821a44n6J93Mj13j18L10j47M9o0P7o7O6K01k33J8N7Q3j32J16j59J90m62K61k
6845f8J21p0J12m0p2J33L2m2q7J41k16L6J72l04L54m50L29Rj61K2K88l14O3n4
6869f6j23M00k84J17j18j6O7J8M6j37K08k39J57l7K50k17q1n6LR2K4j9Q5N2j78
6894e2J33o1l4K02l18L6K62j66rq5r6K03Nj46J04R1Ml01N04k04j4R4k31m4q4p8
6920b85M07p3K0Nk18L34j39j48K54m7q6lJ29o3j44J03J18k82J37j09J71j50R4
6943B5Rj42p2J41m1L0J36k43J88M8j28lJ25j81L17p3j80L00k06K0k00J08o1jK8
6968e6J93R3j11r5m6j01J63n0J65K2O4J1k23r7%J16pp0J4J50j39j80J21L9mj81
$$ plain form
6796 147 -26 -15 -47 90 12 -13 109 59 -163 -212 -38 -63 206 43 -84 135 112 6 -47 -112 49 -2 -70 -62 -144
6821 -144 -200 -7 -3 -116 -234 76 -71 -22 -82 -5 -72 -6 195 -38 -20 37 120 -12 104 -55 135 -327 -66 -68
6845 -68 53 -17 95 55 -17 116 148 106 19 160 -56 -20 152 -152 202 -248 81 90 -71 -49 239 -75 -12 -66
6869 -66 -189 211 -73 44 -74 -90 -23 -5 41 -96 112 -127 30 -7 243 26 -55 -111 -108 -16 8 -11 74 126 -52
6894 -52 81 20 -14 188 -130 -94 168 2 -7 -92 -188 15 20 -126 -22 69 73 -228 276 72 58 152 -79 -123 -207 -285
6920 -285 122 49 69 74 -144 190 51 -97 157 110 24 21 150 87 -57 46 164 -118 19 -90 81 -69 25
6943 25 34 -108 -180 -39 -80 -50 86 -157 31 79 -49 -52 73 -108 209 136 -44 256 50 70 -130 -22 -83 -84 -56
6968 -56 137 230 119 24 -22 -123 40 -10 155 177 241 252 29 -68 -68 48 41 -29 -15 135 -4 -184 -63 -24 -28 -209
6994b09J01K27n5j3j91PJ4J43J55j25J71j53j92J01j03J91j68J46n0J89j38p9
7016c1PJ78l4j71K12j4l17o6R3J38Q2j78K05j62k26J30L44k89J49k48N78j56k09
7039A5k60N86n29L59o9n78Q19p11Q55o26P97q03N09k70M3K01l5n9o83P44o24J80
7061a39L86j02M34k79o94J149l61n65R6L83l96J43l3j59J60J49K84m83J0Q8K89
7082C60l26J13j04k71L26l02L34j67l6J55j46j08k71P50l01k91K84r5J05k0O9
7103E8k64J75N3K03k48j26J76r7K77l13mK09n3J10k63l6oJ45j20R3J8J08JJ09
7127B05j35j97L94k76q8J84j17r6J9L4J17O4j09j62L42j18k02K07k90K68m7L3
7149C0ko2K00r7j75J82j89K80m54K73j18K76r2%Q9K2l7K38l10j23K7P10o14M20
$$ plain form
6994 -209 -108 119 64 51 -140 -133 -119 24 179 54 225 72 -120 -19 -122 69 -99 47 -3 186 48 -31
7016 -31 -24 154 120 -51 161 147 -170 -236 -143 -5 77 -101 104 -58 -284 -154 190 -99 50 -198 380 224 15
7039 15 -245 341 -188 171 102 -476 343 -368 487 -139 658 -145 364 94 137 338 303 244 -439 305 -319 -139
7061 -139 247 145 579 300 -394 755 394 -171 -75 308 -88 55 22 -137 23 172 456 -27 -17 71 360
7082 360 34 147 43 -228 98 -204 130 -37 -73 82 -64 -172 -443 307 6 -285 -1 -96 9 -11 58
7103 58 -206 -31 22 225 -23 -149 27 -70 207 -106 -110 99 46 156 -107 -143 -149 -4 -124 -31 -13 95 96 205
7127 205 70 -127 267 -9 -97 87 -30 -126 -107 -73 44 108 -1 -163 179 61 -141 66 -224 44 -3 30
7149 30 28 -34 166 69 -106 76 -113 167 -287 -14 -132 144 52 52 141 163 126 364 54 -69 -42 668 54 474
7173D74L17j69l40j047l47R31Q09j025L43Q8l75L71k39K28k34j6K36m40L05k20
7193c50M12m5K31o95L73N54l78l79J43K37k63k3K24n52L75J26l04R7R0k94N86
7214A65L5j24K53n32L53l6J2k35J92P4k80%J77J53k03l81J03J77J33J6k47R3L0
7237g2j62J97Jq6J19j71J65m0p1L18l65J61n0J19j0K85m81j6L14kq6K6ok91PR
7263a88K67l03J42N4K39l32K1J04L9Q9l98M25r0m47N51rm8l6K5j53n9l8J53K6
7287C4J13j00j72P6K5k95M50k24k04J88J48J12j99K04j81l7O4l1j44J41k51K13
7309g0Q1P5j18J15Jo5K7k03k9K14Q0m5l62K34p0J88j26Q8Q8j41K09r4k7q9Q0k4
7335A7j80K60q0j16J49j05K76l59L50M3k69J7r1K59l07K27j16Q%k49K19R6r5J29
$$ plain form
7173 474 791 622 282 -765 -1112 -181 628 -397 -54 34 -341 30 -209 19 -215 -231 5 -435 -130 -350
7193 -350 62 17 248 -447 -74 480 102 -277 -134 103 -160 -183 41 -511 -136 -10 -314 -217 -127 -421 165
7214 165 200 76 329 -203 150 114 126 -109 83 157 -123 -123 54 207 4 -377 -274 -97 36 52 -195 -102 -72
7237 -72 -234 -37 -36 -122 -3 -174 -9 -49 -120 198 -167 -6 -56 63 53 338 -143 -159 155 153 67 93 87 -204 -197 -188
7263 -188 79 -224 -82 -28 211 -121 -100 4 43 132 -266 159 69 -378 173 164 116 80 105 -48 -107 -145 8 34
7287 34 147 47 -125 -49 -24 -319 131 -93 -297 -109 39 151 -48 156 -25 -62 2 -29 -173 -32 -283 -70
7309 -70 11 86 -32 83 84 19 46 -157 -186 28 108 63 -299 -65 -135 53 -73 15 103 -38 171 77 50 -39 41 17
7335 17 -163 97 17 -99 50 -55 221 -138 212 255 -14 3 -88 171 -136 91 -25 -17 -17 -266 -47 49 -46 83
7359H3r1N7J09j59L3m7j02O2J91n7j0r0j11J22j27P3J33N6k70J25K73k22K8j2
7383D7j75K5QN9j00K73k35J50L0l39R0O7K54j5m07M26j15m5j89J88O4n2J24l11
7407a78K22j5l9j32P2j13K30M0j29J1k48N42k51q5K02j46oQ0j73J66M8L3j1o9
7431E1n0J43j80l28L15L40l25j53K40l02M04m03M11q6j11p2K0J85j13J19k55J03
7453d7J7L3J30j71o8N9J82j62j20L23j93J33m2n1j2j17J04K3MK5K1q2j30P7J36
7478G2j45K84j33j03O5Mj25p6L17L1p1kl24J08n8J47L1j03M06n17L07J15J26l39
7502A7kk90j00q2J97L44O0J02k71K41m46K02k35M61l08K74J91l97n0K65l20K55
7524A08k84R32m31p30P78o15R7P4L13k08K48k66j00k06K44p5L67j62k4K30j46
$$ plain form
7359 83 -8 49 158 -1 32 -15 -117 -55 136 79 69 -21 -132 -10 -137 -64 69 125 -145 -20 253 31 59 47
7383 47 -128 -103 -95 -36 -136 137 -98 52 82 -257 -167 -100 154 139 -268 158 43 -2 -191 -3 61 9 133 -178
7407 -178 44 29 -10 -142 -70 -183 47 87 -42 -31 -279 263 12 -73 129 -17 -23 57 -116 50 98 131 120 51
7431 51 1 144 -36 -364 -49 291 -34 -187 53 -249 155 -248 163 77 -34 -106 -86 99 -14 105 -150 -47
7453 -47 -30 3 133 -38 -106 -47 135 -27 -147 176 -17 116 74 23 11 -106 -2 21 25 50 71 -11 -141 -64 72
7478 72 -73 211 78 -25 40 44 -81 -157 160 191 120 118 -206 -98 -156 -9 22 -81 325 -192 115 230 356 17
7502 17 15 -275 -375 -457 -260 84 144 246 -25 216 -230 -28 -263 198 -110 164 355 -42 -92 173 -147 108
7524 108 -176 756 325 -405 373 -242 -145 -71 242 34 282 16 -84 -290 -46 -121 246 84 60 290 144
7545A44j08m07L11L7o6L39k58J36j2k20K43k18j05K71k10M83m10k3K7K40m22L42
7567A14n4o1Lk11L98k23K16j69L7P1r8R5n9k6k40J77L5O6n8k84K65j43J63q8J38
7592F4j69O4P5J48k23p9J44r6J04j97K59k01O7Rrl6N4k05K10Q3j04k86P2J94m0
7617i8L04j75M6pKj82J28r1m5J15k27O7m4L04n1j09j1M34m81K3K94k82N9o3P0
7642b0J50j59nM4n6J33j2k5j2q5J71p9j21j4m2L11k78J64j78q0J04l7K69j83o0
7667a00J28K8k9j36J49P7j20r0j74L58n7j65R1J74q6n7J56k29N9j09J15M5O8j03
7691gL1lj34R4J21l1j49j27K01Jm8k57M09QP2l98O2N09l25j04K95L4j43k91J94
7716A4j23J96L5k73J46J8O4k73K55J5L3k84L40l45L32r3j35L22j03M9o3N6k88
$$ plain form
7545 144 36 -371 -60 -23 -89 250 -8 128 116 -104 139 -79 -184 87 -123 360 -50 -73 -46 194 -228 114
7567 114 60 -1 2 -209 189 -34 182 13 50 121 23 118 59 33 -207 -30 5 71 13 -271 -6 -149 14 -74 64
7592 64 -105 -41 34 182 -41 -120 24 -72 32 -165 94 -107 -40 -31 -40 -76 -22 -227 -17 66 -38 -324 -252 -58 -98
7617 -98 206 31 77 70 72 -110 18 -73 -118 -3 -230 -163 -207 97 46 -63 -74 360 -121 -98 196 -86 -27 -90 -20
7642 -20 130 -29 -34 10 -46 87 75 50 38 -47 124 45 -76 -90 -132 179 -99 65 -113 -193 -89 -126 143 -40 -100
7667 -100 28 56 27 -109 40 117 -3 -93 -267 91 34 -131 -40 134 48 -9 147 -82 -23 -132 -17 28 96 -7
7691 -7 24 21 -113 -19 102 71 -78 -205 -4 -3 -51 -308 101 109 181 -217 -155 354 29 -75 220 254 111 -180 14
7716 14 -109 87 122 -151 -5 13 77 -196 59 74 107 -177 163 -182 150 57 -78 244 141 190 127 183 -105
7739a05K43j45k64K42m3j83L35p7k33K78R6j55J82l65n0J70J16n9q4j16L54j5
7761A22j20j62J61qJ83j63k27J52j53L52Q7l41R8L3o1k6M3K01l96J2J39J20o4
7784a8j69J53P9j02J85M7j07k3l48K63omM2j08J07j07j05K25k19K29j61J54J23
7807A30j82q9K47o2J78m84K21q5J35o6j43K39O2k05p8K45n5P4k43K01j19L4J08
7830F3M0J5l9l15L37j57J88j12n8n9J82j70L2n1R6j6j24K63j68q7J05K22n0j28
7854In4j71L39J2k94L06l2l54J1L17j54q8o7Q3J77pJ04k23n6K38K2j52o1k0Q1
7879c4R3k15J09L07j5m63J96O7n8mj24J44j31N7N7k2K62k10J47l27L64j85k95
7902b80M41l48K74l18L45l6J03k37J25p0J13J6k34J51m4J99k5k37M5N0j96J97
$$ plain form
7739 -105 138 -7 -271 -29 -72 -255 80 3 -230 48 144 -11 171 -194 -244 -74 42 -17 -101 -217 137 122
7761 122 2 -160 1 -7 176 13 -214 -62 -215 137 224 -117 -19 14 -47 -73 -30 171 -225 -213 -74 46 -18
7784 -18 -187 -34 45 -57 128 175 68 45 -303 -40 -46 -50 -8 -116 -9 -116 -221 4 -215 14 -147 7 130
7807 130 -52 -141 106 44 222 -262 -41 -126 9 -57 -200 39 101 -104 -182 63 8 82 -161 40 -79 -45 63
7830 63 103 118 79 -236 101 -56 132 20 -38 -97 85 -85 -53 -104 -8 -24 -148 115 -53 -140 -35 187 137 9
7854 9 -45 -216 123 135 -159 147 115 -239 -228 89 -65 -153 -220 -137 40 33 137 -86 -142 96 118 -34 -95 -115 -34
7879 -34 59 -156 -47 260 245 -218 -22 45 -13 -17 -141 3 -128 -71 -14 -36 226 16 163 -164 200 15 -280
7902 -280 161 -187 87 -231 114 78 181 -56 69 -1 112 128 -106 45 1 200 175 -62 -17 33 -163 34
7924C4r2L8K9n8J29j85P1R4n6p5p3J64k1Q8L5j85K18j95J20q8q8K2j25K15j25
7949a09K79j10k09L6J58o1j74K71k86J87K8L6j16J68RmL6k47J0N7K60j93K5Pj68
7974a10K16r5k70J21j25L42k22K24q0p0R9j56l9r0L01lJ3J97l28J42j20k0K2K79
7998B28j32j24RJ06k07J44O9k78M43k62j58L44j91qo1J40J32l26N1J47j8q7R6
8021E7r3K1r2l7jJ12M3l6j18L01j39j14J71k08M3Q1N4R3l51K22j03J70j12J68
8045A32k29M4M0j98J7J6J74J52l16M05l09J87J16l58N18m78L4K30J6m40L70k74
8067a51L04j55No1M5k42L40k23J93j43N9J9pq9n4J76q7J73k89L20J31m50L48k8
8091A34K1l45L55j31Kj64K54M1l47K18N4k01n6K96Qj39r6J69k8L8j34K61k80j2
$$ plain form
7924 34 -58 -20 9 -49 80 -105 -34 60 4 -71 -144 20 -1 87 122 -63 155 -40 80 -8 -96 -74 -199 16 -109
7949 -109 170 60 -149 -113 45 -16 -190 81 -205 -18 10 46 -70 98 107 103 139 -108 -98 -41 219 26 51 58 -110
7974 -110 106 11 -259 -138 -263 79 -143 81 1 -69 30 -126 -165 -255 46 43 56 253 -75 67 -53 -73 -51 228
7998 228 96 -28 -19 87 -120 24 93 -185 258 -4 -162 182 -9 -17 -78 62 194 -132 -81 66 48 -39 57
8021 57 -36 -15 -107 -144 -145 -33 10 -26 -144 157 18 -96 75 -133 -90 -9 45 138 -213 9 -94 76 -36 132
8045 132 -97 -53 -13 -211 -194 -178 -4 148 -168 237 -72 115 231 -127 391 -87 -53 177 193 -247 123 -151
8067 -151 153 -2 3 -58 -13 -255 85 -138 55 -88 -29 -10 -17 -106 -160 16 -71 102 -187 133 264 -186 162 134
8091 134 155 -190 165 34 36 -128 126 167 -180 38 92 -109 -165 131 139 0 -96 73 45 83 -51 210 -70 -82
8115h2J7r4J15J9p3M5KK9J1j82L50o6N8k97J03Pj1r4K3J16j45J04jJ25j0Q1l10
8142a60K17l9J80l11J11O1k70K55j65J76j79m1K31J25l51R3j27J80j6o5NL45j79
8165G6j69M16l51o9K48M2k30j80K10j83Q4M8K2J48r8k2r0KK58j92J65O1k72R2
8189A6M7n5
$$ plain form
8115 -82 -65 -159 -44 -25 -98 -53 -51 -22 -11 -193 157 91 149 -148 -45 -38 -49 -143 -120 -4 -149 -45 -46 79 69 150 -160
8142 -160 57 18 198 -113 -2 59 -211 44 -121 55 -124 -165 66 191 -160 -67 -194 -14 -30 -95 -90 255 76
8165 76 -93 323 -28 -97 151 193 -37 -217 -7 -190 -106 -58 -36 112 14 -8 -98 -96 162 -30 135 196 -76 16
8189 16 63 8
8191H
$$ Imaginary data points
##PAGE= N=2
##DATA TABLE= (X++(I..I)), XYDATA
0@%%%%%%%%qJ6j6J6j6K4l2M0m8N6p2Q8j05J29j58J84k16K55k98L46m00M62n30
31b83O07o92P84q88J004j132J272j425J593j777J978k195K435k698K984l296L636
48A907m010M419m868N361n906O509p182P937q785R750j0859J2150j3671J5497
62H249j7739K0563k4254K9320l6757M8918p3472K11909l26299J62189M61735n77708
74a13346J5368L26276k17688j38239J74625q9959L0326o3503o0583J78827m1188
85I16k56123K63744J39811m17246J68181L41517l90171n4102M09691j93566k31820
96b19168L27338l5325j80788J10980L3097l5017j648n2723Q2200O9848k26315
107a27521J09014K10988k84998j4404L18676j76957k06908L27659k3462k64653
$$ plain form
0 0 0 0 0 0 0 0 0 0 -8 8 -8 8 -8 16 -16 24 -24 32 -40 48 -57 72 -86 98 -118 137 -161 185 -215 247 -283
31 -283 324 -368 416 -472 532 -600 672 -753 840 -937 1041 -1154 1281 -1417 1567 -1729 1907
48 1907 -2103 2316 -2552 2809 -3097 3412 -3770 4167 -4618 5132 -5727 6423 -7248 8249
62 8249 -9490 11073 -13181 16139 -20618 28300 -45172 166737 -159562 2627 464362 -113346
74 -113346 -97978 228298 10610 -127629 46996 -42963 -12637 -76140 -136723 42104 916
85 916 -255207 8537 148348 -268898 -100717 240800 -149371 -203473 206218 12652 -219168
96 -219168 108170 72845 -107943 3037 36134 1117 -531 -53254 28946 98794 -127521
107 -127521 -18507 192481 -92517 -106921 211755 34798 -172110 155549 132087 -132566
117a32566J88963Q9503j90557L4570R1298q4165J9999m1907p323J05730j52175
128g8630l7596K03239j19103j79171K65150j4106k68541K10222J00709k33618
138a51445O3813J71582j48467j1107J17456n5372J5236J357j3736P5611l5734
149B9194q5251J44437K557j83163J52864O9754j98128O0121J47753j60119k9738
160d9719J53524q9700m3796P0166j2534k2501J0528j7184K9072J2733r0235P7112
172B7466L9980j27919M1408J01489j19481l5635J45727q9310o7197J08340k3599
183A269o7589N0828J2964m3540L3331k1914J0051L1194n3970K0008N5531n3302
195b5139k7891J03351m8934n7415R7693j4817o6185N4772L1173p0659L4785K1925
$$ plain form
117 -132566 56397 145900 -44657 -10087 81211 -2954 17045 -24862 -32185 73545 -78630
128 -78630 -116226 87013 -32090 -211261 53889 39783 -228758 -18536 82173 -151445
138 -151445 -87632 83950 -64517 -75624 41832 -13540 1696 3053 -10683 64928 29194
149 29194 -56057 88380 90937 -92226 60638 130392 -67736 -7615 140138 -19981 -49719
160 -49719 103805 14105 -29691 40475 27941 5440 15968 -1216 27856 40589 -49646 27466
172 27466 67446 -60473 -19065 82424 -37057 -72692 73035 -16275 -83472 24868 1269
183 1269 -66320 -15492 -2528 -46068 -12737 -34651 -24600 6594 -47376 -27368 28163 -25139
195 -25139 -53030 50321 1387 -56028 41665 26848 -39337 15435 46608 -24051 10734 32659
207C2659m1046K5289o847j0161K1141j0849l0759N1975j6172n1372O6542r073
219B1327n3533L9094K8756o3748K3306L8978n5055J7419K0213k4213l17K2358
231A4585k7375R310K1567m3211K9620J1016l7791J8239K6473m2451O518M2233
243B8733m9440J3847K5509k8445p44K5321k0389p387L3814l3395N962K1183k1500
256f931k039K3002j4036j6304L6761k6402m355K6872k0533m646K1638j2791j6497
269a6261L7318k5684q515L1478k0281r332K0074p25k4854K6466n241j7025J8215
282E633n992n426N438M113j8724K1360o451j9173K9533j1334j5684J7875Q764
295I932l0718K1451J1579k7779J8066L876p701q33J2712j0663N027O929j6517
$$ plain form
207 32659 -8387 16902 10055 -106 21035 10186 -20573 31402 15230 -36142 30400 21327
219 21327 -32206 6888 35644 -28104 -4798 34180 -20875 -3456 16757 -7456 -7773 14585
231 14585 -12790 -3480 18087 -25124 4496 15512 -22279 -4040 22433 -20018 -13500 28733
243 28733 -20707 -6860 18649 -9796 -10540 14781 -5608 -12995 20819 -12576 -6614 14569 -6931
256 -6931 -8970 14032 -4 -16308 20453 -5949 -10304 16568 -3965 -8611 13027 236 -16261
269 -16261 21057 -4627 -13142 18336 -1945 -11277 8797 8072 -16782 9684 4443 -12582 5633
282 5633 -359 -5785 -347 3766 -14958 6402 -49 -19222 10311 -1023 -16707 1168 9932
295 9932 -20786 665 12244 -15535 2531 6407 -1294 -2127 10585 -78 4949 11878 -4639
308d639J9562n769j0862J0620Q966k4402Q822K0252l3458J1526J1853j5396n879
321h804J4985p886r737J4868j2562O835k507l960O426J617q425K041J6994k4174
335a4289Q044J4397j4818l202J4230l002j8062K1444o851o007N835m60m3k079
349d863N010m468J1564j0535M496J0839j0395L711P375K778j3722J6398j372j1180
363E636R808j482l543n243O976j1406K758l450n601N804j2378K194o37O28r296
378a9232Q174K408j1830J1110Q8N6k132J1517m094j869Q803m197N990m642O000
393F150k106kj550N74M614j1711R025j873l904j317O823l151n846J2417p870L749
409D022j073M795p5l028N672l315L990p499O465k329n437O51o39j795j0763J0657
$$ plain form
308 -4639 14923 9154 -1708 8912 17878 -6524 2298 22550 -10908 618 12471 -2925 -8804
321 -8804 6181 -1705 -11442 3426 -9136 -2301 -4808 -8768 -2342 -725 -9150 -7109 9885 -14289
335 -14289 -6245 8152 -6666 -9868 4362 1360 -16702 4742 -2109 -8116 -2281 -2741 -2784 -4863
349 -4863 147 -4321 7243 -3292 1204 12043 1648 5359 12734 15512 1790 18188 16816 5636
363 5636 15444 13962 10419 5176 12152 746 3504 54 -5547 257 -12121 -9927 -10564 -9936 -19232
378 -19232 -11058 -8650 -20480 -9370 -9282 -9226 -11358 159 -3935 -5804 2999 -1198 4792 150 6150
393 6150 4044 4042 2492 3066 7680 -4031 4994 3121 -783 -2100 4723 1572 -4274 8143 273 4022
409 4022 2949 7744 7669 4641 10313 6998 10988 3489 9954 7625 2188 2839 2200 405 -10358 299
425B99q553m615K934j266k436l381Q607o582M700j486N238K433l426R176M19K893
441D954m147J1970l245l926Q927k475j008n079R181q713j991K771l148j757n795
456c481O627n529k49k762N872k880p317J2924n036j221K55P977o506k644R447
471E477m520j600k144Q178r296n22M088k942j176o173J0414o997l351M466M138
486a960n792l089J4623q308m36N537N811p527N35J1019o696l9M65P829r404k086
502D82Q777n363l664j393R845j1794k094Q256k485p074K61J1986j3224J638N998
517A52K104o165M19J1837j0042j066N606M991j0067J241J0516p953l739K328Q852
532I014j3661Q92J0224o804o389M228J0318j6593L213Q983l719p990N370J0596
$$ plain form
425 299 -8254 -12869 -9935 -11201 -13637 -17018 -8411 -14993 -10293 -11779 -6541 -4108 -7534 1642 2061 4954
441 4954 807 12777 9532 5606 14533 12058 11050 5971 15152 6439 4448 7219 4071 2314 -3481
456 -3481 3146 -2383 -2632 -5394 478 -2402 -9719 3205 -1831 -3052 -2797 5180 -1326 -3970 5477
471 5477 957 -643 -2787 5391 -3905 -4427 -339 -3281 -4457 -10630 -216 -7213 -10564 -6098 -1960
486 -1960 -7752 -10841 3782 -4526 -4962 575 6386 -1141 -606 10413 3717 3678 4143 11972 2568 482
502 482 9259 3896 232 -1161 8684 -3110 -5204 3052 567 -6507 -6246 5740 -7484 -5846 152
517 152 2256 -3909 -3490 8347 -1695 -2761 2845 7836 -2231 -990 9526 1573 -2166 162 9014
532 9014 -4647 -3755 6469 -335 -6724 -2496 7822 -8771 -5558 3425 -294 -8284 -2914 7682
546G682j4713K015P460L63j1190O021J0167j3042l58O219M529j4331N008J2092
560G922j2069l910R901M295j6377R338P581q221l422P006O721j4741O818P238
574H080l981p338O475Q534j4138K303Q872j077j4958J1623P668j7349M906P780
588G400l495j1707J1091K446r508M97M835K886j3257P619N773o473n754R108M666
603F127j7691J0064P513q665o076J3546j329j3072J1790J128l495m678P295J983
617D440p865J907N096J492j3170J0620M197j1346R50R928l626j3300J5648j656
631C315r511L856O156n012n409Q548l467J292n394N849L015j0182M726O363m044
646A01q810J5103l137j0591J0243K585o095k410J1173p412j289M432j145J281
$$ plain form
546 7682 -7031 -5016 2444 2807 -8383 -2362 7805 -5237 -5595 624 5153 -9178 -4170 7922
560 7922 -4147 -8057 1844 6139 -10238 -900 6681 -1540 -4962 2044 8765 -5976 842 8080
574 8080 4099 -3239 3236 11770 -2368 -65 8807 7730 -7228 4395 12063 -5286 -380 7400
588 7400 3905 -7802 3289 5735 -3773 -3276 1559 4445 -8812 -1193 4580 -1893 -7647 1461 6127
603 6127 -11564 -1500 6013 -2652 -8728 4818 3489 -9583 2207 3335 -160 -4838 2457 4440
617 4440 -3425 -1518 3578 5070 -8100 2520 6717 -4629 -3679 6249 2623 -10677 4971 3315
631 3315 -6196 -2340 3816 -1196 -6605 1943 -1524 -232 -5626 223 3238 -6944 -2218 4145 101
646 101 -8709 6394 3257 -7334 2909 5494 -601 -3011 8162 750 -539 3893 2748 4029
660D029m626M048N50j183n838Q791n65j1902J1431k39p942Q33R310r849j684Q761
676C925p448J444m46J845k412J225j868R26L469q490Q115Q4n104J124O930n613
692b294l722J2023q728L42M752j012k962M014M81m595P511o364K715K656l622
707A195L13L126j108n882R549o095j642M933k829k983K232K491q206P556l278
722f28l850M793k292j905P42L691q111N950n34m546N086j511j010J66L745n883
738f097N644M94n177O840j700j199N28N846o709K350N431o370L105O42R38l263
754A303M274k674%K943n415N242k067j886k24L861n318j353P025q181J283J571
770C84p2m694K841J473n235M112l779K449j780m10R35L25j270k596P046o649J000
$$ plain form
660 4029 -597 3451 4001 2818 -3020 5771 5206 -6696 4735 4496 -3446 -2613 6697 -3152 -4836 3925
676 3925 -3523 -2079 -2525 -680 -3092 -1867 -3735 -2809 660 -7830 285 369 -4735 -3611 3319 -2294
692 -2294 -6016 6007 -2721 -2379 2373 1361 -1601 2413 2894 -1701 5810 -554 2161 4817 1195
707 1195 1508 4634 3526 -2356 7193 1098 -544 4389 1560 -1423 809 3300 -4906 2650 -628
722 -628 -4478 315 -1977 -3882 -3140 551 -7560 -1610 -2144 -6690 -1604 -3115 -4125 -3959 -214 -6097
738 -6097 -453 41 -5136 1704 4 -1195 -667 5179 -1530 820 6251 -119 2986 3628 4566 1303
754 1303 5577 2903 2903 5846 431 5673 3606 1720 1496 5357 39 -1314 5711 -2470 -1187 384
770 384 312 -4382 -1541 -68 -5303 -1191 -4970 -2521 -4301 -4711 -3776 -3451 -4721 -7317 -271 -6920 -5920
787e920L312q54k077J284M841o296M745K54M45o31J782K365k137L522k488N334
803G481l161k88N031k958k17P56L418o673L611N45l050j80j080J999o040L523
819B717k463q24p18j982K110l238Q24j611L549n346J611L543n608L329m10R09
835c608l296L386n57j499K248j538L257l372L517j220J297L54o63M690l960L083
851B119N09J551k333L654J538m410N708k573J640r36J108n71k009J763l002K194
867E950m073J233j669j136q07j980K410n627L357j968p91o41J027L53k680M015
883c027l604K463r00R32J124j448K106j660L168k753K744J0o93K003j503K801
899A763k870L680j666R16P71p82J910j947L139k922K771r11j46R20j633J752k701
$$ plain form
787 -5920 -2608 -3462 -5539 -4255 586 -5710 -965 -711 -266 -897 885 3250 1113 4635 2147 7481
803 7481 4320 4032 9063 6105 5888 6644 10062 3389 7000 7545 4495 4315 3235 5234 -806 2717
819 2717 254 -570 -1288 -3270 -1160 -4398 -3574 -5185 -1636 -6982 -5371 -1828 -7436 -4107 -4517 -3608
835 -3608 -6904 -3518 -4075 -5574 -3326 -4864 -1607 -4979 -1462 -2682 -1385 -1031 -1694 2996 -964 2119
851 2119 2628 4179 1846 5500 7038 2628 8336 5763 7403 6467 7575 7004 4995 6758 3756 5950
867 5950 1877 3110 1441 305 -502 -2482 -72 -5699 -2342 -4310 -5101 -5742 -4715 -4362 -7042 -3027
883 -3027 -6631 -4168 -5068 -4136 -3012 -4460 -2354 -4014 -846 -3599 -855 -845 -1538 465 -1038 1763
899 1763 -1107 2573 907 1823 2594 1812 3722 1775 4914 1992 4763 3852 3706 4626 2993 4745 2044
916B044K474l223R63m53j671Q87k857K112l809K412j865o18R51k262J703j659
932d871J998k728K733j103r57K839j880K207j440L157k421J587J012j392K800
947A541k132K587j576K411k440J803J424l494L972j907K30j194K913k304p35L487
963D586m102K281j430R27j472J024o82j202K453m275L423j324p30o76J991j063
979b71l075N785m501M40J205k5k097J411J358l770M395l753J651P33j261K73P21
996g81O36l906N605k996p46K742m53j309J99L768n657M627o81k082K526n78l84
1013E30j34K994n347M636l49l766M273j559p17J57K789m822K468J478l625K720
1029A726r25M44k333L785l271J57L170m892K569J62j084j288M016m133k8M073
$$ plain form
916 2044 4518 1295 2258 1805 134 1021 -1836 276 -3533 -1121 -2986 -3604 -2653 -4915 -3212 -4871
932 -4871 -2873 -5601 -2868 -3971 -4928 -2089 -3969 -1762 -3202 -45 -2466 -879 133 -1259 1541
947 1541 -591 1996 420 2831 391 2194 3618 124 4096 2189 2419 1225 4138 1834 1099 4586
963 4586 484 2765 1335 2262 790 1814 1132 -70 2383 -1892 1531 207 -523 -1199 792 -271
979 -271 -3346 2439 -2062 -1622 -417 -442 -2539 -1128 230 -3540 855 -2898 -1247 -514 -1775 -1502 -781
996 -781 -145 -4051 1554 -1442 -2188 554 101 -1208 -1009 2759 -2898 1729 1048 -1034 1492 914 530
1013 530 396 3390 -1957 2679 2330 -1436 2837 1278 561 718 3507 -1315 1153 2631 -994 1726
1029 1726 801 1245 -1088 2697 -574 -417 2753 -2139 430 592 -492 -1780 2236 -1897 -1925 2148
1045B148n570L101l10k46j455K445j466j629M237l414J586n18J205j912J786R17
1061I05l418M910l042M37J014K38j735K541L10l933N386k915l8J329M9j593K09
1078F54K293m488L497j537q82M76p95k22j081K266m192L419j201j712K421m17
1094a501n40o48L868m137K901J169j813J602m28J636k300L128k167J140O54j919
1110F45J933j912P81j515K332l046N76K015l548K172r17J035j943K777p84r38
1126c37J988j837K339k434K117j162M19o40q86K054l754J950r16o29j337J261
1142a804J16l464L811k162O82p3J485k26N2K353j515L738k638K512P59j032O00
1159C194N49O43l516M023k656j432L40m42o01k654K767l463J217r45m3Q12j237
$$ plain form
1045 2148 -3422 -321 -631 -877 -2332 113 -1353 -2982 1255 -2159 -573 -1091 114 -1798 -12 905
1061 905 -2513 2397 -645 -208 806 1044 -691 1850 2160 -1773 3613 698 660 1989 2038 445 654
1078 654 2947 -1541 1956 419 -463 13 -782 -1004 -2085 181 -4011 -592 -1793 -3505 -1084 -1501
1094 -1501 -2041 -2689 1179 -2958 -57 1112 -701 901 473 2109 -191 2937 770 1910 2564 645
1110 645 2578 666 1447 -68 2264 -782 -206 1809 -1739 433 -484 551 -1392 1385 601 -337
1126 -337 1651 -186 2153 -281 1836 674 1093 453 -433 1621 -2133 -183 -1099 -1728 -3065 -1804
1142 -1804 -1688 -5152 -1341 -3503 -2821 -2894 -1409 -1635 -1583 770 -745 2993 355 2867 3626 2594 3194
1159 3194 3743 4386 870 4893 2237 805 1145 703 102 -2552 215 -3248 -2031 -2976 -3019 -2207 -3444
1176c444J766o16K103k677L759J33k127L283l82J35j497L488k819K8J116j618
1192F31N82j969J344j653N58j822J080O99l181L285m32j72p59L645j710n73M106
1209C659k520J617o42J659j923J083m21r51J650m343K179j051j691o36J457j520
1225b394l161M760l102k53J262J275j952R55L101k811L265j533J615K82q17Q49
1241A341J050%l241M513k658k119K655m95k434L25L114m862K341Q10j433R81M8
1258f4P92p82K175k853L641k10k988L695p26j410k58L320n034J163J912l315P21
1275b21k67M98k441K190k041J42J913l468L206n77j176j21L102k307j85M020l452
1292a185N39J145N36k444K220o58j576K792l003J686j68o76o42K176j593j901
$$ plain form
1176 -3444 -1678 -2294 -191 -2868 891 1024 -1103 2180 1798 1933 436 3924 1105 1133 2249 631
1192 631 1213 -756 588 -1065 -507 -2329 -1249 -550 -3731 -446 -878 -1050 -1809 1836 126 -447 3659
1209 3659 1139 2756 2114 3773 1850 2933 2512 1561 3211 -1132 1047 -4 -1695 -2331 -874 -2394
1225 -2394 -5555 -795 -3897 -4150 -2888 -1613 -3565 -2610 491 -2320 945 -588 1027 1309 492 1341
1241 1341 2391 2391 -850 3663 1005 -1114 1541 1046 -1388 -1063 2051 -2811 -470 340 -1093 -112 -64
1258 -64 728 -54 2121 -732 2909 2699 -289 3406 2680 1270 1012 4332 -702 461 2373 -942 -221
1275 -221 -488 10 -2431 -241 -2282 -2140 -227 -3695 -489 -1066 -2242 -2363 739 -1568 -1753 2267 -1185
1292 -1185 -646 499 1035 -1409 811 153 -1423 1369 -1634 52 -116 -792 -1434 742 -851 -2752
1308b752N082l439j84K366n6k141J850J885l949L718j286k01O47l2m02M99M46
1325B051k958M165k439p27K162j069j461J74K632m595K580L23k070Q29Lk09j216
1342a825K059k937K141o29j686K258j006j12o00K885l319J694K002k480J822m9
1358B18N97j274K590j388J84J388j989J745p20N75j250J814j706o50K219l321
1374i68J552l14J19j455J314l66j417K206k171J431r90P92r20N09L33j445K208
1391D18k287J132J20q6p08K28J302k364K439j816J094n8J61K10l50J599j353J914
1409A595j058Q00L31m43P84j091J795j780J438p38j54M04j245J471k432J532j575
1426c66L87j68p37L77j355J190j728Q84p79P15m67m06J446j546J702j117R97j47
$$ plain form
1308 -2752 2330 -1109 -1293 1073 1017 -1124 726 2611 -1338 2380 1094 893 1540 1508 1106 1605 2051
1325 2051 -907 3258 819 92 2254 1185 -276 -102 2530 -2065 515 838 -1232 -403 -400 -609 -1825
1342 -1825 234 -2703 -562 -1191 -2877 -619 -1625 -1737 -2337 548 -2771 -1077 925 -1555 267 218
1358 218 815 -459 2131 743 927 2315 326 2071 1351 1926 676 2490 784 134 2353 -968
1374 -968 584 270 389 -1066 248 -118 -1535 671 -1500 -69 -1059 -267 -1187 -678 -345 -1790 418
1391 418 -1869 -737 -617 -703 -1411 -1183 119 -2245 194 -1622 -528 -586 -425 -215 -565 1034 -319 1595
1409 1595 537 1337 1668 1225 2009 918 2713 933 2371 1633 1479 1883 638 2109 -323 1209 -366
1426 -366 21 -147 -884 -507 -1862 -672 -2400 -1516 -2295 -1580 -2047 -2453 -1007 -2553 -851 -1968 -971 -1118
1444a118L12M39m23J533j573K463j077M74O72k63K71o85J816k355J615m28o97
1461I76O06q39M43j535J495j991R38k73q99Q53r27K80j354K588k397O33J458j956
1479a901J317k78O55j356K132j366qJ584k052J749p99O27j167J275q60n21K560
1496A591k222J040N70N81j381K203k3j359K814j760O50J98o0j061J315p39k222
1513A35K961l290k47M62q06k281M82Q12l490K604j015q23O70N70o85N33J731k323
1531d000L657p99o80K669k11p93J279K113l721K739M36k074J137K21m27j337K142
1548B351k537J259N30j865J874m9j012K66L003l492J230K352l411J281R09m52
1564B237k161K448k183r29J636k927R40r83l09j439J959k409q36L549l488O84
$$ plain form
1444 -1118 -806 -367 -790 743 -830 1633 556 1030 1702 1439 1710 1025 2841 486 2101 1673 976
1461 976 1582 743 1186 -349 1146 -845 93 -180 -1079 -226 -1153 -873 -2227 361 -2036 -1403 55 -1901
1479 -1901 -584 -862 -207 -1563 569 -797 -805 779 -1273 476 -323 304 -863 412 -448 -969 1591
1496 1591 -631 409 979 1560 179 2382 2359 1000 3814 2054 2704 2902 2842 1781 3096 2357 135
1513 135 3096 -194 -441 21 -785 -3066 -2584 -1772 -5262 -2658 -3673 -4496 -3826 -3256 -3941 -3408 -1677 -4000
1531 -4000 -343 -1142 -1822 847 636 -157 1122 3235 -486 2253 2689 615 1752 1973 1546 209 2351
1548 2351 -186 1073 1603 -262 1612 1563 551 817 3820 328 1558 3910 499 1780 2689 2237
1564 2237 76 2524 341 -588 1048 -1879 -939 -1922 -2231 -3670 -1711 -4120 -4956 -1407 -4895 -4211
1580d211K122k62k112L976L3k273M030j140J049L23O76o25J291r0j814L372k858
1597A487r9J488q97k250J957P64m358L568q26j603J073O42r91j99J682k261K621
1614A798j752n90K086j311j223Q60J584m339K675J75k618P08R79j144j403K761
1630g54k089P44P07q95J523l34l07N48K417k444J633J957k888J883J426p56j607
1647G64L068j880p23J993j947P88o64M10j011Q93j229k14J675k765J303M18r51
1664g2j406K210r26k214K931j869J74k58P87j415N56K29j618K268k113P88K85
1681a663j10n77J246J17j834L013j166l53Q68N68k61j86J726j897J913l26l43
1698G35P47k10L2m13J432k111J974l32j057J272k70m34n62J581k069Q47J07j226
$$ plain form
1580 -4211 -2089 -2351 -4463 -487 -454 -2727 1303 163 1212 1535 2211 1586 2877 2787 973 4345 1487
1597 1487 1388 2876 1979 -271 1686 2450 -1908 1660 834 -769 304 946 -45 -244 1438 -823 1798
1614 1798 46 -544 1542 231 -992 -132 1452 -2887 -212 -37 -2655 -1947 -968 -2112 -3515 -754
1630 -754 -2843 -2099 -1392 -2287 -764 -1098 -1405 -857 1560 -884 749 2706 -182 1701 3127 2371 764
1647 764 3832 1952 1229 3222 1275 2063 1399 1809 798 1691 462 248 1923 -842 461 879 -72
1664 -72 -1478 732 -194 -2408 523 -1346 -1172 -1430 -643 -2058 -1502 -1273 -2891 -623 -2736 -1948 -1663
1681 -1663 -1773 -2350 -1104 -987 -2821 192 -974 -1327 -459 109 -152 -338 1388 -509 1404 1078 735
1698 735 1482 1272 1304 891 2323 212 2186 1854 797 2069 1799 1365 803 2384 315 1162 1269 43
1716D3O76p56L79r70R43j819M88O22j642J197r95N43r45J482r22r3J201j572J613
1735e27n01O39j032J847o94m70J861j419O48k62J163j415R43m3j104J691j493
1752a68R90n24K97l60M68J25j551K450j674J53L14L82p89J05J313k217J298o42
1770c0O2l97n4J60l98N91j766K323j286r91J434j46o34J22K226k519J202N71n52
1789h2j36N88J057j524J645j155R11l6j147J658n43r17k42K412l196R48J596k171
1807c34P7L16P67k539J928m85n64O54r31J208j346M62k47J263j611q2K699k784
1825a549L60J322L12k272K150N92k424K459r88L15p44J163k79q7J11r34K373k377
1843d97J76J535l62j900J583J308l469K335L91j232k17J172n01j117J457r06J024
$$ plain form
1716 43 719 -37 342 -628 315 -1504 -1016 -394 -2036 -839 -1834 -1291 -2236 -754 -1676 -1769 -568 -2140 -527
1735 -527 -1028 -389 -1421 426 -268 -738 1123 -296 352 90 1253 -162 781 738 -366 1325 -168
1752 -168 822 298 595 235 703 828 -723 1727 53 206 520 902 113 218 1531 -686 612 -30
1770 -30 32 -365 -419 -259 -657 -66 -1832 491 -795 -1786 -352 -498 -1132 -1010 1216 -1303 -101 470 -82
1789 -82 -218 370 1427 -97 1548 393 1304 1268 121 1779 1236 319 77 2489 -707 241 1837 -334
1807 -334 -257 59 826 -1713 215 -270 -834 -180 -1111 97 -1249 -787 -1034 229 -1382 -1464 1235 -1549
1825 -1549 -1189 133 445 -1827 323 915 -1509 950 -38 277 -467 696 417 330 441 -493 1880 -497
1843 -497 -321 1214 852 -1048 535 1843 -1626 709 1100 -132 -349 823 322 -795 662 -244 780
1860G80j266J57R51q03o76P42J442l499K176P43j914L92J351o74k018K962j480
1877f34m2O34q9N22q21P16l36J503j867J075J048k464J051P46m24j847K899j545
1895A25j466J834p23P3q84J530j472P48r07N32J170k029J555j28k67r58K008n7
1913F84k051K312p67m33j17J354j225k17J156j234J291j410J486m82m20M9L84
1930C60L74j943K671q60p81N31N54m49p52K122j668L46j21M35m92l44Q75r21P28
1949F65j382J470r64o12P67m68K80j035J844j627M61M95l47J39n24J204j264O80
1967b18k93Q39p26m31J322j143O74r00J392r50j06J159j056P07j043J187q71L60
1985i7N63m41J59p61J649j712R06o2L23l23l43J431j861J027k54O08q34K9N88
$$ plain form
1860 780 -486 -329 622 -181 -857 -115 1327 -2172 4 747 -1167 -775 576 -98 -2116 846 -634
1877 -634 -676 -42 -131 391 -430 286 -50 1453 -414 661 1709 -755 296 1042 618 -1229 1670 125
1895 125 -1341 493 -230 -157 -1041 489 -983 -235 -1142 -610 560 -1469 86 -42 -309 -1267 741 684
1913 684 -1367 945 178 -255 -372 982 -243 -460 696 -538 753 -657 829 347 -73 -24 360
1930 360 734 -1209 1462 602 -179 352 906 457 -295 1827 159 505 384 819 327 -17 858 -63 665
1949 665 -717 753 -211 -823 -56 -524 -244 -1279 565 -1062 -601 -106 -453 -314 -838 366 -898 -218
1967 -218 -511 328 -398 -829 493 -650 24 -876 516 -434 -540 619 -437 270 -773 414 -457 -97
1985 -97 466 25 184 -577 1072 -640 266 204 527 204 -139 1292 -569 458 204 812 -22 7 595
2004E95r70R91j011J234r58L43N56r51P02o88J175j601Q64J91n38N24r71J241
2022G28j124Q20o78N54l39l94J171j437O06j24O20j342Q09M43j412J265p23P48
2040A91p12N78k90k43P67j055J306j257R48m93L60l75J88J075j819J429m70J05
2058B33l19M64J1r58J084q10J074q69J59L80o07N59o69J365k032J439j04n17J85
2077F8N5M98j682J761j215N93j7k19O44j019J012j125R56p22M42O33r30N00m68
2096b35J119j405J091l22m57R28q21Q05r36J035j132O35k6m80Q95j181Q08p10
2114c89P42q74O04J29j044J379j040N75p29J047q23J17N96r57R48p21P26q24P91
2133B53l66k98N79r38J200p77J75j13M18k25p57J660j603R89j55K19k20J78K60
$$ plain form
2004 595 -375 616 -395 839 -119 224 780 -171 531 -157 1018 -583 281 472 -66 458 -513 728
2022 728 -396 424 -254 300 -39 -433 738 -699 -93 -217 403 -939 -130 313 -1099 166 -557 191
2040 191 -521 57 -233 -476 291 -764 542 -715 233 -260 100 -275 -87 988 -831 598 128 233
2058 233 -86 378 389 -569 515 -295 779 -90 69 449 -158 401 -268 1097 -935 504 400 -117 68
2077 68 123 621 -1061 700 -515 78 61 -158 486 -533 479 -646 310 -412 30 663 -267 233 -235
2096 -235 884 -521 570 248 -209 719 -102 703 -233 802 -330 305 279 -201 694 -487 321 -389
2114 -389 353 -521 83 212 -832 547 -493 82 -647 400 -423 -306 290 -667 281 -440 286 -538 253
2133 253 -113 -411 168 -770 430 -347 -172 -285 133 -92 -849 811 -792 197 42 261 41 219 479
2152D79r93J471r56O77r4k98J76l30N46r52J278j180M38J53m81M21n21R25j592
2171h33J572p23l72K25J69K66j317J576j050L75j39M30p7p11R07o41Q89j135P23
2190A34r8q17R28k90M43j487J783j011q6O66o61M30p49J016p30O30n6l37P16j004
2210e80R72o17M68o24Q02r5j071J350o04J81o14J167r52k25J111j149O72q07J117
2229E02r51M94K22l47P18j119J240j178M51k59Q26m34n59J678j329K07k07R65
2247I20r38J79P44j080Q73r82R02p77L5j4K65r2j105J842j482j32O84j38p76k0
2267a092J521j754Q14j70M30k44J67L83q10J017r73J023l05k60R89n28j55l15
2285b62J559j673J89J004p00j7k80J530k049J537l78m1J71k66P06p53J27k75J315
$$ plain form
2152 479 -514 957 1 678 584 286 462 132 678 -274 1004 -176 262 415 -66 355 -166 759 -833
2171 -833 739 16 -356 -131 38 304 -1013 563 -487 -112 -251 179 102 -609 298 -343 546 -589 134
2190 134 36 -781 147 -143 300 -1187 596 -415 -501 165 -496 -66 -815 201 -529 101 45 -292 424 -580
2210 -580 392 -225 243 -381 421 326 -745 605 1 182 -432 735 -217 -442 669 -480 192 -615 502
2229 502 -449 45 267 -80 638 -481 759 -419 32 -227 599 165 -394 1284 -45 162 -45 920
2247 920 -18 161 905 -175 698 -284 618 -159 -124 -138 127 35 -1070 772 -710 -842 -158 -296 -1072 -1092
2267 -1092 429 -1325 -511 -681 -251 -495 -328 55 -755 262 -711 312 7 -253 736 208 53 -262
2285 -262 1297 -376 -187 817 117 100 -180 1350 -699 838 460 419 590 324 1030 277 404 129 1444
2304A444j336L54Q15j389j9K35N58j928J369M3j088N02j51N32j327P77k61K30
2322f40j94k81J358j142P17J47K44n82N15J085j833J005K8K25j016J010k60p96
2340d10J043n79J104j421O18P4l94J35k94J068j605J235j90l06k29M33K75j334
2358g77J315q27L52o73L38rn23O36o08N88p88N14L29n81J39O9L24q05J237m94
2378b44l7N61P8J1p50J279o99N47j78m7L38n89P69n83N21r84P37j8q50R56o42
2399A76L47q07R87r26K77nn81N78o59P60n91P6m40L32M31j355J014m56J57l08
2419i93O90l37m27J304r01P11m72P05k84n8K07l94O99p58N64l90J93P7J47J51
2439D34p67J116p75L86j67J89K34j43L80p54J052q64K07m7k43M44m02K71r38J052
$$ plain form
2304 1444 108 462 1277 -112 -131 104 662 -1266 103 146 -942 -440 -591 -59 -1386 -609 -870 -640
2322 -640 -834 -1115 243 -899 -182 -35 209 -373 142 1227 -606 399 427 652 -364 646 386 -410
2340 -410 633 54 1158 -263 355 429 35 170 -124 944 -661 574 384 78 -151 282 557 -777
2358 -777 538 -289 63 -610 -272 -281 -804 -168 -776 -188 -976 -462 -133 -714 -575 -506 -182 -987 250 -244
2378 -244 -281 280 358 369 -381 898 199 746 568 521 859 270 1039 456 977 -7 730 712 -138 818 176
2399 176 523 -284 703 -223 54 49 -532 46 -613 147 -444 -368 -808 -476 -45 -1400 -386 -842 -685 -993
2419 -993 -303 -640 -1067 237 -664 47 -425 280 -4 -62 145 -249 450 -308 256 -134 59 136 283 434
2439 434 -333 783 8 394 227 416 650 507 887 133 1185 321 528 481 238 682 280 551 -387 665
2459F65q06J07K72n46M1l69O00r40N36j25k10M02n62R41j023J042p56M17L45k20
2479a89P32p77O71l61N05o69N39J33o90N32n56M86j030M86q2j61M82p64Q75l77
2499b15L02j96K88j09j44P63r50J002n03L31l72K76J95r38J145r05L2j77p5j33
2519c83j24L58p65R88q72N96pj54O9J60K96p38J234o82L08O39m77R6k89J174j457
2540c0O02n8l44M84p38L83n57N48q95Q85n50o13Q07k60L02k86P58j142N96K03
2560I5m03K52k09N97q91P03l64M41L13j034Q79p00L2K09J17m86K48O67j066R60
2580C60k98k0m37Q40l08k51O66j164J249o98M07j09J33o4m29Q32j081O26l48K10
2600A16j79L97K2j068J468j021J41J16j20J95p5K54r47J490j252K99N73o14j50
$$ plain form
2459 665 -141 -34 238 -308 -267 -636 -36 -976 -440 -565 -775 -373 -935 6 -1017 25 -731 -314 31 -189
2479 -189 543 -234 437 76 581 -88 451 584 -106 426 -130 356 -674 -188 -270 -431 51 -713 162 -215
2499 -215 87 -109 179 70 -74 689 -261 741 238 569 197 473 668 -270 875 -30 2 -175 -250 -383
2519 -383 -507 -149 -914 74 -798 -202 -209 -363 -294 -134 162 -576 658 -24 284 923 446 542 253 1427 -30
2540 -30 572 514 170 654 -84 299 -258 290 -605 280 -270 -883 -76 -336 -34 -320 438 -704 -108 95
2560 95 -308 -56 -265 332 -559 144 -220 221 534 -500 379 -321 -289 -80 37 -449 -201 466 -600 360
2580 360 62 42 -395 445 137 -114 552 -612 637 -61 346 237 370 306 -123 709 -372 254 -94 116
2600 116 -63 334 356 -712 756 -265 -124 -8 -128 67 -8 246 -701 789 -463 -164 409 -205 -355
2619c55L76M56j133J206m55l42N09k49J66m23P62j006R62o13k10J005r96K09N6
2638g5L60j339J017K23j111P57m1o8n86J085n63Q8O67q18Q63m90J69k05M31q73
2658e09N70O10j151O84l8k48o15J158p75n88J080n75M82l81L34k10L72j5j81Q90
2678H94j250Q92R7l72J58L54k20r88J628j134n2L48j6l68k8K76j060J287j074
2697f28P8Q25q39q9M63L74j280J657m78p92J171j83q30M54P87j460J001j3o19
2716d01O66m72Q1J8K03j183J247j52j229J712o32j94J22J034j400O38P05p66N64
2735E61l15K57m47O77p59K34N45j371J200r8r82M65P85j187K1J291j838P70M70
2754B79j45o64R96k96q74J386j012L58M89n73j33M92l25o08J886j623n9J088o58
$$ plain form
2619 -355 21 477 -656 550 95 -247 262 13 179 -244 518 -488 474 -139 -349 656 -340 -131 -75
2638 -75 285 -1054 -37 186 -925 -168 -209 -277 -863 222 -341 -253 414 -404 459 -31 138 -67 364 -509
2658 -509 61 671 -480 204 166 -82 -697 461 -314 -902 178 -397 85 -296 38 -172 200 185 4 894
2678 894 -356 536 633 261 419 773 553 -435 1193 59 7 355 339 -29 -57 219 -841 446 -628
2697 -628 -550 275 -564 -653 -190 184 -1096 561 83 -709 462 279 -551 -97 690 -770 231 218 -401
2716 -401 265 -207 -126 -108 95 -1088 159 7 -1222 490 -142 -336 -214 820 -580 58 763 -3 561
2735 561 246 503 56 733 -26 208 753 -618 582 484 -498 -33 752 -435 -414 877 -961 -191 279
2754 279 134 -530 466 170 -704 682 -330 28 517 -56 -189 303 -22 -630 1256 -367 -426 662 4
2773Dl79O95J18j393J698j027r4N09j72o1J78K38j332J723r75m66J081l70n02
2792e27K81P34j791J515r9j100J226l8k00k51R18j115Q49j57p23J194n96j03j30
$$ plain form
2773 4 -375 320 438 -955 743 -284 -378 131 -41 -102 76 314 -1018 705 -270 -736 345 -25 -527
2792 -527 -246 488 -1303 212 113 -987 239 201 1 -250 668 -447 402 245 -478 716 120 17 -113
$$ [...]
8191b37
##END NTUPLES=NMR FID
##END=
