##TITLE=1H_CA-8815-1
 CDCl3, 8 sc, 
 2.02.2021
##JCAMPDX= 6.0         $$ Bruker NMR JCAMP-DX V2.0
##DATA TYPE= NMR SPECTRUM
##DATA CLASS= NTUPLES
##ORIGIN= UXNMR, Bruker Analytische Messtechnik GmbH
##OWNER= root
$$ XWIN-NMR		Version 3.5
$$ Tue Feb  2 09:51:06 2021 Russian Standard Time (UT+4h)  she@DPX200
##.OBSERVE FREQUENCY= 200.1315066352
##.OBSERVE NUCLEUS= ^1H
##.ACQUISITION MODE= SIMULTANEOUS
##.ACQUISITION SCHEME= undefined
##.AVERAGES= 8
##.DIGITISER RES= 18
##SPECTROMETER/DATA SYSTEM= spect
##.PULSE SEQUENCE= zg30
##.SOLVENT NAME= CDCl3
##.SHIFT REFERENCE= (INTERNAL, CDCl3, 0, 15.9326)
##AUDIT TRAIL= $$ (NUMBER, WHEN, WHO, WHERE, WHAT)
$$ ##TITLE= Audit trail, XWIN-NMR		Version 3.5
$$ ##JCAMPDX= 5.01
$$ ##ORIGIN= Bruker BioSpin GmbH
$$ ##OWNER= she
$$ F:/spectra/data/she/nmr/H-F/1/pdata/1/auditp.txt
$$ ##AUDIT TRAIL=  $$ (NUMBER, WHEN, WHO, WHERE, WHAT)
(   1,<2021-02-02 09:49:01.93 +0400>,<she>,<DPX200>,
      <created by zg, POWCHK disabled, PULCHK disabled
       configuration hash MD5:
       00 E9 B6 7A A2 85 ED C7 34 08 36 98 17 FE 4E 26
       data hash MD5: 16K
       C0 C8 B4 47 7F 5D A8 0D 68 0E 50 FB 3B D5 D9 40>)
(   2,<2021-02-02 09:49:08.23 +0400>,<she>,<DPX200>,
      <Start of raw data processing
       efp BC_mod = 2 LB = 0.24 FT_mod = 6 PKNL = 1 PHC0 = -10762.91 PHC1 = 12.00095 SI = 16K 
       data hash MD5: 16K
       1F F7 48 C2 08 B3 D3 8F C3 63 3A CF 6E B5 10 BA>)
(   3,<2021-02-02 09:49:30.68 +0400>,<she>,<DPX200>,
      <pk PHC0 = 5.306806 PHC1 = -1.490116e-08 
       data hash MD5: 16K
       E3 93 97 D1 4E E9 BE 56 F3 A9 25 0D 2B 72 60 39>)
(   4,<2021-02-02 09:49:33.95 +0400>,<she>,<DPX200>,
      <abs ABSG = 5 
       data hash MD5: 16K
       6A 25 6B EC 40 1C AB 00 ED 35 A8 21 03 64 43 5F>)
$$ ##END=
$$ 
$$ hash MD5
$$ 43 AA CC A3 05 F2 76 B7 4E B3 B0 33 6C 7F C6 38
##$RELAX= 
##$RELAX= 
##$RELAX= 
##$RELAX= 
##$RELAX= 
##$RELAX= 
$$ Bruker specific parameters
$$ --------------------------
##$DU= <F:/spectra>
##$EXPNO= 1
##$NAME= <H-F>
##$PROCNO= 1
##$TYPE= <nmr>
##$USER= <she>
##$AMP= (0..31)
100 100 100 100 100 100 100 100 100 100 100 100 100 100 100 100 100 100 
100 100 100 100 100 100 100 100 100 100 100 100 100 100 
##$AQSEQ= 0
##$AQ_mod= 1
##$AUNM= <au_zg>
##$AUTOPOS= <>
##$BF1= 200.13
##$BF2= 200.13
##$BF3= 200.13
##$BF4= 200.13
##$BF5= 200.13
##$BF6= 200.13
##$BF7= 200.13
##$BF8= 200.13
##$BYTORDA= 1
##$CFDGTYP= 0
##$CFRGTYP= 5
##$CHEMSTR= <none>
##$CNST= (0..31)
1 1 145 1 1 1 1 1 1 1 1 1 1 1 1 1 1 1 1 1 1 1 1 1 1 1 1 1 1 1 1 1 
##$CPDPRG= <>
##$CPDPRG1= <>
##$CPDPRG2= <>
##$CPDPRG3= <>
##$CPDPRG4= <mlev>
##$CPDPRG5= <mlev>
##$CPDPRG6= <mlev>
##$CPDPRG7= <mlev>
##$CPDPRG8= <mlev>
##$CPDPRGB= <>
##$CPDPRGT= <>
##$D= (0..31)
0 1.2 0 0 0 0 0 0 0 0.06 0 0.03 0 0 0 0 0.0002 0 0 0 0 0 0 0 0 0 0 0 0 
0 0 0 
##$DATE= 1612244941
##$DBL= (0..7)
120 120 120 120 120 120 120 120 
##$DBP= (0..7)
150 150 150 150 150 150 150 150 
##$DBP07= 0
##$DBPNAM0= <>
##$DBPNAM1= <>
##$DBPNAM2= <>
##$DBPNAM3= <>
$$ [...]
##$SUBNAM3= <"">
##$SUBNAM4= <"">
##$SUBNAM5= <"">
##$SUBNAM6= <"">
##$SUBNAM7= <"">
##$SUBNAM8= <"">
##$SUBNAM9= <"">
##$SW= 16.9725356469052
##$SWIBOX= (0..15)
0 0 2 0 0 0 0 0 0 0 0 0 0 0 0 0 
##$SW_h= 3396.73913043478
##$TD= 16384
##$TD0= 1
##$TE= 0
##$TE2= 300
##$TE3= 300
##$TEG= 300
##$TL= (0..7)
0 120 120 120 120 120 120 120 
##$TP= (0..7)
150 150 150 150 150 150 150 150 
##$TP07= 0
##$TPNAME0= <>
##$TPNAME1= <>
##$TPNAME2= <>
##$TPNAME3= <>
##$TPNAME4= <>
##$TPNAME5= <>
##$TPNAME6= <>
##$TPNAME7= <>
##$TPOAL= (0..7)
0.5 0.5 0.5 0.5 0.5 0.5 0.5 0.5 
##$TPOFFS= (0..7)
0 0 0 0 0 0 0 0 
##$TUNHIN= 0
##$TUNHOUT= 0
##$TUNXOUT= 0
##$USERA1= <user>
##$USERA2= <user>
##$USERA3= <user>
##$USERA4= <user>
##$USERA5= <user>
##$V9= 5
##$VALIST= <valist>
##$VCLIST= <CCCCCCCCCCCCCCC>
##$VD= 0
##$VDLIST= <DDDDDDDDDDDDDDD>
##$VPLIST= <PPPPPPPPPPPPPPP>
##$VTLIST= <TTTTTTTTTTTTTTT>
##$WBST= 1024
##$WBSW= 4
##$XGAIN= (0..3)
0 0 0 0 
##$XL= 0
##$YL= 0
##$YMAX_a= 798689
##$YMIN_a= -602005
##$ZGOPTNS= <>
##$ZL1= 120
##$ZL2= 120
##$ZL3= 120
##$ZL4= 120
##$ABSF1= 15.98749
##$ABSF2= -0.9851742
##$ABSG= 5
##$ABSL= 3
##$ALPHA= 0
##$AQORDER= 0
##$ASSFAC= 0
##$ASSFACI= 0
##$ASSFACX= 0
##$ASSWID= 0
##$AUNMP= <proc_1d>
##$AZFE= 0.1
##$AZFW= 0.1
##$BCFW= 0
##$BC_mod= 2
##$BYTORDP= 0
##$COROFFS= 0
##$CY= -3
##$DATMOD= 1
##$DC= 0
##$DFILT= <>
##$DTYPP= 0
##$F1P= 0
##$F2P= 0
##$FCOR= 1
##$FTSIZE= 16384
##$FT_mod= 6
##$GAMMA= 0
##$GB= 0
##$INTBC= 1
##$INTSCL= 2.992141e-10
##$ISEN= 128
##$LB= 0.24
##$LEV0= 0
##$LPBIN= 0
##$MAXI= 10000
##$MC2= 0
##$MEAN= 0
##$ME_mod= 0
##$MI= 1.114404
##$NCOEF= 0
##$NC_proc= -7
##$NLEV= 6
##$NOISF1= 3.799351
##$NOISF2= 2.8
##$NSP= 0
##$NTH_PI= 0
##$NZP= 0
##$OFFSET= 15.93259
##$PC= 1
##$PHC0= -10757.6
##$PHC1= 12.00095
##$PH_mod= 1
##$PKNL= yes
##$PPARMOD= 0
##$PSCAL= 0
##$PSIGN= 0
##$REVERSE= no
##$SF= 200.130016414474
##$SI= 16384
##$SIGF1= 3
##$SIGF2= 2
##$SINO= 5.538805
##$SIOLD= 16384
##$SREGLST= <1H.CDCl3>
##$SSB= 0
##$STSI= 16384
##$STSR= 0
##$SW_p= 3396.73913043478
##$SYMM= 0
##$S_DEV= 0
##$TDeff= 16384
##$TDoff= 0
##$TI= <>
##$TILT= no
##$TM1= 0
##$TM2= 0
##$TOPLEV= 0
##$USERP1= <user>
##$USERP2= <user>
##$USERP3= <user>
##$USERP4= <user>
##$USERP5= <user>
##$WDW= 1
##$XDIM= 16384
##$YMAX_p= 524497529
##$YMIN_p= -1633825
$$ End of Bruker specific parameters
$$ ---------------------------------
##NTUPLES= NMR SPECTRUM
##VAR_NAME=  FREQUENCY,     SPECTRUM/REAL,   SPECTRUM/IMAG
##SYMBOL=    X,             R,               I
##VAR_TYPE=  INDEPENDENT,   DEPENDENT,       DEPENDENT
##VAR_FORM=  AFFN,          ASDF,            ASDF
##VAR_DIM=   16384,         16384,           16384
##UNITS=     HZ,            ARBITRARY UNITS, ARBITRARY UNITS
##FACTOR=    0.207333158178281, 1,           1
##FIRST=     3188.58940435306, 0,            0
##LAST=      -208.149726081715, 0,           0
##MIN=       -208.149726081715, -1633825,    0
##MAX=       3188.58940435306, 524497529,    0
$$ Real data points
##PAGE= N=1
##DATA TABLE= (X++(R..R)), XYDATA
$$ [...]
7656 33559111 34844552 35154609 36340438 37500335 37905746 39067547 40704738 42246909
7648 42246909 44511681 46902988 49483096 51992316 54865179 58264033 61709503 65248839
7640 65248839 69539139 73509361 77773354 81828374 84375428 86810273 88040155 87574100
7632 87574100 87131203 87021079 86768492 87283744 87685323 88537117 89572698 90083701 90395322
7623 90395322 90479996 89261350 87037109 84260057 80734935 77619148 75344126 73043030
7615 73043030 71720602 70342908 69399161 68419324 67688460 67624863 67879075 68603017 70208455
7606 70208455 71465097 73245309 76138750 78148727 81135239 84885777 88734537 94421609
7598 94421609 99847037 105203354 110641525 116115387 121623557 125943583 129006623 130650853
7590 130650853 131177418 130511684 129952534 128792740 127815895 127009616 126924955 126449964 125929132
7581 125929132 125565612 124265536 121012271 116959514 112177440 106623570 100658101 95442283
7573 95442283 90126133 84268758 80058058 76332396 72169407 69693469 67316727 64692184
7565 64692184 63038870 61889118 61257918 60534424 60063352 59136563 58457365 58995783 59624870
7556 59624870 60508347 62364564 64253512 66004020 68370559 70610675 72422783 73828963
7548 73828963 73862604 72773580 70478928 68492771 66711283 65039890 64047647 63474107 63784051
7539 63784051 63899227 63211791 62545631 61082446 58725773 55773053 51679821 47344926 44062038
7530 44062038 41268340 38450141 35942718 34509842 31994355 30355808 29000908 27145814
7522 27145814 25963702 25426065 24145148 22530879 22218819 21554087 21067864 19953797 18925447
7513 18925447 18205676 17422415 17685513 17279701 16263725 15886578 15123343 14514131 14073894
7504 14073894 13834059 13752121 13286698 13137764 13324541 13094167 13125150 13324722 12902517 11769631
7494 11769631 10904790 10357465 10187930 10727678 11057360 10903742 10386276 9989009 10240620
7485 10240620 10338928 10088181 9798364 9770715 9736654 10157354 10102325 9754900 9508331 9125553
7475 9125553 9317980 9392160 8987844 9097285 9520613 9837803 9815704 9798418 9923049 9840480
7465 9840480 9319359 8832360 8511992 8448650 8773207 7734185 7552033 8329077 7855806 7392710
7455 7392710 7517354 7195364 6890615 6548933 6756886 6332807 5694732 6037426 6214536 6397422
7445 6397422 6498947 6255606 6492658 6497451 6312578 5618609 5154563 4782790 4658355 5266007
7435 5266007 5343026 5797447 6620269 6269156 6101835 6101043 5948193 6026164 5953562 6017006 5749201
7424 5749201 5549377 6116778 6156041 5276804 4939715 4437902 4278548 5420557 5909752 6194400
7414 6194400 5593972 4356319 4270205 4277504 4006138 4106185 4230477 4343049 4522988 4630167
7404 4630167 4320020 3900712 3757569 3494985 2980273 3256238 3529847 3488938 3874366 4215907
7394 4215907 4432582 3812759 3289978 3214481 3372881 2998587 3542422 3672645 2906982 2674903
7384 2674903 3385059 3669910 3278737 3275785 3024692 2180210 2163686 2564475 2229146 1447632
7374 1447632 1375011 1611893 1952897 2528361 2671820 2417756 2532818 2481055 2067699 1908835
7364 1908835 1914848 2038684 2220296 2654540 2600872 2605242 2872584 2387247 2077287 1860766
7354 1860766 2099502 2311925 2277447 2202133 2393155 2369196 2263841 2745240 2797980 2581140
7344 2581140 2602152 2800819 2638393 1803932 1566524 1718362 1731772 1494528 2066266 1919959
7334 1919959 1415603 1321205 1732065 2080678 2370536 2396401 1829627 1246759 1354674 1459966
7324 1459966 1066075 1150812 916741 1026724 1312049 1797593 1931390 1809668 1706476 1746520
7314 1746520 1578521 1736775 1743853 1408512 1141342 1799984 1886840 1842101 1589785 654120
7304 654120 361285 1049446 1544680 1150029 897051 1435924 1157053 1096323 1331215 1231365
7294 1231365 906416 1815356 1927268 1478257 1491997 635811 -33376 -121818 385185 778512
7284 778512 961196 1043429 1338059 1642330 1595285 1557235 1300989 1083911 1087857 1045565 1193073
7273 1193073 1248591 1437974 1447835 1186981 1628682 2109715 1442111 1306098 1882974 2202880
7263 2202880 2522610 2824814 2707873 2281531 2469314 2223772 2140558 2222340 2101479 1524540
7253 1524540 737053 845962 1096378 1451905 2204391 2502014 2801272 2948130 2554614 2372762
7243 2372762 2210163 2133431 1822652 1743927 1822112 2381583 2792479 2224260 2296251 2147223
7233 2147223 2011877 1705170 1679087 1706909 1941406 1936343 2209866 2456113 2441718 2281595
7223 2281595 1930824 2214924 2332324 2050732 2047527 2213499 1522267 1562369 1430354 1547192
7213 1547192 1894708 1861722 2111240 2199292 2036421 1804287 2130757 2334841 1869622 2090170
7203 2090170 2275101 1514068 1127696 1546639 1518398 1842552 2164499 2060476 1933742 2701641
7193 2701641 2307122 1436328 1356067 1329124 1092238 1152055 1335695 1279030 827067 1116931
7183 1116931 1029716 1161175 1488883 1585505 1259394 1681049 1295472 553048 803396 935659
7173 935659 801708 1417053 1330569 883591 471188 713809 1289306 1292806 668530 617563
7163 617563 965424 978054 344321 -119193 333387 332174 978254 1839533 1914309 1135451
7153 1135451 1469778 1203340 387123 -317382 -264394 -141465 720108 1113134 1052934 1235700
7143 1235700 1355270 524607 23266 272248 673816 401521 675242 176886 102344 1181256
7133 1181256 1182322 176511 -83841 -200401 -128826 893555 759725 355852 391096 -299583
7123 -299583 -251840 -11400 466974 966672 728752 922068 836863 669604 366901 -55322
7113 -55322 -7515 -533 -53910 563233 799199 452157 -49152 -625507 -732860 -130266 339977
7102 339977 109756 9244 350696 70763 180207 344783 124968 -222164 76164 27690
7092 27690 -131789 246950 -60317 -371557 -31079 -360131 -378020 606880 929428 -96976
7082 -96976 -465148 11583 20534 -93186 -267854 -79862 13073 95584 171767 376952 131287
7071 131287 219684 -9465 -515790 -965211 -936464 -139599 259072 349266 256503 -184883
7061 -184883 -536849 -106977 75896 102417 -51637 -476642 -521235 -311454 91868 -472138
7051 -472138 -755844 197789 250473 551 169596 193489 306753 153192 -522448 -405077
7041 -405077 187830 -214752 -509595 -278740 -274603 -479419 -104062 475953 -77346 -281552
7031 -281552 153092 -125256 -994598 -996713 -481338 -317356 -147100 -280080 -380359 13066
7021 13066 517070 -226426 -381717 -472516 -1030436 -782332 -646142 -363506 -403438 254721
7011 254721 510972 261281 269633 -142560 -6000 150361 -116364 -438441 108395 212813
7001 212813 41924 169600 435341 686636 511073 -158296 -206031 -75549 -371743 -398014
6991 -398014 -242264 67759 -305347 92997 691640 289516 289055 692625 420227 66445
6981 66445 -132588 -265072 -496566 -303054 -74852 285104 414994 469739 92217 249044
6971 249044 539787 461054 -197387 -138742 -32339 -408008 -375823 104603 59216 -279536
6961 -279536 166897 265213 79458 65555 68966 73903 -73392 151032 180399 433233 708050
6950 708050 528979 626489 1011687 579592 -229958 -200762 -802227 -892370 -231430 654052
6940 654052 1230786 1105063 572896 368675 127400 -138833 -669983 -216838 423100 5910
6930 5910 -270858 54966 21795 445024 903333 737973 505026 215449 -417746 -295221
6920 -295221 -241596 -351003 168808 887462 899975 403067 571489 560388 -270663 -294793
6910 -294793 -167565 -630287 -455134 -130064 468898 897273 1135111 967738 963717 964487 324461
6899 324461 -188523 -586451 -966554 -768822 116978 718225 421457 -107035 -172783 127785
6889 127785 564512 512402 135124 297503 243592 -29532 -159357 174477 -173547 -40584
6879 -40584 490619 208901 112685 217296 462143 -191074 -660222 -564423 -802154 -351570
6869 -351570 160582 48964 326999 644113 698406 144823 -278825 -329858 -447021 -502629
6859 -502629 -289537 6049 -108910 73809 -68142 -377613 -359305 47519 667435 566536
6849 566536 130877 186412 128617 -229112 -490836 -819330 -355816 -37281 414921 757722
6839 757722 465349 37798 -473312 -565970 -860530 -428632 278887 249916 252934 439750
6829 439750 223418 -158757 -140835 -634720 -552223 -487459 -65593 -18645 -689954 -166176
6819 -166176 76764 -618734 -491703 -578507 -730598 -468500 -380416 36039 15831 -557343
6809 -557343 -30972 382965 331036 -327926 -583679 -668386 -668057 -169719 -269909 -140634 -45123
6798 -45123 153386 -184640 -166162 -172549 -118935 -337139 -519437 -968923 -774440 -141388 -138309
6787 -138309 -381931 83343 -199573 -439476 -409381 -535062 -931491 -683758 -559946 -365286
6777 -365286 -162535 -20569 -174439 -570045 -336575 -579938 -573991 91998 -97422 -400489
6767 -400489 -166713 286486 420954 388756 131955 -73109 -61933 159706 423731 -89321
6757 -89321 -100392 -401258 -254400 -63510 -267219 -679932 -1031859 -556077 -141109 -237486
6747 -237486 133631 -62648 -155440 141078 248114 -145872 -398560 -892090 -712391 -36528
6737 -36528 398696 91089 188517 164063 -111613 260281 27153 -85055 -563031 -670398
6727 -670398 -342875 98476 850517 861502 808346 139158 271065 68350 -402332 -574426
6717 -574426 -727168 -108720 294284 544487 617727 191025 -22219 623128 582760 18815
6707 18815 311518 232108 19696 124190 368474 -52609 46759 1178416 501617 149478
6697 149478 669529 491729 -204471 10773 -184461 -15294 499571 600583 155864 -162864
6687 -162864 109931 453312 557943 299952 -230109 -384391 -694440 -677105 -521161 171176
6677 171176 231698 -97734 -12052 -77934 363106 52325 591159 83523 -213713 122529
6667 122529 -260916 -612161 -996046 -414070 45013 -29448 -63811 -3025 -458824 -525656
6657 -525656 233486 219275 175499 173309 -117116 -622906 -566923 199049 302394 141104 282733
6646 282733 234404 -165199 -545870 -615571 -154838 276836 703368 304530 -161228 52553
6636 52553 10869 330787 101932 107742 -248395 -357497 120076 251618 438557 516709 -19418
6625 -19418 -263333 232678 -96782 -717748 -134423 -227420 -158171 211936 164183 109912 -174718
6614 -174718 -363171 -525344 -203583 -356335 -698336 -601819 -554883 -536076 -424274 -69677
6604 -69677 429753 -78286 -47694 376842 95725 -94972 167563 403442 696178 -159787
6594 -159787 -772061 -676034 -621902 -680336 373300 449234 -318659 193965 32183 -291994
6584 -291994 -743378 -488172 -449728 -357270 387437 -205373 -439176 -209904 -434433 -512777
6574 -512777 60807 -121314 -466444 -216907 -180220 -94516 -229400 -291527 -299064 -81190 159283
6563 159283 169625 198451 296675 -241357 -630549 -1029031 -1206235 -532634 -182979 217889
6553 217889 224693 173060 436679 439865 736339 -119464 -329438 -885230 -676553 -200249 -124235
6542 -124235 -3665 -78328 -106367 -319619 -464625 -236500 174427 41978 -84104 -319945
6532 -319945 -275920 -38823 -127731 -508737 -318137 -45610 -230239 -598279 -516795 -207869
6522 -207869 -324963 -281357 426494 364448 37178 249726 123611 -91569 -104173 -307358
6512 -307358 -42291 162437 96612 -348079 -419958 -156301 158023 375303 452267 400616
6502 400616 -26093 -154496 236431 528827 396716 31725 -425168 -361034 -165410 -364699
6492 -364699 240836 337973 -65121 -97254 505154 717180 -112454 -387932 -284810 -735844
6482 -735844 -469341 637956 242629 -349008 -289036 531879 822982 613885 429064 -174831
6472 -174831 -713180 -737050 -269903 148179 670998 612931 569693 92327 -381729 122835
6462 122835 388345 338857 -172499 -678309 -273519 528433 496232 -245476 -238274 171797
6452 171797 299397 172617 216629 35977 21068 394298 665558 622530 179922 -247987
6442 -247987 -415131 -697703 -550484 78127 538880 626299 308572 668723 580716 491683
6432 491683 423622 436252 602976 562755 428179 -84409 91611 591731 1043610 1325024
6422 1325024 722787 160869 176472 466694 444265 487480 274436 -65800 368284 640976
6412 640976 317878 886683 1173451 961114 653859 606286 505737 -89763 37185 -41985
6402 -41985 103635 649979 315980 431718 843537 596309 493152 648127 516397 784359
6392 784359 795225 51972 -457412 -658117 -204102 -77524 280162 531792 105479 501321
6382 501321 991692 321091 453609 432763 -70118 -109410 207256 385248 18355 -157647
6372 -157647 -33806 298770 -33901 -219729 -348316 -236346 -77520 -95137 19678 -296604
6362 -296604 -259322 -41711 261176 461371 327857 -343908 -946177 -906348 -499128 -296065
6352 -296065 459705 874196 476117 565126 422639 74839 -359335 -370588 91818 191536
6342 191536 29100 487932 849381 785346 577422 71813 -373408 -526682 -500598 -424591
6332 -424591 -305552 -154348 -235008 -91828 78035 370894 196595 -173863 214625 808573
6322 808573 238483 -341816 236339 -149716 -482984 -293612 129849 -220690 -17048 246473
6312 246473 47853 394393 479037 58210 -17152 457238 248665 372450 272033 -325029
6302 -325029 -414928 -123387 60623 -234182 42111 51574 -262239 171941 381140 -25851
6292 -25851 127438 6701 -103924 560388 637208 -51499 -624226 -98176 293259 638244
6282 638244 762190 90020 -532961 -66651 584290 87526 412416 491876 116429 -180926
6272 -180926 -386730 -137497 186862 314092 220518 262459 361639 -83343 -538450 -168451
6262 -168451 -417940 -332113 -157354 187488 139394 609740 1055529 272549 147974 924326
6252 924326 589664 -12150 21585 -171149 -431102 269334 486961 159047 624832 807106
6242 807106 590188 902 530826 705910 543179 749447 257126 31019 -480848 -702159
6232 -702159 -247775 251275 815718 494130 447384 -29769 -22731 313964 178566 -119861
6222 -119861 -418564 -123508 -399565 118737 796209 329063 -272738 269926 681012 373103
6212 373103 171257 -374765 -745899 -198044 73895 286169 773360 385156 732873 756795
6202 756795 375422 288736 -39966 238762 499410 518511 -186330 -372262 60974 188886
6192 188886 202451 455564 648835 294321 346257 354236 -168283 -753185 -386575 90478
6182 90478 87338 226715 911785 1043907 1027948 809402 20551 -529546 -724948 -607242
6172 -607242 -518796 197232 615989 272974 4909 -49983 173867 396979 622718 707451
6162 707451 787042 324446 -420868 -220906 -233865 -544600 -236473 350647 657032 802113
6152 802113 586355 193476 -285555 49533 175330 -4454 222683 421313 934894 891152
6142 891152 718776 -157149 127044 1059832 907228 546585 -20033 -196077 181939 545966
6132 545966 -13272 -13028 157893 166171 588952 817009 583049 574081 616530 43004 -235357
6121 -235357 409947 1107131 713682 -133303 -121916 435746 503220 718891 945294 192456
6111 192456 403675 163715 86010 366246 -201371 358886 351731 221641 525383 732219
6101 732219 272462 12089 202457 231441 490840 996584 564804 -25061 360188 546346
6091 546346 -254110 -87979 684332 -108746 -191293 308060 211213 423117 471761 196208
6081 196208 384145 984389 1144473 1053795 461510 -442441 118359 1003784 664098 138848
6071 138848 364576 1203542 1123832 1257948 1261247 277768 402747 326337 -253288 399478
6061 399478 540002 -293152 -33774 890387 897549 1111112 1430208 1089058 707050 400547
6051 400547 704874 145492 144195 462471 537834 1212752 1577892 1195759 841822 354983
6041 354983 121581 652500 1006650 528214 213178 629815 1438161 1498340 1247817 1728337
6031 1728337 1495853 875636 538508 272316 501206 741342 340556 876592 861828 433437
6021 433437 533637 598379 184764 327333 317416 686637 1150960 437970 529995 372827
6011 372827 401814 839117 680431 363690 674521 442279 668368 1081086 1124190 765498
6001 765498 855649 1219646 1028402 291893 507427 1001956 675919 572043 907445 818733
5991 818733 747847 834445 963369 977846 581771 648051 495059 166959 113989 617407 780949
5980 780949 970924 695440 258617 256603 491889 167497 -140400 61525 944505 823062
5970 823062 812977 644528 -204017 -464447 130195 319113 243465 501548 803525 933570
5960 933570 946972 1435375 1192110 404797 492618 741765 -24105 726308 1239494 569897
5950 569897 1048231 1140718 926297 897158 880368 793556 512682 500614 600282 243687 592628
5939 592628 971985 580936 896759 756049 169337 428685 725618 493614 641229 398328
5929 398328 35357 432127 506283 619292 672946 314255 563066 738604 489403 581359
5919 581359 1010374 820647 428808 198715 805275 850227 311880 547972 563959 807760
5909 807760 1297957 1400914 842216 796097 921685 316467 -73469 107960 267799 373654
5899 373654 596284 518848 347548 1107034 1330698 790080 129217 -180617 -195035 21824
5889 21824 278577 549225 563705 51553 651686 823118 455683 359181 540654 272780
5879 272780 -14263 9932 171515 619262 941864 640772 566313 661662 828238 1128144
5869 1128144 1132817 737570 -134264 -302023 174814 373361 426592 407496 481752 546627 1091633
5858 1091633 1282319 890825 424372 137308 384009 867282 737652 530467 469002 226672
5848 226672 -21374 552171 955438 1011807 1269046 833013 694130 701648 536077 213262
5838 213262 -455927 67590 735327 1032143 784937 578268 225905 389493 1061919 420658
5828 420658 172287 318495 762184 470808 422967 735855 866957 1081395 1128340 807805
5818 807805 894553 1187904 674017 366529 980625 1018143 1056372 809012 408898 669905
5808 669905 1051705 753888 366478 145654 297543 579858 1151035 862111 851629 1421923
5798 1421923 973281 1060925 1317459 1002612 1129009 1005722 330908 423143 529184 663230
5788 663230 1198180 1078381 981091 1427184 1466393 1749179 1386658 251959 -170525 -37065
5778 -37065 210463 724967 847155 1003493 939715 717025 1204007 1516171 974976 662936
5768 662936 386737 -113463 495979 892285 316702 592518 756297 957432 1744372 1526655
5758 1526655 1221903 1312758 634571 530466 851042 1076548 1315465 1542442 1887674 1681600
5748 1681600 1371319 1187559 647399 327806 962998 1042469 1249166 1060815 1428977 2158621
5738 2158621 2045512 1499563 1387300 1394689 1389176 1555753 971297 975324 1423029 1240790 933748
5727 933748 835458 866475 1290339 1749123 1812230 1517862 1512856 1920521 1716234 1404836 1342495
5716 1342495 1132256 1030909 1037015 826891 1172639 2067489 1752026 1707079 2135996 2259748
5706 2259748 1957604 1519189 844066 497598 762110 1476154 1915009 2000690 1853969 1359825
5696 1359825 1453850 1613572 1458083 1340838 1206293 1010011 1136169 1476874 1090915 1843010
5686 1843010 2328258 2118858 2166346 1739053 1174976 1195608 1424329 1357898 1250887 1412260
5676 1412260 1630730 1631825 2110121 2060580 1427733 1876149 1845462 1372611 1722989 1723170 864875
5665 864875 1322348 1504714 1146353 1482728 1483154 1505928 1455834 1678777 1511028 1619370 1613829
5654 1613829 1344617 1358567 1586622 921824 829165 1798499 2285477 2178652 1806692 1459165
5644 1459165 944547 1175283 1446967 1533681 1814096 1876172 2359285 2433747 1952027 1705697
5634 1705697 1344299 1023274 1510878 1954316 2117837 2327198 2144825 1802912 2022423 2083793
5624 2083793 2091343 1427995 1212380 1443713 1583184 1818693 1871528 1605683 2006719 2377797
5614 2377797 2527742 2315972 2121806 1860997 1683035 1671012 1623237 1729974 1681622 1827510
5604 1827510 2138883 2468404 2400484 2169902 2305943 2133215 1743293 1685451 1502751 1483798
5594 1483798 1795016 2128163 2344061 2460110 2157470 1972896 2345180 2592833 2384601 2521658
5584 2521658 2554567 2702902 2513372 2326603 1940715 1785682 1788943 1954753 1934099 2337683
5574 2337683 2677001 2813143 2963699 2936153 2806928 2971758 2389402 2347981 2586072 2363573
5564 2363573 2428975 2701310 2663354 3075702 2893173 2376730 2217327 2387726 2698146 3015606
5554 3015606 3303019 2935587 3358187 3665278 3508876 3188174 3720398 3964895 3795330 3967047
5544 3967047 3650010 3041843 3134148 3496279 3875446 4039651 3833704 3523648 4053130 4665311
5534 4665311 4812189 4777793 4983086 5149291 5258362 5413993 5891123 5930767 5924129 6122168
5524 6122168 6626071 6774899 7680353 8148976 7910885 8248272 8374774 8770531 8457510 7765109
5514 7765109 7366361 7359802 6963804 6547338 5908011 5990315 5815025 5043944 4888287 4958839
5504 4958839 4958868 4540540 5014115 5466540 5699475 5334327 4716834 4492934 4826786 4649704
5494 4649704 4783630 4677503 4294099 5172571 5423381 5034139 4595743 4112802 4111041 4520614
5484 4520614 4443835 4510924 4506107 4752176 4904359 4387027 4867400 4940310 4425159 4374094 4395773
5473 4395773 4718209 4701255 4313546 4605791 4532501 4285841 4921154 5144533 4998915 4938891
5463 4938891 4555636 4696648 4632293 4397258 5137435 5188923 5350478 5436748 4947452 4950889
5453 4950889 4980659 4273978 4283938 4852868 5375282 5730988 5886885 5685212 5713936 5832741
5443 5832741 5673183 5410769 5450027 5732673 6215660 6771062 6509063 5892869 6071501 6284572
5433 6284572 6076561 6240662 6807155 6247692 6709842 7138699 6776628 6916546 6898785 5883420
5423 5883420 6057808 6784905 7155524 7715354 7167188 6870242 7117238 7805601 8168588 7566422
5413 7566422 7141024 7341617 7480164 8217300 8396069 8226111 8064648 8080862 8175277 8405876
5403 8405876 8637147 8999472 8368520 7963243 8329247 9025909 9520796 9698460 9760216 9726533
5393 9726533 9904482 10143098 9664617 8764279 8930027 8970195 9192886 9721555 9919748 10682435
5383 10682435 10933295 10503412 10734915 10894459 10790486 11127377 11296501 11092655 11537715
5374 11537715 12482655 12762648 12514517 12315566 11419795 11099887 11340332 11548890 12127166
5365 12127166 12738428 13399712 13300436 12745720 12909146 12584641 12809602 13834935 13418959
5356 13418959 13355480 14052697 13317719 12842718 12794788 13072590 13503395 13128523 13036247 13236206
5346 13236206 13444432 13995086 14341090 13998188 13979382 14284610 14627302 14600758 14397077 14486331
5336 14486331 14201227 13432140 13840501 14366615 14095496 14129450 14805202 14786943 14171727 14267643
5326 14267643 14578383 14231456 14404480 14061558 13903541 14442055 14864713 14770141 14056958 13582644
5316 13582644 13367857 13293973 13357545 13254722 13732213 13781034 13426874 13379364 13237813 13479976
5306 13479976 13555211 13146717 13323618 13714795 13711714 13180946 12419715 12480918 12882873 12597975
5296 12597975 12306131 12647424 13065783 13673412 13605352 13842344 13334870 12315430 12184816
5287 12184816 12297185 12413969 13003088 12803456 12335329 12256162 12841525 12803265 12677655 12870132
5277 12870132 12553178 12621247 12752083 12272618 11934989 11569610 11885248 12769598 13182381 13113975
5267 13113975 12286940 11619160 11787531 11703892 11433200 11669307 11745520 11848904 12339637 12822449
5257 12822449 13131004 13151872 13308338 13003969 12495019 12983705 13013144 12437057 12330707 12459803
5247 12459803 12404521 13043049 12686125 12774884 13245578 13521961 13594380 13290722 13215685 13333622
5237 13333622 13172490 13127768 13404501 13317915 13728448 13799039 13825553 13794096 13853894 13786016 13394914
5226 13394914 13177005 13325974 14218061 14130450 13661347 14156525 14224682 14689351 15125203 15419187
5216 15419187 15035607 14717953 14973973 14746329 14689409 14906453 15290793 15210995 15392478 15788168
5206 15788168 15944862 16644216 16309043 15336747 15506817 15680654 16455963 16707541 16371921
5197 16371921 16731812 17130545 17102403 17153825 17269441 17191717 17312294 17912984 17837868 17790706
5187 17790706 17879802 17764429 17932402 17791913 18223649 18658826 18442670 18665331 18717072 18446872
5177 18446872 18433416 18483712 18706133 19099629 19638777 19500272 20026278 19730578 19579227 19699174
5167 19699174 19831403 19985610 19695129 19404504 19658598 20064399 20591919 21117466 20596995
5158 20596995 20012850 20376288 20992469 21129873 20932721 21111026 21020501 21063862 21396393 21149852
5148 21149852 21189433 21378589 21566429 21776595 22371430 22251439 22170471 22033906 21905631 22093676
5138 22093676 22456869 22553253 22577644 23031277 22372671 22733491 23932403 23697039 23682491 23409296
5128 23409296 23072963 23258064 24001410 23956725 23416473 23888947 24575874 24046472 24333989 25112919
5118 25112919 24821396 24420414 24278885 24427908 24909288 24993724 24971085 25095117 24896356 25202702
5108 25202702 25042115 25012259 25273801 24880440 25478015 25672500 25050545 25544821 25754635 25096808
5098 25096808 25284159 25547887 25679947 25638548 25887046 26147911 26220084 26100985 25887527 26559823
5088 26559823 26569582 26522960 26694631 26200915 25979589 26144647 25903137 25816137 26445425 26118280
5078 26118280 25856591 26085681 26535463 26779311 26205933 26200568 25800629 26115925 26973740 26276258
5068 26276258 25700166 25809373 25658363 25979099 26328380 26096637 26037351 25792507 25732182 25599399
5058 25599399 25361546 25605534 25461067 25155295 25500739 25749740 25622056 25710234 25299841 25676448
5048 25676448 26052761 25556477 25615379 25201155 24892640 24821728 24898309 25043204 25118638 25104271
5038 25104271 24733225 24723438 24973126 24703334 24222241 24485014 24097486 23651356 23777882 24022799
5028 24022799 24227581 24680714 24423776 23565092 23114882 22982669 22412070 22608149 23157995
5019 23157995 23637117 23855216 23377655 22630188 22012414 21739145 22312523 22596589 22646677 22720233
5009 22720233 22570237 22708742 22546581 21866422 21722234 21294492 21331769 21604758 21048528 21234528
4999 21234528 20895047 20601616 20567921 20715736 21230395 21118668 20455599 20247057 20581540 20443930
4989 20443930 20207113 19712650 19258803 19091091 19529146 19689084 19895538 19514792 18972215
4980 18972215 18752832 18415914 18562190 18537745 18246089 17825819 17777803 18070128 18108503 17971115
4970 17971115 17742754 17409268 17503376 17981150 17938666 17562074 17491813 16986044 16951326 16979010
4960 16979010 16892599 17079977 16835382 16455203 17015718 16812528 16567552 16756581 16478122 16450391
4950 16450391 16542153 15960831 16198006 16504751 16107183 16303976 16136947 15734705 15858262 16110594
4940 16110594 16459615 15667658 15690483 16125856 15568821 15118595 15938014 16495149 16190083 16047295
4930 16047295 16065701 15833710 15207753 15399108 15538813 15705788 16014780 15282358 15197147 15261971
4920 15261971 14951737 15384085 15244759 14678666 14973835 15190053 14785409 14481390 14417797 14807082
4910 14807082 15016769 14581947 14205107 14067846 13693066 13534455 13735105 14217829 14720915
4901 14720915 14455765 13832206 14069257 14449436 14123261 14102202 14296927 13690428 13699153 13792466
4891 13792466 14058750 14091131 13534528 13926142 13792072 14060586 14051829 13387639 13806765 13932048
4881 13932048 13192481 13485470 13574560 13357813 13360449 13492549 13442017 13329009 13902945 13902013 13376255
4870 13376255 13146163 13189685 12686387 12553853 12444958 12361035 12757769 12784609 12365571 12791717
4860 12791717 12661478 12445474 12571825 12480276 12094447 11990470 11559378 10684837 10857372 11280525
4850 11280525 11455513 11872938 11679431 11295834 10693761 10810336 10999196 10762146 10754705 10469772
4840 10469772 10439518 11039662 11505351 10893884 11316487 11232982 10636453 10349590 9767197 9723293
4830 9723293 9684235 9402295 10115982 10694008 10989500 10889479 10240311 9940941 9287457 9121404
4820 9121404 9490257 9535757 9639227 9713191 9621493 9264177 8789174 9121932 9201846 9272977
4810 9272977 9478263 9427114 8607251 8709350 8768815 8964103 8832082 8832744 9394250 8972477
4800 8972477 8654071 8387181 8566400 9095488 9077632 8377306 8719011 9407114 9405694 9428757
4790 9428757 9847294 9575076 9207233 9332672 8740380 8674190 9224045 9509396 9502724 9323679
4780 9323679 9437077 9415929 8931676 8751549 9154748 9615007 9743019 9281468 8758977 9341300
4770 9341300 9625030 9445520 10405816 10383688 10342382 10171514 10009036 10084996 10059205 9979422
4760 9979422 10046269 10565301 10810127 10451157 10567301 10260315 10158846 10876815 10825131 10465730
4750 10465730 10536994 10374354 9927646 10016188 10515801 11211988 11164442 10797993 11199284 11166975
4740 11166975 11287116 11569169 11303515 11880880 12033794 12037090 12229968 12100412 12143808 12638271
4730 12638271 13090193 12551277 12712453 13169992 13050302 13104324 13322121 13687773 13694546 14285198
4720 14285198 14317261 14617377 15371735 14984544 14486244 14899154 15193912 14927585 15102337 16071612
4710 16071612 16818806 17424917 17401686 17332176 17188187 16973222 17321717 17159419 17271556 18598786
4700 18598786 18810174 18523312 18866037 19290325 19452831 19264946 20065894 20164368 20212188 19852907
4690 19852907 20070977 20180918 20192460 20098523 19583768 20482241 21185747 20559446 20098851 20732814
4680 20732814 20956850 20574352 20910502 21074923 21041840 21517427 21816669 21222048 21458923 21473815
4670 21473815 20832468 20524165 20672328 21109700 21467991 21181975 20190687 20436376 20368341 20128020
4660 20128020 20194220 20484478 20811831 20864762 20526673 20152090 20178950 19853583 19694710 19870571
4650 19870571 20206667 19846685 18887230 18909061 18517476 17934391 18300370 18256893 17975018 18201892
4640 18201892 18183231 17474817 17195928 17314638 16837427 16343935 16700954 16708101 15746421 15380842
4630 15380842 15417252 15282532 15542403 15284180 14304565 14567504 14350029 14122480 14489964 14366784
4620 14366784 14038959 13739325 13479756 12873544 12963558 13215280 13151513 13080408 13303050 13519876
4610 13519876 13167146 12529124 12168247 12089851 12132316 12320633 12182146 12535303 12610813 12339445
4600 12339445 12488002 12974427 13035291 12990170 12038811 11420333 11536886 12132347 12543488 12140560
4590 12140560 12495178 13018002 13589692 13482983 13375068 13322174 13269409 13131519 12998933 13105600
4580 13105600 13451780 14436438 14430825 14917871 15893475 15793426 15498523 15882790 16025970 16216541
4570 16216541 17092846 17259626 17217708 17882408 18871014 18934713 19259943 19432590 19651443 20131075
4560 20131075 20388298 20684920 21035343 21787509 22087218 21907558 22878636 23517626 23620322
4551 23620322 24412563 25089474 24668768 25464112 26334811 26321046 26165031 25708302 25463043 26135842
4541 26135842 26281722 25879389 26149521 27125912 27496641 27235211 27423776 27387276 27548328 27803600
4531 27803600 27932205 28044187 28077584 28494647 28744640 28199709 27922417 27874556 28088064 27927858
4521 27927858 27693002 28067330 28258148 27664118 27299186 27200598 26782066 26155051 26339014 26101984
4511 26101984 25697513 25035183 24770029 24546000 24461828 24203154 23934494 23978046 23383093 22936818
4501 22936818 22782551 22292103 22404883 21917966 21702114 21826780 21988453 21892372 21956525 21631187
4491 21631187 20825117 20212677 19475315 19872562 20293501 20131083 19734158 19330248 19585665
4482 19585665 20125744 19874347 19404110 19376538 19492449 18707813 18527277 18383472 17982358 17848136
4472 17848136 18182903 17608246 17593512 17627406 17674210 17185664 16979992 16889532 16647815 17040380
4462 17040380 17638983 17626406 17499590 18008178 17754207 18049950 18422419 17716191 17985254 18337762
4452 18337762 18281632 18275223 18087391 18520339 18925932 19320445 19438330 19734837 20262518 20686408
4442 20686408 21220929 22074069 23019597 24075995 24751664 25289870 25700364 26610233 28030911
4433 28030911 29105365 30395071 31917695 33420060 34706364 35758834 36550543 36883425
4425 36883425 37747890 37964843 38138560 37409357 37355799 38007752 38269416 38220562 38186655 38563027
4415 38563027 38673599 39093856 39684937 40039881 41017743 42026996 43276050 44807158 45406825
4406 45406825 46732737 46834910 46698929 46465101 46007067 44726541 43535930 42444819 40518210
4397 40518210 39693741 39063850 37741526 36273122 34869036 33980377 32876737 31615655 31329709
4388 31329709 31027547 30462329 30882864 30553433 29853325 29540957 29815308 29422226 28774313
4379 28774313 28456912 27534512 27025233 25824936 24641961 24122601 23410846 22407197 21260152
4370 21260152 20681276 20041798 19556138 19131380 18798792 18621440 18099908 17412122 16604043
4361 16604043 15674567 15068238 14960475 14671697 14627083 14949990 15299443 15465247 15601674 14790221
4351 14790221 14492940 13918199 13669860 13775087 13662705 13173161 12863548 12300126 11992534
4342 11992534 12745995 12526873 12062174 12211287 11958651 11881267 12114964 12188698 12018964 12001785
4332 12001785 12177142 11998253 11926921 12393151 12473394 11966400 12100225 12708203 12640177 12727291
4322 12727291 13398786 12770429 12317664 12301364 12196062 12160867 12545268 12695398 12756796 13542381
4312 13542381 13744712 13586642 13891279 14197421 13900152 13924409 13754361 13682368 14145886 14442977
4302 14442977 14952771 15481910 15611942 15713258 16173478 15790406 15635464 16547184 17153423
4293 17153423 17053621 17012910 17457210 18171245 18829312 18730594 18275085 17827092 18504549 19479568
4283 19479568 19723064 19456855 19767464 20385563 20565265 20818154 21389810 21141436 20619722
4274 20619722 20830528 20829593 21176006 21664820 20836308 20495686 21008933 21333889 21645586 21761049
4264 21761049 21618049 21767819 21726801 21429469 21653244 20879163 20281046 20178508 20890151 21804820
4254 21804820 21500072 20778604 20265846 20148933 20522239 21139996 20932917 20343269 19956466
4245 19956466 19480632 19319139 19485056 19582447 18695360 18497550 18469112 18349083 18715827 18651352
4235 18651352 17141699 16240604 16224306 16587879 16083643 16168101 16638765 15842762 15312082 15566685
4225 15566685 16006426 15504219 14593263 14063537 13899129 13521795 13079931 12231592 12053635
4216 12053635 12279502 12087667 11967402 12037239 11892278 11558084 11032744 10728377 10405756 10097730
4206 10097730 9488196 9444960 9111539 8847157 8961431 8116601 7086093 7040094 7604287 8001258
4196 8001258 8097859 7927592 8074536 7338517 6726253 6615638 6648830 5912781 5749625 6174305
4186 6174305 6585898 6862785 5672341 5395132 5849410 5782936 5671458 5427924 5196093 5317738
4176 5317738 5612054 5588989 5665690 5747220 6085576 5901791 5663237 5387410 4996654 4355938
4166 4355938 3890360 3879202 4590081 5248477 4923904 4178679 3810051 4405259 4459340 4182459
4156 4182459 4177382 4237239 3897277 3429148 3812978 4265384 3881803 3530794 3205225 2998004
4146 2998004 3089449 3825762 3953022 4066875 4111107 4095899 3779094 4076018 3961804 3423255
4136 3423255 3077741 3330680 4104493 4225393 3870933 4137488 3755641 2866844 3280512 3508627
4126 3508627 3345484 3472873 3135989 2732130 2459663 2995145 3820692 3876904 3611569 3197510
4116 3197510 3139482 2673803 2973466 3234990 3897360 4153908 3685458 3603631 3303161 3237133
4106 3237133 3191780 2876498 2716136 2849854 2863417 3445057 3711108 3692758 3432703 3514441
4096 3514441 3921834 3730468 3180787 2438186 2376747 2623895 3540797 4508759 4396214 4228765
4086 4228765 4210405 4043731 3254771 3239659 3840290 3680141 3252410 3349671 3600424 3440815
4076 3440815 3425749 3799271 3809487 3936686 3949290 3966453 3685213 3288151 3369066 3460555 3643826
4065 3643826 3866654 3515813 3095075 3372291 3617986 4064611 4333747 3583317 3417261 3360163
4055 3360163 3416040 3246695 2739636 3451444 4245872 4150411 3659320 3705952 3884484 4664199
4045 4664199 4562035 4080320 3788483 4349285 4257272 3955116 4087595 4403933 4861774 4695226
4035 4695226 4527863 4356592 4268796 4527011 4116831 4159486 4526664 4736666 5050334 5590163
4025 5590163 5088122 4618657 4943070 4880925 4523497 4622515 4928334 5482912 5326432 5012960
4015 5012960 5159241 5456723 6243190 6375645 5966637 5721996 5821223 5980265 6121475 6350221
4005 6350221 6525826 6953256 7320204 7641784 7592189 7656621 8058814 7567520 7436540 7488501
3995 7488501 7228784 6914707 6763941 7042391 7389666 7449367 7449803 7594756 7812092 7946351
3985 7946351 8432392 8561313 8103025 7660713 7719364 7742662 7552833 7578024 7746609 7275270
3975 7275270 7415586 7337242 7159572 7490864 7343901 6865680 7109021 6906558 6840786 6819876
3965 6819876 6660467 6795475 6620527 6727990 7036358 7281531 6919448 6717196 6567176 6378475
3955 6378475 6612845 7073175 7429831 6916504 7175067 7530733 7594947 8243899 7969409 7673375
3945 7673375 7798969 8038033 7573177 7735507 7739158 7580815 8204526 8438409 9254486 9681723
3935 9681723 10000118 10181861 10580205 10820304 10225294 9932990 10230865 10562131 10783394 11143999
3925 11143999 11208056 10944585 10810924 10532975 10430833 10742897 10828294 10755762 11262369 11712811
3915 11712811 11981433 11867758 11233208 11144367 11669938 11907050 11848861 11959191 11697208 11482452
3905 11482452 11339280 11080264 10868661 10872939 10862926 10698075 10795736 11134897 11160447 11236198
3895 11236198 10995361 10324507 10683871 11089995 11133658 11131232 11061914 10777799 11018200 10904914
3885 10904914 10638870 11058299 11807118 11681280 11413114 12182436 12457351 12625718 12130119
3876 12130119 11709055 11367733 11801493 12609679 12484629 12169800 12299870 12846864 13123521
3867 13123521 13546549 13458613 13734091 14097301 13924024 14665248 14746207 14333190 14495529 14758065
3857 14758065 15119407 15733156 16017148 15904270 15998674 16261142 16564902 16850868 16754292 16262876
3847 16262876 16226819 17009442 16731193 16895644 17088649 17122349 17611974 17852819 17417213 17026018
3837 17026018 17149941 16792100 17089035 17364710 17423011 17584707 17668529 17656063 17975108 17954097
3827 17954097 17836445 17158631 17153055 17438316 17032561 17287360 18132135 18253462 17885430 18147901
3817 18147901 17959977 18039291 17818414 17707984 17814084 18248262 18843528 19287002 19261778 19475720
3807 19475720 19308286 18945103 19353441 19657592 20203704 20887866 20810532 20626615 21103821 21482717
3797 21482717 21746500 21914533 22046796 22321616 22616480 23067435 23210807 22987278 23326180
3788 23326180 23497862 23571146 24245672 24616585 24311759 24731906 25148414 25581385 25616147 24954442
3778 24954442 25241345 26061956 26555534 26484805 26744302 26788743 26833738 27586376 28089680 28399286
3768 28399286 28691655 28424676 28639119 29411349 29443057 29051356 28829261 28396993 28462992 29145682
3758 29145682 29543949 29506639 28916676 28898140 28644543 28560243 28770270 28934132 28734895 28862320
3748 28862320 29450552 29318979 29086042 28264958 27371340 27515461 27974798 27441977 27787989
3739 27787989 28685323 28554073 28350961 28364609 28438347 28374222 28578630 28743770 28477162 28831063
3729 28831063 29443820 29747862 29853620 30743239 30549446 30533264 31270056 31662006 32160322 32540569
3719 32540569 33475378 33691146 33720262 34733082 35136844 35149269 36503439 37076014 36835197
3710 36835197 37096041 37583243 38134487 39182527 39239452 39184268 39734012 40632262 41655295
3701 41655295 42527773 43357088 43482461 43491253 44230918 45174212 46420960 46799577 46380203 45899962
3691 45899962 46323496 46803871 47540924 48303409 48397571 48339474 49494696 50535801 50862602
3682 50862602 51827573 52299901 52091422 52306356 53497921 54105587 54246539 54706259 54852382
3673 54852382 55200079 55882919 56089297 56498519 58284998 58994409 59388079 60346836 60986526
3664 60986526 62151987 63139686 64469260 65413710 66330666 67476604 68955712 69956787 71327441
3655 71327441 72494308 73217795 74765316 76185710 78038115 80206125 81152958 82197107
3647 82197107 83600963 84706801 86404983 88458026 90136407 92562053 94378606 96316338
3639 96316338 99156858 101922281 104418466 106486205 109359872 112492303 115983208 120361379
3631 120361379 124773688 128317630 132468696 136937220 140984220 146370690 151670471 156648188
3623 156648188 162548300 169079658 176108112 183017803 189879260 196860961 203923428 211062828
3615 211062828 217915706 224917133 230984284 236975124 242024369 246703294 251268634 255078701
3607 255078701 258643002 261820024 264155849 267591835 271944502 276212161 281040753 286603694
3599 286603694 292847598 299409546 306191471 313269641 320617707 328416927 336776567 344809612
3591 344809612 352471973 360198480 368149622 374930648 381558218 386681807 390881055 394996546
3583 394996546 399175788 402206042 404201059 405726291 405131728 403909933 402776943 400629880
3575 400629880 397326359 394468320 391833064 389533555 387885534 385464438 383339914 381443519
3567 381443519 379214589 377050786 375729404 374899174 374616830 374723754 375712772 377712459 380095918
3558 380095918 384275104 389633498 395390556 401370612 407734404 414046792 419141014 423361582
3550 423361582 426013288 426715549 425406710 423269573 420563554 416472651 411119057 403105797
3542 403105797 393206412 382140178 371032584 359737011 348566982 337990519 327316830
3535 327316830 317280646 307573454 298863696 290917604 284453132 280127157 275481980 272477393
3527 272477393 270709579 268619182 266401011 264246071 261415935 257516303 252168740 246101572
3519 246101572 239404271 231423943 223205105 213948183 203317346 193029796 182939759 172623173
3511 172623173 163195149 153853261 145332598 138922448 132250347 125334951 119642015 114214805
3503 114214805 108374426 103727328 99716371 95533322 92881484 90144109 87062430 84191031
3495 84191031 81717971 79191417 77133781 74872445 72682421 70749699 68544545 66431077
3487 66431077 65300213 64482110 63410997 61766584 60300968 58679592 57335731 56355477
3479 56355477 55297387 54288212 53293801 52169507 51334936 50854485 50145829 49370676 48985720
3470 48985720 48614752 47777573 47146090 46763576 45134966 43835955 43094530 41890165 40882777
3461 40882777 40992624 40268964 39395756 39615142 38652193 37727053 37457894 37367485 37133646 37447954
3451 37447954 36911065 36183432 36482395 35913796 35328235 35507491 35323685 35674613 35751356 35277228
3441 35277228 34983993 34506828 33480985 33320823 33396963 33299394 33035537 32779250 32023797 31161178
3431 31161178 30709238 30747507 30048455 29231753 28887435 27968160 27676485 27997817 27510476 27117174
3421 27117174 27194120 26678845 26229705 26452124 25774830 25174464 25529180 24875105 24110147 24381931
3411 24381931 24318668 24127882 24543986 24798559 24551480 24610950 24459613 24265646 24168941 24195154
3401 24195154 24680096 25076102 25833067 25335864 24852647 24719451 24254442 24232682 24342364 24520997
3391 24520997 24489836 23994531 23468730 23688753 23033408 22804166 23048536 22650085 22666980 23038271
3381 23038271 23072099 23010341 23156295 23233243 23079061 22387615 22030616 22040004 22244631 22979986
3371 22979986 23526320 24007853 24028802 24265476 24257729 23898465 23861462 23082959 23491280 24081232
3361 24081232 23496593 23159340 23110942 22104747 21914735 21869207 21603452 21863402 22088635 21916006
3351 21916006 21688450 21446528 21576719 21196589 20609350 21256383 21711520 21508080 21732474
3342 21732474 21842881 21298327 20939807 21357866 21505874 21669699 21839295 21960529 22285539
3333 22285539 22404231 22393872 22223020 22217933 22487808 22966069 23577595 23793005 23790098 23958862
3323 23958862 23590018 23027668 22905278 23267135 23440934 24118263 24392464 24278232 24509158
3314 24509158 24331197 24453689 24551880 24795768 25492509 25827486 26519646 27461850 28373865 29288359
3304 29288359 30009749 30780395 31342552 31312650 32067029 33450537 33820610 34298064 35680126
3295 35680126 36534915 37261544 38713330 40073729 40663228 41860650 43745785 44870226 46832320
3286 46832320 49006000 50877018 53641010 56623104 60217049 64634671 69501427 75104392
3278 75104392 81763964 88941777 98384312 110560220 124520112 141414082 161412696 181203288
3270 181203288 199041494 213137606 220632616 220278869 212830198 199121346 180917123 160783176
3262 160783176 141548257 124113878 109012298 96558068 86725715 78445964 72342134
3255 72342134 67061946 61766034 57996804 54148013 50547945 47198366 44424457 42561333
3247 42561333 40665195 38397553 36739067 35489523 34463335 33622003 32854621 31781623
3239 31781623 30272415 29038817 29105768 28827576 28010676 27993870 27619330 26953445 27130321
3230 27130321 26760912 26355836 25767671 25382847 24678004 23862739 23378707 23190714 23115986 22777947
3220 22777947 22295261 22198862 22265938 21796373 20889891 20642649 20860452 20674139 20527426 20565650
3210 20565650 19925268 20043241 20407116 19944545 20126123 20216983 19967263 20036917 19578143 18953519
3200 18953519 18790717 18533122 19214613 18869779 18613039 18630981 18705471 19107885 19175872 18990573
3190 18990573 18499665 18826167 18678297 18333034 18727296 19562106 19450540 19558707 19701093
3181 19701093 19596411 20471684 20553835 20142170 20173621 19723667 19445193 19494493 19540112 19821123
3171 19821123 20155295 20830042 21184071 20480611 20304040 20322390 20090556 19888096 20049167 20684268
3161 20684268 20777768 20906400 20982035 21238088 21396964 21872851 21792485 22115073 21835242 21399138
3151 21399138 22021320 22578499 22844261 22865177 23193843 23437918 23107655 23621270 24014032 24071372
3141 24071372 24738157 25068121 24441124 24647139 24775271 24720561 25429425 26725581 27298149
3132 27298149 27669474 28336935 28189206 28124421 28843468 29396954 29338301 29837749 30207905 30810800
3122 30810800 32072575 33120158 33640926 34718441 35029916 34773175 35300192 35629713 35683775
3113 35683775 36593452 37840536 37899983 38453807 39131790 39512612 40765574 41567203 42278677
3104 42278677 42949069 43231311 43494378 43979246 44622449 45367389 45438419 46246192 47261260
3095 47261260 47502574 48667477 48551311 48200648 49524721 50383091 50768225 51606725 52125195
3086 52125195 52409265 52593995 52935070 53479917 53730566 54107248 54023859 53538769 53858481 54371810
3076 54371810 54742912 55250432 55714074 55669182 56101691 56253248 55993177 56358936 56413360 56594942
3066 56594942 56787300 57122362 57098653 57889660 57894242 58443092 59360043 59310170 59824513 61071657
3056 61071657 61591238 61911175 62708614 63641544 65151216 65966149 67352890 68567194 69257941
3047 69257941 70699868 72259829 73337961 75313753 77062078 78771251 80798439 82130522
3039 82130522 84226297 87099911 89025702 90702232 93395649 96581385 98939362 101103287
3031 101103287 103889687 105950194 107851539 110351077 112772946 115609296 118785935 120967447
3023 120967447 123477354 126139027 129215982 131527419 133481501 135572378 137471202 139695649
3015 139695649 142333784 144267525 146182017 147760861 148928895 150090786 151234999 152961940
3007 152961940 154096420 154752878 155478245 156447688 157074324 156154292 156437149 157108282 156662423
2998 156662423 156901336 157136115 156421462 155364385 154575856 153620709 152736221 151381478 149990294
2989 149990294 148360276 147458257 146709044 145039547 143475437 142065967 140042027 139043935
2981 139043935 137731933 135644819 133956230 131956329 130460664 129419258 127452166 125856933
2973 125856933 123986831 121796974 120719852 119278833 117633398 115911483 114129681 112669664
2965 112669664 111358121 109883773 108788908 107379643 106385060 105081431 103689053 102289059
2957 102289059 100424216 98258586 95834560 94423954 92762451 91583792 90597709 89454304
2949 89454304 88218532 86930154 85246445 84164832 82422163 80115598 79201592 78277721
2941 78277721 76928311 76188578 74968003 73248605 72321690 71873623 71624184 70994638 69921571
2932 69921571 68815646 67385699 66928346 66317113 65565653 65273180 64805426 64119918 64289423
2923 64289423 64014467 63973734 64235542 63560648 62879050 62527276 62682839 62679539 62659965 63164897
2913 63164897 63148621 63219701 64191617 64588899 64355929 65114737 65938673 66587905 66812278 67305170
2903 67305170 68233678 68886525 69886084 70844059 72101003 73517970 74693782 75459140 76797439
2894 76797439 78519580 80591807 82137566 83742837 85609175 87429175 89255222 90853212
2886 90853212 92801919 94856146 97063451 99026975 100056003 101729264 103664871 105270333
2878 105270333 106727667 109055627 111454326 114199551 116798501 119319812 121764664 124175636
2870 124175636 126925292 129574351 132035509 134608331 136496874 138552982 140907394 142290154
2862 142290154 144392522 147272167 148767918 150696775 152746531 155197127 158804277 162073792
2854 162073792 165467749 169122480 172829597 177416298 181835215 186003283 190802781 194450938
2846 194450938 198883999 204317052 209649215 216124075 223775318 231468286 239092062 246013882
2838 246013882 252842083 259680452 265929205 271979339 278713501 285634815 292440682 299115745
2830 299115745 306138775 313990601 321771518 329833717 338396864 347769771 358562527 369539835
2822 369539835 380808351 394251868 408056564 421969577 437182211 453396930 468368111
2815 468368111 481323601 490127057 495095643 497858651 499297581 500722390 502482998 504000655
2807 504000655 505955455 508971343 512850705 516603999 519398819 522018982 523222967 523866276
2799 523866276 524373559 524497529 523689362 521996951 519713194 517331773 514562790 511320060
2791 511320060 507928841 503866585 498750780 493395549 486670083 478508885 468589561 456251629
2783 456251629 442679022 428692692 414016817 399444204 386000298 374373051 364424218
2776 364424218 355771577 348741061 342748575 336992368 332117868 327839801 324138398 321409283
2768 321409283 317956790 313808288 309549501 304700585 299623859 294366503 288416610 282210372
2760 282210372 275509548 268104822 260290837 252467069 245669832 239686240 234513234 230037449
2752 230037449 226345993 222732681 218116863 212058213 205355781 198898809 193017687 186863583
2744 186863583 180933744 175399819 170572395 166288051 162962034 160210276 157444283 155346573
2736 155346573 152900930 150809469 148824158 146779084 144183529 142196049 139855060 136750581
2728 136750581 133954713 131361729 128782393 126697304 124701947 121988143 120024752 118416009
2720 118416009 116982024 115540546 114241484 112985364 111575059 110325353 109446880 108085217
2712 108085217 106615547 105617849 104360068 103343517 102384649 101642263 101237765 100542553 99671718
2703 99671718 98630079 98326681 98066088 97459699 97348389 97418752 97902748 98462561 98966221
2694 98966221 99614601 100143028 100721932 101745566 102196604 102710541 103806583 104965729 106263542
2685 106263542 107252775 109186974 110982640 112292602 113683648 115017298 115860822 116858280
2677 116858280 118313777 119901628 121881066 124026144 126107940 127812749 130437288 132965350
2669 132965350 135302126 137019724 138818461 140649133 141983641 143244497 145274319 146907078
2661 146907078 149061922 151315341 153082270 155326629 158132989 160762886 162899822 164507989
2653 164507989 166004638 167568681 169334016 170577407 171464573 172932762 174942928 176685622
2645 176685622 178432557 180643378 182515714 184435609 186468102 188028098 189443923 191137157
2637 191137157 192431503 194144545 195689499 197514895 199651351 202107036 203854613 205406787
2629 205406787 207170707 208050728 208861026 210291930 211278742 212421941 213941023 215239831
2621 215239831 216102298 216892384 217860723 218931118 219623792 221075264 221606998 221950461 223217892
2612 223217892 224464937 225578780 226521238 227549363 228725978 230053668 231242918 232610187
2604 232610187 233244635 234379787 235855079 237739132 239712589 242128333 244983772 247648874
2596 247648874 249928961 252923733 256512823 260239273 263707816 267281992 271132745 275679286
2588 275679286 279694617 284471610 289160996 293283237 297735103 302233903 307242009 312173999
2580 312173999 317163198 321982056 326656649 331907531 336798945 341491315 345487797 349543098
2572 349543098 353296314 356486847 359745150 361886098 363759292 365404314 366743646 367517722
2564 367517722 368803849 369238270 370395658 372022987 371890942 370974652 371088990 370613375 369774223
2555 369774223 368687220 367524460 365592518 363995667 363440831 362451437 361264183 360964861
2547 360964861 361074094 362086181 362582940 363385099 364917537 366619625 367872898 370104582
2539 370104582 372487400 374853629 377640478 380218160 382736338 385552190 387837734 389935526
2531 389935526 391700350 392555311 392275068 391280247 390405519 389011361 386595393 383517176 380407501
2522 380407501 376430751 371876961 366475668 360785928 354751140 348672757 341632601 334220676
2514 334220676 325924603 316991588 307406431 297860740 287568962 277487414 267528889 258333174
2506 258333174 248928729 239694793 230645273 222206741 214199559 206384467 199097506 191921029
2498 191921029 184877965 178435008 173122386 167878737 162836980 158234851 153986796 149797477
2490 149797477 145159298 141271431 137702769 134516657 131670006 128308986 125198587 122589150
2482 122589150 120500628 118888915 116935925 114986553 113479451 111246674 109291237 107884930
2474 107884930 105585506 103517720 102623239 101171576 99646880 98542895 97335052 95293521
2466 95293521 93069501 92473785 91603355 89986708 88556874 86729474 84435797 83253146
2458 83253146 82423100 81209363 79989348 78790479 77113234 75646287 74125286 72368628
2450 72368628 70618182 68527054 67349359 66318770 65454696 64340967 62837138 60992094
2442 60992094 59057427 58195854 56995594 55500957 54683571 53652358 52294243 51019456
2434 51019456 50214146 48767546 47868526 47404789 45954349 44855915 44447012 43323482 42544993
2425 42544993 42123690 41144006 40369441 39938221 39540098 38691994 37935469 37988087 37323558 37180100
2415 37180100 36659042 35679369 34622176 34562891 34009116 33274381 32945399 33075262 33299832
2406 33299832 33069036 32589090 31956664 31437653 31215037 30748242 30504743 30698563 30297280
2397 30297280 29998590 29695282 29784995 29928311 30011852 28927283 28215300 28711200 29044585 28683346
2387 28683346 28625624 28305997 27847083 27809494 27766074 27565283 27432466 27302624 26717786 26594515
2377 26594515 26977488 26529080 26210539 26037310 25994653 26220544 26654282 26443806 25994678 25427130
2367 25427130 24984811 24860486 24935283 25192794 25522818 25584206 25290520 25007792 24338569 24390887
2357 24390887 24448172 24730533 24877250 24939756 25153927 25137396 24973914 24779026 24911687 24501986
2347 24501986 24071057 24492241 24021921 23778406 24229622 24429162 24338890 25173602 25556387 25530121
2337 25530121 25138416 24649062 24385836 24226628 24664430 24536622 24645693 24716938 24627362 24680157
2327 24680157 24795244 24426371 24595212 24633658 24630298 24169719 24362148 24296909 24435726 25224044
2317 25224044 25200871 24470301 24285296 25040612 25611521 25856253 25875586 25573846 25206816 25876375
2307 25876375 26869909 26931780 27285751 27686158 27787827 27625403 27503150 27513597 28377705 28610794
2297 28610794 27904444 27623561 27866314 28716255 28632145 28158924 27996305 28093635 28880942 29500116
2287 29500116 29883643 30532463 31241655 31114618 30991864 31212491 32027914 33067906 33012000
2278 33012000 33667362 34555612 35366897 36079712 36860082 36709349 36859895 37764814 38167539
2269 38167539 38503931 39654842 40538691 40717911 41090008 41603478 42008539 42993420 43885939
2260 43885939 44234187 44826522 45393499 45583633 46435879 47855003 48921001 50301898 51994254
2251 51994254 52506461 53109679 54858665 56634122 58187334 59221342 59980046 60923016 62290279
2242 62290279 63684324 65483830 67074992 68953782 70848560 73163070 76411325 79869798
2234 79869798 83362728 86903130 91247797 95556453 99952959 103944531 107566737 110596885
2226 110596885 113510463 115936591 116426607 115536293 113664842 111799654 109287504 106083301
2218 106083301 102997705 100098979 97479682 94761514 91581149 88806634 86240972 82792794
2210 82792794 79481018 76083861 72895278 69603574 67449962 64789540 61885236 59632358
2202 59632358 56763835 54289613 51372791 48768637 46575707 44719856 42540174 40611398
2194 40611398 39312914 38054929 36591613 34737031 33784547 32817485 31523983 30270487
2186 30270487 29509129 29066523 28551767 27437729 26334240 25750760 24499223 24125893 23998973
2177 23998973 23225955 22755089 22660590 22936336 22115967 21045468 20336876 19974506 19848195
2168 19848195 20012553 20148895 19779494 19495876 18696639 17909024 18117041 18427614 18373432 18625748
2158 18625748 18517192 18557059 18295008 17858990 17286175 16531436 15765843 16280521 16199055 15785901
2148 15785901 15685563 15445217 15260819 14741911 14239432 14093982 13953798 14032910 14536938 14509163
2138 14509163 14709272 14815016 14306520 13764143 13201757 13033158 13204195 12361126 11977248
2129 11977248 12007055 11611586 11146588 10790188 10623657 11044655 10877196 10517849 10349930 10052919
2119 10052919 10578862 10202731 9475447 9862744 10540035 10190119 9919356 9389749 9109843
2110 9109843 9516408 9073553 8785845 9107729 9164820 9078287 8962430 9086799 9408360 8970742
2100 8970742 8834302 8742811 8158400 8737922 8918530 8933152 8786045 8780618 8829815 8826688 8794981
2089 8794981 8644855 9011149 8932267 8582278 8160745 7961077 7757752 8202899 8587937 8419733
2079 8419733 7551789 7766736 8624039 8290757 7831875 7219968 7149933 7655356 7908209 8263996
2069 8263996 8451770 8109797 8129260 8020526 7362796 7093972 6501626 6112389 6283804 6178698
2059 6178698 6262534 6980245 6873038 6770412 6767165 6544475 6356355 6404635 6623472 6611020
2049 6611020 6528188 5496704 5423763 5989556 6018885 6166463 5924681 6218234 6012548 5718217
2039 5718217 5634522 5799894 6149406 5955406 5256333 5206913 5702037 5894453 6423781 6365449
2029 6365449 5757543 5527621 5173681 4718083 4961754 5032777 4733849 5470126 6207544 6386859
2019 6386859 5902793 5608820 5453408 5594312 5672803 5397387 4720225 4564028 5552916 5651939
2009 5651939 5811887 5666264 5833720 5883263 5662349 5350138 5546642 5872806 5779747 5596007
1999 5596007 5367696 5793449 5938301 5662364 5964866 5746582 5519458 5619687 6058720 6146443
1989 6146443 5652149 5442211 5918684 5820393 5876811 6526998 6649095 6687325 6868402 6862274
1979 6862274 7005343 7150361 6866930 7407912 7161630 6889591 7802910 8380188 8229022 8623386
1969 8623386 9193192 9458446 9869502 9580714 9347528 9461226 9732295 9478118 9270118 9883770
1959 9883770 10220474 9816435 10332803 10721655 9841177 10175549 10202428 10078552 10722387 10737186
1949 10737186 10367319 11010733 11016290 10517727 11193480 10881189 10524097 11083149 11792614 12036559
1939 12036559 12219819 13175515 13263108 13439147 14339932 14081987 13963329 14867959 15572243 15757586
1929 15757586 16273312 17015738 16867928 16853717 17225867 16811166 16320628 16900689 17476081 17323438
1919 17323438 17193721 17619281 17563499 17807626 17510811 17615420 17918465 17574345 17779331 17843284
1909 17843284 17870569 18268763 18973156 19092753 19455843 20335199 20961338 21825403 22810766 23909638
1899 23909638 24943021 25951035 26944269 27950786 29516515 31533638 32779488 34289274
1891 34289274 36321880 38338452 40318662 41913199 43112942 44059030 44710853 44239802 43712792
1882 43712792 43478960 43305973 43483433 43531328 43979448 43972546 44002769 44231773 43526086 42878020
1872 42878020 43078268 43032002 42785931 43755467 45136495 46377968 47668639 48806123 50124795
1863 50124795 51838574 53786312 56843018 60143049 64087978 68764451 74521706 79015654
1855 79015654 80139274 76246652 69941657 64588905 60086468 55887977 51799014 48379578
1847 48379578 46026268 43298156 41624482 40322712 38486120 37135100 36533394 35371449
1839 35371449 34240776 33514922 32374123 31541308 31108499 31377571 31654356 31727947 32389108
1830 32389108 33508918 33687104 33937837 34332741 34818983 35084531 34859701 34608296 33950469
1821 33950469 33198338 32237320 30713198 28606592 26515325 24874959 23059948 21874735
1813 21874735 20675027 19381627 18752079 17829328 17004481 16681280 16090675 15111262 14395100
1804 14395100 13921452 12985566 12544780 12441665 11765046 10799916 10444882 10384388 9862920 9858635
1794 9858635 9520589 9127821 9617319 9285812 8540410 7955831 7504015 7182979 6801578 6699632
1784 6699632 6761123 6334105 6569572 6995708 6727575 6286960 6105858 5502231 4819394 4602497
1774 4602497 5191026 5446137 5248625 5410958 5352699 4735019 4784121 4726952 4550111 4677404
1764 4677404 4556514 4238536 3866150 3809803 4291081 4377310 4623996 4860281 4484776 3891548
1754 3891548 3506064 2552706 2699226 3394213 3613774 3688419 3265451 3105496 3708272 3663170
1744 3663170 2958030 2777274 2663539 2428502 2590151 2742339 2381364 2226005 2622110 2230018
1734 2230018 2035469 2891207 2663623 1993138 2213670 2622766 2258616 2558379 2505943 1895003
1724 1895003 2003168 2313126 2653299 3037554 2759297 2600327 1947331 1713602 1787012 1899979
1714 1899979 1663432 1519912 1744297 2082358 2012174 2059226 2493714 2590241 2274455 2591241
1704 2591241 2405814 1690930 1330870 1197647 1109902 1410125 1466558 1265499 1338789 1672858
1694 1672858 1826462 1697163 1755904 1514082 1186024 799681 1305073 1885824 1683017 2083078
1684 2083078 1968204 1506530 1436531 1625703 1234290 899537 967630 887532 1321970 948056
1674 948056 1018372 1236995 1481568 1828523 2162480 1362638 892363 1078600 1184563 1287802
1664 1287802 1555781 1565014 1401402 1468778 1328696 1256765 1578394 1076147 518535 881116
1654 881116 780704 558358 1008448 1402490 1128667 930314 1069634 1143621 724393 578876
1644 578876 196938 981973 1644604 1853061 1214612 333112 583246 1199107 1698825 1591213
1634 1591213 1577979 1396951 1011423 1028380 438556 271051 1257200 1533546 693856 387748
1624 387748 1334731 1462307 659551 987651 1144884 917023 1163603 1491803 428025 224146
1614 224146 935370 1246166 1431266 1780922 1440718 1080757 1001282 572948 612004 804513
1604 804513 591262 1034898 1099315 667626 1279504 1778279 1591743 1871593 1691332 1235549
1594 1235549 1425505 1546488 1510463 1701389 2188361 2151763 2055209 1589439 1888577 1866695
1584 1866695 2199460 2525067 2567805 2234862 1853685 1789568 1994385 1958412 1762409 1899768
1574 1899768 2502273 2304110 2470128 2396833 1773294 1724023 2681166 2844052 2771366 2661955
1564 2661955 2421778 2080484 2870004 3442295 3200964 3428019 3075782 2403382 2390622 3171709
1554 3171709 3574760 3484028 2718495 2777736 3012936 3251323 4206876 3983934 2980945 2679594
1544 2679594 2227521 2702993 3412456 3471605 3142264 3164739 3134829 2978422 3320300 3249620
1534 3249620 3562073 3484929 3301391 3159717 3029604 3404081 3742974 3559162 3822517 3675763
1524 3675763 3858911 4177011 3820328 3698835 3544624 3243236 2757859 2704265 2994604 2915927
1514 2915927 2845624 3135291 3319159 3484756 3513233 3340077 3073330 3135452 2707915 2299234
1504 2299234 3005043 3179141 2636957 2567950 2717395 2858312 3290528 3523628 3044080 2623812
1494 2623812 2523879 2880041 2498952 2718368 3861450 3851683 3148325 2949757 2252125 2171073
1484 2171073 2354402 2689899 2662577 2816638 2726141 2241521 1948827 2014322 1880170 1837703
1474 1837703 1526361 1295587 1888292 2037446 1962141 2716820 2092419 970724 1322299 1066753
1464 1066753 1176557 1929632 1947527 1668483 1925691 1696676 1046201 941302 1156923 1261280
1454 1261280 1435184 1666297 1842289 1152217 696777 965061 732540 1053735 1478461 1168435
1444 1168435 966663 1123185 877815 839731 994965 1244115 1267662 1214550 575874 -9725
1434 -9725 297526 596209 392201 711536 1183815 940979 484045 278034 980828 1242204
1424 1242204 634953 807249 422950 -276227 114202 215806 -353794 267545 248285 212513
1414 212513 732069 394963 361250 282893 182575 538210 665255 876058 489775 -168464
1404 -168464 299687 324675 280738 445685 154297 -34948 249974 391075 542201 1132931
1394 1132931 941852 -5241 -496262 -792744 -22276 111485 367317 1017841 1207112 779499
1384 779499 668883 -172279 -680221 -513462 -436433 -82064 284641 389781 583269 -41152
1374 -41152 372908 376070 -402398 131062 339350 -390439 -464823 -685622 -752157 -324962 110272
1363 110272 426773 629605 819165 848303 453450 -56985 110944 311081 257019 107086
1353 107086 -7747 317902 551267 326423 250450 -222915 154665 384668 128605 722844
1343 722844 1034464 294041 -55985 248129 -267631 -689887 -448793 -408731 86422 474395
1333 474395 699984 401300 96545 357883 -194637 -922258 -772032 -859888 -460309 565761
1323 565761 481386 295017 365897 -321857 -562232 -22200 303637 189246 -181116 -435679
1313 -435679 -563675 -241977 421010 485717 565496 569592 52377 170092 441478 59000
1303 59000 -180350 -163593 50594 -44133 29307 202230 142701 360329 406315 339268 498221
1292 498221 405383 329566 366991 44860 88540 632655 792940 367675 397336 412431 -276638
1281 -276638 -266363 -49107 -75792 77181 362806 185481 333 375002 711032 785712
1271 785712 627939 251384 -378084 -556648 -553901 -294597 186822 -114563 -193464 387172
1261 387172 732486 865223 832281 335920 -32331 -205339 -400279 -139261 172419 165564
1251 165564 204034 379805 695205 594137 720064 253025 136890 233546 293565 258354
1241 258354 386725 333390 137488 157536 347730 281878 301395 289636 136959 290929 983285
1230 983285 901941 16338 666121 859344 342558 412859 469225 358305 265657 741843
1220 741843 780724 450320 234817 280949 297809 684165 910832 710303 424549 445365
1210 445365 426346 628195 594202 393739 763181 702744 832749 790079 1096242 1124546 880153
1199 880153 -61416 -653046 -194970 213041 110859 119671 1107599 1428886 1376390 1515452
1189 1515452 1360587 869770 600785 252675 -254362 86341 490587 1026696 695393 779668
1179 779668 951574 1038698 965524 983326 1148586 1114733 1176149 910911 794431 494082 232915
1168 232915 841516 682191 419549 239666 562128 612861 815292 902957 270321 212378
1158 212378 701071 909001 502812 411027 685759 845655 996457 1157907 1512697 1403738
1148 1403738 1160223 639627 762395 999797 950904 1015639 969288 880997 556565 1094008
1138 1094008 1698215 1389045 1000164 1190799 796808 888402 1097582 561665 429976 906370
1128 906370 1036251 1256695 1688044 1667601 1258215 1208080 1424988 866925 932124 2093570
1118 2093570 2154461 1602097 1876122 2046891 2046985 1807828 1306566 1564440 1483184 1221371 1006782
1107 1006782 1654794 1906993 1779880 2111705 2180273 2072777 2004830 2309645 2235958 2237887
1097 2237887 2238271 1992312 1993283 2201788 2205646 1950537 1826652 1766336 1891286 2038242 2268743
1086 2268743 2584470 2720531 2483175 2310385 2501022 2938067 3297366 2860368 2451126 2474729
1076 2474729 2883920 2964755 2826699 2784877 2308070 2111872 2702100 3264900 3531542 3624007
1066 3624007 3285604 3331584 3471733 3181348 3146537 3448868 3500808 3708566 3448036 3389823
1056 3389823 3924434 3947012 3802623 3728135 3857467 4584856 4946011 4860125 4759976 4750661
1046 4750661 4670711 4655581 5082691 5900161 6663176 6632048 6719539 6290680 5986019 6642712
1036 6642712 7131629 7777237 8881705 9937173 10473660 10683263 11129243 11228051 11157805 11453215
1026 11453215 12262134 13095226 14168769 15976785 16890827 17930662 18778317 19613459 20673468
1017 20673468 22467936 25157354 27847872 30705154 34612514 39869233 45319756 53302296
1009 53302296 62549173 72954065 87946562 103802561 107568688 93011235 73970811
1002 73970811 60264513 50646395 43761861 39086245 34180858 29605928 26326036 23937005
994 23937005 22108215 19879029 18511347 17866440 17133264 15759546 14058227 12481703 11368775
985 11368775 10882360 10305319 9546541 9039911 9125152 8339303 7534955 7447018 7227876 6115993
975 6115993 5414680 5195422 4804595 5254856 4932999 4618311 4843299 5296048 5497215 5288725
965 5288725 4887589 4127431 3721044 3312342 2982420 2662293 3231428 3338352 2800476 3138995
955 3138995 3028073 2596752 2173932 2183796 2284155 2818208 2739422 2254004 1917499 1764444
945 1764444 2087011 1811760 2124177 2387761 1907406 2165735 1969490 1462875 1078462 1438680
935 1438680 1954515 2250257 2101676 2013701 2456658 2058816 1660286 1921238 1712715 1452084
925 1452084 1375144 1249951 953318 1458708 1622912 1581747 1515936 1155958 1064823 1331076
915 1331076 1481706 1326079 1512005 1546650 1375889 1007221 426694 507181 522993 791091
905 791091 682308 1094726 1114532 839515 842397 1007326 1020122 839459 1578688 1055190 406960
894 406960 210009 753524 918455 898164 853684 172767 580444 733227 1517196 1673130
884 1673130 577718 257314 447785 230588 356480 321488 -264848 199079 565508 934888
874 934888 939563 765628 624196 213172 325677 532397 234470 -208734 -550067 -471549
864 -471549 -31606 472040 801707 1064994 787422 1064489 607589 -5639 -251937 -312613
854 -312613 -331840 -395998 59223 459110 583456 697608 1162513 1188142 791552 673146
844 673146 -38369 -275710 -138996 75029 354516 219779 457257 579247 631166 878253
834 878253 569514 306886 85792 -127239 -834193 -519662 115107 -113434 -287583 102330
824 102330 -31620 80437 864871 814841 69807 -157208 344115 19227 66177 98893
814 98893 -561935 -654482 -19053 689521 739446 825007 274712 156516 313618 -166641 -12525
803 -12525 -617391 -525526 37363 489243 506123 383397 309042 138627 518128 589931 214677
792 214677 -565673 -614372 -745470 -772069 -307784 -26552 170449 187551 614857 652561 465038
781 465038 -139138 -1051903 -1599189 -646460 284108 233932 121655 -27868 72437 -138441
771 -138441 -163840 -281009 -1070740 -657982 -202799 -222178 -230872 -201617 500082 847713 579140
760 579140 298495 22309 315690 260700 -233718 -322674 -260263 -251839 113795 283533 -462435
749 -462435 -386461 292361 490131 338092 343778 50296 -42245 -362554 -437876 -111373 411710
738 411710 234283 -56157 -341789 -610739 -174378 -26530 167263 473795 436608 221162
728 221162 -80984 -159629 -95934 662463 1097458 539313 325780 631265 588943 607267 788475
717 788475 130688 173733 140346 -112715 231780 582367 99210 5717 597972 891805
707 891805 486062 305659 184759 -32689 364486 546460 168587 229594 346102 22303
697 22303 -219265 60784 -417439 -412157 -141221 -61178 119568 430163 274855 151860 649927
686 649927 378802 -329230 -561136 -419976 -259661 40993 131836 -24572 35201 46858
676 46858 217568 314555 203886 82947 -44280 -261382 -238633 -179298 -473057 -290378 129480
665 129480 659226 537070 328813 -121272 -124753 -240023 -241277 -279438 -367251 105205 48952
654 48952 242687 687371 -212604 -789918 -363406 -621211 -385656 169603 -18335 -70521
644 -70521 416234 378403 -97534 -214459 120717 479970 564519 696682 370545 -61030
634 -61030 -303289 -1021293 -805752 -198752 91946 432410 338037 388737 229339 -118434
624 -118434 -482404 -296487 283348 182125 -369491 -534771 -515335 -574532 -94946 -235199
614 -235199 -464984 45524 404587 -556819 -832708 -701670 -744054 -517319 -68679 -141462
604 -141462 -189100 321394 -68977 -402059 308087 175080 -985455 -727127 -382259 -687838
594 -687838 -355840 203703 -211959 -257972 182637 344650 -29063 -176680 -279151 -144388
584 -144388 12417 540910 337413 147277 341594 -14197 -401541 -484731 -572030 -601997
574 -601997 -572992 -202790 635508 -50621 -511503 -120706 -636721 -754230 -271311 -800886
564 -800886 -1250705 -666746 -426203 -131366 -481301 -263368 -255104 -89840 213896 17331
554 17331 -571545 -310664 3918 -1108407 -1235900 -795318 -360734 -58990 103523 480667
544 480667 -30140 -617917 -626105 -249389 -333811 -95731 263672 -110732 -251425 -278434 -706821
533 -706821 -929619 -1200494 -1121280 -94584 -256749 -319189 -867227 -1023666 -1197914 -1586689
523 -1586689 -1171243 -807592 -1067900 -134142 359601 -117544 -7168 -334985 -467617 -285342
513 -285342 -115380 -348116 -1122406 -1274121 -784107 -633986 -279400 -248805 -645716 -419653
503 -419653 -278975 -190058 -741724 -678338 -293038 -276891 -416363 -672002 -510449 -308219
493 -308219 -512086 -980053 -857765 -945246 -985398 -399673 -377232 -727393 -497743 131511
483 131511 -114907 -224954 -314014 -626140 -898200 -577472 -663004 -532682 -333820 -766489
473 -766489 -796975 -1098779 -581302 -197797 -353716 -316220 -832341 -887436 -602165 -230436
463 -230436 -115259 -463726 -572317 -84917 -307417 -556764 -507095 -689157 -23792 -73976
453 -73976 -599915 -1089549 -1377085 -761058 -437094 -563611 -402413 -201428 -132989 37629
443 37629 -173496 -651947 -729863 -413968 -691753 -1150490 -858717 -664339 -401859 -289891
433 -289891 -296833 -182460 -373421 -603624 -415965 -608825 -796473 144236 120122 -197111
423 -197111 -325266 -597546 -208917 -53054 -397794 -366679 -445579 -312646 14276 308204
413 308204 261819 -135894 -96202 -489269 -668064 -741104 -393024 -458667 -551058 -331586 -505987
402 -505987 -414608 -439537 -985315 -1312837 -675550 -734644 -627001 -135329 -555523 -651907 -268169
391 -268169 -21477 -264460 -405508 -976039 -1271474 -1183020 -821606 -1212030 -1159218 -742316
381 -742316 -818993 -907298 -265720 -68588 -136087 -282824 -568975 -550094 -413680 -764557 -1048213
370 -1048213 -778559 -880033 -1140947 -693770 -540656 -375271 -584537 -758126 -1055337 -1073263
360 -1073263 -1140404 -911150 -784663 -109692 543339 -37899 -219101 -781458 -775590 -626190
350 -626190 -893536 -1476031 -1223395 -843206 -975378 -776156 -558184 -278057 367391 539934
340 539934 122684 -243204 -747110 -1273864 -1016457 -1364431 -1109335 -528169 -126931 -251029
330 -251029 -627954 -776683 -790354 -893903 -1479035 -1183593 -1137406 -581137 4019 87334
320 87334 -59002 -474976 -451613 -519593 -836686 -1258028 -1340107 -1846872 -1617030 -1100964 -747094
309 -747094 -190359 -37403 -479744 -610996 -313437 -544682 -824354 -1178862 -1250607 -1159868
299 -1159868 -1321135 -1146509 -630965 -453588 -1145694 -1232052 -901612 -206070 -168959 -686508
289 -686508 -1116790 -1096151 -248375 -123963 -778247 -911941 -1320614 -1088232 -738964 -1100427
279 -1100427 -1287092 -837708 -858362 -1366273 -1006882 -510557 -450425 -463147 -744887 -733804
269 -733804 -670845 -637152 -1054580 -1437611 -1163445 -1019707 -1185359 -1257956 -824429 -1305008
259 -1305008 -828422 -374005 -491593 -506914 -217483 -169491 -542516 -637012 -575701 -721280
249 -721280 -1001082 -810772 -1155954 -1061391 -1169117 -938286 -868490 -715447 -469787 -1063233
239 -1063233 -1193936 -851932 -602972 -624636 -261158 -657783 -902303 -717432 -1446393 -1754347
229 -1754347 -1644143 -1284840 -1313701 -1439287 -1034756 -453467 -372871 -403928 -977879 -1307747
219 -1307747 -362078 -522090 -617488 -901737 -1069956 -1110582 -993410 -697366 -976890 -926497
209 -926497 -962601 -934678 -791782 -669975 -759674 -1173871 -1508538 -1477277 -1350306 -906906 -725732
198 -725732 -1211425 -706471 -528542 -871754 -1117888 -1398451 -1404411 -1548788 -1519787 -1059663
188 -1059663 -816019 -947622 -1352844 -1107510 -1052171 -662414 -632633 -736001 -338907 -893987
178 -893987 -1015848 -1011511 -1480478 -1170772 -540184 -329766 -464551 -63410 -761989 -645006
168 -645006 -266552 -787024 -852318 -624014 -1298780 -1488250 -888303 -912348 -897543 -1147005
158 -1147005 -939419 -849086 -946507 -937109 -1181889 -1087017 -944196 -1177185 -1096750 -1111298 -1647963
147 -1647963 -1891834 -1420377 -1089309 -732000 -753968 -1054010 -1317410 -1688552 -1624241 -1039380
137 -1039380 -740523 -617879 -744933 -632518 -697976 -1038713 -1055610 -890629 -1081899 -689922
127 -689922 -710986 -1348195 -1658531 -1293989 -1185319 -1106450 -1061842 -973183 -936175 -959087 -1597685
116 -1597685 -1444772 -752715 -690304 -1068633 -1378596 -1398463 -1375550 -1471064 -1617363 -1355284
106 -1355284 -1130730 -991873 -821241 -726512 -819470 -801012 -881235 -915083 -1187992 -760194 -623861
95 -623861 -1171530 -1765344 -1219939 -1031909 -1491616 -1847468 -1461606 -1627021 -1203762 -876845
85 -876845 -1054172 -1241804 -946796 -989171 -1128347 -953418 -881867 -708918 -1009391 -1334081
75 -1334081 -1681935 -1830831 -1531563 -1055234 -1032369 -945875 -1065692 -1138426 -1320056 -1472134
65 -1472134 -1348937 -1210204 -1080558 -1333358 -1107250 -798842 -705277 -414416 -1096273 -1414236
55 -1414236 -1394256 -1065480 -1025422 -691115 -915400 -1151166 -907437 -1272089 -1421213 -1277111
45 -1277111 -1305729 -1028675 -984395 -1063086 -1454341 -1383604 -1651286 -2005832 -1501964 -874258 -1242513
34 -1242513 -1218992 -876724 -1151041 -1307334 -1188426 -1066005 -1102806 -1372902 -1408339 -1661996
24 -1661996 -1728381 -1350588 -979921 -835431 -915150 -1106842 -1296504 -1150861 -1101749 -709084
14 -709084 -860620 -1425401 -1874133 -1747517 -1555309 -1126732 -1016323 -1067481 -868587 -946085
4 -946085 -1290598 -1349260 -1643548 -1739338
0 -1739338
$$ Imaginary data points
##PAGE= N=2
##DATA TABLE= (X++(I..I)), XYDATA
16383 -9261504 -9161575 -9167042 -9472237 -9625407 -9154985 -8952490 -8726075 -8706764 -8725580 -8606173
16373 -8606173 -8056263 -7455755 -7373368 -7583303 -7181533 -7504955 -8187826 -7631191 -7442365 -7207984
16363 -7207984 -6920624 -7053849 -6916004 -6855080 -6673108 -6444098 -6016721 -5860715 -5749327 -5956107
16353 -5956107 -6230632 -5961558 -5579976 -5449415 -5668214 -5822670 -5747016 -5330666 -4812270 -4764713
16343 -4764713 -4758511 -4774173 -4829600 -4608458 -4727559 -4479316 -4183203 -4427777 -4361828 -3965316
16333 -3965316 -3612395 -3457017 -3817184 -4022059 -4008500 -3642714 -3120831 -2726870 -2563597 -3063586
16323 -3063586 -3115718 -2681066 -2153743 -1551413 -1858264 -2370235 -2237413 -2023363 -2132256 -2108345
16313 -2108345 -1967321 -2052815 -2471170 -2164171 -889509 -800890 -854277 -437016 -654239 -859977
16303 -859977 -806959 -677298 -612441 -566500 -238001 -256312 -626906 -740818 -211349 -149445
16293 -149445 -68491 420664 780216 562829 544214 400718 166857 424421 450952 239343
16283 239343 892755 1674956 1739021 1600262 1509979 1268346 1127099 1452781 1412517 1343637
16273 1343637 1565315 1835176 2201067 3004440 2806386 2360541 2270932 2359902 2100425 2192414
16263 2192414 2577578 1873971 1751110 2586655 2882976 3387088 3505595 3132414 2943137
16254 2943137 3383818 3224309 3070784 2728455 2590191 2822073 3320438 4283190 4211040 3917725
16244 3917725 3767200 3903329 3831242 4210174 4260221 4155440 4150526 4194535 4430242 4836120
16234 4836120 5142019 4784122 4697512 4800722 4983663 4717085 4421675 4602452 4194740 4157713
16224 4157713 4501529 5014158 5091563 5609709 5996720 5790087 5423806 5429063 5575444 5341655
16214 5341655 4993862 5151682 5123621 5088611 5411966 5525970 5871316 6302847 6395391 6009612
16204 6009612 5880998 6201668 6157158 6063435 5947199 5533850 5508911 5985983 6816929 6863961
16194 6863961 7003181 7052505 6481613 5908105 6397332 6896436 6466984 5943769 5998055 6446888
16184 6446888 6915736 7399767 7419228 7053706 7035331 6853017 7110007 7144228 6855026 6897308
16174 6897308 6619382 6673981 6644577 6245646 6819148 7507546 7142764 7299524 7845635 7721552
16164 7721552 7517940 7529364 7426824 7454966 7083157 6748304 6437552 7118445 7680543 7838863
16154 7838863 7874806 7741403 7182474 7432612 7897896 8059188 8049273 7643849 7735036 7811190
16144 7811190 7588702 7364902 7542270 7601163 7520076 7752214 8042238 7949697 7838578 7587320
16134 7587320 7341023 7646793 8079246 8307941 8607497 8129900 7357928 6887078 6956247 7206231
16124 7206231 7558112 8092992 8108629 8283438 8583658 8379548 8319517 8406409 8012868 8471981
16114 8471981 8857780 7900206 7856001 8331571 8965737 8943134 8420431 8499335 8410404 7984145
16104 7984145 7596275 7588102 8215628 8343528 8024478 8104770 8790398 8999180 9039032 8801867
16094 8801867 8512393 8144413 7621503 7497186 7668719 7328519 7718357 8612196 8887211
16085 8887211 8746863 9113480 8847357 7982105 7830979 7808860 7906521 8313709 8129591 7886953
16075 7886953 7716368 7663472 8222899 8584954 9392374 9280457 8791397 9320512 8818249 8334569
16065 8334569 8765837 9198016 8649314 7984620 7906208 8179509 8651015 8822834 8846920 8796492
16055 8796492 8989774 8817428 8644067 8575757 8403965 8725418 9073988 8378735 8070075 8326907
16045 8326907 8256583 8738001 8666202 8099299 8052084 8679268 8622415 7974781 8101536 7869784
16035 7869784 7951329 8379856 9332284 9677855 9253783 8879278 8471103 7691472 8135568 8419498
16025 8419498 8648176 8882701 8773263 8767613 9272177 8939767 8967781 8399716 7965400 8522259
16015 8522259 8856039 9155670 8934308 8798881 9152967 8787211 8804367 9188141 8540831 8012352
16005 8012352 8081056 8248046 8385469 8632959 8981959 8688556 8264744 8307072 8590937 8711221
15995 8711221 8235129 8627785 8648821 8324239 8560404 9302655 9020562 8019295 8030544 8502069
15985 8502069 8514107 8522180 8067069 7927708 8403091 8966560 8143922 8454585 8750901 8434660
15975 8434660 9022967 9064857 8820239 9036854 8759237 8571090 8822251 8928984 9041062 9036205
15965 9036205 8907461 8809176 8649187 8863857 8630205 8029133 8699685 9019868 8904807 9214238
15955 9214238 8876614 8142716 7291348 7565347 8718223 8861559 9053782 8908765 8832519
15946 8832519 8594486 8367482 8315358 8007731 7690327 8200961 8465303 8920370 9661879 9544630
15936 9544630 8680391 8267827 7916597 7939491 8466597 8890405 9102572 8897691 8656700 8865164
15926 8865164 8839482 8817996 8514313 9029651 9119078 8759035 8492093 8240526 8752943 8658750
15916 8658750 8174878 8422950 8490300 8329423 8398516 8163850 8544496 8496227 8464737 8331673
15906 8331673 8152635 8461705 8730485 8662623 8739256 8437824 8251482 8718110 8721154 8001135
15896 8001135 8289139 8346631 8673646 8904768 9303900 9087427 8873094 8675109 8935914 9090206
15886 9090206 9073226 8980613 8853280 8926116 8404936 8017069 8675241 9141073 8599252 8309676
15876 8309676 8210839 8492931 8794139 8755282 8406222 8236350 8680732 8131031 8354888 8804991
15866 8804991 8544183 8433616 8847155 8852725 8499232 8874018 8170518 7718032 8073746 8587252
15856 8587252 8967951 9202878 8839152 9152824 9200788 9171148 9535587 9207810 8517206 8437442
15846 8437442 8296133 8475326 8986529 9089145 9149580 9052165 8800115 8941393 8723211 8632609
15836 8632609 8472104 8578957 8779005 8540927 8731317 8817232 8783386 8736972 8948239 8817888
15826 8817888 8781043 8954147 8698165 8532725 8379856 8299217 8091057 8388124 8685606 8712759
15816 8712759 9186031 9353924 8719121 8781666 8831453 8372823 8578988 8620541 8189453 8521354
15806 8521354 8963514 8860977 8922465 8894957 8775336 9252238 9412941 9250539 8730139 8337155
15796 8337155 8772184 8855398 8614134 9101285 9280664 8982052 8766080 8388232 8695396 8963044
15786 8963044 9057758 9176631 8846883 9021579 9533898 8875691 8981291 8875711 8112833 7990882
15776 7990882 7926068 8231453 9007300 9272750 9323985 9131411 9073722 8924908 8799603 8607921
15766 8607921 8434836 8273583 8662100 9348668 9105853 9121168 9312189 9213385 9372105 9111710
15756 9111710 8768807 8780175 8668118 8963383 8368087 8592095 8860435 8393800 8088744 8787483
15746 8787483 8827994 8641799 9232885 9544765 9473065 9410331 8767315 8712597 8477661 8474858
15736 8474858 8615874 8678295 8656873 8579299 8454908 8631399 8845918 8996480 8946495 9040078
15726 9040078 9147511 9254475 9239408 9000132 8736016 8180456 8514546 9186406 9389918 9197147
15716 9197147 8986704 8606612 8104628 7740226 8276021 8437528 8621063 8680152 9096455 9040255
15706 9040255 9113580 8858531 9156276 9286664 8723588 8923237 9321492 8945593 8700540 8560420
15696 8560420 8618795 8395990 8420562 8610561 8648751 8518185 8996000 9110088 8972461 9222193
15686 9222193 8947328 9118362 9521322 8594840 8262994 8770638 9000304 9093908 9513550 8641322
15676 8641322 8104608 8378717 8755001 9321278 9486027 9494495 9364902 8782221 8349881 8517781
15666 8517781 8703289 9412362 8933076 8182946 8526429 8914493 8985703 8507037 8469785 9076713
15656 9076713 9391455 9350681 9318441 9415647 9018992 8794913 8350770 8740764 8794191 8942140
15646 8942140 9148203 9023334 8987018 8774442 8777591 8949547 8998834 8498619 8280071 8828988
15636 8828988 8566756 8869635 9238388 9082345 8723199 8709360 8463034 8713303 8725064 8514670
15626 8514670 8811071 8769788 8813670 8806830 8609205 8792558 8965199 8833538 9208300 8784843
15616 8784843 8494810 8693108 8683891 8903676 9048509 9070074 9147545 8861727 8724325 8456062
15606 8456062 8288647 8397158 8746027 8971853 8788611 8939390 9079081 8905002 8850013 8320226
15596 8320226 8434745 8445623 8790986 8718239 8973910 9328324 8928691 8471403 8284932 8540002
15586 8540002 8534556 8736951 8217631 8155703 8935171 9091840 9185961 9678413 9016070 8940381
15576 8940381 8598539 7865753 8260373 8651712 8930476 9376580 9401088 9189851 8678555 9027773
15566 9027773 8767247 8572948 8682530 9000384 8640501 8885407 8918853 8738283 9145429 9351588
15556 9351588 8906491 8050173 8546470 8931372 8811569 9112457 8500720 8234894 8939959
15547 8939959 9160318 8475880 8521560 9574556 9781763 9551344 9659833 9092850 8368667
15538 8368667 8095935 7731887 8260489 8668488 9001421 8877634 9107258 9328962 9601160
15529 9601160 8714245 8934768 9177121 9138959 9295205 8873825 8244922 8570380 9126966 8963056
15519 8963056 9175951 9146840 8740987 8356345 8704114 8375133 8245865 8633872 8379190 8725911
15509 8725911 9140711 9519770 9671371 9945921 9353299 8534244 8509123 8516498 8476513 8372417
15499 8372417 8621828 8787246 9425197 10189862 9864904 9334946 9213719 8655994 8517627
15490 8517627 9028398 8918709 8787555 9053188 9189880 8507613 9042317 8997107 8708391 9046327
15480 9046327 8885369 9085430 9310398 9644317 9095785 9517186 9445280 8686972 8601772 8840346
15470 8840346 8833456 8636836 9357261 9399747 8974839 8886353 8721976 8562235 8738599 8917104
15460 8917104 8654308 8744494 9264028 9474473 9171050 9491759 9237374 8782287 8994054 9207784
15450 9207784 8818950 8737885 9088619 9030775 9338223 9529673 9201263 9259571 9203013 8879928
15440 8879928 8533969 9039521 9356629 9485487 9114374 8697719 9020943 9320367 9113893
15431 9113893 8767453 8327346 8662398 8999854 8707406 8898266 8773738 9034971 9399066
15422 9399066 9423653 9259300 9248841 8526186 8571359 8806934 8472494 8845794 8673927 8979421
15412 8979421 9088223 9047183 9306634 9200497 9277140 8890607 8815390 8757909 8955309 9202501
15402 9202501 9741938 9021590 8736870 8974996 8954474 9083409 9265632 9042029 8890977 9247404
15392 9247404 8804559 9177289 9523118 9119674 8981545 8307447 8570427 8941197 9131303
15383 9131303 9148005 9065252 8972557 8860172 8723050 8722275 9182592 9052495 9313764 9307378 8971778
15372 8971778 9154953 9092632 8393509 8181105 8388722 8559503 8653468 9011002 9558398 9562779
15362 9562779 9534779 9488327 9045563 9378655 9122955 9075894 9009189 9269227 8993829 9475247
15352 9475247 9471876 8784948 8707498 9033015 8840495 8908314 8747129 8213796 8164164 8620254
15342 8620254 8689374 8851242 9214583 9563498 9934863 9540433 9354400 8889609 8575329 7911275
15332 7911275 8080752 8721207 8592675 9152441 9601288 9363021 10150227 10276698 9338766
15323 9338766 8475021 8790846 8937965 9010865 8533496 8822644 9001141 9575680 9909491 9860754
15313 9860754 9591490 9318012 8607129 8508863 9015203 9141104 9522824 9369271 9419449 9542783
15303 9542783 9900846 9645779 9516692 9045918 8489577 8772336 9047048 9061801 9161303 9192201
15293 9192201 9164969 8921632 9219277 9303945 8935132 8726319 9242768 9189022 9097852 9211112
15283 9211112 9373078 9140322 8555051 8533986 8648504 8884028 9195943 9291302 9259983 9422640
15273 9422640 9525460 9323940 9302606 8770027 9133561 9269271 9538500 9706282 9064929 9463120
15263 9463120 10071069 9850404 9267279 8838703 8544011 8416109 8494719 9632203 9786381
15254 9786381 9530035 10083254 10105331 9833234 9696864 9124108 8479380 8423488 8461454 8832532
15244 8832532 9923853 10007386 9761345 9362832 9627147 9685589 9189660 9136753 8810390 9063122
15234 9063122 9433098 9294686 9275651 9298173 9593656 9856420 10138697 9761696 9420338 9451919
15224 9451919 8976108 8706295 9114058 9020297 8929686 9597043 9903488 9491033 9767954 9758218
15214 9758218 9362218 9757197 10030559 9307066 9100292 8923698 8062909 7947957 8609245
15205 8609245 9123758 9591846 10177449 9816295 9759146 9856828 9496594 9217650 9114471 9039385
15195 9039385 8700676 8941193 9345044 9355914 9774834 9867941 9156129 8951387 9282587 8936694
15185 8936694 8964560 8878405 8981287 9066504 8885118 9487346 9654412 9286793 9334374 9547063
15175 9547063 10074196 9946289 9382439 8899500 8590844 8975394 9186893 9205747 9346291 9217049
15165 9217049 9253211 9065011 9316741 9675159 9925307 9872631 9821501 10195416 9868919 9161108
15155 9161108 8955104 8762071 9197664 9555089 9430317 9227275 9832497 9751627 8994478 9476163
15145 9476163 9322484 9143901 8941326 9084618 9040966 9144508 9326462 9164360 9286573 9672995
15135 9672995 9522526 9434252 9616926 9615423 9247686 9060312 8767766 8999301 9154156 9773105
15125 9773105 9921701 9372188 9581042 9638032 9270019 9443544 9159277 8816628 8856638 8813783
15115 8813783 9675776 9536410 8906380 8706160 8752439 9271222 9848429 9762966 9521370 9814000
15105 9814000 9401753 9164861 9292193 8722271 8840951 9299524 9325296 9068113 9536518 9546181
15095 9546181 8917540 8586270 8574732 8911401 9297403 9274845 9648396 9306810 9700428 9790747
15085 9790747 9238759 9218815 9213163 8742097 8821126 9470458 9525603 9347479 9226813 9070552
15075 9070552 9238353 9070282 9371779 9196387 8934817 9113090 8888390 9238328 9403505
15066 9403505 9187290 9306238 8953487 8965156 9052363 8875469 9102191 8680958 8925846 9718411
15056 9718411 9680349 9544496 9264028 8955121 8977679 9526731 9574460 9087622 9143161 9061713
15046 9061713 8966801 8733370 8683328 8413956 8973877 9591872 9894347 9449581 9118247 9000998
15036 9000998 9136019 9068029 8993528 9296265 9261458 8816760 8724943 8937358 9085088 9550257
15026 9550257 9469160 9148451 9395450 9914274 9959981 9476211 9439992 9220032 9329649 9092729
15016 9092729 8603208 9012374 9594834 9790028 9931444 9979801 9922543 9446733 9343200 8762728
15006 8762728 8801669 9545004 9572103 9623417 9485394 8771470 8729389 9218903 9711665 9156199
14996 9156199 9338018 9212877 9114589 9482899 9522315 9243303 8718540 9054306 9134054 9096778
14986 9096778 9497551 9372784 9236654 9322559 9231124 9293711 8984840 9566847 9673784 9459803
14976 9459803 9916421 10258086 9570568 9283393 9474985 9565616 8942420 8965336 9076709 9113013
14966 9113013 9493844 9605389 9405910 9640940 9809672 9585599 9415921 9645928 9258367
14957 9258367 9220772 9390512 9596533 9172141 9665259 9654022 8868989 9098684 9793681 9837098
14947 9837098 9866447 9815922 9420272 9712636 10356941 9770306 9789560 10064463 9505792 9055061
14937 9055061 9242542 9054309 9076348 9926645 9999884 10098093 9338808 9025333 9092403 9247999
14927 9247999 9648356 10221641 10369195 10320288 9608394 9278070 8876401 9094364 9589699 9578321
14917 9578321 9055681 9782261 10058558 9773803 9481835 9635211 9253751 9473616 9811600
14908 9811600 9496506 9402220 9584015 9256770 8846763 9761387 9982540 9500974 9577000 9240458
14898 9240458 9142348 9689379 9910459 9242069 9543027 9975247 9422029 9894522 10199373 10348544
14888 10348544 10110047 9536054 9209419 9651288 9412889 9372832 9387493 9448192 9124307 9205222
14878 9205222 9824739 10037464 9554290 9661654 9423709 9093973 9969085 10128684 9768030
14869 9768030 10149532 10017694 9530096 9229053 9326096 9097230 9630958 9884146 9374340 9189022
14859 9189022 9825316 9899811 9324077 9503100 9633242 9525026 9901619 9986084 9465975 9264063
14849 9264063 9371038 9429876 9324250 9579217 9710208 9658777 9493023 9644030 9587131 10091929
14839 10091929 10237430 9662530 9309383 9028128 9501814 9876139 9542346 9774538 9834612
14830 9834612 9387077 9112114 9306651 8912281 9388242 9862781 9324319 9467282 9511404 9252440
14820 9252440 9140438 9429142 9450641 9153318 9451064 9974356 9693011 8854107 8799031 8788518
14810 8788518 9033520 9560633 9991880 10219279 10045076 9614251 9226269 9017451 9252992
14801 9252992 9743345 9787492 10065980 9868464 9447118 9774644 9480427 9358474 9439117 9510377
14791 9510377 9303438 9465417 9780797 9744085 9394231 9219016 9903278 10144015 9796446 9269725
14781 9269725 9226917 10015955 9730396 8565451 8733387 9681483 9259258 9210543 10255098
14772 10255098 9700885 9331605 9679194 9052690 9006884 9236844 8997574 9078045 9357880 9599207
14762 9599207 9333289 9574595 9754999 9078254 8551690 9078173 9501423 10061294 10047215 9728274
14752 9728274 9653873 9930375 10118084 9960116 9404921 9587274 10381049 9746365 8777012 8913517
14742 8913517 9462802 9669697 9619924 9883252 9487269 9589830 9587948 9319310 9710036 10292772
14732 10292772 10126748 9583699 9734518 9650696 9582223 9770070 9506630 8815123 8945505 9343670
14722 9343670 9966856 9998202 10213833 10052839 10344839 10396883 10023156 9557261 8904464 9138734
14712 9138734 9829626 9934482 10226648 10240573 9940977 9538733 9776919 10005800 10184707 9985439
14702 9985439 9556310 9143432 9262651 10051214 10194419 10582426 10058881 9711972 9986441
14693 9986441 9282401 9326090 9309099 9227907 9875390 10207432 10036516 9942320 9992254 9719419
14683 9719419 9739129 9860541 10420786 10272752 10230892 10008984 9642209 10018842 10655415 10099998
14673 10099998 9835872 9732620 9661559 9644811 9842407 9652456 9635083 9627716 9891305 10190059
14663 10190059 10751658 10724005 10443815 10471753 10222234 9697752 9582178 9908394 9586959 9687522
14653 9687522 10411127 10501329 9864594 9560557 9300446 9736749 9929189 10438208 10171886 9942000
14643 9942000 9964474 9850005 9460155 9372664 9520583 9686390 10475450 10690291 10664603 10072890
14633 10072890 9123150 9134067 9226436 9673620 10260094 10587821 10575810 10806338 10712547 10665197
14623 10665197 9836881 9314499 9104345 8879147 9388283 10122013 10655558 10050644 9827444
14614 9827444 9639780 10061869 10441888 10528513 10472637 9940159 9987049 10403411 9885385 9427569
14604 9427569 9895327 9908872 9638842 9961976 10041762 9805872 9435802 9837000 10058023 9602047
14594 9602047 9918148 10379506 9748017 9922210 10030558 9640236 9909873 10032630 9712367
14585 9712367 9618837 9803819 10020975 10256200 10095600 9948395 9956394 10066886 10233370 9982922
14575 9982922 9833877 9521963 9254505 9676159 9711339 9693689 9693357 9664331 9727418 10070751 9601265
14564 9601265 9120292 9791823 10431641 10072897 9834080 10101101 9842281 9697457 9727707 9900670
14554 9900670 10205574 10258602 10005419 9660946 9693630 9865789 9974894 9809803 9755574 9709791
14544 9709791 10099580 10060894 9638122 9814968 10113124 10122825 10210876 10295534 9869535 9838010
14534 9838010 9867895 10272164 9931764 9612244 9926919 9768717 9480743 9679152 10044192 9767346
14524 9767346 9612968 9826930 10112452 9966109 9997367 10043970 10091959 9894830 9728680 10051509
14514 10051509 9744429 9373647 9456756 9440052 9766955 10151717 10009603 9874707 9887886 9391667
14504 9391667 9773564 10414935 10968698 10718313 10328238 9781164 9233303 9148774 9357469 9875749
14494 9875749 9570520 9428983 9801209 10201165 9882047 9978559 9744496 9606359 10262828 10243673
14484 10243673 10285263 10711044 10385965 9933427 9782781 9212968 8900449 9172951 9584525
14475 9584525 9721518 9905004 10365654 10310210 10311652 10391121 10283623 9745309 9475807 9491862
14465 9491862 10293049 10396109 10345253 10047153 9555283 8986286 9629358 10411542 10327077 10227826
14455 10227826 9672777 9851435 10352574 10607394 10444982 9873750 10246063 10875898 10732130
14446 10732130 10555094 10062198 9495430 9350734 9656158 9386138 9982697 9924158 9983459 9986318
14436 9986318 10144993 10065134 10221922 9793303 9967971 10332388 9810792 10128120 10601602 10249254
14426 10249254 9964998 9955447 9594561 9258482 9591981 9710280 9755661 9844125 10605562 10356036
14416 10356036 9925361 10010099 10222092 10705805 10190201 9691368 10175548 10620809 10207697
14407 10207697 10278102 10215338 10035287 9800914 10105054 9907645 10490848 10453112 10651528 10543562
14397 10543562 9973180 9766072 9801617 9661772 9576909 9724711 10217604 10369127 10466170 10493981
14387 10493981 10362708 10043516 9971198 9821330 10242047 10585812 10195971 9858663 10797100
14378 10797100 10991316 10878138 10647352 10426957 9735927 9263483 9821849 9278412 9292170
14369 9292170 10070350 10116215 10236883 11254554 11211251 10856530 10928115 9927690 9858128 10049118
14359 10049118 9463484 9629307 9926248 10162511 10228578 10123457 9757079 9952697 9815853
14350 9815853 9962472 10038761 9964229 9749541 9875359 9965466 10532023 10870911 10438630 10527598
14340 10527598 10565610 10608220 9898701 9448577 10275909 10353122 10122423 9950961 10086279 9813955
$$ [...]
##END NTUPLES=NMR SPECTRUM
##END=
