##TITLE=1H_CA-8814-2
 DMSO, 8 sc, 
 2.02.2021
##JCAMPDX= 6.0         $$ Bruker NMR JCAMP-DX V2.0
##DATA TYPE= NMR SPECTRUM
##DATA CLASS= NTUPLES
##ORIGIN= UXNMR, Bruker Analytische Messtechnik GmbH
##OWNER= root
$$ XWIN-NMR		Version 3.5
$$ Tue Feb  2 09:58:34 2021 Russian Standard Time (UT+4h)  she@DPX200
##.OBSERVE FREQUENCY= 200.1315066352
##.OBSERVE NUCLEUS= ^1H
##.ACQUISITION MODE= SIMULTANEOUS
##.ACQUISITION SCHEME= undefined
##.AVERAGES= 8
##.DIGITISER RES= 18
##SPECTROMETER/DATA SYSTEM= spect
##.PULSE SEQUENCE= zg30
##.SOLVENT NAME= DMSO
##.SHIFT REFERENCE= (INTERNAL, DMSO, 0, 15.9326)
##AUDIT TRAIL= $$ (NUMBER, WHEN, WHO, WHERE, WHAT)
$$ ##TITLE= Audit trail, XWIN-NMR		Version 3.5
$$ ##JCAMPDX= 5.01
$$ ##ORIGIN= Bruker BioSpin GmbH
$$ ##OWNER= she
$$ F:/spectra/data/she/nmr/H-F/1/pdata/1/auditp.txt
$$ ##AUDIT TRAIL=  $$ (NUMBER, WHEN, WHO, WHERE, WHAT)
(   1,<2021-02-02 09:57:10.89 +0400>,<she>,<DPX200>,
      <created by zg, POWCHK disabled, PULCHK disabled
       configuration hash MD5:
       00 E9 B6 7A A2 85 ED C7 34 08 36 98 17 FE 4E 26
       data hash MD5: 16K
       A0 87 78 02 38 69 16 20 34 74 5B 9C 17 2E 71 99>)
(   2,<2021-02-02 09:57:15.31 +0400>,<she>,<DPX200>,
      <Start of raw data processing
       efp BC_mod = 2 LB = 0.24 FT_mod = 6 PKNL = 1 PHC0 = -10757.6 PHC1 = 12.00095 SI = 16K 
       data hash MD5: 16K
       2E 5F 0A EA 4C E8 E6 47 B3 73 7D 8A 04 97 50 DE>)
(   3,<2021-02-02 09:57:33.68 +0400>,<she>,<DPX200>,
      <pk PHC0 = -3.506661 PHC1 = 0 
       data hash MD5: 16K
       67 08 D7 AA E6 60 CD 34 C6 DA 4A 09 C9 2E 46 EC>)
(   4,<2021-02-02 09:57:36.87 +0400>,<she>,<DPX200>,
      <abs ABSG = 5 
       data hash MD5: 16K
       1F B0 68 BD 98 6E 56 54 FA DE B8 F4 A0 33 B6 12>)
(   5,<2021-02-02 09:57:50.57 +0400>,<she>,<DPX200>,
      <pk PHC0 = 1.200055 PHC1 = 0 
       data hash MD5: 16K
       9A 9F 85 3C 53 BA 52 03 79 91 C9 63 E9 E1 28 3E>)
(   6,<2021-02-02 09:57:53.96 +0400>,<she>,<DPX200>,
      <abs ABSG = 5 
       data hash MD5: 16K
       64 D3 AF F1 D1 0F EF 96 5F 88 47 AB 51 AB 94 36>)
$$ ##END=
$$ 
$$ hash MD5
$$ FF 94 AB 9E 1D 4C 1C C6 7A 6F 94 4D DF 2C 74 0A
##$RELAX= 
##$RELAX= 
##$RELAX= 
##$RELAX= 
##$RELAX= 
##$RELAX= 
$$ Bruker specific parameters
$$ --------------------------
##$DU= <F:/spectra>
##$EXPNO= 1
##$NAME= <H-F>
##$PROCNO= 1
##$TYPE= <nmr>
##$USER= <she>
##$AMP= (0..31)
100 100 100 100 100 100 100 100 100 100 100 100 100 100 100 100 100 100 
100 100 100 100 100 100 100 100 100 100 100 100 100 100 
##$AQSEQ= 0
##$AQ_mod= 1
##$AUNM= <au_zg>
##$AUTOPOS= <>
##$BF1= 200.13
##$BF2= 200.13
##$BF3= 200.13
##$BF4= 200.13
##$BF5= 200.13
##$BF6= 200.13
##$BF7= 200.13
##$BF8= 200.13
##$BYTORDA= 1
##$CFDGTYP= 0
##$CFRGTYP= 5
##$CHEMSTR= <none>
##$CNST= (0..31)
1 1 145 1 1 1 1 1 1 1 1 1 1 1 1 1 1 1 1 1 1 1 1 1 1 1 1 1 1 1 1 1 
##$CPDPRG= <>
##$CPDPRG1= <>
##$CPDPRG2= <>
##$CPDPRG3= <>
##$CPDPRG4= <mlev>
##$CPDPRG5= <mlev>
##$CPDPRG6= <mlev>
##$CPDPRG7= <mlev>
##$CPDPRG8= <mlev>
$$ [...]
##$SUBNAM3= <"">
##$SUBNAM4= <"">
##$SUBNAM5= <"">
##$SUBNAM6= <"">
##$SUBNAM7= <"">
##$SUBNAM8= <"">
##$SUBNAM9= <"">
##$SW= 16.9725356469052
##$SWIBOX= (0..15)
0 0 2 0 0 0 0 0 0 0 0 0 0 0 0 0 
##$SW_h= 3396.73913043478
##$TD= 16384
##$TD0= 1
##$TE= 0
##$TE2= 300
##$TE3= 300
##$TEG= 300
##$TL= (0..7)
0 120 120 120 120 120 120 120 
##$TP= (0..7)
150 150 150 150 150 150 150 150 
##$TP07= 0
##$TPNAME0= <>
##$TPNAME1= <>
##$TPNAME2= <>
##$TPNAME3= <>
##$TPNAME4= <>
##$TPNAME5= <>
##$TPNAME6= <>
##$TPNAME7= <>
##$TPOAL= (0..7)
0.5 0.5 0.5 0.5 0.5 0.5 0.5 0.5 
##$TPOFFS= (0..7)
0 0 0 0 0 0 0 0 
##$TUNHIN= 0
##$TUNHOUT= 0
##$TUNXOUT= 0
##$USERA1= <user>
##$USERA2= <user>
##$USERA3= <user>
##$USERA4= <user>
##$USERA5= <user>
##$V9= 5
##$VALIST= <valist>
##$VCLIST= <CCCCCCCCCCCCCCC>
##$VD= 0
##$VDLIST= <DDDDDDDDDDDDDDD>
##$VPLIST= <PPPPPPPPPPPPPPP>
##$VTLIST= <TTTTTTTTTTTTTTT>
##$WBST= 1024
##$WBSW= 4
##$XGAIN= (0..3)
0 0 0 0 
##$XL= 0
##$YL= 0
##$YMAX_a= 886426
##$YMIN_a= -724556
##$ZGOPTNS= <>
##$ZL1= 120
##$ZL2= 120
##$ZL3= 120
##$ZL4= 120
##$ABSF1= 15.93259
##$ABSF2= -1.040072
##$ABSG= 5
##$ABSL= 3
##$ALPHA= 0
##$AQORDER= 0
##$ASSFAC= 0
##$ASSFACI= 0
##$ASSFACX= 0
##$ASSWID= 0
##$AUNMP= <proc_1d>
##$AZFE= 0.1
##$AZFW= 0.1
##$BCFW= 0
##$BC_mod= 2
##$BYTORDP= 0
##$COROFFS= 0
##$CY= -3
##$DATMOD= 1
##$DC= 0
##$DFILT= <>
##$DTYPP= 0
##$F1P= 0
##$F2P= 0
##$FCOR= 1
##$FTSIZE= 16384
##$FT_mod= 6
##$GAMMA= 0
##$GB= 0
##$INTBC= 1
##$INTSCL= 2.992141e-10
##$ISEN= 128
##$LB= 0.24
##$LEV0= 0
##$LPBIN= 0
##$MAXI= 10000
##$MC2= 0
##$MEAN= 0
##$ME_mod= 0
##$MI= 1.114404
##$NCOEF= 0
##$NC_proc= -7
##$NLEV= 6
##$NOISF1= 3.799351
##$NOISF2= 2.8
##$NSP= 0
##$NTH_PI= 0
##$NZP= 0
##$OFFSET= 15.93259
##$PC= 1
##$PHC0= -10759.91
##$PHC1= 12.00095
##$PH_mod= 1
##$PKNL= yes
##$PPARMOD= 0
##$PSCAL= 0
##$PSIGN= 0
##$REVERSE= no
##$SF= 200.130016414474
##$SI= 16384
##$SIGF1= 3
##$SIGF2= 2
##$SINO= 5.538805
##$SIOLD= 16384
##$SREGLST= <1H.CDCl3>
##$SSB= 0
##$STSI= 16384
##$STSR= 0
##$SW_p= 3396.73913043478
##$SYMM= 0
##$S_DEV= 0
##$TDeff= 16384
##$TDoff= 0
##$TI= <>
##$TILT= no
##$TM1= 0
##$TM2= 0
##$TOPLEV= 0
##$USERP1= <user>
##$USERP2= <user>
##$USERP3= <user>
##$USERP4= <user>
##$USERP5= <user>
##$WDW= 1
##$XDIM= 16384
##$YMAX_p= 455893886
##$YMIN_p= -2690395
$$ End of Bruker specific parameters
$$ ---------------------------------
##NTUPLES= NMR SPECTRUM
##VAR_NAME=  FREQUENCY,     SPECTRUM/REAL,   SPECTRUM/IMAG
##SYMBOL=    X,             R,               I
##VAR_TYPE=  INDEPENDENT,   DEPENDENT,       DEPENDENT
##VAR_FORM=  AFFN,          ASDF,            ASDF
##VAR_DIM=   16384,         16384,           16384
##UNITS=     HZ,            ARBITRARY UNITS, ARBITRARY UNITS
##FACTOR=    0.207333158178281, 1,           1
##FIRST=     3188.58940435306, 0,            0
##LAST=      -208.149726081715, 0,           0
##MIN=       -208.149726081715, -2690395,    0
##MAX=       3188.58940435306, 455893886,    0
$$ Real data points
##PAGE= N=1
##DATA TABLE= (X++(R..R)), XYDATA
$$ [...]
$$ plain form
5329 19196281 18973321 19146920 19357607 19130240 19250408 19010014 18904135 18652087 19293034
5320 19293034 20152311 20119733 20111635 19879218 20319946 20461242 20672498 20505329 20345597 20291245
5310 20291245 20353444 20402358 20212597 20570707 21360507 21751176 21442719 21519779 22152416 21857201
5300 21857201 22291294 23104225 22646036 22417629 22557284 22368692 22573577 22642296 22999058 22419978
5290 22419978 21796728 22276700 22230725 22222658 22744587 23082575 22472449 22530653 23257104 23634507
5280 23634507 23716676 24086292 24208170 23738471 23439746 23812540 24014869 23943588 23656710 23914098
5270 23914098 24102321 24493811 24108095 24424144 24815689 24889803 25247741 25448937 25261720 25604663
5260 25604663 26270482 26066584 25791905 25887967 25401996 24796507 24965202 25531257 25291878 24968008
$$ packed form
5329A9196281k22960J73599K10687k27367J20168k40394j05879k52048O40947
5320A9293034Q59277l2578q098k32417M40728J41296K11256j67169j59732n4352
5310B0291245O2199M8914j89761L58110P89800L90669l08457P7060O32637k95215
5300B1857201M34093Q12931m58189k28407J39655j88592K04885O8719L56762n79080
5290B2419978o23250M79972m5975q067N21929L37988o10126N8204P26451L77403
5280B3634507Q2169L69616J21878m69699k98725L72794K02329p1281k86878K57388
5270B3914098J88223L91490l85716L16049L91545P4114L57938K01196j87217L42943
5260B5604663O65819k03898k74679R6062m85971o05489J68695N66055k39379l23870
$$ plain form
5250 24968008 25466346 25845244 25401544 25952654 27222354 27271219 26762169 27454474 28019297
5241 28019297 27537975 27520185 28138870 28144101 26965006 26854867 27576428 27455131 26928253 27596085
5231 27596085 28225687 28053424 28490345 29542283 29797522 29756399 30417205 31545338 31715898
5222 31715898 31701699 31763780 31230180 30808296 31254953 31476221 31394640 31476057 31626194 31767450
5212 31767450 32392270 32823248 32580253 33074942 33393870 33723793 34093346 33678782 33310235
5203 33310235 33500933 34031525 34119684 34138939 34130790 34175500 34711704 35119756 35185461 35414298
5193 35414298 35965187 37015206 37399395 37447254 38053646 38258245 38118598 38383896 38510387
5184 38510387 38915804 39220295 39251052 38546522 38453201 39015204 40047119 40169970 40056386 40086704
$$ packed form
5250B4968008M98338L78898m43700N51110J269700M8865n09050O92305N64823
5241B8019297m81322j7790O18685N231j179095j10139P21561j21297n26878O67832
5231B7596085O29602j72263M36921J051938K55239m1123O60806J128133J70560
5222C1715898j4199O2081n33600m21884M46657K21268q1581Q1417J50137J41256
5212C1767450O24820M30978k42995M94689L18928L29923L69553m14564l68547
5203C3310235J90698N30592Q8159J9255q149M4710N36204M08052O5705K28837
5193C5414298N50889J050019L84189M7859O06392K04599j39647K65298J26491
5184C8510387M05417L04491L0757p04530r3321N62003J031915J22851j13584L0318
$$ plain form
5174 40086704 40164372 40594021 40926415 41149017 40781817 41244298 41591572 41334138 41756114 41935906
5164 41935906 42422185 43043614 43298166 43599789 43936984 44406970 45092233 45625270 45521519
5155 45521519 45782602 46245012 46356638 46029851 46702048 46813000 47105561 46937656 46583391
5146 46583391 46638455 47167028 47500594 47612994 47562785 47210913 47259857 47396572 47633981 47957528
5136 47957528 47884022 48461776 48587484 48820991 49504375 49909008 50261444 51240583 51508686 51196687
5126 51196687 51636556 51832853 51902457 51885724 52406462 52587305 52007261 51969148 52815695 53632927
5116 53632927 53309039 53468788 53745088 53441266 53960986 54336588 53773519 53554389 54080106
5107 54080106 53850929 53866308 53759825 54206412 54514213 54556548 54701411 54631404 55092323 55213215
$$ packed form
5174D0086704P7668M29649L32394K22602l67200M62481L47274k57434M21976J79792
5164D1935906M86279O21429K54552L01623L37195M69986O85263N33037j03751
5155D5521519K61083M62410J11626l26787O72197J10952K92561j67905l54265
5146D6583391N5064N28573L33566J12400n0209l51872M8944J36715K37409L23547
5136D7957528p3506N77754J25708K33507O83384M04633L52436R79139K68103l11999
5126E1196687M39869J96297O9604j6733N20738J80843n80044l8113Q46547Q17232
5116E3632927l23888J59749K76300l03822N19720L75602n63069k19130N25717
5107E4080106k29177J5379j06483M46587L07801M2335J44863p0007M60919J20892
$$ plain form
5097 55213215 55494373 55620366 55350264 56107344 57034617 57134822 57154033 57930624 58677373 58664064
5087 58664064 58955807 59661763 59235832 59330183 60107781 60058057 59574191 59735462 60567758 60982754
5077 60982754 60864655 61041549 61640442 61623570 61500054 62702204 63245601 62655654 62980154
5068 62980154 63913906 63966941 63709943 64171251 65147680 65138089 65213606 65189676 65699056 66367266
5058 66367266 66144961 66616447 66867230 67414626 67780132 67489011 67833639 68725775 69317446
5049 69317446 69359814 69914247 70463027 70831202 71302401 72086704 72528924 72993470 73528506 73272245
5039 73272245 73753292 73674704 73050154 73552668 74867644 75333307 75178356 76329595 77386913
5030 77386913 77869862 78333504 78762223 79250675 79457397 79865998 80173333 80749119 80701822 81245248
$$ packed form
5097E5213215K81158J25993k70102P57080R27273J00205J9211P76591P46749j3309
5087E8664064K91743P05956m25931R4351P77598m9724m83866J61271Q32296M14996
5077F0982754j18099J76894N98893j6872j23516J202150N43397n89947L24500
5068F2980154R33752N3035k56998M61308R76429r591P5517k3930N09380O68210
5058F6367266k22305M71486K50783N47396L65506k91121L44628Q92136N91671
5049F9317446M2368N54433N48780L68175M71199P84303M42220M64546N35036k56261
5039G3272245M81047p8588o24550N02514J314976M65663j54951J151239J057318
5030G7386913M82949M63642M28719M88452K06722M08601L07335N75786m7297N43426
$$ plain form
5020 81245248 81951205 81590737 82056210 82675810 83295109 83921880 84687527 85064526 85273378
5011 85273378 86263084 86747411 87003104 87463683 88175987 88981457 89423382 89569497 90197917
5002 90197917 90814443 91849446 92386614 92784782 93893672 94710456 95126518 95685316 96571743
4993 96571743 97168442 97637206 97649109 98601201 99420737 99532222 99746043 100444660 101165170 101713757
4983 101713757 102593700 102807217 103387940 103838011 104739726 106066830 106514634 106533475 107180788
4974 107180788 108353742 109118477 109696297 110260092 111352168 112121272 112137402 113152733 114370395
4965 114370395 115212414 115919346 116708660 117439395 118238112 119095397 119992694 120914724 121337353
4956 121337353 121890502 122689381 123636584 124240102 124869372 125896038 127106169 128487015 128773497
$$ packed form
5020H1245248P05957l60468M65473O19600O19299O26771P65647L76999K08852
5011H5273378R89706M84327K55693M60579P12304Q05470M41925J46115O28420
5002I0197917O16526J035003N37168L98168J108890Q16784M16062N58798Q86427
4993I6571743N96699M68764J1903R52092Q19536J11485K13821O98617P20510N48587
4983A01713757Q79943K13517N80723M50071R01715J327104M47804J8841O47313
4974A07180788J172954P64735N77820N63795J092076P69104J6130J015331J217662
4965A14370395Q42019P06932P89314P30735P98717Q57285Q97297R22030M22629
4956A21337353N53149P98879R47203O03518O29270J026666J210131J380846K86482
$$ plain form
4947 128773497 129257304 130441162 131488388 132535744 132919695 133078951 134044017 135029087 136218257
4938 136218257 137291524 138414103 139681675 141268820 142325732 142968326 144266071 145837632
4930 145837632 147001110 147457555 148424747 149038327 149858219 150874479 152187712 152924826 153395432
4921 153395432 154977254 156813482 157367179 158656123 160604148 162472917 163310080 163841035
4913 163841035 165067022 166985165 168081782 168400701 169619392 170627407 171453707 172648358
4905 172648358 174137859 175381302 176620267 178488354 180226249 181851554 183117031 184844917
4897 184844917 187217721 188027574 189476863 191365301 192823982 194256398 196511946 198247833
4889 198247833 199231465 201477277 204089779 205644218 207239659 209402358 212168554 212999382
$$ packed form
4947A28773497M83807J183858J047226J047356L83951J59256R65066R85070J189170
4938A36218257J073267J122579J267572J587145J056912O42594J297745J571561
4930A45837632J163478M56445R67192O13580Q19892J016260J313233P37114M70606
4921A53395432J581822J836228N53697J288944J948025J868769Q37163N30955
4913A63841035J225987J918143J096617L18919J218691J008015Q26300J194651
4905A72648358J489501J243443J238965J868087J737895J625305J265477J727886
4897A84844917K372804Q09853J449289J888438J458681J432416K255548J735887
4889A98247833R83632K245812K612502J554439J595441K162699K766196Q30828
$$ plain form
4881 212999382 214091588 216424793 218777196 220458394 222016701 224183096 225819537 227412501
4873 227412501 229573929 232438915 233835309 235144222 238051862 240100428 241936318 244480609
4865 244480609 246593921 249246888 251935199 254860198 256799463 259337735 261596558 263893154
4857 263893154 266423279 268439751 270240523 272083630 273936734 275524695 277949015 279866959
4849 279866959 281726615 284396818 286020669 288273709 291652207 294507251 296499076 298169597
4841 298169597 300489770 302278745 304215156 305981919 306680683 308199981 309526024 310738357
4833 310738357 312357487 313451375 314746992 317023387 318606249 319430850 321465812 324148671
4825 324148671 325430206 327164495 330023848 331606476 333205190 335338288 337257430 339358302
$$ packed form
4881B12999382J092206K333205K352403J681198J558307K166395J636441J592964
4873B27412501K161428K864986J396394J308913K907640K048566J835890K544291
4865B44480609K113312K652967K688311K924999J939265K538272K258823K296596
4857B63893154K530125K016472J800772J843107J853104J587961K424320J917944
4849B79866959J859656K670203J623851K253040L378498K855044J991825J670521
4841B98169597K320173J788975J936411J766763O98764J519298J326043J212333
4833C10738357J619130J093888J295617K276395J582862Q24601K034962K682859
4825C24148671J281535J734289K859353J582628J598714K133098J919142K100872
$$ plain form
4817 339358302 341194456 342346756 343535668 344560257 345002422 346074955 347537660 347933885
4809 347933885 348356499 349094567 350042479 351502187 352878336 353503988 354419451 355624969 356975170
4800 356975170 357954578 358976707 359701114 360409319 361695244 362167867 362714142 363672799 364323063
4791 364323063 365170727 366142742 366571457 367126157 367806160 368391477 368219563 368454318 369605274
4782 369605274 370028199 370322263 370114504 371390916 372438136 372721393 373333576 373342235 373930501
4773 373930501 374575414 374914771 374726224 374213634 374707874 374821076 374920067 375429258 375648691
4764 375648691 375624958 375872527 376064304 376423277 376843407 377246381 377473102 377363318 377590674
4755 377590674 377502115 377792153 378166787 377990022 378118942 378133469 378683877 378199913 378401923 378835593
$$ packed form
4817C39358302J836154J152300J188912J024589M42165J072533J462705L96225
4809C47933885M22614P38068R47912J459708J376149O25652R15463J205518J350201
4800C56975170R79408J022129P24407P08205J285925M72623N46275R58657O50264
4791C64323063Q47664R72015M28715N54700O80003N85317j71914K34755J150956
4782C69605274M22925K94064k07759J276412J047220K83257O12183Q659N88266
4773C73930501O44913L39357j88547n12590M94240J13202R8991N09191K19433
4764C75648691k3733K47569J91777L58973M20130M02974K26721j09784K27356
4755C77590674q8559K90038L74634j76765J28920J4527N50408m83964K02010M33670
$$ plain form
4745 378835593 378478745 378711900 378881758 379160298 378471387 378625639 379321798 379218062 379112434
4736 379112434 379048313 378985475 378484340 378004899 378343352 377389380 376666659 376652210 376554735 375890245
4726 375890245 375599298 375382756 375070860 375007115 374413293 374224614 374290583 373983196 373269998 372821512
4716 372821512 372292402 371588452 371276702 369867626 368708414 368408760 367581184 366543854 365448469
4707 365448469 364693418 363211965 362416595 361697148 360369192 359572044 358137941 356838035 355141409
4698 355141409 353937578 352698325 351438451 350789429 349102738 347848276 346963588 346169548
4690 346169548 344877478 343556084 343134626 341729725 341030612 339694840 338491276 337361163
4682 337361163 335768486 335131982 333391632 331844231 330498929 329226566 328265161 326710452
$$ packed form
4745C78835593l56848K33155J69858K78540o88911J54252O96159j03736j05628
4736C79112434o4121o2838n01135m79441L38453r53972p22721j4449r7475o64490
4726C75890245k90947k16542l11896o3745n93822j88679O5969l07387p13198m48486
4716C72821512n29110p03950l11750j409076j159212k99654q27576j037330j095385
4707C65448469p55051j481453p95370p19447j327956p97148j434103j299906j696626
4698C55141409j203831j239253j259874o49022j686691j254462q84688p94040
4690C46169548j292070j321394m21458j404901o99113j335772j203564j130113
4682C37361163j592677o36504j740350j547401j345302j272363r61405j554709
$$ plain form
4674 326710452 325105782 323657643 322553693 321413361 319917501 318630144 317156409 315421667
4666 315421667 313838646 312369267 310261844 308230713 306947992 304542964 301953469 300485857
4658 300485857 298717445 296710776 295295580 293256686 291200441 290190936 288813499 286962825
4650 286962825 285119447 283490407 281889207 280757646 279370404 276996119 275588404 274136014
4642 274136014 272770723 271387225 269606885 268525267 266767694 265291695 263460058 261905234
4634 261905234 261299393 259395666 257804675 256073041 254520902 253234662 251101952 249158153
4626 249158153 247308051 245741873 243974801 242323091 240846643 238662359 236587688 235505283
4618 235505283 233741607 231928411 230344622 229079372 227650806 226572377 225313305 223562749
$$ packed form
4674C26710452j604670j448139j103950j140332j495860j287357j473735j734742
4666C15421667j583021j469379k107423k031131j282721k405028k589495j467612
4658C00485857j768412k006669j415196k038894k056245j009505j377437j850674
4650B86962825j843378j629040j601200j131561j387242k374285j407715j452390
4642B74136014j365291j383498j780340j081618j757573j475999j831637j554824
4634B61905234o05841j903727j590991j731634j552139j286240k132710j943799
4626B49158153j850102j566178j767072j651710j476448k184284k074671j082405
4618B35505283j763676j813196j583789j265250j428566j078429j259072j750556
$$ plain form
4610 223562749 221810010 220138628 219444666 218468702 216212063 214484040 213590866 211710615
4602 211710615 209997694 208927752 207862566 206807370 205619048 204269546 202750131 202296546
4594 202296546 201793038 200142247 198760398 197230081 196289677 195233547 193795453 192245676
4586 192245676 190696325 189811857 189111002 187954614 186540002 185172980 185118695 184421527 183037488
4577 183037488 182645118 182111616 181101271 179801659 179244236 179048016 178051104 177151132 176138763
4568 176138763 175804558 175717854 174644967 173765930 173172030 173074756 172365650 172672525 172500992
4559 172500992 171923853 171980732 172341153 172387669 172549620 172590107 171765697 170691003 169833418 168838421
4549 168838421 167543060 166813099 165994259 164668092 164014233 163567700 162637670 161688226 161303868
$$ packed form
4610B23562749j752739j671382o93962r75964k256639j728023q93174j880251
4602B11710615j712921j069942j065186j055196j188322j349502j519415m53585
4594B02296546n03508j650791j381849j530317r40404j056130j438094j549777
4586A92245676j549351q84468p00855j156388j414612j367022n4285o97168j384039
4577A83037488l92370n33502j010345j299612n57423j96220r96912q99972j012369
4568A76138763l34205q6704j072887q79037n93900r7274p09106L06875j71533
4559A72500992n77139N6879L60421M6516J61951M0487q24410j074694q57585r94997
4549A68838421j295361p29961q18840j326167o53859m46533r30030r49444l84358
$$ plain form
4540 161303868 161092937 160777485 160425906 160252419 160885566 160861676 160982779 160925824 161121419 161268913
4530 161268913 160490476 159853195 159455472 159038844 158417501 157476451 157208807 157347295 157822304
4521 157822304 157902932 157960185 158529061 159710667 160674267 162098826 163900804 165351032 166787585
4512 166787585 168938748 171381823 174056621 177419902 180924395 184721471 189297741 194357146
4504 194357146 198965195 204616858 209503882 212999581 216537215 218883877 218799215 217402442
4496 217402442 216281112 214690303 213822132 213828920 214110319 215450443 217342647 220087680 223733190
4487 223733190 227942828 231370924 234274250 236940160 238262679 238661989 237858973 237042682
4479 237042682 235700467 234069451 232549880 229483191 225456971 220754535 216010633 210430837
$$ packed form
4540A61303868k10931l15452l51579j73487O33147k3890J21103n6955J95595J47494
4530A61268913p78437o37281l97723m16628o21343r41050k67644J38488M75009
4521A57822304Q0628N7253N68876J181606R63600J424559J801978J450228J436553
4512A66787585K151163K443075K674798L363281L504493L797076M576270N059405
4504A94357146M608049N651663M887024L495699L537634K346662q4662j396773
4496B17402442j121330j590809q68171O788K81399J340124J892204K745033L645510
4487B23733190M209638L428096K903326K665910J322519L99310q03016q16291
4479B37042682j342215j631016j519571l066689m026220m702436m743902n579796
$$ plain form
4471 210430837 205198588 201300490 197535705 194782931 192287666 190318007 189607556 189253885
4463 189253885 189402867 189374453 189649258 189877676 189142396 187624361 184946535 180887211 175326089
4454 175326089 169829504 165216348 159584448 154263443 150426626 146654407 142709455 139221326
4446 139221326 136308998 133702356 130835533 128412450 126280145 124395823 122162462 120306154
4438 120306154 119269111 117875288 116392146 115576618 114804295 114246974 113708288 112970152 112282525
4429 112282525 111647161 110695561 108941985 106955030 105517352 104413965 102566710 101369393
4421 101369393 100495375 98677711 97379814 96068355 94807207 93740903 92426745 91673220
4413 91673220 91138336 90556791 89576489 88972616 88491937 87957484 87336604 87185155 86598913
$$ packed form
4471B10430837n232249l898098l764785k752774k495265j969659p10451l53671
4463A89253885J48982k8414K74805K28418p35280j518035k677826m059324n561122
4454A75326089n496585m613156n631900n321005l836817l772219l944952l488129
4446A39221326k912328k606642k866823k423083k132305j884322k233361j856308
4438A20306154j037043j393823j483142q15528p72323n57321n38686p38136o87627
4429A12282525o35364r51600j753576j986955j437678j103387j847255j197317
4421A01369393q74018j817664j297897j311459j261148j066304j314158p53525
4413I1673220n34884n81545r80302o03873m80679n34453o20880j51449n86242
$$ plain form
4404 86598913 85852117 85121443 83756902 82536030 81429805 80271289 79029954 77411801
4396 77411801 76653465 75731323 74653422 73988765 72982641 72107104 70730118 70040257 69539878
4387 69539878 68188185 67273150 67392073 67774260 66826281 66235564 66018382 65363305 65232419
4378 65232419 64718210 64427250 63861408 62994278 62210976 61820339 61596616 60947673 60613833
4369 60613833 60297046 59826485 59726354 59692849 59235086 58618780 58725373 58482809 57382845
4360 57382845 56892066 56703107 56558641 55603906 55158434 54689395 53790215 52991669 52772247
4351 52772247 52855751 52238872 52233873 51857675 50908478 51244268 51429331 51362088 50824377 50628686
4341 50628686 50205270 50147097 50641144 50445979 50127020 49798315 49425124 49040525 48570999 48021137
$$ packed form
4404H6598913p46796p30674j364541j220872j106225j158516j241335j618153
4396G7411801p58336r22142j077901o64657j006124q75537j376986o89861n00379
4387F9539878j351693r15035J18923L82187r47979n90717k17182o55077j30886
4378F5232419n14209k90960n65842q67130p83302l90637k23723o48943l33840
4369F0613833l16787m70561j00131l3505m57763o16306J06593k42564j099964
4360E7382845m90779j88959j44466r54735m45472m69039q99180p98546k19422
4351E2772247Q3504o16879m999l76198r49197L35790J85063o7243n37711j95691
4341E0628686m23416n8173M94047j95165l18959l28705l73191l84599m69526n49862
$$ plain form
4331 48021137 48002562 47879125 46868362 46103685 46458579 46378488 45463360 45602192 46170636 45136650
4321 45136650 44178669 44216845 44063574 43793118 43706119 43362156 42937925 42325402 42220344 42081200
4311 42081200 42005313 41714881 42016451 41374675 40715361 40674892 41080098 40891531 40445568 40620082
4301 40620082 40676573 40556016 40372136 40498324 40185648 39238963 39302837 39319680 38411717 38173614
4291 38173614 38220788 37696424 36772205 36350389 36614486 36228206 36607608 37209439 36826679 36743783
4281 36743783 37242728 37185826 36656958 37103635 37208490 36597368 36039198 35216877 35064995 35211078
4271 35211078 34509926 33836023 33652905 33395333 33073474 32996483 32842519 32681803 32303939 32209204
4261 32209204 32175797 32552742 32790220 32526159 32178179 31962082 32080347 31976059 31832208 31515407
$$ packed form
4331D8021137j8575j23437j010763p64677L54894q0091r15128J38832N68444j033986
4321D5136650r57981L8176j53271k70456q6999l43963m24231o12523j05058j39144
4311D2081200p5887k90432L01570o41776o59314m0469M05206j88567m45963J74514
4301D0620082N6491j20557j83880J26188l12676r46685O3874J6843r07963k38103
4291C8173614M7174n24364r24219m21816K64097l86280L79402O01831l82760q2896
4281C6743783M98945n6902n28868M46677J04855o11122n58170q22321j51882J46083
4271C5211078p01152o73903j83118k57572l21859p6991j53964j60716l77864r4735
4261C2209204l3407L76945K37478k64061l47980k16097J18265j04288j43851l16801
$$ plain form
4251 31515407 30833594 30529751 29959173 29950222 29747250 29612623 30030169 29989574 29956817 29796693
4241 29796693 29491976 30018043 29991519 29555021 29277683 28983848 28648584 28217543 28180127 27844783
4231 27844783 26725785 26170886 26094622 26601526 26601686 26402036 27393452 27690613 27450574 27491031
4221 27491031 27677155 27529239 26994826 26757900 27030431 26978915 26679592 26426077 26477687 26133762
4211 26133762 25886207 25806720 25886443 26132347 25820289 25875192 26044473 25570559 25528315 25451770
4201 25451770 25638326 25191588 24534740 24880774 25147980 24775570 24660391 25078924 24664863
4192 24664863 23984755 23844585 23652894 23624874 23830629 23489091 23991147 23779048 23628747 24041014
4182 24041014 24438547 24173110 23460471 23546487 23571850 23626551 23227383 23300761 23563414 22769557
$$ packed form
4251C1515407o81813l03843n70578q951k02972j34627M17546m0595l2757j60124
4241B9796693l04717N26067k6524m36498k77338k93835l35264m31041l7416l35344
4231B7844783j118998n54899p6264N06904J60j99650R91416K97161k40039M0457
4221B7491031J86124j47916n34413k36926K72531n1516k99323k53515N1610l43925
4211B6133762k47555p9487P9723K45904l12058N4903J69281m73914m2244p6545
4201B5451770J86556m46738o56848L46034K67206l72410j15179M18533m14061
4192B4664863o80108j40170j91691k8020K05755l41538N02056k12099j50301M12267
4182B4041014L97533k65437p12639Q6016K5363N4701l99168P3378K62653p93857
$$ plain form
4172 22769557 22606255 22214411 21897239 21938557 22088129 22257969 21781017 21535096 21411283 21359225
4162 21359225 21330966 21896765 21541799 21147961 21210729 21139932 20950277 20936258 21419000 21029988
4152 21029988 20205803 20165650 20537518 20491448 20108287 19938270 19881122 19417954 19847617 20070961
4142 20070961 19534147 19364512 19506138 20062390 19907696 19471462 19875617 20387852 20080862
4133 20080862 19587469 19971736 19659055 19389338 19500278 19900055 19428334 18808251 18851242 18953152
4123 18953152 18484251 18216134 18516301 18452790 17966984 17897753 18458510 18319816 18261339 18368632
4113 18368632 18699245 18505130 18745836 19000294 18339454 18440909 18554573 18163939 18040626
4104 18040626 17856629 17938625 17463954 17630338 17862900 18270034 17858839 17508008 18164166 17725318
$$ packed form
4172B2769557j63302l91844l17172M1318J49572J69840m76952k45921j23813n2058
4162B1359225k8259N65799l54966l93838O2768p0797j89655j4019M82742l89012
4152B1029988q24185m0153L71868m6070l83161j70017n7148m63168M29663K23344
4142B0070961n36814j69635J41626N56252j54694m36234M04155N12235l06990
4133B0080862m93393L84267l12681k69717J10940L99777m71721o20083M2991J01910
4123A8953152m68901k68117L00167o3511m85806o9231N60757j38694n8477J07293
4113A8368632L30613j94115K40706K54458o60840J01455J13664l90634j23313
4104A8040626j83997Q1996m74671J66384K32562M07134m11195l50831O56158m38848
$$ plain form
4094 17725318 17672096 17829003 17676956 17180885 16909225 17161156 16956597 17293430 17054199 16330930
4084 16330930 16408981 17133017 16882098 16415689 16232629 15928622 15549255 15420758 15118085 15339331
4074 15339331 15591283 15035887 15154770 15539557 15755625 15637856 15753144 15847654 15783405 15765029
4064 15765029 15767296 15801144 15519129 15653994 15435734 15540015 15120086 14868085 14869161 14391108
4054 14391108 15059008 14886100 14702385 14488123 14634807 14811822 14618839 14919366 15412713
4045 15412713 15073803 14857328 14926603 14981704 14679714 14586953 14504688 14316171 14472353 14567473
4035 14567473 14946343 15332417 14802388 14679564 15183078 15079109 15015069 15209309 15536031 15560038
4025 15560038 15478953 14827219 14629247 14788960 14371443 14606783 14874295 14867254 14692369 14624785
$$ packed form
4094A7725318n3222J56907j52047m96071k71660K51931k04559L36833k39231p23269
4084A6330930P8051P24036k50919m66409j83060l04007l79367j28497l02673K21246
4074A5339331K51952n55396J18883L84787K16068j17769J15288R4510o4249j8376
4064A5765029K267L3848k82015J34865k18260J04281m19929k52001J076m78053
4054A4391108O67900j72908j83715k14262J46684J77015j92983L00527M93347
4045A5412713l38910k16475O9275N5101l01990r2761q2265j88517J56182R5120
4035A4567473L78870L86074n30029j22824N03514j03969o4040J94240L26722K4007
4025A5560038q1085o51734j97972J59713m17517K35340K67512p041j74885o7584
$$ plain form
4015 14624785 15296929 14965811 15017391 14969125 14429009 14906199 15117204 14920268 14597069 15232026
4005 15232026 15571874 15344999 15808333 16136600 16654677 16815118 16747999 17081256 17808322 18583513
3995 18583513 18212873 19151221 19938056 20464314 22153748 23947119 24775302 24081049 23045677
3986 23045677 21267422 20235523 19776522 19029244 18732228 18314242 17701458 17435183 17866025
3977 17866025 17442311 17120858 16680634 16474436 16603197 16378772 15822789 15997520 16452324
3968 16452324 16571978 17055183 16829856 17052084 17006454 17119301 17386709 17683477 17719702 17425725
3958 17425725 17534211 17535608 18062517 18036781 17859230 18165187 17597354 17595845 17748634 17878630
3948 17878630 18014275 17954081 17993400 18023239 18150150 18357925 18542037 18490085 18497317 19013114
$$ packed form
4015A4624785O72144l31118N1580m8266n40116M77190K11005j96936l23199O34957
4005A5232026L39848k26875M63334L28267N18077J60441o7119L33257P27066P75191
3995A8583513l70640R38348P86835N26258J689434J793371Q28183o94253j035372
3986B3045677j778255j031899m59001p47278k97016m17986o12784k66275M30842
3977A7866025m23714l21453m40224k06198J28761k24425n55983J74731M54804
3968A6452324J19654M83205k25327K22228m5630J12847K67408K96768L6225k93977
3958A7425725J08486J397N26909k5736j77551L05957n67833j509J52789J29996
3948A7878630J35645o0194L9319K9839J26911K07775J84112n1952P232N15797
$$ plain form
3938 19013114 19308157 19395286 19912508 19810958 20045641 20654758 20824959 20698645 20857208 21625489
3928 21625489 21927621 21888804 22172870 22543970 22945499 22997871 23960937 24451814 25236999 25908770
3918 25908770 26228726 27094164 27827822 28989364 30262538 30849960 31417909 32757825 34904155
3909 34904155 36195327 37733250 39931169 41031509 42219929 43730736 44733903 44413670
3901 44413670 45298490 46304220 46281691 45533467 45472470 46158877 47241522 47186737 47116506 47641785
3891 47641785 48615956 48568623 48765492 48688426 48437612 48118738 47585982 46685600 45010352 43584989
3881 43584989 43312252 42807379 41339242 40184450 39027668 38813944 38038711 36832942 35848420
3872 35848420 35414480 35319780 35167172 34722335 34514751 34665802 35009029 35173049 35209542 35389255
$$ packed form
3938A9013114K95043Q7129N17222j01550K34683O09117J70201j26314J58563P68281
3928B1625489L02132l8817K84066L71100M01529N2372R63066M90877P85185O71771
3918B5908770L19956Q65438P33658J161542J273174N87422N67949J339916K146330
3909C4904155J291172J537923K197919J100340J188420J510807J003167l20233
3901D4413670Q84820J005730k2529p48224o0997O86407J082645n4785p0231N25279
3891D7641785R74171m7333J96869p7066k50814l18874n32756r00382j675248j425363
3881D3584989k72737n04873j468137j154792j156782k13724p75233j205769r84522
3872C5848420m33940r4700j52608m44837k07584J51051L43227J64020L6493J79713
$$ plain form
3862 35389255 36761412 37041307 37419697 38325975 39292720 40220656 41339626 43097320 44541413
3853 44541413 45833694 47953775 50222285 52434028 54641438 57192827 59665078 61761451
3845 61761451 64101477 65495540 66577182 67633535 67739627 67355432 66984857 66175549 65860532
3836 65860532 66066678 65487711 65405707 66141843 66058613 66063382 66941348 67318686 66882618 67149467
3826 67149467 66965589 65937959 64570440 62840856 60118514 56069854 52722072 50163920
3818 50163920 47645276 45493565 43479933 41494805 40097337 39600105 38518071 37202359
3810 37202359 36121751 35720282 35183834 33629800 33161367 32814200 31737829 30277545 29748102
3801 29748102 29919049 29006900 28524505 28294984 28299739 27956989 27388370 27541250 27602799 26896854
$$ packed form
3862C5389255J372157K79895L78390R06278R66745R27936J118970J757694J444093
3853D4541413J292281K120081K268510K211743K207410K551389K472251K096373
3845F1761451K340026J394063J081642J056353J06092l84195l70575q09308l15017
3836F5860532K06146n78967q2004P36136q3230M769Q77966L77338m36068K66849
3826F7149467j83878j027630j367519j729584k722342m048660l347782k558152
3818E0163920k518644k151711k013632j985128j397468m97232j082034j315712
3810C7202359j080608m01469n36448j554034m68433l47167j076371j460284n29443
3801B9748102J70947r12149m82395k29521M755l42750n68619J52880O1549p05945
$$ plain form
3791 26896854 26467360 27153137 26619372 26098262 26216841 25460907 24989278 24925700 24911174 24137536
3781 24137536 24268938 24688298 24215238 24554410 24301291 23449669 23052357 23160884 22940475
3772 22940475 23006727 23151873 22323211 22567417 22436747 22272779 22661192 22737419 22348244 22341119
3762 22341119 22692932 22278605 21815225 22422903 22422923 22163635 22437485 22803061 22615834 22679209
3752 22679209 23411654 23828004 23893607 23896675 24991597 25410154 25374960 25663482 27483518 28139362
3742 28139362 28716596 29563747 31115477 32761077 34262856 35601259 37958583 40503324
3734 40503324 42760440 45622117 49327604 53118753 57985823 64695161 72091514 80238357
3726 80238357 88864867 94844746 95305788 91758827 83922108 73616550 65462593 59131660
$$ packed form
3791B6896854m29494O85777n33765n21110J18579p55934m71629o3578j4526p73638
3781B4137536J31402M19360m73060L39172k53119q51622l97312J08527k20409
3772B2940475O6252J45146q28662K44206j30670j63968L88413P6227l89175p125
3762B2341119L51813m14327m63380O07678K0k59288K73850L65576j87227O3375
3752B2679209P32445M16350O5603L068J094922M18557l5194K88522J820036O55844
3742B8139362N77234Q47151J551730J645600J501779J338403K357324K544741
3734D0503324K257116K861677L705487L791149M867070O709338P396353Q146843
3726H0238357Q626510N979879M61042l546961p836719j0305558q153957o330933
$$ plain form
3718 59131660 54179119 50798565 48184729 45651748 43159656 41849671 40319940 39526063
3710 39526063 37992327 36788005 35866889 35467807 35005916 35073697 35078779 34667427 34869843 35103747
3700 35103747 35091386 35325764 35509569 35761942 35926098 36627937 37097504 38045366 38852647 40061327
3690 40061327 42207658 43114500 44489786 45954922 48195408 50119318 51596983 53227127
3682 53227127 54529715 55574413 56085798 56374185 55882360 54874497 53883382 52119464 50529824
3673 50529824 48583199 46899288 46513031 45020339 43191667 42362335 41928508 41035565 39982319
3664 39982319 39600422 38683270 38191202 38408730 38239030 37711864 37110333 37589891 38132264
3655 38132264 37416720 37560119 38890522 39281709 39717776 40927644 41978677 42371081 43780409
$$ packed form
3718E9131660m952541l380554k613836k532981k492092j309985j529731p93877
3710C9526063j533736j204322r21116l99082m61891O7781N082m11352K02416K33904
3700C5103747j2361K34378J83805K52373J64156P01839M69567R47862Q07281J208680
3690D0061327K146331R06842J375286J465136K240486J923910J477665J630144
3682E3227127J302588J044698N11385K88387m91825j007863r91115j763918j589640
3673E0529824j946625j683911l86257j492692j828672q29332m33827q92943j053246
3664C9982319l81897r17152m92068K17528j69700n27166o01531M79558N42373
3655C8132264p15544J43399J330403L91187M36067J209868J051033L92404J409328
$$ plain form
3646 43780409 45707431 47036407 48246578 49798243 51382729 53245404 54409013 55966047
3638 55966047 57595068 57938663 57980507 57618943 57098510 56322416 56061574 55276896 53868854
3629 53868854 53497324 53120939 52760176 52950734 53130624 53310671 53191875 53486647 53075178
3620 53075178 52373852 51533420 50059585 48759513 46671217 44109062 42953322 41332333
3612 41332333 39389440 38210804 38140147 37254556 36236817 36205935 35226324 35155336 35327683
3603 35327683 35181690 34726207 34071293 33506998 33271667 33054279 32917863 33570934 33591981 33724596
3593 33724596 34431652 35109862 35521137 36413804 38480632 39484329 41030072 42641070 44373797
3584 44373797 46673468 49137609 51619830 53339862 55857646 58334150 60784145 63076792
$$ packed form
3646D3780409J927022J328976J210171J551665J584486J862675J163609J557034
3638E5966047J629021L43595M1844l61564n20433p76094k60842p84678j408042
3629E3868854l71530l76385l60763J90558J79890J80047j18796K94772m11469
3620E3075178p01326q40432j473835j300072k088296k562155j155740j620989
3612D1332333j942893j178636p0657q85591j017739l0882r79611p0988J72347
3603C5327683j45993m55483o54914n64295k35331k17388j36416O53071K1047J32615
3593C3724596P07056O78210M11275Q92667K066828J003697J545743J610998J732727
3584D4373797K299671K464141K482221J720032K517784K476504K449995K292647
$$ plain form
3576 63076792 65302638 68664990 71840137 76289651 81802483 88566453 95480997 97126668
3568 97126668 95549722 92100348 86171757 76793213 68025121 61755344 55687471 50735398
3560 50735398 47372386 45003690 42618899 39332447 37852283 36267469 34092732 32339052
3552 32339052 30866892 29670717 28365196 27905739 27105205 26030422 24967933 24455150 24057368
3543 24057368 23733955 23237258 22515738 22129244 21368261 20990400 21319043 21313757 21068257 20507491
3533 20507491 19637424 19049333 19119965 19067466 18651519 17823776 17178685 16891009 16946275 17363213
3523 17363213 17765061 17989403 17357627 17714246 18137155 17827944 18016592 18540780 17765742
3514 17765742 16830907 16867746 16479643 16242181 15570494 16062073 16150432 15817544 15627088 16139103
$$ packed form
3576F3076792K225846L362352L175147M449514N512832O763970O914544J645671
3568I7126668j576946l449374n928591r378544q768092o269777o067873m952073
3560E0735398l363012k368696k384791l286452j480164j584814k174737j753680
3552C2339052j472160j196175j305521m59457q00534j074783j062489n12783l97782
3543B4057368l23413m96697p21520l86494p60983l77861L28643n286k45500n60766
3533B0507491q70067n88091P0632n2499m15947q27743o45091k87676N5266M16938
3523A7363213M01848K24342o31776L56619M22909l09211J88648N24188p75038
3514A7765742r34835L6839l88103k37462o71687M91579Q8359l32888j90456N12015
$$ plain form
3504 16139103 16917786 16624251 17025791 17264120 16369661 16499505 16507316 17058289 17300577 17033031
3494 17033031 17061429 16420142 17094598 17613486 18227523 18362013 17648496 17955560 17981590 18269731
3484 18269731 18484227 18730009 18776968 18581140 18543911 17848682 18671573 19558044 19390961 19080769
3474 19080769 19052214 19878140 20006555 19772973 19853171 20725945 21023562 20731426 20771953 21450386
3464 21450386 22124238 22871363 23585215 23095224 22957954 23559758 23923484 24250415 24238073 24698222
3454 24698222 25185382 25501172 26071184 26487045 27614510 27721280 28044218 28226995 28432312
3445 28432312 29549466 29987395 30063265 29843794 30206853 30710865 31236564 32010971 32170002
3436 32170002 33011684 33848406 34268792 35046038 36009943 36845219 38172764 39684208 40683405
$$ packed form
3504A6139103P78683k93535M01540K38329q94459J29844P811N50973K42288k67546
3494A7033031K8398o41287O74456N18888O14037J34490p13517L07064K6030K88141
3484A8269731K14496K45782M6959j95828l7229o95229Q22891Q86471j67083l10192
3474A9080769k8555Q25926J28415k33582Q0198Q72774K97617k92136M0527O78433
3464B1450386O73852P47125P13852m89991j37270O01804L63726L26931j2342M60149
3454B4698222M87160L15790N70012M15861J127465J06770L22938J82777K05317
3445B8432312J117154M37929P5870k19471L63059N04012N25699P74407J59031
3436C2170002Q41682Q36722M20386P77246R63905Q35276J327545J511444R99197
$$ plain form
3427 40683405 41530736 43207131 44491240 46179458 47803699 49700694 51559000 53579516
3419 53579516 56035125 58640115 61238939 64607388 68226244 72086008 75700657 79632661
3411 79632661 85089192 90689726 96572708 103132762 111000112 120655596 132636191 147563091
3403 147563091 164164651 184560227 209244373 240238956 276117394 311956525 331187244
3396 331187244 306368504 263921775 231467723 206717697 187642271 174459375 165203160
3389 165203160 158017908 153104190 149048260 146294578 143719130 142439342 142204301 142234251
3381 142234251 142968360 145430186 148398565 150642342 153076928 154880297 155886698 157453147
3373 157453147 160963635 165850482 171471276 177018389 180908835 182660239 183076849 183606007
$$ packed form
3427D0683405Q47331J676395J284109J688218J624241J896995J858306K020516
3419E3579516K455609K604990K598824L368449L618856L859764L614649L932004
3411G9632661N456531N600534N882982O560054P867350R655484J1980595J4926900
3403A47563091J6601560K0395576K4684146L0994583L5878438L5839131J9230719
3396C31187244k4818740m2446729l2454052k4750026j9075426j3182896r256215
3389A65203160p185252m913718m055930k753682k575448j279788k35041K9950
3381A42234251P34109K461826K968379K243777K434586J803369J006401J566449
3373A57453147L510488M886847N620794N547113L890446J751404M16610N29158
$$ plain form
3365 183606007 185854123 189016437 192905009 197901570 199360403 196751101 190680355 182497120
3357 182497120 174208880 166907826 161976748 157823047 154570560 151666664 147511200 141867572
3349 141867572 134205692 126649670 120024416 114113087 108720340 104314320 100378903 95761373
3341 95761373 90210410 84555013 79269051 74376903 70114922 66008276 63051328 60202985
3333 60202985 56826125 54136263 52481541 50422653 47932675 46087773 44504345 42762358
3325 42762358 41028390 39590282 38214712 37154864 35976828 35029667 34672177 33831830 32965783
3316 32965783 32596502 32107745 30675789 29945269 29877741 28994039 28203313 27478786 27229590
3307 27229590 26629626 25914462 25478323 25085519 24432790 23640967 23657447 23309438 22721475 22679132
$$ packed form
3365A83606007K248116L162314L888572M996561J458833k609302o070746q183235
3357A82497120q288240p301054m931078m153701l252487k903896m155464n643628
3349A41867572p661880p556022o625254n911329n392747m406020l935417m617530
3341I5761373n550963n655397n285962m892148m261981m106646k956948k848343
3333F0202985l376860k689862j654722k058888k489978j844902j583428j741987
3325D2762358j733968j438108j375570j059848j178036r47161l57490q40347q66047
3316C2965783l69281m88757j431956p30520o7528q83702p90726p24527k49196
3307B7229590n99964p15164m36139l92804o52729p91823J6480l48009n87963m2343
$$ plain form
3297 22679132 22206954 21706772 21161708 21141237 20919207 20143946 19775217 19488892 19160621 18772277
3287 18772277 18095655 17847779 17390677 16810448 16470331 16348287 15601793 15688592 16522314 16555598
3277 16555598 16266388 16434631 16698577 15934702 15936585 16274650 15754636 15808474 15382633 14630125
3267 14630125 14304254 13357316 13152185 13132206 13203983 12555803 12619237 12890288 12492944 12260279
3257 12260279 12276128 12264503 11979025 11375925 11085435 10737224 10607194 10516007 10810211 10795577
3247 10795577 10185193 10100024 9965633 10089112 9752040 9359749 9214181 9239829 9462391 9504344
3237 9504344 9925712 9935268 9804710 9706740 9838768 9954651 9489078 9239525 8993861 8920030
3227 8920030 8579809 8350297 7706812 8004255 8140443 7382751 7539986 7565611 6847822 6943170
$$ packed form
3297B2679132m72178n00182n45064k0471k22030p75261l68729k86325l28271l88344
3287A8772277o76622k47876m57102n80229l40117j22044p46494Q6799Q33722L3284
3277A6555598k89210J68243K63946p63875J883L38065n20014N3838m25841p52508
3267A4630125l25871r46938k05131j9979P1777o48180O3434K71051l97344k32665
3257A2260279J5849j1625k85478o03100k90490l48211j30030r1187K94204j4634
3247A0795577o10384q5169j34391J23479l37072l92291j45568K5648K22562M1953
3237I504344M21368R556j30558r7970J32028J15883m65573k49553k45664p3831
3227H920030l40221k29512o43485K97443J36188p57692J57235K5625p17789R5348
$$ plain form
3217 6943170 7207405 6767085 6581841 6328420 6499409 6215791 6393838 6621181 6187218 6517483
3207 6517483 6485228 6666734 6194060 6208620 6248363 5487219 5629165 5771617 5600868 5191151
3197 5191151 5486951 5429137 5560925 5492027 5574534 5885148 5272097 4749834 5084291 5127494
3187 5127494 4806737 4757314 4476773 4456923 4395093 4672742 4820798 4709312 4810278 4457205
3177 4457205 4629797 4630580 4431981 4183121 3672249 4001016 4609953 4999556 4978909 5012374
3167 5012374 5305393 5703872 5711753 5905144 5938367 5725828 6108329 6147451 6359801 5834605
3157 5834605 5540056 5812812 5802732 5525989 5257351 5635254 5725352 5651614 5664583 6376966
3147 6376966 6330382 6515980 7264358 7176150 7444697 7301583 7468655 7463578 7149526 7369247
$$ packed form
3217F943170K64235m40320j85244k53421J70989k83618J78047K27343m33963L30265
3207F517483l2255J81506m72674J4560L9743p61144J41946J42452j70749m09717
3197E191151K95800n7814J31788o8898Q2507L10614o13051n22263L34457M3203
3187E127494l20757m9423k80541j9850o1830K77649J48056j11486J00966l53073
3177D457205J72592P83j98599k48860n10872L28767O08937L89603k0647L3465
3167E012374K93019L98479P881J93391L3223k12539L82501L9122K12350n25196
3157E834605k94549K72756j0080k76743k68638L77903R0098p3738J2969P12383
3147F376966m6584J85598P48378q8208K68547j43114J67072n077l14052K19721
$$ plain form
3137 7369247 7463893 7637277 7232104 7207374 7469357 7388046 7440650 7777009 7895010 7791993
3127 7791993 7740734 7637042 7860343 7791996 7417966 7405494 7427726 7337331 6891960 7319175
3117 7319175 7513635 7441752 7970625 8146238 8364180 8551360 8725236 9342073 8877807 8617691
3107 8617691 8843863 8521300 8159155 8160960 8801936 8526116 8731015 9219651 9765270 10473371
3097 10473371 11287948 11434913 11213520 11581413 11416787 11365855 11488815 11340522 11066323 11112627
3087 11112627 11176590 11023420 10984387 11519256 12255904 12821001 12918672 13036849 13821267 14065647
3077 14065647 13763764 14526935 14331128 14027140 14425944 14921840 14615102 14707847 15321917 15681310
3067 15681310 16164028 16704278 16857576 17195289 17772912 17730342 18330305 18848152 19077554 19555381
$$ packed form
3137G369247R4646J73384m05173k4730K61983q1311N2604L36359J18001j03017
3127G791993n1259j03692K23301o8347l74030j2472K2232r0395m45371M27215
3117G319175J94460p1883N28873J75613K17942J87180J73876O16837m64266k60116
3107H617691K26172l22563l62145J805O40976k75820K04899M88636N45619P08101
3097A0473371Q14577J46965k21393L67893j64626n0932J22960j48293k74199M6304
3087A1112627O3963j53170l9033N34869P36648N65097R7671J18177P84418K44380
3077A4065647l01883P63171j95807l03988L98804M95896l06738R2745O14070L59393
3067A5681310M82718N40250J53298L37713N77623m2570N99963N17847K29402M77827
$$ plain form
3057 19555381 19602341 19897165 19743561 19402823 19504970 19871628 19713593 19472875 19779649 20051354
3047 20051354 20014999 19598787 20176276 20782797 21656959 21617292 21889127 23031107 23593618 23872078
3037 23872078 24550056 24914324 25727341 25770425 26369340 27164235 27637381 28164125 28763832 29167857
3027 29167857 29865621 30688751 31280860 31699771 32179147 32563404 33385531 34528014 34678614
3018 34678614 34998825 36458251 37616410 38051763 39300734 40130828 40539255 41817128 43068589
3009 43068589 43936561 44423129 45694739 46918605 47837992 49845752 51308080 53218979 54820014
3000 54820014 56579514 58709669 61364520 63423772 65669354 67955005 70114112 72813689
2992 72813689 75456900 78456972 81354359 84631335 88091533 91782618 95688948 99057039
$$ packed form
3057A9555381M6960K94824j53604l40738J02147L66658j58035k40718L06774K71705
3047B0051354l6355m16212N77489O06521Q74162l9667K71835J141980N62511K78460
3037B3872078O77978L64268Q13017M3084N98915P94895M73146N26744N99707M04025
3027B9167857O97764Q23130N92109M18911M79376L84257Q22127J142483J50600
3018C4678614L20211J459426J158159M35353J248971Q30094M08427J277873J251461
3009D3068589Q67972M86568J271610J223866R19387K007760J462328J910899J601035
3000E4820014J759500K130155K654851K059252K245582K285651K159107K699577
2992G2813689K643211L000072K897387L276976L460198L691085L906330L368091
$$ plain form
2984 99057039 103104977 107581970 111760585 116224316 120305414 124544989 128734478 133864512
2976 133864512 139185825 143621101 148288305 153629887 158241884 162816963 167939963 173491662
2968 173491662 178579576 182838541 187484934 192509748 196937635 201109013 205611707 209381954
2960 209381954 212543004 216381556 220018517 222884793 225472297 227853598 230257337 231847233
2952 231847233 233218847 233788441 234754926 234936633 234154922 233588254 232485702 230804798 229172892
2943 229172892 227296040 225574494 222674614 219542726 216436152 212414946 208556110 204225135
2935 204225135 200406472 196421702 191338842 186277068 181714141 177656794 173604947 168279151
2927 168279151 163123803 158693566 153821842 149246762 144737918 140303681 135248926 131057607
$$ packed form
2984I9057039M047938M476993M178615M463731M081098M239575M189489N130034
2976A33864512N321313M435276M667204N341582M611997M575079N123000N551699
2968A73491662N087914M258965M646393N024814M427887M171378M502694L770247
2960B09381954L161050L838552L636961K866276K587504K381301K403739J589896
2952B31847233J371614N69594R66485J81707p81711n66668j102552j680904j631906
2943B29172892j876852j721546k899880l131888l106574m021206l858836m330975
2935B04225135l818663l984770n082860n061774m562927m057347m051847n325796
2927A68279151n155348m430237m871724m575080m508844m434237n054755m191319
$$ plain form
2919 131057607 126982599 122590650 118308574 114149898 110592385 107033157 103212205 99687330
2911 99687330 96665200 93567172 89804299 86886138 84495842 81837523 78822775 76324182
2903 76324182 74205507 71461537 69700318 67640103 65385888 63461614 61477085 60290155
2895 60290155 58917481 56820642 55887983 54934828 53663064 52793718 52680372 51463807 50493066
2886 50493066 49873419 48812046 48027242 47143111 46301947 45107974 43971213 43143165 42409125
2877 42409125 42323084 41614867 40757608 40372251 40574766 40819195 40209768 39919868 39820022 40127438
2867 40127438 39531827 38453100 38335549 37739516 36869102 36571912 36237206 35399342 34751490
2858 34751490 34988995 34450602 34459438 34364821 34395680 34245918 34492886 34460909 34207178 34831863
$$ packed form
2919A31057607m075008m391949m282076m158676l557513l559228l820952l524875
2911I9687330l022130l098028l762873k918161k390296k658319l014748k498593
2903G6324182k118675k743970j761219k060215k254215j924274j984529j186930
2895F0290155j372674k096839r32659r53155j271764q69346j13346j216565r70741
2886E0493066o19647j061373p84804q84131q41164j193973j136761q28048p34040
2877D2409125q6041p08217q57259l85357K02515K44429o09427k89900r9846L07416
2867D0127438n95611j078727j17551n96033q70414k97190l34706q37864o47852
2858C4751490K37505n38393Q836r4617L0859j49762K46968l1977k53731O24685
$$ plain form
2848 34831863 34796366 34325811 33694564 33828493 34407434 34689124 34385240 33954075 34036294 34316526
2838 34316526 34093041 34482947 34724209 34732782 34519831 34247557 34545897 34802791 34345881 34835472
2828 34835472 35580947 35200944 34674143 35107914 35682719 36276859 35804713 35589279 36252394
2819 36252394 36527962 36663082 36879855 37693361 37848862 37319826 37856728 38812095 39105586
2810 39105586 39200705 40330840 40780258 40424532 41013160 41591631 42129385 43003266 43402871
2801 43402871 44187517 45340125 45709009 46540800 47545755 48134432 48551705 49536181 50026817
2792 50026817 50980923 52525727 53668762 54708847 55870172 57019799 58166303 59797343
2784 59797343 60899097 62304983 63787178 64932036 65975132 66795975 68519819 70009212
$$ packed form
2848C4831863l5497m70555o31247J33929N78941K81690l03884m31165Q2219K80232
2838C4316526k23485L89906K41262Q573k12951k72274K98340K56894m56910M89591
2828C4835472P45475l80003n26801M33771N74805N94140m72146k15434O63115
2819C6252394K75568J35120K16773Q13506J55501n29036N36902R55367K93491
2810C9105586R5119J130135M49418l55726N88628N78471N37754Q73881L99605
2801D3402871P84646J152608L68884Q31791J004955N88677M17273R84476M90636
2792E0026817R54106J544804J143035J040085J161325J149627J146504J631040
2784E9797343J101754J405886J482195J144858J043096Q20843J723844J489393
$$ plain form
2776 70009212 70996779 72395093 73520400 75140551 76425706 77865891 79694497 80820777
2768 80820777 81438596 82879233 84659738 85253382 86362727 88368318 89200342 90143961 91412493
2759 91412493 93079058 94602020 95606956 96852996 98678308 100975561 102322879 104745758
2751 104745758 107455403 109712275 112741770 115631246 118455770 122493036 126469519 130934925
2743 130934925 136025300 141370124 145935541 150359403 155025486 159946114 164988157 171504525
2735 171504525 178250712 185883526 194573821 203083606 213018743 224004790 234741464 246621773
2727 246621773 259166413 271966829 285078287 299343412 314386399 328600629 342948380
2720 342948380 357191029 371094585 384307040 396749856 408635453 419181585 428893686
$$ packed form
2776G0009212R87567J398314J125307J620151J285155J440185J828606J126280
2768H0820777O17819J440637J780505N93644J109345K005591Q32024R43619J268532
2759I1412493J666565J522962J004936J246040J825312K297253J347318K422879
2751A04745758K709645K256872L029495K889476K824524M037266L976483M465406
2743A30934925N090375N344824M565417M423862M666083M920628N042043O516368
2735A71504525O746187P632814Q690295Q509785R935137J0986047J0736674J1880309
2727B46621773J2544640J2800416J3111458J4265125J5042987J4214230J4347751
2720C42948380J4242649J3903556J3212455J2442816J1885597J0546132R712101
$$ plain form
2713 428893686 436444062 442485004 448241925 452189103 454268428 455480565 455893886 453993144
2705 453993144 451214746 447903420 443402629 436982745 430166625 422756526 413739161 403593760
2697 403593760 393077851 382211273 370251702 358247619 346081220 333240640 320893951
2690 320893951 308432905 296465504 284641000 273680296 262408901 252321447 243530314
2683 243530314 234283966 225526812 218396095 212022083 204836927 198929261 194023419 189774034
2675 189774034 185443494 181577033 178031252 174894481 171491348 167973905 165348934 162554446
2667 162554446 159000511 156309135 154342278 151424581 147873479 146257494 145026021 142690139
2659 142690139 140795339 139696515 137230792 135247974 133551129 131289053 128964564 126125121
$$ packed form
2713D28893686P550376O040942N756921L947178K079325J212137M13321j900742
2705D53993144k778398l311326m500791o419884o816120p410099r017365j0145401
2697D03593760j0515909j0866578j1959571j2004083j2166399j2840580j2346689
2690C20893951j2461046j1967401j1824504j0960704j1271395j0087454q791133
2683B43530314r246348q757154p130717o374012p185156n907666m905842m249385
2675A89774034m330540l866461l545781l136771l403133l517443k624971k794488
2667A62554446l553935k691376j966857k917697l551102j615985j231473k335882
2659A42690139j894800j098824k465723j982818j696845k262076k324489k839443
$$ plain form
2651 126125121 123779814 120532848 118053300 115314856 112679958 110735275 107919951 105821979
2643 105821979 104343335 102115274 100154254 98258929 96969104 95631580 94011171 92556778
2635 92556778 91051822 90049805 88791129 87666704 86773129 85529813 84972546 83592062
2627 83592062 82486158 81466654 80757890 79841622 78671040 77853416 76994016 76354110 75991408
2618 75991408 75390996 74841719 74751360 74698001 74598401 74721645 74773632 74756883 75157100 75914115
2608 75914115 75443447 75681809 75946966 76427533 77490427 77954659 78725996 79413696 80786598
2599 80786598 81923560 83170764 84523548 85099016 87112823 89365209 90973384 92392429
2591 92392429 94720284 97513743 99802766 102571941 105342697 108706796 111982703 115668334
$$ packed form
2651A26125121k345307l246966k479548k738444k634898j944683k815324k097972
2643A05821979j478644k228061j961020j895325j289825j337524j620409j454393
2635I2556778j504956j002017j258676j124425q93575j243316n57267j380484
2627H3592062j105904j019504p08764r16268j170582q17624q59400o39906l62702
2618G5991408o00412n49277r0359n3359r9600J23244N1987j6749M00217P57015
2608G5914115m70668K38362K65157M80567J062894M64232P71337O87700J372902
2599H0786598J136962J247204J352784N75468K013807K252386J608175J419045
2591I2392429K327855K793459K289023K769175K770756L364099L275907L685631
$$ plain form
2583 115668334 118656383 121358263 124723186 127200672 129524565 131089611 132513251 134428036
2575 134428036 135534490 137515663 138886772 140567919 142294934 143319766 144680660 145358548
2567 145358548 146219727 147081106 147104517 147135694 146265110 145182325 144212760 143666865 141951249
2558 141951249 140241080 139058528 137711578 136598263 135284956 134523197 133990594 133266119
2550 133266119 131946612 130839627 130847414 129355395 128716118 128755757 128054505 126941188 126690019
2541 126690019 126953482 126646177 126921908 127935164 128942653 129750017 130855864 132321260 133985253
2532 133985253 136234103 138455194 140772036 143807213 146532254 149618082 153706648 157921416
2524 157921416 161999630 166877403 172254754 177699460 183753585 190342144 197092649 204297805
$$ packed form
2583A15668334K988049K701880L364923K477486K323893J565046J423640J914785
2575A34428036J106454J981173J371109J681147J727015J024832J360894O77888
2567A45358548Q61179Q61379K3411L1177q70584j082785r69565n45895j715616
2558A41951249j710169j182552j346950j113315j313307p61759n32603p24475
2550A33266119j319507j106985P787j492019o39277L9639p01252j113317k51169
2541A26690019K63463l07305K75731J013256J007489Q07364J105847J465396J663993
2532A33985253K248850K221091K316842L035177K725041L085828M088566M214768
2524A57921416M078214M877773N377351N444706O054125O588559O750505P205156
$$ plain form
2516 204297805 211334243 219404570 227425888 235254504 244346587 253638827 262285065 270634117
2508 270634117 279686266 289178496 297989053 306690174 315700359 325082236 333876213 342269496
2500 342269496 350471642 358909165 366526240 373474056 380024762 386043567 391617649 396805337
2492 396805337 401545278 405416601 408630673 411615569 414569425 416771826 418044335 418324840
2484 418324840 418790226 419037136 418146743 416564979 414728456 412035957 409201441 405434312
2476 405434312 401502038 396497423 390539432 385478109 379577012 372929258 365723957 358375431
2468 358375431 351145473 343102272 334859112 326474023 318200803 310324700 301580670 293247520
2460 293247520 285105821 276776793 268213838 259985997 251531393 243093066 235572989 227481222
$$ packed form
2516B04297805P036438Q070327Q021318P828616R092083R292240Q646238Q349052
2508B70634117R052149R492230Q810557Q701121R010185R381877Q793977Q393283
2500C42269496Q202146Q437523P617075O947816O550706O018805N574082N187688
2492C96805337M739941L871323L214072K984896K953856K202401J272509K80505
2484D18324840M65386K46910q90393j581764j836523k692499k834516l767129
2476D05434312l932274n004615n957991n061323n901097o647754p205301p348526
2468C58375431p229958q043201q243160q385089q273220p876103q744030q333150
2460B93247520q141699q329028q562955q227841q454604q438327p520077q091767
$$ plain form
2452 227481222 219091808 211817174 204607254 197470993 190661483 184523137 177863192 171979211
2444 171979211 166402697 161825410 157239593 152385543 148404905 145006667 140907497 137663080
2436 137663080 135377890 132396318 129972588 127767036 126120240 124396102 122826244 120965178
2428 120965178 119301975 118206857 117006049 116229953 115523994 113164513 111962997 111619370
2420 111619370 110320365 108465814 107361064 106505458 105264085 103684804 102443404 100458592
2412 100458592 98593981 97348867 96324651 94921461 92887584 91182094 90175644 88553714
2404 88553714 86279872 84651852 83497595 81518730 79220155 77418309 74920786 73336223
2396 73336223 71547223 69548256 67655700 66419658 64635372 63288824 62542075 60481479
$$ packed form
2452B27481222q389414p274634p209920p136261o809510o138346o659945n883981
2444A71979211n576514m577287m585817m854050l980638l398238m099170l244417
2436A37663080k285190k981572k423730k205552j646796j724138j569858j861066
2428A20965178j663203j095118j200808p76096p05959k359481j201516l43627
2420A11619370j299005j854551j104750q55606j241373j579281j241400j984812
2412A00458592j864611j245114j024216j403190k033877j705490j006450j621930
2404H8553714k273842j628020j154257j978865k298575j801846k497523j584563
2396G3336223j789000j998967j892556j236042j784286j346548p46749k060596
$$ plain form
2388 60481479 58574278 57335898 55999515 54765467 53068370 51716561 50236030 49325461
2380 49325461 47756463 46084457 45687959 45015842 43862965 42725178 41799437 40582459 39935540
2371 39935540 39306514 38972932 38127618 37248574 36075397 35265173 35046166 35060012 34526812
2362 34526812 33476806 32381753 31616778 30847146 30556880 30092615 29489435 28572808 27931189
2353 27931189 27906166 27774733 27531172 27513971 27399720 26642150 26002547 26053798 26087597 25737902
2343 25737902 24414812 23430748 23636022 22712976 22314339 21665591 21335020 21063282 20625829
2334 20625829 20395127 19950863 19721759 19763866 19613677 19532129 19344666 18789198 18448085 17782084
2324 17782084 17728518 17272042 16789577 16401192 15731053 16041672 15991078 15860398 16122899 16003998
$$ packed form
2388F0481479j907201j238380j336383j234048j697097j351809j480531r10569
2380D9325461j568998j672006l96498o72117j152877j137787r25741j216978o46919
2371C9935540o29026l33582q45314q79044j173177q10224k19007J3846n33200
2362C4526812j050006j095053p64975p69632k90266m64265o03180r16627o41619
2353B7931189k5023j31433k43561j7201j14251p57570o39603N1251L3799l49695
2343B5737902j323090r84064K05274r23046l98637o48748l30571k71738m37453
2334B0625829k30702m44264k29104M2107j50189q1548j87463n55468l41113o66001
2324A7782084n3566m56476m82465l88385o70139L10619n0594j30680K62501j18901
$$ plain form
2314 16003998 15357695 15614831 16216217 15405905 15183211 15201856 14448507 13708382 13974452 14009957
2304 14009957 13697768 13376049 13034725 12933380 13177003 12843589 12813313 12597006 12455076 12466737
2294 12466737 12262964 11701778 11749590 12556635 12318718 11557808 11398172 11366359 10925914 10818759
2284 10818759 10929328 10481891 10207967 10549215 10408408 10698165 10712406 10946266 10889791 10300363
2274 10300363 9660354 9443135 9483517 9356197 9149776 8931811 8408814 8907394 9468598 9443926
2264 9443926 9393334 9567191 9135279 9201073 9600049 9175541 8761570 8867848 8803027 8559414
2254 8559414 8824848 8186173 7890505 8169433 8255477 8310842 7853272 7817921 8004520 7874361
2244 7874361 7964698 7730288 7794059 7722783 7196902 7757767 8019129 7415664 7497460 7980659
$$ packed form
2314A6003998o46303K57136O01386q10312k22694J8645p53349p40125K66070L5505
2304A4009957l12189l21719l41324j01345K43623l33414l0276k16307j41930J1661
2294A2466737k03773n61186M7812Q07045k37917p60910j59636l1813m40445j07155
2284A0818759J10569m47437k73924L41248j40807K89757J4241K33860n6475n89428
2274A0300363o40009k17219M0382j27320k06421k17965n22997M98580N61204k4672
2264I443926n0592J73857m31912O5794L98976m24508m13971J06278o4821k43613
2254H559414K65434o38675k95668K78928Q6044N5365m57570l5351J86599j30159
2244G874361R0337k34410O3771p1276n25881N60865K61362o03465Q1796M83199
$$ plain form
2234 7980659 7897346 7275495 7693345 7972990 7632051 7549548 7221437 7413709 7903791 7517317
2224 7517317 7254902 7847223 7910023 7824435 8029150 7742606 7546175 7196827 7451001 7690417
2214 7690417 7931574 7447016 6777818 7444331 7447193 7494866 7222255 7869054 7680293 7732715
2204 7732715 8339239 8235283 8542018 7930748 7712154 8170849 8497018 8269840 7499907 8081261
2194 8081261 8516035 8825069 9277717 8618726 8900759 8908299 8550853 8924692 9325897 8585468
2184 8585468 8359814 8520902 8272087 8016782 8118761 8857544 8541179 8329510 8273537 8548082
2174 8548082 8487591 7763390 7928603 8387661 8125671 7487474 7576490 7520830 7640303 8426857
2164 8426857 8804477 8523992 8250017 8422548 8662025 9095743 8794701 8976103 9110662 8125267
$$ packed form
2234G980659q3313o21851M17850K79645l40939q2503l28111J92272M90082l86474
2224G517317k62415N92321O2800q5588K04715k86544j96431l49348K54174K39416
2214G690417K41157m84558o69198O66513K862M7673k72611O46799j88761N2422
2204G732715O06524j03956L06735o11270k18594M58695L26169k27178p69933N81354
2194H081261M34774L09034M52648o58991K82033P540l57446L73839M01205p40429
2184H585468k25654J61088k48815k55305J01979P38783l16365k11669n5973K74545
2174H548082o0491p24201J65213M59058k61990o38197Q9016n5660J19473P86554
2164H426857L77620k80485k73975J72531K39477M33718l01042J81402J34559r85395
$$ plain form
2154 8125267 7758407 8073329 8367801 8492544 8468443 8524151 8188069 8421982 9152886 8987525
2144 8987525 9053326 8902069 8985355 8982727 8848250 8580694 8606587 8905556 8800348 8803793 8449042
2133 8449042 8595121 9318044 8957203 9072435 9243472 9409203 9045575 9048605 9348341 9588995
2123 9588995 10005619 9871444 9316357 9654953 9541865 9184395 9445922 9597638 9177148 8402215
2113 8402215 8704798 8923584 8551967 7933787 7600249 7831558 7620806 6920137 6849470 7268504
2103 7268504 6584837 6589367 6829321 6501517 6122810 5889949 6313187 5822857 5188090 5659123
2093 5659123 5915888 5620197 4973625 4679765 5307607 5642722 5535358 4938366 4702996 4760294
2083 4760294 4520013 4196411 4444096 4540768 4497463 4755031 4953190 5122314 4950648 4936334
$$ packed form
2154H125267l66860L14922K94472J24743k4101N5708l36082K33913P30904j65361
2144H987525O5801j51257Q3286k628j34477k67556K5893K98969j05208L445l54751
2133H449042J46079P22923l60841J15232J71037J65731l63628L030K99736K40654
2123I588995M16624j34175n55087L38596j13088l57470K61527J51716m20490p74933
2113H402215L02583K18786l71617o18180l33538K31309k10752p00669p0667M19034
2103G268504o83667M530K39954l27804l78707k32861M23238m90330o34767M71033
2093E659123K56765k95691o46572k93860O27842L35115j07364n96992k35370N7298
2083D760294k40281l23602K47685R6672m3305K57568J98159J69124j71666j4314
$$ plain form
2073 4936334 5213341 5348892 5548554 4884395 4495309 4492068 4206961 3701962 3979562 3752993
2063 3752993 2697441 2689052 3127622 2853122 2802706 2673629 2647445 2340120 2447423 2936473
2053 2936473 3214433 3196224 3201024 3331332 3573310 3051923 2759502 2767751 2881482 2703865
2043 2703865 2602908 2892122 2718752 2193170 2938092 3182840 2868774 3053538 2648464 2474701
2033 2474701 2644755 2906744 2694850 2692955 1781389 1189125 2344688 2543394 1794301 2174317
2023 2174317 2236323 2607179 2180554 2062621 2344204 2418803 2049037 1657911 2492733 2140782
2013 2140782 1408101 1861861 1983228 1982677 2415568 2665247 2773512 2519135 2118781 2538132
2003 2538132 3057229 2878938 2547573 2688479 2053651 1978979 2580062 2522759 1834616 1803234
$$ packed form
2073D936334K77007J35551J99662o64159l89086l241k85107n04999K77600k26569
2063C752993j055552q389M38570k74500n0416j29077k6184l07325J07303M89050
2053B936473K77960j8209M800J30308K41978n21387k92421Q249J13731j77617
2043B703865j00957K89214j73370n25582P44922K44748l14066J84764m05074j73763
2033B474701J70054K61989k11894j895r11566n92264J155563J98706p49093L80016
2023B174317O2006L70856m26625j17933K81583P4599l69766l91126Q34822l51951
2013B140782p32681M53760J21367n51M32891K49679J08265k54377m00354M19351
2003B538132N19097j78291l31365J40906o34828p4672O01083n7303o88143l1382
$$ plain form
1993 1803234 2522986 2306750 2059160 2449118 2612276 2526660 2542566 2921916 2748474 2131200
1983 2131200 1948687 1919014 2029868 1419913 1371237 2074120 1949730 1576775 2264968 2586042
1973 2586042 2347206 2195281 2280821 2663780 2514785 2714313 2654864 2780063 2759358 2422624
1963 2422624 2291311 1968481 1950105 2128267 1482819 1881073 1833238 1119304 1542055 1905552
1953 1905552 1821445 1513545 2051332 2101471 2004747 2150039 2861904 3199430 2293746 2385682
1943 2385682 2583071 2158365 2176095 2087396 2224090 2183049 2318079 2117274 1829775 1360797
1933 1360797 1183651 2224983 2334742 1413488 1175350 2059018 1664043 1175665 1676525
1924 1676525 1870322 1505569 1363127 1796911 1702531 1738219 2197109 2590786 2304415 1335204
$$ packed form
1993A803234P19752k16236k47590L89958J63158q5616J5906L79350j73442o17274
1983B131200j82513k9673J10854o09955m8676P02883j24390l72955O88193L21074
1973B586042k38836j51925Q5540L82959j48995J99528n9449J25199k0705l36734
1963B422624j31313l22830j8376J78162o45448L98254m7835p13934M22751L63497
1953A905552q4107l07900N37787N0139r6724J45292P11865L37526r05684R1936
1943B385682J97389m24706J7730q8699J36694m1041J35030k00805k87499m68978
1933A360797j77146J041332J09759r21254k38138Q83668l94975m88378N00860
1924A676525J93797l64753j42442M33784r4380L5688M58890L93677k86371r69211
$$ plain form
1914 1335204 1199886 1468630 1469156 1290062 1435482 1530026 873788 1203001 1538894 1516604
1904 1516604 1840979 2001762 1454669 1385058 1361229 1551258 1922242 1985790 1383666 1271966
1894 1271966 1167680 1615886 1768391 1209229 935608 1027925 1229895 556630 801842 1040130
1884 1040130 528488 485475 813085 865639 973558 758185 469387 951537 1246112 269693
1874 269693 611416 911315 293949 354156 806470 271908 70579 256393 467794 382314
1864 382314 1019927 1227744 1450156 1562305 1346589 1437470 1563917 1530632 1118800 1083184
1854 1083184 793576 501240 414300 316599 16071 204040 598780 855180 1278135 1094202
1844 1094202 973734 1343982 1139956 540875 360267 735111 178234 566142 545901 -36031
$$ packed form
1914A335204j35318K68744N26j79094J45420R4544o56238L29213L35893k2290
1904A516604L24375J60783n47093o9611k3829J90029L70984O3548o02124j11700
1894A271966j04286M48206J52505n59162k73621R2317K01970o73265K45212K38288
1884A040130n11642m3013L27610N2554J07919k15373k88798M82150K94575r76419
1874B69693L41723K99899o17366O0207M52314n34562k01329J85814K11401q5480
1864C82314O37613K07817K22412J12149k15716R0881J26447l3285m11832l5616
1854A083184k89608k92336q6940r7701l00528J87969L94740K56400M22955j83933
1844A094202j20468L70248k04026n99081j80608L74844n56877L87908k0241n81932
$$ plain form
1834 -36031 559811 739826 663595 1516122 1799237 1046235 1089428 1986104 1631458 1267787
1824 1267787 1032251 1429724 2009984 1749561 1638810 1893875 2250456 2213028 2331448 2276363
1814 2276363 1915020 2214974 2273938 1968481 1539962 1645454 1659567 1271775 1221983 940825
1804 940825 1519255 1819401 2128864 2430001 2392168 3086808 3314214 3455152 3302331 3332326
1794 3332326 3454658 3019247 2702330 2738968 3391599 3058116 2767256 3207380 3268734 3276568
1784 3276568 3683028 4330809 4374266 3986176 4560395 4872178 4429617 3979647 4263862 4409353
1774 4409353 3709095 3384439 3748216 3908795 3824134 3933289 4422285 5054431 4985745 5309065
1764 5309065 5303378 5287889 5889114 6275634 5786332 5211086 5089579 5203559 5417132 5845985
$$ packed form
1834c6031N95842J80015p6231Q52527K83115p53002M3193Q96676l54646l63671
1824A267787k35536L97473N80260k60423j10751K55065L56581l7428J18420n5085
1814B276363l61343K99954N8964l05457m28519J05492J4113l87792m9792k81158
1804I40825N78430L00146L09463L01137l7833O94640K27406J40938j52821K9995
1794C332326J22332m35411l16917L6638O52631l33483k90860M40124O1354P834
1784C276568M06460O47781M3457l88090N74219L11783m42561m49970K84215J45491
1774D409353p00258l24656L63777J60579q4661J09155M88996O32146o8686L23320
1764E309065n687j5489O01225L86520m89302n75246j21507J13980K13573M28853
$$ plain form
1754 5845985 5879299 5601159 5648104 5801462 6227506 5600663 5646341 5520822 4690768 4676135
1744 4676135 4660453 4115249 4040960 4161112 3997211 3624819 3490924 3271298 3385496 3372611
1734 3372611 3463744 3836487 4232289 3842764 3460144 3696638 3333224 3572914 3357898 3074529
1724 3074529 2760800 2631524 3002947 2942562 2790758 2524180 2484612 2349337 2118115 2252286
1714 2252286 2299419 2352354 2010440 1916039 1918344 1681076 1557814 1361211 1510592 1575030 963936
1703 963936 1208521 1260201 1220803 1111428 1341463 1601623 1046316 1248672 912286 609702
1693 609702 1057834 606805 566102 649082 555631 429275 719851 672364 842074 1504141
1683 1504141 1323674 1334517 1233093 979194 371408 421778 299559 130362 402286 -375932
$$ packed form
1754E845985L3314k78140M6945J53358M26044o26843M5678j25519q30054j4633
1744D676135j5682n45204p4289J20152j63901l72392j33895k19626J14198j2885
1734C372611R1133L72743L95802l89525l82620K36494l63414K39690k15016k83369
1724C074529l13729j29276L71423o0385j51804k66578l9568j35275k31222J34171
1714B252286M7133N2935l41914r4401K305k37268j23262j96603J49381O4438o11094
1703I63936K44585N1680l9398j09375K30035K60160n55307K02356l36386l02584
1693F09702M48132m51029m0703Q2980r3451j26356K90576m7487J69710O62067
1683A504141j80467J0843j01424k53899o07786N0370j22219j69197K71924p78218
$$ plain form
1673 -375932 -468834 -180961 -99521 555047 799460 1333080 1439246 1355118 1099975 1284392
1663 1284392 2131989 1273685 532048 829139 589488 195197 744056 1078787 544068 810120
1653 810120 1321907 1083985 977543 834110 488225 859835 553501 83598 -48233 274736
1643 274736 35119 143021 824147 357427 -47107 260473 314554 235380 76548 113544
1633 113544 215603 -298260 -582613 -557148 -378648 -276601 -201094 298884 138680 471178
1623 471178 1182135 1013847 1277556 947620 601105 786381 599230 295508 489717 513849
1613 513849 -85178 -168661 577706 559676 835559 1109627 1265835 1555478 1417601 1209557
1603 1209557 748403 526556 335803 41699 194504 -367678 -1000491 -796599 -345430 -264884
$$ packed form
1673c75932r2902K87873Q1440O54568K44413N33620J06166q4128k55143J84417
1663A284392Q47597q58304p41637K97091k39651l94291N48859L34731n34719K66052
1653H10120N11787k37922j06442j43433l45885L71610l06334m69903j31831L22969
1643B74736k39617J07902O81126m66720m04534L07580N4081p9174j58832L6996
1633A13544J02059n13863k84353K5465J78500J02047P5507M99978j60204L32498
1623D71178P10957j68288K63709l29936l46515J85276j87151l03722J94209K4132
1613E13849n99027q3483P46367j8030K75883K74068J56208K89643j37877k08044
1603A209557m61154k21847j90753k94104J52805n62182o32813K03892M51169Q0546
$$ plain form
1593 -264884 -616394 -532185 -333318 208036 -11834 48089 378039 501716 818347 594551
1583 594551 671016 1000296 861345 634157 702511 314909 653538 1320415 726074 255601
1573 255601 657209 873842 626493 347375 599855 198550 377383 455878 191925 -138434
1563 -138434 -309587 264476 199243 220721 450530 343062 116221 -69591 84242 -218087
1553 -218087 -156597 8212 -392549 -765865 -713396 -101044 -414699 -312382 -85303 -194344
1543 -194344 500315 596726 465974 703054 527851 404248 210892 306517 -189867 -260222
1533 -260222 101042 -322096 178995 808127 321403 722036 1353022 1264179 873231 1002057
1523 1002057 804083 345395 200012 228345 9362 -712129 -1230812 -726694 -343720 -775699
$$ packed form
1593b64884l51510Q4209J98867N41354k19870N9923L29950J23677L16631k23796
1583E94551P6465L29280j38951k27188O8354l87602L38629O66877n94341m70473
1573B55601M01608K16633k47349k79118K52480m01305J78833P8495k63953l30359
1563a38434j71153N74063o5233K1478K29809j07468k26841j85812J53833l02329
1553b18087O1490J64809m00761l73316N2469O12352l13655J02317K27079j09041
1543a94344O94659R6411j30752K37080j75203j23603j93356R5625m96384p0355
1533b60222L61264m23138N01091O29132m86724M00633O30986q8843l90948J28826
1523A002057j97974m58688j45383K8333k18983p21491n18683N04118L82974m31979
$$ plain form
1513 -775699 -383110 325308 62030 -105887 647019 746672 343937 -106205 169841 131797
1503 131797 -142339 -626670 -841117 -536350 -1018163 -983521 -868519 -614730 54741 130017
1493 130017 61121 -365611 303335 330811 -313066 261709 384020 2116 -389239 -487015
1483 -487015 -1267236 -1510978 -801559 -688691 -582079 -995410 -1234701 -394241 -317862 -178824
1473 -178824 147713 741450 545906 320988 627143 303608 181379 136419 -215131 -119263
1463 -119263 -194107 -776440 -1002054 -1044129 -855360 -703461 -326734 -81524 7606 82623
1453 82623 391081 595714 457788 25433 -248734 -146179 -557248 -129653 -106477 -666908
1443 -666908 -922341 -706464 -475173 -878030 202751 448540 201956 319874 168734 283547
$$ packed form
1513g75699L92589P08418k63278j67917P52906R9653m02735m50142K76046l8044
1503A31797k74136m84331k14447L04767m81813L4642J15002K53789O69471P5276
1493A30017o8896m26732O68946K7476o43877N74775J22311l81904l91355r7776
1483d87015p80221k43742P09419J12868J06612m13331k39291Q40460P6379J39038
1473a78824L26537N93737j95544k24918L06155l23535j22229m4960l51550R5868
1463a19263p4844n82333k25614m2075J88769J51899L76727K45210Q9130P5017
1453H2623L08458K04633j37926m32355k74167J02555m11069M27595K3176n60431
1443f66908k55433K15877K31291m02857J080781K45789k46584J17918j51140J14813
$$ plain form
1433 283547 452275 581135 145684 289661 -104641 -280602 -165488 -594592 -250111 -85382
1423 -85382 -487426 -571697 -436731 -270345 -426845 -40825 -185956 -493439 -164859 -431451
1413 -431451 -582776 -257869 -243571 -628218 -708878 -1336313 -818485 -312361 -685495 -644116
1403 -644116 -263697 -192912 -440766 -57995 245043 174358 247950 436339 55897 -101791
1393 -101791 -13573 -353344 -330147 -348722 -116319 -106629 -73126 -489228 -229248 54169 -145269
1382 -145269 -278727 117182 14966 5275 -325754 -520318 -154033 -103829 120043 118115 130906
1371 130906 -89196 706611 996706 192359 43240 378541 254551 -367235 -527078 -504487
1361 -504487 -645386 -385563 -184968 199520 -596724 -315819 308405 112936 77280 -34225
$$ packed form
1433B83547J68728J28860m35451J43977l94302j75961J15114m29104L44481J64729
1423h5382m02044q4271J34966J66386j56500L86020j45131l07483L28580k66592
1413d31451j51325L24907J4298l84647q0660o27435N17828N06124l73134M1379
1403f44116L80419P0785k47854L82771L03038p0685P3592J88389l80442j57688
1393a01791Q8218l39771K3197j8575K32403R690L3503m16102K59980K83417j99438
1382a45269j33458L95909j02216r691l31029j94564L66285N0204K23872j928J2791
1371A30906k20102P95807K90095q04347j49119L35301j23990o21786j59843K2591
1361e04487j40899K59823K00595L84488p96244K80905O24224j95469l5656j11505
$$ plain form
1351 -34225 -133232 -480473 -857515 -390756 -533652 -922005 -981722 -891549 -721651 -662438 -251832
1340 -251832 -203836 -208966 -559789 -767656 -118247 -142439 -783466 -1171198 -981628 -925200 -1079678
1329 -1079678 -925892 -769038 -373264 -477183 -267096 98293 -109783 -419973 -746493 -718304
1319 -718304 -747028 -825113 -638908 -946109 -710166 -764806 -585873 -23668 -110570 -66622 -255340
1308 -255340 74692 -232803 -279071 -83789 -710762 -663411 -653834 -644627 -1231254 -1151450 -786835
1297 -786835 -853960 117345 308661 -24673 -4916 152889 448423 534956 310679 -42201
1287 -42201 -223831 -692948 -1071760 -589687 -742850 -1383012 -1030815 -176504 -256841 172963
1277 172963 183174 21657 727512 732446 404204 456374 803668 584306 690729 975226
$$ packed form
1351c4225r9007l47241l77042M66759j42896l88353n9717R0173J69898N9213M10606
1340b51832M7996n130l50823k07867O49409k4192o41027l87732J89570N6428j54478
1329a079678J53786J56854L95774j03919K10087L65389k08076l10190l26520K8189
1319g18304k8724p8085J86205l07201K35943n4640J78933N62205q6902M3948j88718
1308b55340L30032l07495m6268J95282o26973M7351R577R207n86627P9804L64615
1297g86835o7125R71305J91316l33334J9757J57805K95534Q6533k24277l52880
1287d2201j81630m69117l78812M82073j53163o40162L52197Q54311q0337M29804
1277A72963J0211j61517P05855M934l28242N2170L47294k19362J06423K84497
$$ plain form
1267 975226 596235 193454 -87667 -164945 24117 206578 602899 598917 841106 649720
1257 649720 1171786 1567020 1171750 757697 406391 155268 -415440 -167059 -671261 -761252
1247 -761252 -1001310 -1160486 -1111711 -746949 -491741 -460365 386710 93569 331831 713499
1237 713499 -315120 -218759 -192414 -87566 -378842 -566563 -481422 -1290372 -661293 -144942
1227 -144942 -71825 -156754 13357 588333 316951 93395 388144 412084 258947 71476
1217 71476 323968 -380002 -725633 -335930 7417 -354379 -324311 11246 -143213 211944
1207 211944 -175712 -169501 452901 -130989 -464485 -1161520 -1086547 -1167402 -862353 -479526
1197 -479526 -678978 -223033 -365873 68021 135031 80705 -233211 -115452 51484 -509971
$$ packed form
1267I75226l78991m02781k81121p7278J89062J82461L96321l982K42189j91386
1257F49720N22066L95234l95270m14053l51306k51123n70708K48381n04202q9991
1247g61252k40058j59176M8775L64762K55208L1376Q47075k93141K38262L81668
1237G13499j028619R6361K6345J04848k91276j87721Q5141q08950O29079N16351
1227a44942P3117q4929J70111N74976k71382k23556K94749K3940j53137j87471
1217G1476K52492p03970l45631L89703L43347l61796L0068L35557j54459L55157
1207B11944l87656O211O22402n83890l33496o97035P4973q0855L05049L82827
1197d79526j99452M55945j42840M33894O7010n4326l13916J17759J66936n61455
$$ plain form
1187 -509971 -717751 -559347 -256740 -97582 -420845 -331078 58774 -77562 -177185 448172
1177 448172 442867 -228171 -263781 -148633 -693069 -741666 -675064 -594159 -302611 -991669 -871048
1166 -871048 -625037 -435840 -358352 -81640 121341 -435737 31229 674906 360208 -143513
1156 -143513 13510 15210 -248222 -329622 -295473 -193643 316680 279613 -119087 15398 332415
1145 332415 329688 229309 729397 221354 -33787 477816 201898 482672 -74117 22751
1135 22751 266087 337541 -2214 -181989 -13406 -369928 -144484 -299763 -101906 28940
1125 28940 47190 -309336 -358039 437039 124798 51064 213036 339124 494334 681010
1115 681010 759236 560528 1053420 809999 978931 1195974 429650 220765 668297 588211
$$ packed form
1187e09971k07780J58404L02607J59158l23263Q9767L89852j36336r9623O25357
1177D48172n305o71038l5610J15148n44436m8597O6602Q0905K91548o89058J20621
1166h71048K46011J89197P7488K76712K02981n57078M66966O43677l14698n03721
1156a43513J57023J700k63432q1400L4149J01830N10323l7067l98700J34485L17017
1145C32415k727j00379N00088n08043k55141N11603k75918K80774n56789R6868
1135B2751K43336P1454l39755j79775J68583l56522K25444j55279J97857J30846
1125B8940J8250l56526m8703P95078l12241p3734J61972J26088J55210J86676
1115F81010P8226j98708M92892k43421J68932K17043p66324k08885M47532q0086
$$ plain form
1105 588211 222624 39965 -22301 107786 218892 550750 773602 695010 42793 -74471
1095 -74471 -8722 -252820 -263892 193765 84731 -815085 -557386 -553868 -413114 63557 334659
1084 334659 -66250 9611 653615 624169 765063 755917 917151 533798 405304 453800 217993
1073 217993 81906 -302830 -377826 -738248 -707184 -436234 -147754 -244984 -338624 -501140
1063 -501140 -380409 -244854 -431732 -115166 -258986 -384668 -77433 189264 -230155 -468684
1053 -468684 -193822 -290087 -248474 -366652 -572469 -409591 -271730 -235421 -34866 310856
1043 310856 272936 261590 76591 502274 860376 610513 293532 458739 766945 82748
1033 82748 -319599 -157163 -468919 -656935 -96021 -187504 -600139 -617911 26698 283316
$$ packed form
1105E88211l65587j82659o2266J30087J11106L31858K22852p8592o52217j17264
1095g4471O5749k44098j1072M57657j09034q99816K57699L518J40754M76671K71102
1084C34659m00909P5861O44004k9446J40894r146J61234l83353j28494M8496k35807
1073B17993j36087l84736p4996l60422L1064K70950K88480r7230r3640j62516
1063e01140J20731J35555j86878L16566j43820j25682L07235K66697m19419k38529
1053d68684K74862r6265M1613j18178k05817J62878J37861L6309K00555L45722
1043C10856l7920j1346j84999M25683L58102k49863l16981J65207L08206o84197
1033H2748m02347J62436l11756j88016N60914r1483m12635j7772O44609K56618
$$ plain form
1023 283316 -403200 -506405 -318561 -186321 -386298 -250667 -327282 -675187 -562831 -825170
1013 -825170 -460148 -578128 -637253 -724497 -739467 -710891 -824220 -175390 132583 -504224
1003 -504224 -539649 32459 462514 379593 275481 419580 163876 130963 353466 29770
993 29770 120852 -330245 35299 107730 -136662 261415 -153741 -228685 -891229 -315828 -205499
982 -205499 -449000 -431027 -715510 90611 36590 -438148 165969 62334 -464672 99286
972 99286 724070 -129630 -519829 -217573 -520030 -867100 -431821 -1029395 -1320613 -1243949
962 -1243949 -1261407 -572437 84841 -601877 -405866 477431 260960 504637 922786 462868
952 462868 259042 769830 615082 313091 790060 732779 240564 -73706 -75916 490473
$$ packed form
1023B83316o86516j03205J87844J32240j99977J35631p6615l47905J12356k62339
1013h25170L65022j17980n9125q7244j4970K8576j13329O48830L07973o36807
1003e04224l5425N72108M30055q2921j04112J44099k55704l2913K22503l23696
993B9770R1082m51097L65544P2431k44392L98077m15156p4944o62544N75401J10329
982b05499k43501J7973k84483Q06121n4021m74738O04117j03635n27006N63958
972I9286O24784q53700l90199L02256l02457l47070M35279n97574k91218P6664
962a243949j7458O88970O57278o86718J96011Q83297k16471K43677M18149m59918
952D62868k03826N10788j54748l01991M76969n7281m92215l14270k210N66389
$$ plain form
942 490473 54131 -167040 -69135 738534 509006 59852 135243 -41992 237968 284528
932 284528 -73646 -509438 -309073 -474957 -777003 -160241 119928 -667754 -586558 -388547
922 -388547 -601632 -123653 293188 304691 95746 136855 438536 1078367 601785 -109245
912 -109245 481896 379273 248357 605783 1237997 718227 459935 649741 141134 559846
902 559846 852271 833136 488424 361996 315977 -47281 -331590 -103681 -119285 -196842 -195525
891 -195525 45402 -382048 -486446 163081 623075 956069 642863 271272 322870 861134
881 861134 1125999 169972 -340482 -125123 82598 466545 200814 329296 815493 647251
871 647251 522484 939937 861009 685545 640050 294409 146881 -202846 -89846 -11541
$$ packed form
942D90473m36342k21171R7905Q07669k29528m49154P5391j77235K79960M6560
932B84528l58174m35792K00365j65884l02046O16762K80169p87682Q1196J98011
922c88547k13085M77979M16841J1503k08945M1109L01681O39831m76582p11030
912a09245N91141j02623j30916L57426O32214n19770k58292J89806n08607M18712
902E59846K92425j9135l44712j26428m6019l63258k84309K27909j5604p7557J317
891a95525K40927m27450j04398O49527M59994L32994l13206l71591N1598N38264
881H61134K64865r56027n10454K15359K07721L83947k65731J28482M86197j68242
871F47251j24767M17453p8928j75464m5495l45641j47528l49727J13000P8305
$$ plain form
861 -11541 -280869 -638026 -318889 582241 187237 -207721 -2336 112695 -16061 -397263
851 -397263 -507515 -673675 -611228 -632242 -907083 -694865 -614656 -711811 -689970 -421629 -481466
840 -481466 -571451 -160011 -31506 -553054 -376296 -229060 -59571 -485364 -971482 -627590
830 -627590 -461525 -760920 -770905 -392173 -314440 -294064 -126237 -312 -177095 -332612 -285851
819 -285851 -130123 -743363 -903194 -315160 -310976 -947468 -954790 -604506 -271957 -504594 -564230
808 -564230 -147743 43285 -323104 66083 617639 273811 103347 342110 663714 473002
798 473002 19889 272625 373567 9061 -126855 -384588 -468879 -247971 -327698 -293948
788 -293948 -423556 -179901 -202123 -170617 468152 324411 430992 685583 102416 -837416
$$ packed form
861a1541k69328l57157L19137R01130l95004l94958K05385J15031j28756l81202
851c97263j10252j66160O2447k1014k74841K12218Q0209r7155K1841K68341n9837
840d81466q9985M11440J28505n21548J76758J47236J69489m25793m86118L43892
830f27590J66065k99395r985L78732P7733K0376J67827J25925j76783j55517M6761
819b85851J55728o13240j59831N88034M184o36492p322L50284L32549k32637n9636
808e64230M16487J91028l66389L89187N51556l43828j70464K38763L21604j90712
798D73002m53113K52736J00942l64506j35916k57733q4291K20908p9727L3750
788b93948j29608K43655k2222L1506O38769j43741J06581K54591n83167r39832
$$ plain form
778 -837416 -220127 262486 68893 -241824 102089 218612 216445 79808 -312244 -520790
768 -520790 -516283 -514209 -952027 -903173 -499566 -706216 -827758 -867585 -841666 -401438 32336
757 32336 -6392 10909 -70247 111611 409806 257998 36482 -223531 110871 -383376 -473505
746 -473505 -302083 -84305 -88320 -198163 338185 24930 -131059 414115 156603 -294575
736 -294575 -77760 -242772 -716523 -937016 -805697 -933567 -763811 -466671 -227038 51865
726 51865 -383483 -423323 133501 55586 -293043 221946 327101 9969 137304 73970 145673
715 145673 -349579 -46064 371362 90488 -205349 6906 227787 -108144 174483 341746
705 341746 550583 444074 278799 409292 327933 506668 -81011 -148090 127689 191467
$$ packed form
778h37416O17289M82613j93593l10717L43913J16523k167j36637l92052k08546
768e20790M507K074m37818M8854M03607k06650j21542l9827K5919M40228M33774
757C2336l8728J7301q1156J81858K98195j51808k21516k60013L34402m94247r0129
746d73505J71422K17778m015j09843N36348l13255j55989N45174k57512m51178
736b94575K16815j65012m73751k20493J31319j27870J69756K97140K39633K78903
726E1865m35348l9840N56824p7915l48629N14989J05155l17132J27335o3334P1703
715A45673m95252L03515M17426k80874k95837K12255K20881l35931K82627J67263
705C41746K08837j06509j65275J30493q1359J78735n87679o7079K75779O3778
$$ plain form
695 191467 -253453 -160349 274880 -143342 457552 506752 640689 653965 859089 746028
685 746028 740225 1091288 205237 -26471 -373368 -317820 254360 -44332 85677 -338825
675 -338825 -161677 -559 196667 359165 450053 775460 748928 439005 1026094 1009013
665 1009013 455048 193427 295994 504250 144040 206324 207229 576320 547859 670874 1077367
654 1077367 502308 582552 903488 492045 30053 -302250 -278442 76356 221999 -160726
644 -160726 -277096 107543 35656 -336459 205063 442226 194958 246080 611770 524803
634 524803 233163 620350 34170 -78027 548236 336160 -141175 114970 998 -584118
624 -584118 -94638 -134779 -285410 -311603 -500725 78250 164773 -127615 64019 103929 -147816
$$ packed form
695A91467m44920R3104M35229m18222O00894M9200J33937J3276K05124j13061
685G46028n803L51063q86051k31708l46897N5548N72180k98692J30009m24502
675c38825J77148J61118J97226J62498R0888L25407k6532l09923N87089j7081
665A009013n53965k61621J02567K08256l60210O2284R05L69091k8461J23015M06493
654A077367n75059Q0244L20936m11443m61992l32303K3808L54798J45643l82725
644a60726j16370L84639p1887l72115N41522K37163k47268N1122L65690q6967
634E24803k91640L87187n86180j12197O26263k12076m77335K56145j13972n85116
624e84118M89480m0141j50631k6193j89122N78975Q6523k92388J91634L9910k51745
$$ plain form
613 -147816 -344721 173120 -31448 -187352 -119845 -69597 359282 595209 606201 502184
603 502184 422809 387905 72191 -195206 -409271 -282008 -169332 -115836 -328373 2091
593 2091 303908 255226 165055 715327 342460 92621 139841 -273552 -539352 -499160 -928975
582 -928975 -1234057 -564225 -838102 -417781 444855 274077 97977 218379 271565 -130642
572 -130642 -769676 -796207 -897278 -1032820 -1366277 -911604 -565984 -594333 -609852 -276421
562 -276421 54558 151051 543128 226331 220440 168566 7203 -961100 -1354132 -627572 -921269
551 -921269 -1101233 -869231 -942495 -1329265 -1115529 54837 295136 -205658 -165675 -222195
541 -222195 -376645 -337075 -262606 -263812 -613927 -864213 -658047 -613695 -470119 -305491 -487190
$$ packed form
613a47816j96905N17841k04568j55904O7507N0248M28879K35927J0992j04017
603E02184p9375l4904l15714k67397k14065J27263J12676N3496k12537L30464
593B091L01817m8682r0171N50272l72867k49839M7220m13393k65800M0192m29815
582i28975l05082O69832k73877M20321Q62636j70778j76100J20402N3186m02207
572a30642o39034k6531j01071j35542l33457M54673L45620k8349j5519L33431
562b76421L30979R6493L92077l16797n891n1874j61363r68303l93032P26560k93697
551i21269j79964K32002p3264l86770K13736J170366K40299n00794L9983n6520
541b22195j54450L9570P4469j206l50115k50286K06166M4352J43576J64628j81699
$$ plain form
530 -487190 -551369 -237742 -7398 480734 350030 46548 -36458 308188 541650 636855
520 636855 430171 263545 179041 -4176 -86921 -315262 -333175 -180034 -15682 236434
510 236434 126557 -92046 -499685 -90167 290473 189648 -184979 -391658 -80805 139472
500 139472 444280 69371 176969 156507 274742 410272 -84831 175443 -156416 113524
490 113524 324103 87126 311860 702519 692057 176354 -51940 87734 454249 437957
480 437957 180380 448471 437328 50953 414449 454970 -69574 -215805 184592 94167
470 94167 -525091 -770547 -453203 -557842 -471427 -332545 123261 -116399 196410 458812
460 458812 450261 702068 526130 856864 637079 397427 149702 569028 502809 160605
$$ packed form
530d87190o4179L13627K30344M88132j30704l03482q3006L44646K33462R5205
520F36855k06684j66626q4504j83217q2745k28341j7913J53141J64352K52116
510B36434j09877k18603m07639M09518L80640j00825l74627k06679L10853K20277
500A39472L04808l74909J07598k0462J18235J35530m95103K60274l31859K69940
490A13524K10579k36977K24734L90659j0462n15703k28294J39674L66515j6292
480D37957k57577K68091j1143l86375L63496M0521n24544j46231M00397r0425
470I4167o19258k45456L17344j04639Q6415J38882M55806k39660L12809K62402
460D58812q551K51807j75938L30734k19785k39652k47725M19326o6219l42204
$$ plain form
450 160605 724922 653799 199437 203034 668760 314026 291279 814418 416526 -127613 -167256
439 -167256 693831 429533 -8008 444968 596265 99042 -486215 435206 1474046 956559
429 956559 840751 1004242 589027 471523 544602 835565 313337 341456 -216398 -337171
419 -337171 -32551 -426850 -202060 197888 24237 -356295 3004 500898 407571 299699
409 299699 -84242 109316 314072 -293201 -556946 -182942 155498 -428517 -568139 101915
399 101915 -30460 64946 294818 301999 785143 857436 900468 638510 461021 1028285 700770
388 700770 484823 337236 459723 989167 630403 268823 296508 703402 165483 299256
378 299256 1322595 1178927 297614 293268 693779 578106 525486 728334 219252 -404076
$$ packed form
450A60605N64317p1123m54362L597M65726l54734k2747N23139l97892n44139l9643
439a67256Q61087k64298m37541M52976J51297m97223n85257R21421J038840n17487
429I56559j15808J63491m15215j17504P3079K90963n22228K8119n57854j20773
419c37171L04620l94299K24790L99948j73651l80532L59299M97894r3327j07872
409B99699l83941J93558K04756o07273k63745L74004L38440n84015j39622O70054
399A01915j32375R5406K29872P181M83144P2293M3032k61958j77489N67264l27515
388G00770k15947j47587J22487N29444l58764l61580K7685M06894n37919J33773
378B99256J023339j43668q81313m346M00511j15673n2620K02848n09082o23328
$$ plain form
368 -404076 -52619 395894 280666 31790 289561 572803 115059 -862866 -491081 153075
358 153075 -205055 -600413 -351336 -606959 -476518 441451 152080 -59680 500043 805876
348 805876 495774 403008 561862 1159792 666628 -103855 -23258 212994 -217187 161080
338 161080 710398 252219 -6706 430622 737093 970419 677423 364523 54370 -146996
328 -146996 282734 -63617 -302412 -733261 -711639 -503583 -563823 -409147 -381823 -61208
318 -61208 -17551 353777 721716 423655 762835 885413 680174 756333 829050 174275 130041
307 130041 732526 764912 735429 338301 224513 259985 343309 650305 494608 426021 -54172
296 -54172 76187 529708 122382 -59014 302229 144905 56761 602534 851226 554175
$$ packed form
368d04076L51457M48513j15228k48876K57771K83242m57744r77925L71785O44156
358A53075l58130l95358K49077k55623J30441R17969k89371k11760N59723L05833
348H05876l10102r2766J58854N97930m93164p70483Q0597K36252m30181L78267
338A61080N49318m58179k58925M37328L06471K33326k92996l12900l10153k01366
328a46996M29730l46351k38795m30849K1622K08056o0240J54676K7324L20615
318f1208M3657L71328L67939k98061L39180J22578k05239P6159P2717o54775m4234
307A30041O02485L2386k9483l97128j13788L5472Q3324L06996j55697o8587m80193
296e4172J30359M53521m07326j81396L61243j57324q8144N45773K48692k97051
$$ plain form
286 554175 39224 -257005 -151695 -530409 -407543 -189480 -352094 -56900 128013 387357
276 387357 501034 947283 663371 720103 1138198 896135 1121254 797575 562931 470557
266 470557 652162 766386 44512 59440 308519 774643 531487 66575 58387 -46552
256 -46552 26356 538439 215726 84557 194186 49229 255186 304003 565906 622099 413034
245 413034 758750 546200 489675 433388 282320 47273 -49786 355391 61960 212708
235 212708 184893 197550 548845 798019 674854 325250 -26233 -20892 394604 858540 322345
224 322345 303372 68551 138313 508029 511865 543456 394835 363514 248573 490265 304171
213 304171 418270 875954 351626 479711 773811 653724 522191 523071 805814 788136 698880
$$ packed form
286E54175n14951k96229J05310l78714J22866K18063j62614K95194J84913K59344
276C87357J13677M46249k83912N6732M18095k42063K25119l23679k34644r2374
266D70557J81605J14224p21874J4928K49079M66124k43156m64912q188j04939
256d6552P2908N12083l22713j31169J09629j44957K05957M8817K61903N6193k09065
245D13034L45716k12550n6525n6287j51068k35047r7059M05177k93431J50748
235B12708k7815J2657L51295K49174j23165l49604l51483N341M15496M63936n36195
224C22345j8973k34821O9762L69716L836L1591j48621l1321j14941K41692j86094
213C04171J14099M57684n24328J28085K94100j20087j31533Q80K82743j7678q9256
$$ plain form
202 698880 215709 361291 141136 141741 681703 416937 -131821 199503 852735 478244
192 478244 752751 843198 160924 189315 750050 724259 761609 426282 -203345 125883 746981
181 746981 434782 351935 170384 89884 189233 415695 597501 885534 841993 234953 107000
170 107000 281263 145168 -197929 257232 -19503 -332665 -4670 335700 40530 -180685
160 -180685 269476 800306 489037 112761 175347 730323 658610 164903 12003 195323
150 195323 -76341 34099 425834 517578 461264 495317 356406 572890 426357 485019 742601
139 742601 173254 -178168 -402956 -199442 -607207 -510458 -468834 -953722 -296395 56073
129 56073 -3402 312278 947389 874891 583101 1079913 1120789 918604 991817 1209223 1137349
$$ packed form
202F98880m83171J45582k20155O05N39962k64766n48758L31324O53232l74491
192D78244K74507R0447o82274K8391N60735k5791L7350l35327o29627L29228O21098
181G46981l12199q2847j81551q0500R9349K26462J81806K88033m3541o07040j27953
170A07000J74263j36095l43097M55161k76735l13162L27995L40370k95170k21215
160a80685M50161N30830l11269l76276O2586N54976p1713m93707j52900J83320
150A95323k71664J10440L91735R1744n6314L4053j38911K16484j46533N8662K57582
139G42601n69347l51422k24788K03514m07765R6749M1624m84888O57327L52468
129E6073n9475L15680O35111p2498k91790M96812M0876k02185P3213K17406p1874
$$ plain form
118 1137349 1347497 959140 642123 1044402 956404 324197 -20324 287496 324417 224706
108 224706 626573 579845 768392 1166222 1170002 974782 1176651 1156991 1169813 771494 74082
97 74082 -171779 136341 52690 -171390 -6436 -210251 -103349 -132351 38648 175538 148618
86 148618 189098 321913 520700 225256 293277 528957 52701 156581 295988 762037
76 762037 1129598 975616 813803 784294 1055336 1175757 780281 745921 387233 -303529
66 -303529 -346799 -168138 -724348 -675135 -150828 -14852 -7591 39439 445227 895931 1193169
55 1193169 973494 1126593 1091412 588543 650306 1125794 1020913 417069 257486 459083
45 459083 163850 504467 530342 495114 320569 106440 383612 799508 1166539 680653
$$ packed form
118A137349K10148l88357l17017M02279q7998o32207l44521L07820L6921r9711
108B24706M01867m6728J88547L97830L780j95220K01869j9660J2822l98319o97412
97G4082k45861L08120q3651k24080J64954k03815J06902k9002J70999J36890k6920
86A48618M0480J32815J98787k95444O8021K35680m76256J03880J39407M66049
76G62037L67561j53982j61813k9509K71042J20421l95476l4360l58688o90762
66c03529m3270J78661n56210M9213N24307J35976P261M7030M05788M50704K97238
55A193169k19675J53099l5181n02869O1763M75488j04881o03844j59583K01597
45D59083k95233L40617K5875l5228j74545k14129K77172M15896L67031m85886
$$ plain form
35 680653 597545 300509 173215 559667 340838 319995 513749 224963 143144 645618 987934
24 987934 325460 414696 820038 669685 478610 235426 753604 1046310 491781 356044
14 356044 333103 82103 95698 577737 716795 304355 153681 468007 357962 265937 583106
3 583106 518003 705025 543039
0 543039
$$ packed form
35F80653q3108k97036j27294L86452k18829k0843J93754k88786q1819N02474L42316
24I87934o62474Q9236M05342j50353j91075k43184N18178K92706n54529j35737
14C56044k2941k51000J3595M82039J39058m12440j50674L14326j10045r2025L17169
3E83106o5103J87022j61986
0E43039
$$ Imaginary data points
##PAGE= N=2
##DATA TABLE= (X++(I..I)), XYDATA
$$ plain form
16383 -9018766 -9022251 -9167951 -9190052 -8848844 -8879411 -8717804 -8172413 -8500639 -8079466 -8223203
16373 -8223203 -8252334 -7993699 -7735036 -7371837 -7528611 -7487058 -7361432 -7102561 -7067052 -7019954
16363 -7019954 -6817712 -7070761 -7127588 -6555198 -6922583 -6967662 -6741195 -6339906 -6433890 -6523503
16353 -6523503 -6471941 -6061640 -6058559 -5822926 -5774467 -5617290 -5782480 -5639430 -5320942 -5491918
16343 -5491918 -5316878 -5053077 -4972774 -4741232 -4787862 -4746554 -4290200 -4033631 -4424573 -4529525
16333 -4529525 -4264972 -4094887 -3932365 -3899061 -3713635 -3929727 -3795059 -3736091 -3216929 -2928845
16323 -2928845 -3108108 -2886980 -2620047 -2719513 -2477220 -2087929 -1895963 -2294544 -2468509 -2888157
16313 -2888157 -2398306 -2188387 -2416940 -2566034 -2269297 -2108113 -2456402 -2351725 -2236517
$$ packed form
16383i018766l485j45700k2101L41208l0567J61607N45391l28226M21173j43737
16373h223203k9131K58635K58663L63199j56774M1553J25626K58871L5509M7098
16363g019954K02242k53049n6827N72390l67385m5079K26467M01289r3984q9613
16353f523503N1562M10301L081K35633M8459J57177j65190J43050L18488j70976
16343e491918J75040K63801Q0303K31542m6630M1308M56354K56569l90942j04952
16333d529525K64553J70085J62522L3304J85426k16092J34668N8968N19162K88084
16323b928845j79263K21128K66933r9466K42293L89291J91966l98581j73965m19648
16313b888157M89851K09919k28553j49094K96737J61184l48289J04677J15208
$$ plain form
16304 -2236517 -1959415 -1312684 -1381995 -1429114 -1204384 -845228 -724548 -223098 105169 -670284
16294 -670284 -644507 -407150 -34817 -123730 -161107 -345787 -271165 -411876 -733482 99127
16284 99127 -25250 -474907 75701 149688 250113 107132 802047 742471 800912 849066
$$ packed form
16304b236517K77102O46731o9311m7119K24730L59156J20680N01450L28267p75453
16294f70284K5777K37357L72333q8913l7377j84680P4622j40711l21606Q32609
16284I9127j24377m49657N50608P3987J00425j42981O94915n9576N8441M8154
$$ [...]
##END NTUPLES=NMR SPECTRUM
##END=
