##TITLE=1H_CA-8814-1
 CDCl3, 8 sc, 
 1.02.2021
##JCAMPDX= 6.0         $$ Bruker NMR JCAMP-DX V2.0
##DATA TYPE= NMR SPECTRUM
##DATA CLASS= NTUPLES
##ORIGIN= UXNMR, Bruker Analytische Messtechnik GmbH
##OWNER= root
$$ XWIN-NMR		Version 3.5
$$ Mon Feb  1 11:01:53 2021 Russian Standard Time (UT+4h)  she@DPX200
##.OBSERVE FREQUENCY= 200.1315066352
##.OBSERVE NUCLEUS= ^1H
##.ACQUISITION MODE= SIMULTANEOUS
##.ACQUISITION SCHEME= undefined
##.AVERAGES= 8
##.DIGITISER RES= 18
##SPECTROMETER/DATA SYSTEM= spect
##.PULSE SEQUENCE= zg30
##.SOLVENT NAME= CDCl3
##.SHIFT REFERENCE= (INTERNAL, CDCl3, 0, 15.9833)
##AUDIT TRAIL= $$ (NUMBER, WHEN, WHO, WHERE, WHAT)
$$ ##TITLE= Audit trail, XWIN-NMR		Version 3.5
$$ ##JCAMPDX= 5.01
$$ ##ORIGIN= Bruker BioSpin GmbH
$$ ##OWNER= she
$$ F:/spectra/data/she/nmr/H-F/1/pdata/1/auditp.txt
$$ ##AUDIT TRAIL=  $$ (NUMBER, WHEN, WHO, WHERE, WHAT)
(   1,<2021-02-01 11:00:41.09 +0400>,<she>,<DPX200>,
      <created by zg, POWCHK disabled, PULCHK disabled
       configuration hash MD5:
       00 E9 B6 7A A2 85 ED C7 34 08 36 98 17 FE 4E 26
       data hash MD5: 16K
       D5 DD 93 07 8A 62 F9 3D FE 06 2D 78 CA 88 57 25>)
(   2,<2021-02-01 11:00:43.35 +0400>,<she>,<DPX200>,
      <Start of raw data processing
       efp BC_mod = 2 LB = 0.24 FT_mod = 6 PKNL = 1 PHC0 = -10762.86 PHC1 = 16.80095 SI = 16K 
       data hash MD5: 16K
       50 82 90 10 7E FA 2E 72 C0 20 A1 7E 7A 2B 0C 71>)
(   3,<2021-02-01 11:01:04.45 +0400>,<she>,<DPX200>,
      <pk PHC0 = 0.907174 PHC1 = -4 
       data hash MD5: 16K
       78 F1 E2 96 04 36 C6 A5 62 EC 69 95 A7 8F 92 42>)
(   4,<2021-02-01 11:01:07.18 +0400>,<she>,<DPX200>,
      <abs ABSG = 5 
       data hash MD5: 16K
       D7 93 28 F3 74 1D 46 F0 AD 4F BD C4 66 95 8E BF>)
$$ ##END=
$$ 
$$ hash MD5
$$ 9C 22 F8 F5 04 E9 CC 3B 58 1F 22 AB 5E 14 69 97
##$RELAX= 
##$RELAX= 
##$RELAX= 
##$RELAX= 
##$RELAX= 
##$RELAX= 
$$ Bruker specific parameters
$$ --------------------------
##$DU= <F:/spectra>
##$EXPNO= 1
##$NAME= <H-F>
##$PROCNO= 1
##$TYPE= <nmr>
##$USER= <she>
##$AMP= (0..31)
100 100 100 100 100 100 100 100 100 100 100 100 100 100 100 100 100 100 
100 100 100 100 100 100 100 100 100 100 100 100 100 100 
##$AQSEQ= 0
##$AQ_mod= 1
##$AUNM= <au_zg>
##$AUTOPOS= <>
##$BF1= 200.13
##$BF2= 200.13
##$BF3= 200.13
##$BF4= 200.13
##$BF5= 200.13
##$BF6= 200.13
##$BF7= 200.13
##$BF8= 200.13
##$BYTORDA= 1
##$CFDGTYP= 0
##$CFRGTYP= 5
##$CHEMSTR= <none>
##$CNST= (0..31)
1 1 145 1 1 1 1 1 1 1 1 1 1 1 1 1 1 1 1 1 1 1 1 1 1 1 1 1 1 1 1 1 
##$CPDPRG= <>
##$CPDPRG1= <>
##$CPDPRG2= <>
##$CPDPRG3= <>
##$CPDPRG4= <mlev>
##$CPDPRG5= <mlev>
##$CPDPRG6= <mlev>
##$CPDPRG7= <mlev>
##$CPDPRG8= <mlev>
##$CPDPRGB= <>
##$CPDPRGT= <>
##$D= (0..31)
0 1.2 0 0 0 0 0 0 0 0.06 0 0.03 0 0 0 0 0.0002 0 0 0 0 0 0 0 0 0 0 0 0 
0 0 0 
##$DATE= 1612162840
##$DBL= (0..7)
120 120 120 120 120 120 120 120 
##$DBP= (0..7)
150 150 150 150 150 150 150 150 
##$DBP07= 0
##$DBPNAM0= <>
##$DBPNAM1= <>
##$DBPNAM2= <>
##$DBPNAM3= <>
##$DBPNAM4= <>
$$ [...]
##$SUBNAM3= <"">
##$SUBNAM4= <"">
##$SUBNAM5= <"">
##$SUBNAM6= <"">
##$SUBNAM7= <"">
##$SUBNAM8= <"">
##$SUBNAM9= <"">
##$SW= 16.9725356469052
##$SWIBOX= (0..15)
0 0 2 0 0 0 0 0 0 0 0 0 0 0 0 0 
##$SW_h= 3396.73913043478
##$TD= 16384
##$TD0= 1
##$TE= 0
##$TE2= 300
##$TE3= 300
##$TEG= 300
##$TL= (0..7)
0 120 120 120 120 120 120 120 
##$TP= (0..7)
150 150 150 150 150 150 150 150 
##$TP07= 0
##$TPNAME0= <>
##$TPNAME1= <>
##$TPNAME2= <>
##$TPNAME3= <>
##$TPNAME4= <>
##$TPNAME5= <>
##$TPNAME6= <>
##$TPNAME7= <>
##$TPOAL= (0..7)
0.5 0.5 0.5 0.5 0.5 0.5 0.5 0.5 
##$TPOFFS= (0..7)
0 0 0 0 0 0 0 0 
##$TUNHIN= 0
##$TUNHOUT= 0
##$TUNXOUT= 0
##$USERA1= <user>
##$USERA2= <user>
##$USERA3= <user>
##$USERA4= <user>
##$USERA5= <user>
##$V9= 5
##$VALIST= <valist>
##$VCLIST= <CCCCCCCCCCCCCCC>
##$VD= 0
##$VDLIST= <DDDDDDDDDDDDDDD>
##$VPLIST= <PPPPPPPPPPPPPPP>
##$VTLIST= <TTTTTTTTTTTTTTT>
##$WBST= 1024
##$WBSW= 4
##$XGAIN= (0..3)
0 0 0 0 
##$XL= 0
##$YL= 0
##$YMAX_a= 197154
##$YMIN_a= -248435
##$ZGOPTNS= <>
##$ZL1= 120
##$ZL2= 120
##$ZL3= 120
##$ZL4= 120
##$ABSF1= 15.98438
##$ABSF2= -0.9882822
##$ABSG= 5
##$ABSL= 3
##$ALPHA= 0
##$AQORDER= 0
##$ASSFAC= 0
##$ASSFACI= 0
##$ASSFACX= 0
##$ASSWID= 0
##$AUNMP= <proc_1d>
##$AZFE= 0.1
##$AZFW= 0.1
##$BCFW= 0
##$BC_mod= 2
##$BYTORDP= 0
##$COROFFS= 0
##$CY= -3
##$DATMOD= 1
##$DC= 0
##$DFILT= <>
##$DTYPP= 0
##$F1P= 0
##$F2P= 0
##$FCOR= 1
##$FTSIZE= 16384
##$FT_mod= 6
##$GAMMA= 0
##$GB= 0
##$INTBC= 1
##$INTSCL= 2.992141e-10
##$ISEN= 128
##$LB= 0.24
##$LEV0= 0
##$LPBIN= 0
##$MAXI= 10000
##$MC2= 0
##$MEAN= 0
##$ME_mod= 0
##$MI= 1.114404
##$NCOEF= 0
##$NC_proc= -7
##$NLEV= 6
##$NOISF1= 3.799351
##$NOISF2= 2.8
##$NSP= 0
##$NTH_PI= 0
##$NZP= 0
##$OFFSET= 15.98335
##$PC= 1
##$PHC0= -10761.95
##$PHC1= 12.80095
##$PH_mod= 1
##$PKNL= yes
##$PPARMOD= 0
##$PSCAL= 0
##$PSIGN= 0
##$REVERSE= no
##$SF= 200.130006256198
##$SI= 16384
##$SIGF1= 3
##$SIGF2= 2
##$SINO= 5.538805
##$SIOLD= 16384
##$SREGLST= <1H.CDCl3>
##$SSB= 0
##$STSI= 16384
##$STSR= 0
##$SW_p= 3396.73913043478
##$SYMM= 0
##$S_DEV= 0
##$TDeff= 16384
##$TDoff= 0
##$TI= <>
##$TILT= no
##$TM1= 0
##$TM2= 0
##$TOPLEV= 0
##$USERP1= <user>
##$USERP2= <user>
##$USERP3= <user>
##$USERP4= <user>
##$USERP5= <user>
##$WDW= 1
##$XDIM= 16384
##$YMAX_p= 482976735
##$YMIN_p= -2389137
$$ End of Bruker specific parameters
$$ ---------------------------------
##NTUPLES= NMR SPECTRUM
##VAR_NAME=  FREQUENCY,     SPECTRUM/REAL,   SPECTRUM/IMAG
##SYMBOL=    X,             R,               I
##VAR_TYPE=  INDEPENDENT,   DEPENDENT,       DEPENDENT
##VAR_FORM=  AFFN,          ASDF,            ASDF
##VAR_DIM=   16384,         16384,           16384
##UNITS=     HZ,            ARBITRARY UNITS, ARBITRARY UNITS
##FACTOR=    0.207333158178281, 1,           1
##FIRST=     3198.74789549099, 0,            0
##LAST=      -197.991234943792, 0,           0
##MIN=       -197.991234943792, -2389137,    0
##MAX=       3198.74789549099, 482976735,    0
$$ Real data points
##PAGE= N=1
##DATA TABLE= (X++(R..R)), XYDATA
$$ [...]
$$ plain form
5378 -37596 197602 340162 156649 91443 65480 124708 79061 -36458 65952 190742 -127708
5367 -127708 -124553 -127128 -154539 295344 292764 120210 154522 285882 96009 161955 329850
5356 329850 428816 407279 400760 357148 216645 234851 652543 344415 285474 198599 62188
5345 62188 189799 378226 421013 453210 40807 103776 75221 86886 252839 216223 -10579
5334 -10579 224292 203148 223378 400306 330928 245220 135676 122553 309143 298660 421841
5323 421841 731794 470129 200684 191966 92835 173545 458775 619426 720243 576519
5313 576519 427089 359094 412152 626072 516614 582359 945364 998732 812574 877116 776700
5302 776700 589015 972666 603281 456877 537029 400533 403973 375201 449252 704381 655883
$$ packed form
5378c7596K35198J42560j83513o5206k5963N9228m5647j15519J02410J24790l18450
5367a27708L155k575k7411M49883k580j72554L4312J31360j89873O5946J67895
5356C29850R8966k1537o519m3612j40503J8206M17692l08128n8941q6875j36411
5345F2188J27611J88427M2787L2197m12403O2969k8555J1665J65953l6616k26802
5334a0579K34871k1144K0230J76928o9378q5708j09544j3123J86590j0483J23181
5323D21841L09953k61665k69445q718r9131Q0710K85230J60651J00817j43724
5313E76519j49430o7995N3058K13920j09458O5745L63005N3368j86158O4542j00416
5302G76700j87685L83651l69385j46404Q0152j36496L440k8772P4051K55129m8498
$$ plain form
5291 655883 349141 169919 183844 393139 631595 448401 660996 505919 358200 543051
5281 543051 630263 460618 326184 542534 714409 981268 1453541 1452074 1143629 1157854
5271 1157854 1027813 772253 1064111 1171138 1133074 1030258 923082 926276 869019 659658
5261 659658 647498 547222 308972 255181 454070 367685 464904 426429 369091 305176 235213
5250 235213 186199 441603 298617 500261 867560 892940 604377 807044 944491 937477
5240 937477 1075283 1093024 805171 1108558 1315544 675480 892216 957865 785471 525899
5230 525899 396692 227004 473127 469932 361600 377750 260191 141236 295287 310639
5220 310639 470676 572949 347710 159140 27557 -89068 167390 185941 120045 134625
$$ packed form
5291F55883l06742j79222J3925K09295K38456j83194K12595j55077j47719J84851
5281E43051Q7212j69645j34434K16350J71875K66859M72273j467l08445J4225
5271A157854j30041k55560K91858J07027l8064j02816j07176L194n7257k09361
5261F59658j2160j00276k38250n3791J98889q6385R7219l8475n7338o3915o9963
5250B35213m9014K55404j42986K01644L67299K5380k88563K02667J37447p014
5240I37477J37806J7741k87853L03387K06986o40064K16736O5649j72394k59572
5230E25899j29207j69688K46123l195j08332J6150j17559j18955J54051J5352
5220C10639J60037J02273k25239j88570j31583j16625K56458J8551o5896J4580
$$ plain form
5210 134625 277901 -157788 104193 223388 415266 761694 520311 57277 440773 669711
5200 669711 612314 627265 821449 526627 569739 254191 -59035 274855 522802 112176
5190 112176 46154 -19699 90456 122445 -59533 -124455 142024 130904 -55121 171373 112688
5179 112688 211964 324617 368949 382587 343884 126852 16702 -2259 368648 545878 304525
5168 304525 -58815 264201 158919 454857 832869 709965 205356 224408 212363 227021
5158 227021 327750 442918 498720 356101 -27638 -135103 134423 428100 13707 87638
5148 87638 242474 351938 68277 -10847 243985 393726 356888 173033 4635 226551
5138 226551 366530 426080 308554 396694 320697 456392 368841 69933 238220 578068
$$ packed form
5210A34625J43276m35689K61981J19195J91878L46428k41383m63034L83496K28938
5200F69711n7397J4951J94184k94822M3112l15548l13226L33890K47947m10626
5190A12176o6022o5853J10155L1989j81978o4922K66479j1120j86025K26494n8685
5179A12688R9276J12653M4332J3638l8703k17032j10150j8961L70907J77230k41353
5168C04525l63340L23016j05282K95938L78012j22904n04609J9052j2045J4658
5158B27021J00729J15168N5802j42619l83739j07465K69526K93677m14393P3931
5148H7638J54836J09464k83661p9124K54832J49741l6838j83855j68398K21916
5138B26551J39979N9550j17526Q8140p5997J35695q7551k98908J68287L39848
$$ plain form
5128 578068 644110 226459 104335 206757 481808 237710 -26725 -111287 -10686 64172
5118 64172 201761 286954 552118 624038 710500 201877 79237 430006 529301 205345 121358
5107 121358 177918 217488 325312 -62234 19980 292991 332500 -110131 -276876 181610
5097 181610 523689 458237 482711 216429 -7008 150241 261539 341625 757671 914575
5087 914575 361250 -71647 -85890 212918 689158 565447 359410 307754 229832 88431
5077 88431 181686 456328 528711 412987 425835 172553 240033 496542 640098 540693 40510
5066 40510 154180 457266 254804 -8666 238405 386868 240958 65151 -98843 -59982
5056 -59982 337905 325161 598892 755741 799098 719057 604371 476250 689651 452889
$$ packed form
5128E78068O6042m17651j22124J02422K75051k44098k64435q4562J00601P4858
5118F4172J37589Q5193K65164P1920Q6462n08623j22640L50769R9295l23956q3987
5107A21358N6560L9570J07824l87546Q2214K73011L9509m42631j66745M58486
5097A81610L42079o5452K4474k66282k23437J57249J11298Q0086M16046J56904
5087I14575n53325m32897j4243K98808M76240j23711k06037n1656p7922j41401
5077H8431R3255K74642P2383j15724J2848k53282O7480K56509J43556r9405n00183
5066D0510J13670L03086k02462k63470K47071J48463j45910j75807j63994L8861
5056e9982L97887j2744K73731J56849M3357q0041j14686j28121K13401k36762
$$ plain form
5046 452889 442761 383345 224769 269369 382144 269052 366177 313685 117832 -187621 -99229
5035 -99229 -122094 173242 200357 86839 316399 362667 272692 311716 503543 482738 481371
5024 481371 609915 342073 348083 622766 562921 333175 130942 218355 395242 352630 334431
5013 334431 558284 654219 708680 519616 -32189 -141665 226163 300513 199809 191197 163290
5002 163290 -113734 135304 313877 376047 202829 -97830 -160788 82580 256061 538796
4992 538796 655246 563468 654731 730034 693472 380706 151725 415009 639697 907831
4982 907831 614288 430444 418248 353227 470661 468294 -31316 -77416 231908 376733 450431
4971 450431 532890 546376 618781 250005 8963 83295 393825 591341 398158 474349 629272
$$ packed form
5046D52889j0128n9416j58576M4600J12775j13092R7125n2492j95853l05453Q8392
5035i9229k2865K95336K7115j13518K29560M6268q9975L9024J91827k0805j367
5024D81371J28544k67842O010K74683n9845k29746k02233Q7413J76887m2612j8199
5013C34431K23853R5935N4461j89064n51805j09476L67828P4350j00704q612k7907
5002A63290k77024K49038J78573O2170j73218l00659o2958K43368J73481K82735
4992E38796J16450r1778R1263P5303l6562l12766k28981K63284K24688K68134
4982I07831k93543j83844j2196o5021J17434k367m99610m6100L09324J44825P3698
4971D50431Q2459J3486P2405l68776k41042P4332L10530J97516j93183P6191J54923
$$ plain form
4960 629272 592056 709323 739410 764701 613692 618872 373862 597493 802361 906801 703543
4949 703543 475268 430474 729407 662665 714495 557248 385190 545904 623400 436549
4939 436549 485314 780056 596890 467823 447233 654545 474499 546499 491944 621399
4929 621399 472647 346792 465011 551548 476186 699466 736709 578937 591562 985486
4919 985486 1137775 969088 523765 729989 799800 750049 681605 819041 768378 533230
4909 533230 621055 633247 543550 749357 754883 800634 743009 759772 874566 660832 629900
4898 629900 675789 781142 969622 771074 601487 635340 693188 714602 338285 228452
4888 228452 424525 192358 74192 313720 330802 447791 536472 563816 553494 588693 439817
$$ packed form
4960F29272l7216J17267L0087K5291j51009N180k45010K23631K04868J04440k03258
4949G03543k28275m4794K98933o6742N1830j57247j72058J60714P7496j86851
4939D36549M8765K94742j83166j29067k0590K07312j80046P2000n4555J29455
4929F21399j48752j25855J18219Q6537p5362K23280L7243j57772J2625L93924
4919I85486J52289j68687m45323K06224O9811m9751o8444J37436n0663k35148
4909E33230Q7825J2192q9697K05807N526M5751n7625J6763J14794k13734l0932
4898F29900M5889J05353J88480j98548j69587L3853N7848K1414l76317j09833
4888B28452J96073k32167j18166K39528J7082J16989Q8681K7344j0322L5199j48876
$$ plain form
4877 439817 426001 521639 714759 925921 950260 400833 348836 636342 774050 671714
4867 671714 863821 1065669 1048243 774681 825022 962333 1060324 940508 881763 552682
4857 552682 544649 728401 476095 435559 646310 683640 500267 495700 335675 433888 863755
4846 863755 853815 499806 681082 898108 888774 892853 797273 777424 1062815 957134 850993
4835 850993 833600 1064641 1403421 1246394 645979 612844 763085 710492 1011359 1144247
4825 1144247 644270 669818 659428 456902 463386 450530 661541 858188 552089 540708 566293
4814 566293 549274 271682 718721 656331 751892 805956 859737 912973 1185042 1191016 1068100
4803 1068100 1095243 794610 837694 905557 1047950 1252745 1370293 1440855 1335454 1267118
$$ packed form
4877D39817j3816R5638J93120K11162K4339n49427n1997K87506J37708j02336
4867F71714J92107K01848j7426k73562N0341J37311R7991j19816n8745l29081
4857E52682q033J83752k52306m0536K10751L7330j83373m567j60025R8213M29867
4846H63755r940l54009J81276K17026r334M079r5580j9849K85391j05681j06141
4835H50993j7393K31041L38780j57027o00415l3135J50241n2593L00867J32888
4825A144247m99977K5548j0390k02526O484j2856K11011J96647l06099j1381K5585
4814E66293j7019k77592M47039o2390R5561N4064N3781N3236K72069N974j22916
4803A068100K7143l00633M3084O7863J42393K04795J17548P0562j05401o8336
$$ plain form
4793 1267118 1023508 771640 1204848 1131082 1114019 1124650 1169112 1122293 900137 817770 838299
4782 838299 714032 654383 876298 759478 660721 1011868 1135230 1114717 1371834 1300661
4772 1300661 1269914 1342936 1242358 1337930 1463547 1164920 977026 1240308 954099 871438
4762 871438 997237 1484889 1560567 1421210 1516993 1610515 1289437 1316531 1179478 1380781
4752 1380781 1397832 1746861 1671526 1833372 1730541 1514189 1488964 1610102 1570222 1414570
4742 1414570 1668062 1552475 1561917 1931038 1772529 1591139 1613438 1625236 1652015 1991696
4732 1991696 2375539 2224222 1992521 1473359 1567753 1835461 2112255 2145809 2301209 2716856
4722 2716856 2433645 1940860 1945194 2098750 2301350 2007875 1821410 1939224 2259047 2062101
$$ packed form
4793A267118k43610k51868M33208p3766j7063J0631M4462m6819k22156q2367K0529
4782H38299j24267n9649K21915j16820r8757L51147J23362k0513K57117p1173
4772A300661l0747P3022j00578R5572J25617k98627j87894K63282k86209q2661
4762H71438J25799M87652P5678j39357R5783R3522l21078K7094j37053K01303
4752A380781J7051L49029p5335J61846j02831k16352k5225J21138l9880j55652
4742A414570K53492j15587R442L69121j58509j81390K2299J1798K6779L39681
4732A991696L83843j51317k31701n19162R4394K67708K76794L3554J55400M15647
4722B716856k83211m92785M334J53556K02600k93475j86465J17814L19823j96946
$$ plain form
4712 2062101 1947298 2254414 2229943 2148397 1883927 1623713 1737784 1917028 2322088 2177119
4702 2177119 1984696 2040234 2126619 1941760 1590560 1904388 2178209 2389798 2509398 2530816
4692 2530816 2750091 3131330 3115273 2883806 3031037 3043035 3122487 3337809 3175062 3198444
4682 3198444 2935119 3124396 3264176 3390893 3154746 3046732 3427542 3274339 3214849 3606294
4672 3606294 3568887 3540214 3283427 3227109 3578009 3622792 3845311 3983979 3865573 3696709
4662 3696709 4261112 4453751 4615845 4695680 4585218 4545045 4809303 5107327 5140901 5453408
4652 5453408 5336453 4955397 5315023 5251788 5683677 5910418 5830411 5731717 5959140 6196197
4642 6196197 6418472 6739707 6757501 7049074 7512878 7736635 8136651 8584140 9296039 9761457
$$ packed form
4712B062101j14803L07116k4471q1546k64470k60214J14071J79244M05060j44969
4702B177119j92423N5538Q6385j84859l51200L13828K73821K11589J19600K1418
4692B530816K19275L81239j6057k31467J47231J1998P9452K15322j62747K3382
4682C198444k63325J89277J39780J26717k36147j08014L80810j53203n9490L91445
4672C606294l7407k8673k56787n6318L50900M4783K22519J38668j18406j68864
4662C696709N64403J92639J62094P9835j10462m0173K64258K98024L3574L12507
4652E453408j16955l81056L59626o3235M31889K26741q0007r8694K27423K37057
4642F196197K22275L21235J7794K91573M63804K23757M00016M47489P11899M65418
$$ plain form
4632 9761457 10349768 11184281 12245152 12678198 12341535 12209203 12237020 12121360 12203851 12030603
4622 12030603 12177451 12339163 12565073 12566688 13044881 13446054 13633025 14217549 14865464 15760502
4612 15760502 17064284 18201523 19102981 20166241 20750116 21440156 22404235 23325975 24162663
4603 24162663 24864194 25149543 25180214 24910696 24248644 23523849 23251482 23091211 23000384 23314855
4593 23314855 24188357 24635985 24665264 24600893 24910795 25368840 26255394 27362839 28354732 29098411
4583 29098411 30104861 30912698 31306380 31585814 31803229 31622580 31683529 32024630 32208761
4574 32208761 32148791 31979300 31417122 31188530 30984984 31140119 31263630 31387697 31339738 31026246
4564 31026246 30836662 30627073 29608060 28621166 27940232 27842511 27855630 28059172 27763394 27306990
$$ packed form
4632I761457N88311Q34513J060871M33046l36663j32332K7817j15660Q2491j73248
4622A2030603J46848J61712K25910J615M78193M01173J86971N84524O47915Q95038
4612A5760502J303782J137239R01458J063260N83875O90040R64079R21740Q36688
4603B4162663P01531K85349L0671k69518o62052p24795k72367j60271r0827L14471
4593B3314855Q73502M47628K9279o4371L09902M58045Q86554J107445R91893P43679
4583B9098411J006450Q07837L93682K79434K17415j80649O0949L41101J84131
4574C2208761n9970j69491n62178k28592k03546J55135J23511J24067m7959l13492
4564C1026246j89584k09589j019013r86894o80934r7721J3119K03542k95778m56404
$$ plain form
4554 27306990 26797998 26449925 26186577 26112026 26435474 26880697 27443328 27896996 27939060 27999698
4544 27999698 27973483 27817204 27504510 27113581 26600324 25663135 24477025 23245280 21787083
4535 21787083 19877759 18321936 17088099 16323806 15805702 15493559 15141871 14871086 14582697
4526 14582697 14870293 15217886 15558268 15938568 16573591 17160542 17485686 17154026 16639601
4517 16639601 15839147 14542403 13534839 12806020 11885341 11202460 10465086 10370894 10112715
4508 10112715 9611562 9019665 8605218 8363030 8434404 8378088 8244424 7918746 7592888 7593097
4498 7593097 7722560 7339869 7218456 7152922 7186960 7264113 7379565 7523607 7083355 7024141
4488 7024141 7166209 7243436 7069658 7188003 7165537 7154742 7554729 7475771 7466693 7881041 7946986
$$ packed form
4554B7306990n08992l48073k63348p4551L23448M45223N62631M53668M2064O0638
4544B7999698k6215j56279l12694l90929n13257r37189j186110j231745j458197
4535B1787083j909324j555823j233837p64293n18104l12143l51688k70785k88389
4526A4582697K87596L47593L40382L80300O35023N86951L25144l31660n14425
4517A6639601q00454j296744j007564p28819r20679o82881p37374r4192k58179
4508A0112715n01153n91897m14447k42188P1374n6316j33664l25678l25858K09
4498G593097J29463l82691j21413o5534L4038P7153J15452J44042m40252n9214
4488G024141J42068P7227j73778J18345k2466j0795L99987p8958r078M14348O5945
$$ plain form
4477 7946986 7928275 7950775 7990040 7923308 8169392 8244924 8520246 8585618 8570786 8616979 8616277
4466 8616277 8820858 9207780 9415242 9294001 9186752 9687268 10218991 10235229 10226075 10819075
4456 10819075 11307849 11365601 11692187 12323690 13143384 13965977 14419250 14472830 14266129 14114730
4446 14114730 13943644 13525537 13441964 13476665 13469712 13484774 13534400 13871333 14429096 14466268 14252392
4435 14252392 14584398 15024383 15522473 16108673 16347286 17065084 17593400 18278177 18876199
4426 18876199 19877979 20972392 21779954 22144003 22332472 22848756 23377777 24333994 25149493
4417 25149493 25779942 26801735 27921080 28926858 30059254 31602109 33290314 34942791
4409 34942791 36771680 38731415 41453634 44376135 47268930 50547988 54523943 59783109
$$ packed form
4477G946986j8711K2500L9265o6732K46084P5532K75322O5372j4832M6193p02
4466H616277K04581L86922K07462j21241j07249N00516N31723J6238r154N93000
4456A0819075M88774N7752L26586O31503Q19694Q22593M53273N3580k06701j51399
4446A4114730j71086m18107q3573L4701o953J5062M9626L36933N57763L7172k13876
4435A4252392L32006M39985M98090N86200K38613P17798N28316O84777N98022
4426A8876199J001780J094413Q07562L64049J88469N16284N29021R56217Q15499
4417B5149493O30449J021793J119345J005778J132396J542855J688205J652477
4409C4942791J828889J959735K722219K922501K892795L279058L975955N259166
$$ plain form
4401 59783109 66188036 73498941 82333577 92688942 103110668 110327110 114100520 115592608
4393 115592608 116015043 116463334 115748362 111514974 104203540 95545294 86351222 78430492
4385 78430492 72388604 68049578 64863203 62354564 60658342 59629887 59152876 59713988
4377 59713988 61307232 63978963 67828195 72675888 77517471 81420040 82909551 81418049
4369 81418049 78255897 74434826 71390026 70376185 71483678 73648350 76310610 76368990
4361 76368990 72473761 66625957 59353633 52142649 46375306 42009375 38384918 35057195
4353 35057195 32502196 30164519 28132680 25988461 24590872 23479182 21887997 21138585
4345 21138585 20672204 19812455 19058180 18705724 18313400 18140514 18341136 17951147 17612360
$$ packed form
4401E9783109O404927P310905Q834636J0355365J0421726P216442L773410J492088
4393A15592608M22435M48291p14972m233388p311434q658246r194072p920730
4385G8430492o041888m339026l186375k508639j696222j028455m77011N61112
4377E9713988J593244K671731L849232M847693M841583L902569J489511j491502
4369H1418049l162152l821071l044800j013841J107493K164672K662260N8380
4361G6368990l895229n847804p272324p210984n767343m365931l624457l327723
4353C5057195k554999k337677k031839k144219j397589j111690j591185p49412
4345B1138585m66381q59749p54275l52456l92324j72886K00622l89989l38787
$$ plain form
4336 17612360 17389167 16621612 15654803 14804421 14083821 13241495 12597688 12198001 11854185
4327 11854185 11911136 11832457 11537282 11101482 10602836 10368834 10101676 9886382 9599122 9651452
4317 9651452 9726725 9699755 9306556 9316095 9728442 9760697 9830451 10307689 10072960 9606600 9358532
4306 9358532 8918995 8050215 7447154 6911037 6707977 6342751 5938720 5796624 5805281 5525717
4296 5525717 5352157 5502512 5458360 5073093 4753653 4697722 4986942 5022386 4811951 4517850
4286 4517850 4193961 3728740 3752388 4285852 4301743 4095098 4004474 3822726 3522689 3405860
4276 3405860 3558911 3635234 3410694 3332776 2966205 3129915 3249016 3209065 2824351 2749315
4266 2749315 2621955 2732102 2759824 2963377 2974389 2940072 2903826 2751527 2573024 2909404
$$ packed form
4336A7612360k23193p67555r66809q50382p20600q42326o43807l99687l43816
4327A1854185N6951p8679k95175m35800m98646k34002k67158k15294k87260N2330
4317I651452P5273k6970l93199R539M12347L2255O9754M77238k34729m66360k48068
4306I358532m39537q68780o03061n36117k03060l65226m04031j42096Q657k79564
4296E525717j73560J50355m4152l85267l19440n5931K89220L5444k10435k94101
4286D517850l23889m65221K3648N33464J5891k06645r0624j81748l00037j16829
4276C405860J53051P6323k24540p7918l66571J63710J19101l9951l84714p5036
4266B749315j27360J10147K7722K03553J1012l4317l6246j52299j78503L36380
$$ plain form
4256 2909404 3094100 2741814 2381891 2560028 2533572 2844086 2668938 2400795 2242645 2171222
4246 2171222 2195345 2231496 2193717 2315771 2398270 2499626 2168284 2162275 2312725 1967018 1718929
4235 1718929 1864688 2144940 2089922 2167739 2080927 2183475 1932573 1827490 2021335 2072300
4225 2072300 2265233 2314393 1843448 1648001 1694354 1790746 1708160 1661194 1692625 1894374 1840548
4214 1840548 1833154 1598397 1339455 1223826 1533010 1672606 1767668 1489949 1265623 1098706
4204 1098706 1126895 1562195 1701552 1598115 1857243 1723930 1430085 1170885 1397963 1690122
4194 1690122 1500726 1212179 1417494 1356030 1250333 1155344 1366105 1539355 1497272 1099344
4184 1099344 725627 757916 1103574 1056902 1101422 1199720 1106051 1098803 1234570 1075157 972376
$$ packed form
4256B909404J84696l52286l59923J78137k6456L10514j75148k68143j58150p1423
4246B171222K4123L6151l7779J22054Q2499J01356l31342o009J50450l45707k48089
4235A718929J45759K80252n5018P7817q6812J02548k50902j05083J93845N0965
4225B072300J92933M9160m70945j95447M6353R6392q2586m6966L1431K01749n3826
4214A840548p394k34757k58942j15629L09184J39596R5062k77719k24326j66917
4204A098706K8189M35300J39357j03437K59128j33313k93845k59200K27078K92159
4194A690122j89396k88547K05315o1464j05697r4989K10761J73250m2083l97928
4184A099344l73717L2289L45658m6672M4520R8298r3669p248J35767j59413j02781
$$ plain form
4173 972376 1215441 1266863 1326671 1613515 1657527 1479992 1264321 1156638 1204250 1187970 1129106
4162 1129106 1154214 1128873 1017664 1036213 983115 1040872 840399 813276 870685 768320 593086
4151 593086 1018764 1390893 1401356 1421245 1186272 843019 895972 1017115 988880 1006818 1208867
4140 1208867 1388860 1529439 1397943 1082507 1012686 1099224 976599 1216839 1360100 1253943
4130 1253943 1290346 1234564 935369 821156 849276 863728 908883 838469 834678 972493 1260001
4119 1260001 1407983 1061857 897794 1040247 1156307 1008798 1132277 1035005 1114486 1175264
4109 1175264 1154849 1163310 1278097 1459553 1235855 1181994 1140462 994712 1191673 1208858 913318
4098 913318 1044140 1202275 953603 1089408 1331543 1124090 1342366 1710744 1390190 1361309
$$ packed form
4173I72376K43065N1422N9808K86844M4012j77535k15671j07683M7612j6280n8864
4162A129106K5108k5341j11209J8549n3098N7757k00473k7123N7409j02365j75234
4151E93086M25678L72129J0463J9889k34973l43253N2953J21143k8235J7938K02049
4140A208867J79993J40579j31496l15436o9821Q6538j22625K40240J43261j06157
4130A253943L6403n5782k99195j14213K8120J4452M5155p0414l791J37815K87508
4119A260001J47982l46126j64063J42453J16060j47509J23479r7272P9481O0778
4109A175264k0415Q461J14787J81456k23698n3861m1532j45750J96961J7185k95540
4098I13318J30822J58135k48672J35805K42135k07453K18276L68378l20554k8881
$$ plain form
4088 1361309 1250473 1262409 1119086 1296484 1446134 1163521 1069703 1115619 1357280 1616071
4078 1616071 1519669 1644032 1379693 1338380 1473491 1469763 1407356 1383031 1307629 1636591 2285406
4067 2285406 2402901 2328504 2468362 2209078 2078156 2322889 2227065 2173149 2270336 2238714
4057 2238714 2198587 2447695 2295880 2146252 2179708 2193835 2209817 2304343 2080908 2097574 2362438
4046 2362438 2356959 2356968 2568867 2561519 2371545 2312139 2649217 2855017 3074875 3103198 3153183 3116990
4034 3116990 2918839 3057957 3084788 3273367 3455445 3224091 3060347 3191848 3229175 3066891
4024 3066891 3251801 2879148 2745604 3010132 2992638 2638859 2645366 2255726 1928702 2249778
4014 2249778 2233205 2030461 2435679 2479865 2125412 2292986 2577713 2579547 2375503 2621181
$$ packed form
4088A361309j10836J1936j43323J77398J49650k82613r3818M5916K41661K58791
4078A616071r6402J24363k64339m1313J35111l728o2407k4325p5402L28962O48815
4067B285406J17495p4397J39858k59284j30922K44733r5824n3916R7187l1622
4057B238714m0127K49108j51815j49628L3456J4127J5982R4526k23435J6666K64864
4046B362438n479RK11899p348j89974n9406L37078K05800K19858K8323M9985l6193
4034C116990j98151J39118K6831J88579J82078k31354j63744J31501L7327j62284
4024C066891J84910l72653j33544K64528j7494l53779O507l89640l27024L21076
4014B249778j6573k02744M05218M4186l54453J67574K84727J834k04044K45678
$$ plain form
4004 2621181 2571098 2375579 2569063 2506622 2728334 2946617 3224627 3121076 2728157 2562460
3994 2562460 2482049 2599363 2632986 2196121 1673870 1576946 1753981 1734111 1789536 1811742 1733576
3983 1733576 1809537 1515881 1348801 1796716 1770060 1378212 1359651 1369731 1587911 2062409
3973 2062409 1974378 1832134 1699823 1835724 1588051 1445386 1732925 1998271 1968862 1757793
3963 1757793 1405307 1589473 1934668 1967379 2013790 2118133 1806287 1810524 1905062 1433423
3953 1433423 1099829 1321516 1432669 1246861 1576092 1576532 1383706 1398430 1498478 1615638
3943 1615638 1691557 1678963 1300525 1373512 1814008 1530548 1343304 1329225 1946010 2011165
3933 2011165 1955349 1768389 1330337 1576800 1756403 1493253 1695394 1973465 1768289 1256389
$$ packed form
4004B621181n0083j95519J93484o2441K21712K18283K78010j03551l92919j65697
3994B562460q0411J17314L3623m36865n22251r6924J77035j9870N5425K2206p8166
3983A733576P5961k93656j67080M47915k6656l91848j8561J0080K18180M74498
3973B062409q8031j42244j32311J35901k47673j42665K87539K65346k9409k11069
3963A757793l52486J84166L45195L2711M6411J04343l11846M237R4538m71639
3953A433423l33594K21687J11153j85808L29231M40j92826J4724J00048J17160
3943A615638P5919j2594l78438P2987M40496k83460j87244j4079O16785O5155
3933B011165n5816j86960m38052K46463J79603k63150K02141K78071k05176n11900
$$ plain form
3923 1256389 1362115 1552638 1852853 1527067 1010213 1435452 1968251 1867615 1429722 1204179
3913 1204179 1379979 1639761 1942826 1982635 2091782 1951939 1808514 1694189 1638860 1836240
3903 1836240 2134984 1909444 1705401 2124251 2199198 2054752 2275761 2067638 2056387 1919225
3893 1919225 1676015 1552700 2148692 2337127 2009654 2007810 2257442 2426146 2326661 2050738
3883 2050738 2216319 1971272 2117096 2455477 2356803 2223798 2127304 2255760 2186557 2059256
3873 2059256 1734463 2039741 2150350 2173038 1948569 1909205 1592339 1322491 1677700 1954730
3863 1954730 1916161 2197805 2057535 1872278 2271718 2334783 1991087 1957917 2040756 2538496
3853 2538496 2899704 2598474 2422199 2806257 2813472 3013691 3029382 2647113 2449138 2359769
$$ packed form
3923A256389J05726J90523L00215l25786n16854M25239N32799j00636m37893k25543
3913A204179J75800K59782L03065L9809J09147j39843j43425j14325n5329J97380
3903A836240K98744k25540k04043M18850P4947j44446K21009k08123j1251j37162
3893A919225k43210j23315N95992J88435l27473j844K49632J68704r9485k75923
3883B050738J65581k45047J45824L38381r8674j33005r6494J28456o9203j27301
3873B059256l24793L05278J10609K2688k24469l9364l16866k69848L55209K77030
3863A954730l8569K81644j40270j85257L99440O3065l43696l3170Q2839M97740
3853B538496L61208l01230j76275L84058P215K00219J5691l82269j97975q9369
$$ plain form
3843 2359769 2079316 1978761 2352908 2354808 2191655 2170060 2390592 2421060 2402830 2316429 2092072
3832 2092072 2183233 2277123 2346254 2260253 2404720 2751002 2532358 2658928 2833819 2764085
3822 2764085 3098249 3439208 3324878 3034215 3257734 3162857 3292408 3766209 3737223 3632369
3812 3632369 3752441 3710836 3711629 3575408 3254774 3110533 3357883 3359266 3342814 3304887 3157371
3801 3157371 3092821 3460523 3968487 4008619 3491010 3546037 3548834 3632073 3953416 4213385 4095809
3790 4095809 4100633 4378387 4327051 4565338 4733710 4811990 4942535 4980890 5196893 5186827 5395659
3779 5395659 5489177 5304917 5615032 5871527 5804802 5634128 5889637 6236556 6300124 5889924
3769 5889924 6016956 6330274 6336663 6496125 6682378 7182479 7517681 7293066 7413784 7709167
$$ packed form
3843B359769k80453j00555L74147J900j63153k1595K20532L0468j8230q6401k24357
3832B092072R1161R3890O9131q6001J44467L46282k18644J26570J74891o9734
3822B764085L34164L40959j14330k90663K23519r4877J29551M73801k8986j04854
3812C632369J20072m1605P93j36221l20634j44241K47350J383j6452l7927j47516
3801C157371o4550L67702N07964M0132n17609N5027K797Q3239L21343K59969j17576
3790D095809M824K77754n1336K38287J68372P8280J30545L8355K16003j0066K08832
3779E395659R3518j84260L10115K56495o6725j70674K55509L46919O3568m10200
3769E889924J27032L13318O389J59462J86253N00101L35202k24615J20718K95383
$$ plain form
3759 7709167 7910799 8300804 8512060 8390065 8598747 9322923 9891943 10167622 10442844 10797266
3749 10797266 11085123 11299455 11977166 12620362 13740532 14499857 15201270 16304753 17648472
3740 17648472 19268183 21191348 23405377 25704445 28377246 30259182 30342842 29098395
3732 29098395 27113095 25082285 23331589 21963469 21179848 20704827 20638351 20354450 20165133
3723 20165133 20485634 20754358 21166882 22445285 24206610 26223757 28338296 30028923 30675632
3714 30675632 30382426 28702016 26297087 23822041 21765195 20720589 19770539 18787022 17879481
3705 17879481 17622005 17455095 17191641 16647422 16540822 16256324 15962412 16503441 16917607
3696 16917607 16891657 17197369 17123594 17084192 17753186 18450982 19179324 19920450 20754674 21844123
$$ packed form
3759G709167K01632L90005K11256j21995K08682P24176N69020K75679K75222L54422
3749A0797266K87857K14332O77711O43196J120170P59325P01413J103483J343719
3740A7648472J619711J923165K214029K299068K672801J881936Q3660j244447
3732B9098395j985300k030810j750696j368120p83621m75021o6476k83901j89317
3723B0165133L20501K68724M12524J278403J761325K017147K114539J690627O46709
3714C0675632k93206j680410k404929k475046k056846j044606r50050r83517r07541
3705A7879481k57476j66910k63454n44219j06600k84498k93912N41029M14166
3696A6917607k5950L05712p3775l9402O68994O97796P28342P41126Q34224J089449
$$ plain form
3686 21844123 22974779 24576740 25925798 27344407 29905453 32894110 35876388 39840599
3678 39840599 44346746 48101156 49709750 49060541 46529512 42882653 39229002 36245668
3670 36245668 34051631 32812056 31603789 30588798 30310355 30566365 30843609 31780768 33104597
3661 33104597 34593470 36857853 40009787 43085286 45502543 46310986 44436891 40670774
3653 40670774 36492405 32507411 28914282 26157755 23912310 22139813 20562214 19511173
3645 19511173 18441767 17383247 16401573 15374937 14645834 14427028 14105966 13508840 12982725
3636 12982725 12908103 12224029 11819587 11723679 11658349 11427513 11377042 11064865 10722899 10448921
3626 10448921 10271464 10303956 10329439 10393766 10185854 10011383 9666150 9517108 9935048 10023011
$$ packed form
3686B1844123J130656J601961J349058J418609K561046K988657K982278L964211
3678C9840599M506147L754410J608594o49209k531029l646859l653651k983334
3670C6245668k194037j239575j208267j014991k78443K56010K77244R37159J323829
3661C3104597J488873K264383L151934L075499K417257Q08443j874095l766117
3653D0670774m178369l984994l593129k756527k245445j772497j577599j051041
3645A9511173j069406j058520r81674j026636p29103k18806l21062n97126n26115
3636A2982725p4622o84074m04442r5908o5330k30836n0471l12177l41966k73978
3626A0448921j77457L2492K5483O4327k07912j74471l45233j49042M17940Q7963
$$ plain form
3616 10023011 10074299 9811667 10101059 10361976 9951807 9619483 9666842 9656062 9875437 9832012
3606 9832012 9837080 9877215 9843511 9657154 9714313 9936875 10419165 10229279 10039314 10160183
3596 10160183 10179077 10413379 10374114 10584671 10680213 10605647 10524774 10629286 10470376 10555765
3586 10555765 10827549 10852819 11150292 11228471 11115455 11371105 11648371 11724950 11712888 11907039
3576 11907039 12209947 12238711 12626257 12881465 12714685 12777920 12885223 12918520 13139085 13470618
3566 13470618 13494532 13591969 13997433 14539198 14662571 15114322 15576821 15869837 16091304 16534618
3556 16534618 16961198 17435332 18037756 18485045 18986457 19661561 19931032 20484721 21527851
3547 21527851 22162791 22741844 23877161 25036804 26354515 27489813 28611557 30037848
$$ packed form
3616A0023011N1288k62632K89392K60917m10169l32324M7359j0780K19375m3425
3606I832012N068M0135l3704j86357N7159K22562M82290j89886j89965J20869
3596A0160183J8894K34302l9265K10557R5542p4566q0873J04512j58910Q5389
3586A0555765K71784K5270K97473P8179j13016K55650K77266P6579j2062J94151
3576A1907039L02908K8764L87546K55208j66780O3235J07303L3297K20565L31533
3566A3470618K3914R7437M05464N41765J23373M51751M62499K93016K21467M43314
3556A6534618M26580M74134O02424M47289N01412O75104K69471N53689J043130
3547B1527851O34940N79053J135317J159643J317711J135298J121744J426291
$$ plain form
3539 30037848 32286356 35169693 38281655 41594960 45897892 49846534 52298300 52462023
3531 52462023 50720545 47149085 43273041 39680096 36974859 34926177 33487050 31956615
3523 31956615 30791128 30350952 29600391 29020473 28219661 28004212 28291215 28640583 28633498 28502765
3513 28502765 28733641 29054828 29374676 29815385 30314191 31118879 32109667 33046821 34328743
3504 34328743 35758708 37109957 38835381 41263953 44435907 48222863 52253697 55202334
3496 55202334 56987979 57188584 55466354 52130525 48418682 45052971 42943165 41375166
3488 41375166 40015906 39395602 38884315 38087356 37810746 37905742 38451942 38984118 39355350
3479 39355350 39969788 41585122 43808045 46159749 47871006 48403162 47818053 46315077 43678151
$$ packed form
3539C0037848K248508K883337L111962L313305M302932L948642K451766J63723
3531E2462023j741478l571460l876044l592945k705237k048682j439127j530435
3523C1956615j165487m40176p50561n79918q00812k15449K87003L49368p085j30733
3513B8502765K30876L21187L19848M40709M98806Q04688R90788R37154J281922
3504C4328743J429965J351249J725424K428572L171954L786956M030834K948637
3496E5202334J785645K00605j722230l335829l711843l365711k109806j567999
3488D1375166j359260o20304n11287p96959k76610R4996N46200N32176L71232
3479C9355350O14438J615334K222923K351704J711257N32156n85109j502976k636926
$$ plain form
3470 43678151 41201702 39920577 38388532 37043259 36343210 35291178 35056273 34821725 34223149
3461 34223149 33959250 33700213 33603700 33798223 33821242 33662187 34104905 34389071 34311057 34623662
3451 34623662 35042118 35660832 36192901 36534040 36967917 37600724 38529976 39243032 40138711
3442 40138711 41973873 43755511 45304119 47212171 49150447 50300671 49611166 47769416
3434 47769416 45601090 43369075 41194369 39756773 38551725 37713069 37087917 36223197 35406539
3425 35406539 34950438 34398640 33998244 33354502 32712693 32739327 32473222 31628826 31507756 31184548
3415 31184548 31130880 31230005 30837631 30437835 30212560 29878955 29627292 29714187 29515744 29202561
3405 29202561 28885189 28690920 28456820 28155278 28098887 27862429 27420510 27172168 27083077 27073697
$$ packed form
3470D3678151k476449j281125j532045j345273p00049j052032k34905k34548n98576
3461C4223149k63899k59037r6513J94523K3019j59055M42718K84166p8014L12605
3451C4623662M18456O18714N32069L41139M33877O32807R29252P13056Q95679
3442D0138711J835162J781638J548608J908052J938276J150224o89505j841750
3434D7769416k168326k232015k174706j437596j205048q38656o25152q64720q16658
3425C5406539m56101n51798m00396o43742o41809K6634k66105q44396j21070l23208
3415C1184548n3668R9125l92374l99796k25275l33605k51663Q6895j98443l13183
3405B9202561l17372j94269k34100l01542n6391k36458m41919k48342q9091r380
$$ plain form
3395 27073697 26975120 26749177 26669041 26384900 25923544 25444973 25421748 25268634 24886329 24448132
3385 24448132 24349203 24203521 23591133 23452189 23581510 23433174 23162037 22633519 22263046 22229737
3375 22229737 22048822 21663079 21168336 21188314 21173690 21062228 20565491 20248825 20117958 19927073
3365 19927073 19665055 19247293 19423372 19350248 18560937 18091635 18085501 18332872 17934959 17744866
3355 17744866 17601911 17314452 17199504 17050461 16645894 16398678 16329333 15887736 15738525 15753533
3345 15753533 15596749 15626660 15425904 14866248 14591101 14721633 14556355 14260287 14107352 14134478
3335 14134478 14034731 13852124 13631023 13676110 13667039 13438021 12774288 12559535 12298628 12298586 12503195
3324 12503195 12560326 12138778 12137414 11900040 11461741 11445534 11522929 11339789 11238107 11207870
$$ packed form
3395B7073697r8577k25943q0136k84141m61356m78571k3225j53114l82305m38197
3385B4448132r8929j45682o12388j38944J29321j48336k71137n28518l70473l3309
3375B2229737j80915l85743m94743J9978j4624j11462m96737l16666j30867j90885
3365A9927073k62018m17762J76079p3124p89311m69302o134K47371l97913j90093
3355A7744866j42955k87459j14948j49043m04567k47216o9345m41597j49211J5008
3345A5753533j56784K9911k00756n59656k75147J30532j65278k96068j52935K7126
3335A4134478r9747j82607k21101M5087r071k29018o63733k14753k60907m2K04609
3324A2503195N7131m21548j364k37374m38299j6207P7395j83140j01682l0237
$$ plain form
3314 11207870 10968193 11061449 11328748 11268792 10870975 10677847 10362616 10459200 10537156 10612134
3304 10612134 10408203 10182587 10159541 9792109 9600713 9909399 10189676 9682286 9322902 9262395
3294 9262395 9337198 9508620 9186668 9147272 8899307 8194770 8235142 8923082 8984124 8939247
3284 8939247 8752233 8808121 8608546 8555673 8362137 8465956 8269967 7770329 7864947 8573751
3274 8573751 8388023 8172683 7887121 7583312 7798376 8103780 7717756 7750490 7865120 7420880
3264 7420880 6941458 7258594 7187164 7292663 7123101 6838963 6927613 7126814 6967238 6505689
3254 6505689 6613877 6766373 6665028 6358779 6344064 6626038 6461214 6442592 6541084 6348706
3244 6348706 6377166 6382624 6126272 6142320 6187697 5880168 5975197 6015529 6127589 6151681 6041481
$$ packed form
3314A1207870k39677R3256K67299n9956l97817j93128l15231R6584P7956P4978
3304A0612134k03931k25616k3046l67432j91396L08686K80277n07390l59384o0507
3294I262395P4803J71422l21952l9396k47965p04537M0372O87940O1042m4877
3284H939247j87014N5888j99575n2873j93536J03819j95989m99638R4618P08804
3274H573751j85728k15340k85562l03809K15064L05404l86024L2734J14630m44240
3264G420880m79422L17136p1430J05499j69562k84138Q8650J99201j59576m61549
3254F505689J08188J52496j01345l06249j4715K81974j64824j8622R8492j92378
3244F348706K8460N458k56352J6048M5377l07529R5029M0332J12060K4092j10200
$$ plain form
3233 6041481 5656357 5559228 5450582 5275880 5129185 5335219 5283654 5639242 5793369 5260701
3223 5260701 4781953 5047086 5322776 5590224 5492075 5167997 4759948 4776349 4645457 5003162
3213 5003162 5296448 5396579 4884557 4852567 4863637 5013220 5170368 5038242 4746482 4820501
3203 4820501 4832729 4452977 4505969 4841413 5075153 5039739 4957685 4701806 4442243 4588550
3193 4588550 4676408 4459647 4550056 4715119 4741698 4792830 5112906 4719981 4450458 4605048
3183 4605048 4480729 4301288 4431164 4314978 4496072 4639319 4569328 4539452 4693807 4819766
3173 4819766 4722313 4615003 4531369 4353954 4438105 4410303 4417341 4633307 4903775 4560637 4227322
3162 4227322 4453200 4837450 4556345 4487333 4639171 4787906 4826174 4654935 4318875 4410108
$$ packed form
3233F041481l85124r7129j08646j74702j46695K06034n1565L55588J54127n32668
3223E260701m78748K65133K75690K67448r8149l24078m08049J6401j30892L57705
3213E003162K93286J00131n12022l1990J1070J49583J57148j32126k91760P4019
3203D820501J2228l79752N2992L35444K33740l5414q2054k55879k59563J46307
3193D588550Q7858k16761R0409J65063K6579N1132L20076l92925k69523J54590
3183D605048j24319j79441J29876j16186J81094J43247o9991k9876J54355J25959
3173D819766r7453j07310q3634j77415Q4151k7802P038K15966K70468l43138l33315
3162D227322K25878L84250k81105o9012J51838J48735L8268j71239l36060R1233
$$ plain form
3152 4410108 4375715 4478437 4611450 4808732 4966799 4606183 4100434 3948447 4203339 4669565
3142 4669565 4661099 4284318 4390173 4517960 4828558 4749258 4654419 4550158 4459812 4320363
3132 4320363 4427554 4525176 4525410 4337037 4487837 4796622 5034800 5120581 5104865 4970259 4869421
3121 4869421 4869441 5105534 5260736 5396076 5189630 4849853 4576971 4794575 5263717 5391159
3111 5391159 5311312 5087629 4829387 5022188 5440170 5582155 5226205 5031099 5235653 5309465
3101 5309465 5511432 5784247 5982683 5874552 5551980 5704643 5810335 5840709 6094360 6039300
3091 6039300 5937282 6259807 6557844 6384531 6343925 6619790 6325225 6213120 6637727 6693222
3081 6693222 6744920 6821929 6855605 6684695 6881660 7263263 7472002 7589204 7561975 7249520
$$ packed form
3152D410108l4393J02722J33013J97282J58067l60616n05749j51987K54892M66226
3142D669565q466l76781J05855J27787L10598p9300r4839j04261r0346j39449
3132D320363J07191R7622K34j88373J50800L08785K38178Q5781j5716j34606j00838
3121D869421K0K36093J55202J35340k06446l39777k72882K17604M69142J27442
3111E391159p9847k23683k58242J92801M17982J41985l55950j95106K04554P3812
3101E309465K01967K72815J98436j08131l22572J52663J05692L0374K53651n5060
3091F039300j02018L22525K98037j73313m0606K75865k94565j12105M24607N5495
3081F693222N1698P7009L3676j70910J96965L81603K08739J17202k7229l12455
$$ plain form
3071 7249520 7589387 7851830 7863276 7745081 7936031 8035680 8079930 8366130 8498359 8591231
3061 8591231 9098180 8799615 8553925 9002606 9319342 9467789 9502424 9939120 10155329 10314719
3051 10314719 10635919 10645687 10893817 11315194 11362454 11165325 11509730 11774806 12030236 12278909
3041 12278909 12547017 12752413 13022883 13228966 13402219 13753945 13988477 14114585 14363588
3032 14363588 14666545 14745352 15163328 15646418 16152265 16474638 16785716 16999586 17482694 17952035
3022 17952035 18235325 18832191 19393730 19760887 20406612 21369641 22195773 22752593 23275416
3013 23275416 23907864 24962882 25857493 26806572 27722568 28551041 29758547 30733939 31982232
3004 31982232 33487755 34501993 35826320 37565068 39260429 40806532 42513858 44333684
$$ packed form
3071G249520L39867K62443J1446j18195J90950R9649M4250K86200J32229R2872
3061H591231N06949k98565k45690M48681L16736J48447L4635M36696K16209J59390
3051A0314719L21200R768K48130M21377M7260j97129L44405K65076K55430K48673
3041A2278909K68108K05396K70470K06083J73253L51726K34532J26108K49003
3032A4363588L02957P8807M17976M83090N05847L22373L11078K13870M83108M69341
3022A7952035K83290N96866N61539L67157O45725R63029Q26132N56820N22823
3013B3275416O32448J055018Q94611R49079R15996Q28473J207506R75392J248293
3004C1982232J505523J014238J324327J738748J695361J546103J707326J819826
$$ plain form
2996 44333684 45905240 48209955 50668918 52871324 55284893 57453902 59951446 62905880
2988 62905880 65716970 67853751 70518351 73183967 75477780 77914966 80962726 83824881
2980 83824881 86554932 89602292 92652421 95689699 98438160 101041158 103663704 105778875
2972 105778875 108202035 110272190 112093093 114398396 116432210 118366917 119968436 121075989
2964 121075989 122259598 123731850 124975502 125821059 126752445 127174819 126929031 126806391 126525332
2955 126525332 125929894 124573444 123378553 122127654 120778233 119241273 117468905 116092014
2947 116092014 114450817 112203490 109825319 107690131 105370803 102471152 99517615 96604286
2939 96604286 93720743 90562435 87419364 84782108 81547225 78006686 74931427 72323604
$$ packed form
2996D4333684J571556K304715K458963K202406K413569K169009K497544K954434
2988F2905880K811090K136781K664600K665616K293813K437186L047760K862155
2980H3824881K730051L047360L050129L037278K748461K602998K622546K115171
2972A05778875K423160K070155J820903K305303K033814J934707J601519J107553
2964A21075989J183609J472252J243652Q45557R31386M22374k45788j22640k81059
2955A26525332n95438j356450j194891j250899j349421j536960j772368j376891
2947A16092014j641197k247327k378171k135188k319328k899651k953537k913329
2939I6604286k883543l158308l143071k637256l234883l540539l075259k607823
$$ plain form
2931 72323604 69977569 67358583 64762209 62370511 59474687 56774251 54674467 52013636
2923 52013636 49060084 46733043 44490009 42466372 40701460 38623091 36796622 35235065
2915 35235065 33638247 31929598 30608801 29006443 27504004 26505772 25747665 24457713
2907 24457713 23496299 22695349 21619651 20560925 20006034 19271684 18503962 17899723 17369875
2898 17369875 17290466 16616574 15916016 15452174 14756130 14236214 13884951 13849249 13926138 13382889
2888 13382889 12897419 12989368 12785245 12226184 12268323 11997380 11859443 11811784 11632253 11503267
2878 11503267 11171980 11012527 11158757 11013168 10975211 10423362 10284832 10608239 10617146 10480139
2868 10480139 11059720 10830634 10662144 10411781 10139083 10387595 10321978 10121937 10096777 10068222
$$ packed form
2931G2323604k346035k618986k596374k391698k895824k700436k099784k660831
2923E2013636k953552k327041k243034k023637j764912k078369j826469j561557
2915C5235065j596818j708649j320797j602358j502439r98232p58107j289952
2907B4457713r61414q00950j075698j058726n54891p34350p67722o04239n29848
2898A7369875p9409o73892p00558m63842o96044n19916l51263l5702P6889n43249
2888A3382889m85470R1949k04123n59061M2139k70943j37937m7659j79531j28986
2878A1503267l31287j59453J46230j45589l7957n51849j38530L23407Q907j37007
2868A0480139N79581k29086j68490k50363k72698K48512o5617k00041k5160k8555
$$ plain form
2858 10068222 10163611 10039428 9883277 9799513 9561256 9175885 9150229 8796830 8663758 8961843
2848 8961843 8793952 8645617 8678794 8853799 8671382 8148492 8141457 8333881 8199364 8446365
2838 8446365 8354396 7974062 7895929 7947064 7684189 7692892 7500865 7632051 7729824 7809891 8039115
2827 8039115 8346561 7866378 7673722 7440768 7499135 7512766 7713769 7730843 7656192 8015775
2817 8015775 8517314 8032167 7634041 7550747 7631648 7903595 8130294 7808436 7567027 7564748
2807 7564748 7662247 7679619 7690408 7610936 7341650 7306827 7353089 7008597 7032094 6869593 6694184
2796 6694184 6761227 6943075 6612753 6245983 6356496 6214605 6245849 6479525 6262007 5805774
2786 5805774 5761252 6008861 5959838 5666612 5790967 5805780 6219552 6283170 6017266 5923286
$$ packed form
2858A0068222R5389j24183j56151q3764k38257l85371k5656l53399j33072K98085
2848H961843j67891j48335L3177J75005j82417n22890p035J92424j34517K47001
2838H446365r1969l80334p8133N1135k62875Q703j92027J31186R7773Q0067K29224
2827H039115L07446m80183j92656k32954N8367J3631K01003J7074p4651L59583
2817H015775N01539m85147l98126q3294Q0901K71947K26699l21858k41409k279
2807G564748R7499J7372J0789p9472k69286l4823M6262l44492K3497j62501j75409
2796F694184O7043J81848l30322l66770J10513j41891L1244K33676k17518m56233
2786E805774m4522K47609m9023k93226J24355J4813M13772O3618k65904r3980
$$ plain form
2776 5923286 6110800 5912157 6193039 6076226 5984733 6215597 6121940 6073869 6024832 6073718
2766 6073718 6402904 5892575 5993746 6263635 6002036 5970782 6137976 6044970 6449169 6468165
2756 6468165 5953979 5860592 6071353 6261659 6529782 6430532 6241423 6223567 6343763 6325080
2746 6325080 6204577 6535508 6614729 6670327 6586245 6712284 6732385 6828590 6780950 6790512 7176134
2735 7176134 7363554 7117674 6985780 7054715 7228690 7351262 7276483 7578338 7760390 7692887
2725 7692887 7706776 7932405 7976634 8021682 8089761 8400566 8499600 8363848 8752267 9178511
2715 9178511 9307666 9153270 9241726 9289204 9287888 9637401 9776555 9740877 9647197 9704981 9898640
2704 9898640 10171770 10105040 9765584 9469998 9655811 10119442 10539225 10549071 10840205 10681869
$$ packed form
2776E923286J87514j98643K80882j16813r1493K30864r3657m8071m9037M8886
2766F073718L29186n10329J01171K69889k61599l1254J67194r3006M04199J8996
2756F468165n14186r3387K10761J90306K68123r9250j89109j7856J20196j8683
2746F325080j20503L30931P9221N5598q4082J26039K0101R6205m7640R562L85622
2735G176134J87420k45880j31894O8935J73975J22572p4779L01855J82052o7503
2725G692887J3889K25629M4229M5048O8079L10805R9034j35752L88419M26244
2715I178511J29155j54396Q8456M7478j316L49513J39154l5678r3680N7784J93659
2704I898640K73130o6730l39456k95586J85813M63631M19783R846K91134j58336
$$ plain form
2694 10681869 10939497 10958926 11147408 11146763 11279699 11224519 11378938 11655738 11909303 11789845
2684 11789845 11956163 11816015 12051196 12301889 12358178 12662485 13097496 13037426 12981095 13388427
2674 13388427 13577228 13668920 13937587 14355703 14322991 14427107 14874261 15290930 15429293 15522637
2664 15522637 15387542 16003795 16368873 16680576 16812658 17432005 17783229 18218743 18814033
2655 18814033 19503393 19612513 20060356 20127556 20610114 21168087 22140957 22745993 23359443 23736043
2645 23736043 24458403 24778391 25664277 26215366 27098211 28066143 28664001 29057267 29959036
2636 29959036 31142538 32210438 33377638 34647805 35843505 37071036 38412157 39824470
2628 39824470 41124525 42792545 44273351 45216302 46353201 47646072 49160739 50249169
$$ packed form
2694A0681869K57628J9429J88482o45J32936n5180J54419K76800K53565j19458
2684A1789845J66318j40148K35181K50693N6289L04307M35011o0070n6331M07332
2674A3388427J88801R1692K68667M18116l2712J04116M47154M16669J38363R3344
2664A5522637j35095O16253L65078L11703J32082O19347L51224M35514N95290
2655A8814033O89360J09120M47843O7200M82558N57973R72870O05036O13450L76600
2645B3736043P22360L19988Q85886N51089Q82845R67932N97858L93266R01769
2636B9959036J183502J067900J167200J270167J195700J227531J341121J412313
2628C9824470J300055J668020J480806R42951J136899J292871J514667J088430
$$ plain form
2620 50249169 51308834 52579631 54199793 55284038 56021369 57024784 58336597 59642965
2612 59642965 60698417 61402331 62589575 63523003 64118738 64503492 64871859 65267883 65660446
2603 65660446 66000890 66526575 66812442 66896722 67245373 67834100 68286096 68922144 69818930 70484082
2593 70484082 70939776 71711908 72798281 74039346 75264786 76335210 77590563 79192101
2585 79192101 80818411 82806739 85179900 87225791 89565237 92480380 95314650 98527286
2577 98527286 101977667 105680675 109193680 113411346 118056733 122955732 128013197 133024467
2569 133024467 137976052 143317197 148657004 153970200 159260262 164763625 170213511 175263821
2561 175263821 180537182 186133722 191166322 196208652 201204750 206033142 211089455 216387010
$$ packed form
2620E0249169J059665J270797J620162J084245P37331J003415J311813J306368
2612E9642965J055452P03914J187244R33428N95735L84754L68367L96024L92563
2603F5660446L40444N25685K85867Q4280L48651N88727M51996O36048Q96786O65152
2593G0484082M55694P72132J086373J241065J225440J070424J255353J601538
2585G9192101J626310J988328K373161K045891K339446K915143K834270L212636
2577I8527286L450381L703008L513005M217666M645387M898999N057465N011270
2569A33024467M951585N341145N339807N313196N290062N503363N449886N050310
2561A75263821N273361N596540N032600N042330M996098M828392N056313N297555
$$ plain form
2553 216387010 221222974 225472191 229926900 233787911 237809304 241611680 245287542 248917673
2545 248917673 252175458 255386490 258896015 262940608 267169410 271539873 275746516 280631754
2537 280631754 285619026 290780302 296077584 301442003 307060343 313454050 319726095 326176181
2529 326176181 333580379 341909822 351117396 361622281 373630114 386609487 400603975
2522 400603975 414891893 428663771 441840693 453749195 463491886 471331957 477324746
2515 477324746 481176214 482976735 482403343 480127258 476406959 471269690 465372489 459335762
2507 459335762 453230029 446859001 440237950 432883608 424026488 413615908 401078624 386878612
2499 386878612 370794451 353371909 335035651 316089651 296774797 277691038 259231639
$$ packed form
2553B16387010M835964M249217M454709L861011M021393L802376L675862L630131
2545B48917673L257785L211032L509525M044593M228802M370463M206643M885238
2537B80631754M987272N161276N297282N364419N618340O393707O272045O450086
2529C26176181P404198Q329443R207574J0504885J2007833J2979373J3994488
2522D00603975J4287918J3771878J3176922J1908502R742691P840071N992789
2515D77324746L851468J800521n73392k276085l720299n137269n897201o036727
2507D59335762o105733o371028o621051p354342q857120j0410580j2537284j4200012
2499C86878612j6084161j7422542j8336258j8946000j9314854j9083759j8459399
$$ plain form
2492 259231639 242114084 226466120 211915762 198055948 186040259 175463577 165639920
2485 165639920 157202557 149697999 142979024 136625848 130976067 126047218 122316088 118948534
2477 118948534 115644489 112509023 110237608 108391049 106228091 104014383 102181870 100274764
2469 100274764 98920688 97409040 95841853 94792939 93959208 92580528 91640553 90593083
2461 90593083 89223279 87929812 86791833 85298250 83768294 82446674 80502941 78451783
2453 78451783 76988227 75528814 73520086 71191974 69419109 67186162 65133087 63543545
2445 63543545 61827689 60145494 58497823 56385422 54605312 52963893 50957988 48915512
2437 48915512 47016488 45557321 43928364 42449540 40746182 38821266 37676723 36289922
$$ packed form
2492B59231639j7117555j5647964j4550358j3859814j2015689j0576682r823657
2485A65639920q437363p504558o718975o353176n649781m928849l731130l367554
2477A18948534l304045l135466k271415j846559k162958k213708j832513j907106
2469A00274764j354076j511648j567187j048914q33731j378680r39975j047470
2461I0593083j369804j293467j137979j493583j529956j321620j943733k051158
2453G8451783j463556j459413k008728k328112j772865k232947k053075j589542
2445F3543545j715856j682195j647671k112401j780110j641419k005905k042476
2437D8915512j899024j459167j628957j478824j703358j924916j144543j386801
$$ plain form
2429 36289922 34867581 33456489 31957757 30623922 29605577 28775261 27975242 27252273 26429083
2420 26429083 25065030 24078801 23786063 23108119 22263094 21453207 21161412 20934628 20317687
2411 20317687 19640034 19029648 18660708 18042521 17207699 16697613 16513560 16199208 15893421
2402 15893421 15644843 14998116 14518943 14276143 13709309 13585732 13511989 13380740 12953348 12535679
2392 12535679 12270831 11932655 11784665 11806568 11603767 11507036 11176479 10670711 10567323 10583037
2382 10583037 10542225 10530546 10447729 9827387 9658876 9725099 9680421 9442124 9325003 8928401
2372 8928401 9091535 8495546 8225654 8516123 8536830 8424325 8218936 8292639 8093729 7684811
2362 7684811 7473037 7212929 7374690 7493640 7169524 6856998 6931602 7095594 7145157 6620110
$$ packed form
2429C6289922j422341j411092j498732j333835j018345q30316q00019p22969q23190
2420B6429083j364053r86229k92738o77944q45025q09887k91795k26784o16941
2411B0317687o77653o10386l68940o18187q34822n10086j84053l14352l05787
2402A5893421k48578o46727m79173k42800n66834j23577p3743j31249m27392m17669
2392A2535679k64848l38176j47990K1903k02801r6731l30557n05768j03388J5714
2382A0583037m0812j1679q2817o20342j68511O6223m4678k38297j17121l96602
2372H928401J63134n95989k69892K90469K0707j12505k05389P3703j98910m08918
2362G684811k11774k60108J61761J18950l24116l12526P4604J63992M9563n25047
$$ plain form
2352 6620110 6110810 6334568 6574189 6132517 5666741 5742600 6147882 5953736 5634972 5474356
2342 5474356 5498078 5473595 5410877 5228189 5533688 5413519 5011320 4391632 4644806 4945326
2332 4945326 4642102 4399963 4255121 4295571 4358584 4501531 4062053 3941327 4168703 4390840
2322 4390840 4052682 4073438 3947843 4020501 4096651 4158986 4451129 4295236 3502947 3531054
2312 3531054 3912627 4119604 4087289 3784289 3676873 3734526 3568201 3393723 3438638 3514584
2302 3514584 3270187 3303883 3613315 3270945 3147467 3188268 2838620 2803103 3083821 3130634
2292 3130634 2772245 2559321 2697730 3092701 3188631 3016162 2936205 2967277 2945015 2852867
2282 2852867 2898065 3012859 3068069 2911860 3171656 3213022 2576430 2598871 2806687 2556366
$$ packed form
2352F620110n09300K23758K39621m41672m65776P5859M05282j94146l18764j60616
2342E474356K3722k4483o2718j82688L05499j20169m02199o19688K53174L00520
2332D945326l03224k42139j44842M0450O3013J42947m39478j20726K27376K22137
2322D390840l38158K0756j25595P2658P6150O2335K92143j55893p92289K8107
2312C531054L81573K06977l2315l03000j07416N7653j66325j74478M4915P5946
2302C514584k44397L3696L09432l42370j23478M0801l49648l5517K80718M6813
2292C130634l58389k12924J38409L94971R5930j72469p9957L1072k2262r2148
2282B852867M5198J14794N5210j56209K59796M1366o36592K2441K07816k50321
$$ plain form
2272 2556366 2702008 2828924 3271267 3338510 3168071 2913364 2400664 2360226 2477491 2657303
2262 2657303 3223773 2993850 2850959 2979609 2836714 2764723 2834556 2649515 2666833 2720526
2252 2720526 2798648 3088608 3183250 3270883 3235827 3106377 3118761 3125692 3141655 3363633 3221288
2241 3221288 2943167 2861145 3116605 3184117 3227746 3346767 3183329 3128403 3308510 3515918
2231 3515918 3679351 3640127 3693512 3629126 3424755 3253187 3130532 3142582 3452186 3682096
2221 3682096 3633376 3566970 3787732 3802566 3576642 3750399 4077713 4166469 4317049 4094635
2211 4094635 4151143 4424312 4335852 4289129 4360497 4233800 4357724 4077546 3815192 3875956
2201 3875956 4222575 4306828 4365924 4443385 4625908 4447511 3896775 3727672 4110714 4137347
$$ packed form
2272B556366J45642J26916M42343O7243j70439k54707n12700m0438J17265J79812
2262B657303N66470k29923j42891J28650j42895p1991O9833j85041J7318N3693
2252B720526P8122K89960R4642Q7633l5056j29450J2384O931J5963K21978j42345
2241C221288k78121q2022K55460O7512M3629J19021j63438n4926J80107K07408
2231C515918J63433l9224N3385o4386k04371j71568j22655J2050L09604K29910
2221C682096m8720o6406K20762J4834k25924J73757L27314Q8756J50580k22414
2211D094635N6508K73169q8460m6723P1368j26697J23924k80178k62354O0764
2201C875956L46619Q4253N9096P7461J82523j78397n50736j69103L83042K6633
$$ plain form
2191 4137347 3956554 3899952 3661125 3714190 3686046 3727844 3599296 3687714 3857688 3585460
2181 3585460 3549603 3587283 3649284 3580424 3320642 3315035 3518972 3321937 3201656 2849110 2772798
2170 2772798 3048655 3141314 2788306 2794986 2801962 2781901 2891985 2715245 2535221 2515579 2344604
2159 2344604 2392659 2324332 2152520 1998091 1818535 1868646 1896652 2036215 1947043 2001284 1873729
2148 1873729 2112243 2018854 2051912 1656804 1540228 1739125 1845594 1776739 1886732 2017476
2138 2017476 2101334 1980137 2112755 1861021 1628566 1246914 1289514 1674864 1610220 1436686
2128 1436686 1070623 830624 936998 836179 1113459 1152226 1170536 1356695 1253021 1083386
2118 1083386 1196451 1174544 1249294 1056326 753710 1188208 1459785 1593532 1694926 1700369
$$ packed form
2191D137347j80793n6602k38827N3065k8144M1798j28548Q8418J69974k72228
2181C585460l5857L7680O2001o8860k59782n607K03937j97035j20281l52546p6312
2170B772798K75857R2659l53008O680O976k0061J10084j76740j80024j9642j70975
2159B344604M8055o8327j71812j54429j79556N0111K8006J39563q9172N4241j27555
2148A873729K38514r3389L3058l95108j16576J98897J06469o8855J09993J30744
2138B017476Q3858j21197J32618k51734k32455l81652M2600L85350o4644j73534
2128A436686l66063k39999J06374j00819K77280L8767J8310J86159j03674j69635
2118A083386J13065k1907P4750j92968l02616M34498K71577J33747J01394N443
$$ plain form
2108 1700369 1805344 1537832 1159197 1187070 1087831 1256560 1074559 775889 982742 1188583
2098 1188583 1221308 1064330 653304 751124 730257 489075 436591 424679 312263 345536 121668
2087 121668 234311 221184 534032 480352 412417 554370 609071 384762 362516 449866 785408
2076 785408 534333 522473 540523 388689 666278 505830 397544 411863 506989 574798 477470
2065 477470 788160 987927 627177 595985 329773 170682 180100 269582 231181 558924 493606
2054 493606 146828 -270237 99458 162499 147298 216784 434035 267122 292405 347918 143397
2043 143397 282058 466988 20687 -189635 -60065 309287 533560 455777 376269 293365
2033 293365 54654 -298865 -81862 216093 229080 554857 233986 137774 150099 205586
$$ packed form
2108A700369J04975k67512l78635K7873r9239J68729j82001k98670K06853K05841
2098A188583L2725j56978m11026R7820k0867k41182n2484j1912j12416L3273k23868
2087A21668J12643j3127L12848n3680o7935J41953N4701k24309k2246Q7350L35542
2076G85408k51075j1860J8050j51834K77589j60448j08286J4319R5126O7809r7328
2065D77470L10690J99767l60750l1192k66212j59091R418Q9482l8401L27743o5318
2054D93606l46778m17065L69695O3041j5201O9486K17251j66913K5283N5513k04521
2043A43397J38661J84930m46301k10322J29570L69352K24273p7783p9508q2904
2033B93365k38711l53519K17003K97955J2987L25777l20871r6212J2325N5487
$$ plain form
2023 205586 249378 161592 193125 152930 174280 250815 252943 288125 238324 15448 82596 -19540
2011 -19540 87260 63097 120529 206647 334315 160118 244279 -9779 326721 570095 582781
2000 582781 292851 330411 266053 -37286 -26246 78473 -377569 -273007 -67687 -91285
1990 -91285 -229008 -34406 293352 257130 -23121 -16633 -88217 -310273 -205729 -3699 63804
1979 63804 17939 -209590 141588 353310 380647 223436 61460 200237 114585 307711
1969 307711 516875 240151 185752 246680 218038 203383 20257 15757 276887 217702 43863
1958 43863 -130669 -279479 -135331 -118819 2229 -139491 17947 132442 168121 276342
1948 276342 59439 -156672 -274893 -419338 -389440 -286977 120554 -80164 -300783 -139202
$$ packed form
2023B05586M3792q7786L1533m0195K1350P6535K128L5182m9801k22876O7148j02136
2011a9540J06800k4163N7432Q6118J27668j74197Q4161k54058L36500K43374J2686
2000E82781k89930L7560o4358l03339J1040J04719m56042J04562K05320k3598
1990i1285j37723J94602L27758l6222k80251O488p1584k22056J04544K02030O7503
1979F3804m5865k27529L51178K11722K7337j57211j61976J38777q5652J93126
1969C07711K09164k76724n4399O0928k8642j4655j83126m500K61130n9185j73839
1958D3863j74532j48810J44148J6512J21048j41720J57438J14495L5679J08221
1948B76342k16903k16111j18221j44445K9898J02463M07531k00718k20619J61581
$$ plain form
1938 -139202 -155089 -2189 131894 73669 298208 265148 -58935 29653 88755 -76064 -142212
1927 -142212 -308257 -368796 -507530 -575002 -83435 -87446 -53353 122218 -167405 -120613 -165021
1916 -165021 90537 279006 8507 97288 351182 134783 375204 332235 271597 45848
1906 45848 -196709 80730 252139 248609 174230 -289150 -63354 347875 268363 -66119 48905
1895 48905 418384 -67932 -115222 -32733 -55118 72368 34410 -5478 -142312 -31512 -34030
1884 -34030 -196070 128123 152151 32695 54886 -23112 -21903 322794 311584 3256 65764
1873 65764 147611 356625 421873 349778 342619 243768 172103 251267 150077 543090 759806
1862 759806 276071 -25348 -21456 207853 375304 452355 129768 -76390 134372 199973
$$ packed form
1938a39202j5887J52900J34083n8225K24539l3060l24083Q8588N9102j64819o6148
1927a42212j66045o0539j38734o7472M91567m011L4093J75571k89623M6792m4408
1916a65021K55558J88469k70499Q8781K53894k16399K40421m2969o0638k25749
1906D5848k42557K77439J71409l530p4379m63380K25796M11229p9512l34482J15024
1895D8905L69479m86316m7290Q2489k2385J27486l7958l9888j36834J10800k518
1884c4030j62040L24193K4028j19456K2191p7998J209L44697j1210l08328O2508
1873F5764Q1847K09014O5248p2095p159r8851p1665P9164j01190L93013K16716
1862G59806m83735l01419L892K29309J67451P7051l22587k06158K10762O5601
$$ plain form
1852 199973 -214999 -4202 208453 292890 290936 186007 252520 310547 130138 22267 526467
1841 526467 611669 308906 351275 447712 659555 742577 264290 163373 473505 420754 535255
1830 535255 860541 649416 417594 409285 792285 755862 803675 832243 762789 444453 469299
1819 469299 705099 549111 176407 402360 763040 918903 930836 799228 760581 716899
1809 716899 592939 1120181 1611702 1195166 736802 800437 766012 766038 831498 734770 659340
1798 659340 563075 479555 342581 288852 152023 561770 518984 372819 327359 242802 382319
1787 382319 460547 201701 178108 195922 36327 -6357 -8215 18597 6781 142759 664265
1776 664265 537396 406907 190795 143572 31886 285531 724059 581267 188019 106391
$$ packed form
1852A99973m14972K10797K12655Q4437j954j04929O6513N8027j80409j07871N04200
1841E26467Q5202l02763M2369R6437K11843Q3022m78287j00917L10132n2751J14501
1830E35255L25286k11125k31822q309L83000l6423M7813K8568o9454l18336K4846
1819D69299K35800j55988l72704K25953L60680J55863J1933j31608l8647m3682
1809G16899j23960N27242M91521m16536m58364O3635l4425K6O5460r6728p5430
1798F59340r6265q3520j36974n3729j36829M09747m2786j46165m5460q4557J39517
1787C82319P8228k58846k3593J7814j59595m2684j858K6812j1816J35978N21506
1776F64265j26869j30489k16112m7223j11686K53645M38528j42792l93248q1628
$$ plain form
1766 106391 341268 579045 582006 187854 215608 329396 70685 -58081 297217 478045
1756 478045 342490 277452 296268 313804 112698 51462 94479 14281 144483 218529 121241
1745 121241 -72242 -37681 207219 -55511 -35045 -58979 -58147 59055 -16332 -108720 104817
1734 104817 -40291 -50079 152592 195640 40019 -283330 -324352 8427 -86066 -231017 -187442
1723 -187442 -147347 -103400 37838 113917 169778 203157 229292 31751 -19013 165746 265875
1712 265875 311951 182008 -30958 177148 331861 325309 250292 179194 6023 -48328 -260740
1701 -260740 -79494 385252 151197 287635 189220 -260977 -305924 73007 27483 99660
1691 99660 123117 -31899 -357792 -379535 10852 88477 -20706 150068 252909 -56520
$$ packed form
1766A06391K34877K37777K961l94152K7754J13788k58711j28766L55298J80828
1756D78045j35555o5038J8816J7536k01106o1236M3017q0198J30202P4046r7288
1745A21241j93483L4561K44900k62730K0466k3934Q32J17202p5387r2388K13537
1734A04817j45108r788K02671M3048j55621l23349m1022L32779r4493j44951M3575
1723a87442M0095M3947J41238P6079N5861L3379K6135j97541n0764J84759J00129
1712B65875M6076j29943k12966K08106J54713o552p5017p1098j73171n4351k12412
1701b60740J81246M64746k34055J36438r8415m50197m4947L78931m5524P2177
1691I9660K3457j55016l25893k1743L90387P7625j09183J70774J02841l09429
$$ plain form
1681 -56520 -102411 -105313 -228681 -164318 -410508 -293682 -114987 26260 -30735 80912 39599
1670 39599 -204476 -95307 263755 110536 87743 212787 158416 92552 180531 -35998 -187785
1659 -187785 -111335 919 -201660 6613 186647 263491 56470 94192 -145184 -379244
1649 -379244 -390262 -304934 -180805 -143638 -458347 -556126 -430203 -194324 -305492 -334226 -180785
1638 -180785 -77672 171927 162629 -28722 -42076 160148 -214722 -106768 228621 165882
1628 165882 -126031 -88681 -175945 -62652 18583 -141357 -146176 -106026 -75020 53551 -153336
1617 -153336 -321308 -302884 -265324 -325136 -399896 -373981 144373 -10632 -223298 112769 -22585
1606 -22585 -157147 -3456 -108772 -78450 78728 -18057 88452 135828 359228 240846
$$ packed form
1681e6520m5891k902j23368O4363k46190J16826J78695J41247n6995J11647m1313
1670C9599k44075J09169L59062j53219k2793J25044n4371o5864Q7979k16529j51787
1659a87785P6450J12254k02579K08273J80034P6844k07021L7722k39376k34060
1649c79244j1018Q5328J24129L7167l14709r7779J25923K35879j11168k8734J53441
1638a80785J03113K49599r298j91351j3354K02224l74870J07954L35389o2739
1628A65882k91913L7350q7264J13293Q1235j59940m819M0150L1006J28571k06887
1617a53336j67972J8424L7560n9812p4760K5915N18354j55005k12666L36067j35354
1606b2585j34562J53691j05316L0322J57178r6785J06509M7376K23400j18382
$$ plain form
1596 240846 109601 94424 -97432 -145357 -103942 -35773 147824 186548 -312809 -522600 -450229
1585 -450229 -403597 -463344 -456252 -162141 -52856 -373216 -261829 -125322 -426483 -328395 -225630
1574 -225630 -379644 -8825 -69458 -326763 84862 429917 342908 127132 -123013 -299629
1564 -299629 -316717 -141718 -14801 212389 376290 239310 -99015 39693 237161 39382
1554 39382 76142 -212651 -276055 57233 -52949 -213855 -55000 -68266 -443608 -523010 -151172
1543 -151172 11217 -180003 -126612 -32995 -177906 -60533 -8996 -177553 116003 28287
1533 28287 -454996 -416968 -108960 -253282 -257051 -64612 -183181 -136980 149323 22555 -68105
1522 -68105 -2686 -56990 -376374 -3522 22829 -159591 100042 32262 -42871 72146 364455
$$ packed form
1596B40846j31245j5177j91856m7925M1415O8169J83597L8724m99357k09791P2371
1585d50229M6632n9747P092K94111J09285l20360J11387J36507l01161R8088J02765
1574b25630j54014L70819o0633k57305M11625L45055q7009k15776k50145j76616
1564b99629j7088J74999J26917K27190J63901j36980l38325J38708J97468j97779
1554C9382L6760k88793o3404L33288j10182j60906J58855j3266l75342p9402L71838
1543a51172J62389j91220N3391R3617j44911J17373N1537j68557K93556q7716
1533B8287m83283L8028L08008j44322l769J92439j18569M6201K86303j26768r0660
1522f8105O5419n4304l19384L72852K6351j82420K59633o7780p5133J15017K92309
$$ plain form
1511 364455 270344 -80416 65177 -127558 130378 181201 -9706 -470984 -514627 -117550
1501 -117550 -162451 -152005 -81891 -283515 -341839 -303593 -230873 -168471 -395662 -558807 -536960
1490 -536960 -119699 308487 603669 374185 77215 17299 225284 136916 -16109 -29085
1480 -29085 9828 -142073 -232435 -128277 -63185 275845 56925 -393788 -217754 -186255 -218661
1469 -218661 -65690 -68855 -656 -274866 -293579 -144648 -277090 -43982 10730 -69617 -216232
1458 -216232 -304091 -390425 -60763 88418 20563 113445 -94854 -94153 257193 285871 -21096
1447 -21096 -320480 50663 -116804 -448635 -223158 -98770 -239961 -290545 -296300 -367422 -387485
1436 -387485 -144150 68771 185890 -43009 -137591 -389847 -226285 -210093 -98016 -157090
$$ packed form
1511C64455r4111l50760J45593j92735K57936N0823j90907m61278m3643L97077
1501a17550m4901J0446P0114k01624n8324L8246P2720O2402k27191j63145K1847
1490e36960M17261M28186K95182k29484k96970n9916K07985q8368j53025j2976
1480b9085L8913j51901r0362J04158O5092L39030k18920m50713J76034L1499l2406
1469b18661J52971l165O8199k74210j8713J48931j32442K33108N4712q0347j46615
1458b16232q7859q6334L29662J49181o7855R2882k08299P01L51346K8678l06967
1447b1096k99384L71143j67467l31831K25477J24388j41191n0584n755p1122k0063
1436c87485K43335K12921J17119k28899r4582k52256J63562J6192J12077n9074
$$ plain form
1426 -157090 -134777 40467 85481 143986 116667 -27608 -151503 -33470 298335 158263
1416 158263 121307 -183458 -358528 -390419 -215884 -10963 -59815 -329224 21020 112017
1406 112017 -50602 40421 122481 -258154 -438400 -338942 -315546 -99790 11278 -115998
1396 -115998 -13626 375411 82809 137533 150658 -210020 -431159 -26931 -105011 210310
1386 210310 323612 -113019 -343577 -577461 -555509 43337 -4963 -302685 -207348 -150409
1376 -150409 -89466 -24720 45645 -11350 17238 -221347 -447978 61188 66230 223506 149685
1365 149685 -268984 -75173 157358 -192376 -240307 -209840 -402100 -107170 32880 -425238
1355 -425238 -238322 -97906 -160316 -139854 -215507 -191840 -27018 -146675 -343277 -95410
$$ packed form
1426a57090K2313J75244M5014N8505k7319j44275j23895J18033L31805j40072
1416A58263l6956l04765j75070l1891J74535K04921m8852k69409L50244R0997
1406A12017j62619R1023Q2060l80635j80246R9458K3396K15756J11068j27276
1396a15998J02372L89037k92602N4724J3125l60678k21139M04228p8080L15321
1386B10310J13302m36631k30558k33884K1952N98846m8300k97722R5337N6939
1376a50409O0943O4746P0365n6995K8588k38585k26631N09166N042J57276p3821
1365A49685m18669J93811K32531l49734m7931L0467j92260K94930J40050m58118
1355d25238J86916J40416o2410K0462p5653K3667J64822j19657j96602K47867
$$ plain form
1345 -95410 43956 -355829 -258492 -188551 -18944 152672 85189 -97782 -132585 -237526 -413711
1334 -413711 -609574 -446312 132481 157887 -162143 -175483 -241802 -425779 -316569 -106558
1324 -106558 -73257 120358 -23475 -237927 -238314 -212259 -147921 148792 -113711 -225033 -194786
1313 -194786 -154224 -224127 -37959 337096 -12882 -27024 116159 218892 350968 -115534
1303 -115534 -102123 113670 25115 -8347 -128546 -334834 -179256 19120 -293338 -387903
1293 -387903 23287 -92030 -234310 -211282 -331978 -495039 -514832 -204444 82632 176912
1283 176912 92030 11205 -45046 -153749 -124450 79304 50304 235720 272884 317225 165379
1272 165379 247209 72195 148138 70666 47991 140958 -200977 -573584 -22693 -11882 84984
$$ packed form
1345i5410J39366l99785R7337O9941J69607J71616o7483j82971l4803j04941j76185
1334d13711j95863J63262N78793K5406l20030j3340o6319j83977J09210K10011
1324a06558L3301J93615j43833k14452l87K6055O4338K96713k62503j11322L0247
1313a94786M0562o9903J86168L75055l49978j4142J43183J02733J32076m66502
1303a15534J3411K15793q8555l3462j20199k06288J55578J98376l12458r4565
1293c87903M11190j15317j42280K3028j20696j63061j9793L10388K87076R4280
1283A76912q4882q0825n6251j08703K9299K03754k9000J85416L7164M4341j51846
1272A65379Q1830j75014P5943p7472k2675R2967l41935l72607N50891J0811R6866
$$ plain form
1261 84984 381503 -149281 -376101 -25247 -129494 50590 130997 82470 -98907 48053
1251 48053 51557 -83584 -354363 -322573 -145009 58209 317282 433475 474188 465178 294394
1240 294394 299231 344785 303681 488988 418566 300858 262717 180887 162128 237933 418004
1229 418004 201868 -24487 -49529 -13299 117832 183441 258472 88438 40094 -45335 -302882
1218 -302882 -99770 35299 -134274 -112767 -37245 -304158 -202987 -191187 21489 400527
1208 400527 252455 364891 204671 282792 327608 342038 285604 137916 -17663 -84614 29028
1197 29028 201406 187926 422447 206209 302429 194790 163515 74348 -82842 -75044 -46558
1186 -46558 45630 321581 26230 108604 128491 -93489 -244059 -191304 -58908 -75926 106314
$$ packed form
1261H4984K96519n30784k26820L50854j04247J80084Q0407m8527j81377J46960
1251D8053L504j35141k70779L1790J77564K03218K59073J16193M0713r010j70784
1240B94394M837M5554m1104J85307p0422j17708l8141q1830j8759P5805J80071
1229D18004k16136k26355k5042L6230J31131O5609P5031j70034m8344q5429k57547
1218c02882K03112J35069j69573K1507P5522k66913J01171J1800K12676L79038
1208D00527j48072J12436j60220P8121M4816J4430n6434j47688j55579o6951J13642
1197B9028J72378j3480K34521k16238R6220j07639l1275q9167j57190P798K8486
1186d6558R2188K75951k95351Q2374J9887k21980j50570N2755J32396j7018J82240
$$ plain form
1175 106314 -26313 67018 -70982 -148606 92838 265057 100944 -237584 -91054 242655
1165 242655 398408 325653 225041 145920 114243 338932 120879 194157 154451 -104848 -72649
1154 -72649 52817 64578 95859 253169 324335 230503 106013 150130 218495 48306 122315
1143 122315 178338 207447 51207 12460 51997 78710 54770 87470 78426 19814 40134 -52835
1131 -52835 95610 136223 232385 324973 -48309 -293223 115777 308005 508232 673613
1121 673613 739367 599929 282849 132440 209385 311749 449094 509221 447626 237462
1111 237462 128358 192643 423206 529035 381959 337114 69051 149126 175062 428926
1101 428926 826149 550488 294657 452526 517071 609978 444367 549721 595350 652051
$$ packed form
1175A06314j32627R3331j38000p7624K41444J72219j64113l38528J46530L33709
1165B42655J55753p2755j00612p9121l1677K24689k18053P3278l9706k59299L2199
1154g2649J25466J1761L1281J57310P1166r3832j24490M4117O8365j70189P4009
1143A22315N6023K9109j56240l8747L9537K6713k3940L2700r044n8612K0320r2969
1131e2835J48445M0613R6162R2588l73282k44914M09000J92228K00227J65381
1121F73613O5754j39438l17080j50409P6945J02364J37345O0127o1595k10164
1111B37462j09104O4285K30563J05829j47076m4845k68063Q0075K5936K53864
1101D28926L97223k75661k55831J57869O4545R2907j65611J05354M5629N6701
$$ plain form
1091 652051 512732 682566 515395 224852 244121 176269 404381 792184 806277 908210
1081 908210 939727 590396 410384 482482 489473 359215 573812 465499 532755 729001 920633
1070 920633 744483 712203 641807 663199 741598 635808 958781 1071377 734715 791191 998330
1059 998330 1509638 1255014 1176532 1065469 1377757 1340562 1272539 1377992 1160206 608085
1049 608085 680776 843258 1062095 1212246 1266051 1323023 1399081 1539226 1663601 1703541 1361950
1038 1361950 1116046 992550 1537619 1964859 1909938 1906776 1848453 1768676 1995396 2011562 2105125
1027 2105125 1842103 1888458 2100904 2095125 2243178 2307654 2234849 2274245 2281585 2184092 2272520
1016 2272520 2261153 1969898 2472732 2955683 3114004 2776430 2947061 3224413 3293615 3305427
$$ packed form
1091F52051j39319J69834j67171k90543J9269o7852K28112L87803J4093J01933
1081I08210L1517l49331j80012P2098O991j30258K14597j08313O7256J96246J91632
1070I20633j76150l2280p0396K1392P8399j05790L22973J12596l36662N6476K07139
1059I98330N11308k54624p8482j11063L12288l7195o8023J05453k17786n52121
1049F08085P2691J62482K18837J50151N3805N6972P6058J40145J24375L9940l41591
1038A361950k45904j23496N45069M27240n4921l162n8323p9777K26720J6166R3563
1027B105125k63022M6355K12446n779J48053O4476p2805L9396P340r7493Q8428
1016B272520j1367k91255N02834M82951J58321l37574J70631K77352O9202J1812
$$ plain form
1006 3305427 3289872 3313472 3734850 3861345 3534963 3317839 3567883 3829406 4055821 4086368
996 4086368 4183380 4311602 4338176 4183715 4421827 5115105 5307930 5213095 5121782 5738797
986 5738797 6331915 6678978 7074887 7413422 7966462 8419072 8579031 9098853 9493586 10237178
976 10237178 10986450 11693379 12783552 13956025 14939844 15321223 15983406 16944674 17873955
967 17873955 19123985 20306691 21771149 23744919 26028340 29174795 33234205 38491898
959 38491898 44925330 53200781 62667350 71812373 72837748 67132233 58862744 48425005
951 48425005 39795104 33916131 29830041 26374407 23580610 21244649 19023206 17204102
943 17204102 15455471 14388253 13814385 12660018 11706872 10930186 10324096 9503206 8635646
$$ packed form
1006C305427j5555K3600M21378J26495l26382k17124K50044K61523K26415L0547
996D086368R7012J28222K6574j54461K38112O93278J92825r4835r1313O17015
986E738797N93118L47063L95909L38535N53040M52610J59959N19822L94733P43592
976A0237178P49272P06929J090173J172473R83819L81379O62183R61268R29281
967A7873955J250030J182706J464458J973770K283421L146455M059410N257693
959C8491898O433432Q275451R466569R145023J025375n705515q269489j0437739
951D8425005q629901n878973m086090l455634k793797k335961k221443j819104
943A7204102j748631j067218n73868j154367r53146p76686o06090q20890q67560
$$ plain form
934 8635646 7974922 7526299 6822788 6443547 6494279 6140279 5544153 5306887 4835919 4749520
924 4749520 4869373 4751653 4490163 4360331 4254832 3986522 3778375 3421703 3218190 3266328
914 3266328 2930484 2719061 3145041 3616134 3441067 2992890 2534091 2399018 2664132 2321523
904 2321523 2166077 2208612 1842689 1755300 1800213 2085780 2554831 2567712 1888160 1781267
894 1781267 1762432 1784962 2058241 1889772 1767225 1778983 1609936 1430363 1098436 1334207
884 1334207 1506254 1661727 1410368 1333419 1511167 1149388 676894 697212 743880 823836
874 823836 1055055 1023363 1083632 1275993 1080459 949320 996700 793081 896788 1131653
864 1131653 906559 1126635 1391777 1100744 903818 910113 847640 1100952 1152884 503932
$$ packed form
934H635646o60724m48623p03511l79241N0732l54000n96126k37266m70968q6399
924D749520J19853j17720k61490j29832j05499k68310k08147l56672k03513M8138
914C266328l35844k11423M25980M71093j75067m48177m58799j35073K65114l42609
904B321523j55446M2535l65923q7389M4913K85567M69051J2881o79552j06893
894A781267j8835K2530K73279j68469j22547J1758j69047j79573l31927K35771
884A334207J72047J55473k51359p6949J77748l61779m72494K0318M6668P9956
874H23836K31219l1692O0269J92361j95534j31139M7380k03619J03707K34865
864A131653k25094K20076K65142k91033j96926O295o2473K53312N1932o48952
$$ plain form
854 503932 441569 527358 560074 742479 620721 436447 602885 645048 197888 162797 251456
843 251456 68163 298503 592977 561811 377008 375637 112554 579883 617008 555227 455705
832 455705 398131 322967 334986 307520 422307 589736 577304 841444 937553 607193 439526
821 439526 477213 295644 762797 840418 305759 180244 -650 -104101 46943 27221
811 27221 -217731 -204582 110404 246043 244532 18858 -91984 -168 192354 567217 891817
800 891817 832221 786088 537131 386737 427874 698026 393283 265705 29804 -134895
790 -134895 177872 318984 132077 -87051 105682 -102489 -87039 7396 -200091 -51838
780 -51838 64134 110271 -108740 -66782 238871 225768 -61798 -156186 88004 -145865 -177251
$$ packed form
854E03932o2363Q5789L2716J82405j21758j84274J66438M2163m47160l5091Q8659
843B51456j83293K30340K94474l1166j84803j371k63083M67329L7125o1781r9522
832D55705n7574p5164J2019k7466J14787J67429j2432K64140R6109l30360j67667
821D39526L7687j81569M67153P7621n34659j25515j80894j03451J51044j9722
811B7221k44952J3149L14986J35639j511k25674j10842R1816J92522L74863L24600
800H91817n9596m6133k48957j50394M1137K70152l04743j27578k35901j64699
790a34895L12767J41112j86907k19128J92733k08171J5450R4435k07487J48253
780e1838J15972M6137k19011M1958L05653j3103k87566r4388K44190k33869l1386
$$ plain form
769 -177251 -119853 2618 321020 293783 144524 208330 244670 620401 649787 419331 246438
758 246438 100679 -100505 -42325 -73855 -40600 -94861 -158632 -295253 -129646 27199 70128
747 70128 -145653 -326081 -340402 -74752 112660 -44364 -104972 -254325 -98633 -95639 -37151
736 -37151 57886 -120740 -126450 -128235 46279 33126 140933 38179 -36340 226194 531937
725 531937 544295 380919 462429 145999 -275785 -220157 -137994 101989 97661 198517 10736
714 10736 -115091 6878 -56160 145253 109711 21531 -276300 -166656 141498 269965 98819
703 98819 -117252 -29316 -161902 -321266 -115595 -175340 338544 188081 -136352 -180563 -217883
692 -217883 -156328 83028 -70798 -93674 221463 207118 37236 68723 214504 285991 -118834
$$ packed form
769a77251N7398J22471L18402k7237j49259O3806L6340L75731K9386k30456j72893
758B46438j45759k01184N8180l1530L3255n4261o3771j36621J65607J56845M2929
747G0128k15781j80428j4321K65650J87412j57024o0608j49353J55692K994N8488
736c7151R5037j78626n710j785J74514j3153J07807j02754p4519K62534L05743
725E31937J2358j63376Q1510l16430m21784N5628Q2163K39983m328J00856j87781
714A0736j25827J21969o3038K01413l5542q8180k97831J09644L08154J28467j71146
703I8819k16071Q7936j32586j59364K05671n9745N13884j50463l24433m4211l7320
692b17883O1555K39356j53826k2876L15137j4345j69882L1487J45781P1487m04825
$$ plain form
681 -118834 -566661 -353612 58831 107670 255969 380393 170672 34209 36317 -124922
671 -124922 144396 401933 568770 436754 208380 136515 321834 410098 226511 260931
661 260931 212936 123096 169841 115950 245619 269273 139902 -88763 85560 98921 -228270
650 -228270 -19851 162387 436178 296109 -149637 -245599 -250050 -329814 -204087 -64110 -59971
639 -59971 19447 45815 -133653 76019 -101928 -137717 -76683 -138031 -26221 86715 -112864
628 -112864 -265355 -80424 -8550 -337589 -267340 -164122 -126311 -349301 -358516 -8946 455758
617 455758 468890 425428 382608 206366 -9182 -214573 -277175 -155203 -12676 279640 141692
606 141692 -156976 -281079 93083 379431 -14394 44858 -15732 -4562 -165866 -400052
$$ packed form
681a18834m47827K13049M12443M8839J48299J24424k09721j36463K108j61239
671a24922K69318K57537J66837j32016k28374p1865J85319Q8264j83587L4420
661B60931m7995q9840M6745n3891J29669K3654j29371k28665J74323J3361l27191
650b28270K08419J82238K73791j40069m45746r5962m451p9764J25727J39977M139
639e9971P9418K6368j79468K09672j77947l5789O1034o1348J11810J12936j99579
628a12864j52491J84931P1874l29039P0249J03218L7811k22990r215L49570M64704
617D55758J3132m3462m2820j76242k15548k05391o2602J21972J42527K92316j37948
606A41692k98668j24103L74162K86348l93825N9252o0590J1170j61304k34186
$$ plain form
596 -400052 -310017 -171230 -166952 -90559 -47129 -259547 -402733 -209485 -312549 -249712 -124320
585 -124320 -240502 -267719 -102661 -26803 387299 489154 12400 -33048 183945 304343
575 304343 323048 236787 254395 15233 -193650 -63590 99664 66616 -110198 44960 64973
564 64973 -50209 93046 11525 -137419 -84287 -212509 -173238 -118132 -408273 -212060 -31491
553 -31491 -40764 -67778 177913 -8323 -370518 -210716 -43038 15115 198082 -41617 38595
542 38595 331141 -141835 -392945 -203821 -157603 28255 -131320 -83925 116056 -5952
532 -5952 -120024 -65861 97749 -114596 -109887 -270584 -405371 -38597 72100 27166 171646
521 171646 -43167 -580546 -438527 -328700 -213964 62064 -68303 -418849 -191933 249905
$$ packed form
596d00052R0035J38787M278P6393M3430k12418j43186J93248j03064O2837J25392
585a24320j16182k7217J65058P5858M14102J01855m76754m5448K16993J20398
575C04343J8705q6261J7608k39162k08883J30060J63254l3048j76814J55158K0013
564F4973j15182J43255q1521j48944N3132j28222L9271N5106k90141J96213J80569
553c1491r273k7014K45691j86236l62195J59802J67678N8153J82967k39699Q0212
542C8595K92546m72976k51110J89124M6218J85858j59575M7395J99981j22008
532e952j14072N4163J63610k12345M709j60697j34787L66774J10697m4934J44480
521A71646k14813n37379J42019J09827J14736K76028j30367l50546K26916M41838
$$ plain form
511 249905 73268 -85200 -42694 -103022 -307020 -406776 -76981 465720 118262 -5433
501 -5433 -18227 139800 529549 59422 -503279 -220221 -68681 23755 -4749 35332 75782
490 75782 310118 213350 57145 -15442 189982 -34382 -56593 38921 -37150 237770 21833
479 21833 -251248 -89196 -271128 -319843 -160124 -308438 -164343 -65267 -318030 -257705 -78028
468 -78028 72908 -128680 -35561 55904 237571 260594 231857 45956 -260877 -400789 -153901
457 -153901 -38136 51439 266283 318046 240910 172648 181883 164714 -39721 -26248 -306859
446 -306859 -482619 -148094 -397246 -145805 109339 -149164 -301774 -414866 -613807 -552196
436 -552196 -479756 -274410 -143437 4990 -78777 -328527 -287914 3195 -67436 -31259 -288675
$$ packed form
511B49905j76637j58468M2506o0328k03998r9756L29795N42701l47458j23695
501e433j2794J58027L89749m70127n62701K83058J51540R2436k8504M0081M0450
490G5782K34336r6768j56205p2587K05424k24364k2211R5514p6071K74920k15937
479B1833k73081J62052j81932m8715J59719j48314J44095R9076k52763O0325J79677
468g8028J50936k01588R3119R1465J81667K3023k8737j85901l06833j39912K46888
457a53901J15765Q9575K14844N1763p7136o8262R235j7169k04435J3473k80611
446c06859j75760L34525k49152K51441K55144k58503j52610j13092j98941O1611
436e52196P2440K05346J30973J48427q3767k49750M0613K91109p0631L6177k57416
$$ plain form
425 -288675 -47789 159381 137269 19404 -135065 -25045 103523 -242900 -354700 -64160
415 -64160 131536 -113007 -113486 -192042 -109520 -260191 -375600 -353428 -113067 -111 -90695
404 -90695 -72772 -106864 -220685 -187627 -381024 -211919 -169607 -197238 23771 22574 -53556
393 -53556 161142 237015 105167 73286 314661 218462 139919 -28007 -185643 -96331 4700
382 4700 -134147 -59591 93650 -207291 -262983 -204872 -164267 -275573 -599670 -739535 -587167
371 -587167 -295826 69190 42779 39527 -68832 -62489 -262245 -379023 -7777 110941 -137630
360 -137630 -137069 -78438 97407 58259 -350756 -188667 92352 -119337 -220999 -451880 -361272
349 -361272 -112381 -48373 -213476 -270199 -229300 -100035 253788 264666 -197264 120829 159170
$$ packed form
425b88675K40886K07170k2112j17865j54469J10020J28568l46423j11800K90540
415f4160J95696k44543m79p8556Q2522j50671j15409K2172K40361J12956r0584
404i0695J7923l4092j13821L3058j93397J69105M2312k7631K21009j197p6130
393e3556K14698P5873j31848l1881K41375r6199p8543j67926j57636Q9312J01031
382D700j38847P4556J53241l00941n5692N8111M0605j11306l24097j39865J52368
371e87167K91341L65016k6411l252j08359O343j99756j16778L71246J18718k48571
360a37630N61N8631J75845l9148m09015J62089K81019k11689j01662k30881R0608
349c61272K48891O4008j65103n6723M0899J29265L53823J0878m61930L18093L8341
$$ plain form
338 159170 135256 257559 205809 221270 248082 -34210 -389307 -62398 212184 -186747 -107632
327 -107632 -89776 -222791 -264574 -476820 -373784 72246 109999 -78753 -310014 -493499
317 -493499 -312778 68774 -159428 -409849 -586473 -482891 -107178 -234662 -426793 32353
307 32353 159107 -97056 -139348 -270218 -91877 338720 280837 -188787 -173731 -236682 -258966
296 -258966 -28182 195799 229944 200929 -283037 -487507 -201632 182036 200619 -343599
286 -343599 -489332 -341505 14057 -158781 -628213 -318878 -117381 -157065 -176200 -472879
276 -472879 -237046 -93039 -335339 -274654 -165384 -285151 -184858 -242231 -452719 -593251
266 -593251 -378959 -336355 -402626 -281439 -107053 54624 -1746 -276957 -31364 -121483 -228895
$$ packed form
338A59170k3914J22303n1750J5461K6812k82292l55097L26909K74582l98931P9115
327a07632J7856j33015m1783k12246J03036M46030L7753j88752k31261j83485
317d93499J80721L81552k28202k50421j76624J03582L75713j27484j92131M59146
307C2353J26754k56163m2292j30870J78341M30597n7883m69624J5056o2951k2284
296b58966K30784K23981L4145k9015m83966k04470K85875L83668J8583n44218
286c43599j45733J47827L55562j72838m69432L09335K01497l9684j9135k96679
276d72879K35833J44007k42300O0685J09270j19767J00293n7373k10488j40532
266e93251K14292M2604o6271J21187J74386J61677n6370k75211K45593r0119j07412
$$ plain form
255 -228895 142612 106962 322882 347287 173751 67589 96822 -839 104661 210561 -305645
244 -305645 -444308 -106585 -175751 -443219 -484642 -339827 -245899 -122808 -320419 -336123 -157406
233 -157406 -381737 -179926 -150264 -282982 -303407 -422647 -245680 -119708 106096 98213 179521
222 179521 28204 -197895 -11909 351914 36176 -15249 305087 136200 285505 221940
212 221940 140640 99509 -324446 -310031 -113663 -242871 -309801 -168522 -97381 -342125 -364869
201 -364869 -325511 -364268 -418957 -608639 -505516 -76898 -300699 -363900 -261466 -368677 -228135
190 -228135 -11090 -79025 -73997 -84867 -475907 -80241 201982 403194 226211 82702 -169412
179 -169412 26139 112041 89572 59295 -98868 -286941 -195265 -616493 -343248 -308485 -636814
$$ packed form
255b28895L71507l5650K15920K4405j73536j06162K9233r7661J05500J05900n16206
244c05645j38663L37723o9166k67468m1423J44815R3928J23091j97611j5704J78717
233a57406k24331K01811K9662j32718k0425j19240J76967J25972K25804p883Q1308
222A79521j51317k26099J85986L63823l15738n1425L20336j68887J49305o3565
212B21940q1300m1131m23955J4415J96368j29208o6930J41279P1141k44744k2744
201c64869L9358l8757n4689j89682J03123M28618k23801o3201J02434j07211J40542
190b28135K17045o7935N028j0870l91040L95666K82223K01212j76983j43509k52114
179a69412J95551Q5902k2469l0277j58163j88073R1676m21228K73245L4763l28329
$$ plain form
168 -636814 -650992 -352959 -208329 -292159 -685583 -640074 -516679 -301198 -380382 -483947 -189789
157 -189789 -369568 -477051 -268477 -204410 18550 -87659 -183759 112839 -107959 -83966
147 -83966 -64158 -215352 -76302 205921 -3544 -192843 -144212 134222 -17771 -81338 -117605
136 -117605 -230713 -196818 -79938 -424548 -82902 113090 49139 -105868 -335661 -415135
126 -415135 -105577 -64324 -87767 -100824 147118 -77244 -253796 -320066 -112461 -31341 -332273
115 -332273 -284138 -167830 -322954 -310210 -354366 -224330 -72528 -178022 -361276 -195384
105 -195384 -212486 -218705 -147561 -61989 -117933 118240 27313 -319434 -237159 -22896 -45082
94 -45082 -240225 -335633 -376455 -185761 -233005 -472202 -445378 -385498 -457371 -322499 -163152
$$ packed form
168f36814j4178K98033J44630q3830l93424M5509J23395K15481p9184j03565K94158
157a89789j79779j07483K08574O4067K22960j06209r6100K96598k20798K3993
147h3966J9808j51194J39050K82223k09465j89299M8631K78434j51993o3567l6267
136a17605j13108L3895J16880l44610L41646J95992o3951j55007k29793p9474
126d15135L09558M1253k3443j3057K47942k24362j76552o6270K07605Q1120l00932
115c32273M8135J16308j55124J2744m4156J30036J51802j05494j83254J65892
105a95384j7102o219P1144Q5572n5944K36173r0927l46747Q2275K14263k2186
94d5082j95143r5408m0822J90694m7244k39197K6824N9880p1873J34872J59347
$$ plain form
83 -163152 -133473 -291721 -317575 -110743 -53021 -74067 -232208 -300942 -200176 -160017 -27412
72 -27412 -76140 -116265 -34226 21779 -34341 -92021 -20374 81372 -341198 -324285 -254686 -226989
60 -226989 -286598 -255066 42690 -100791 -283269 -369164 -270877 -392869 -258034 -211873 -362021
49 -362021 -543318 -460342 -451176 -565026 -437105 -316812 -391234 -245291 -96339 -170901 -132889
38 -132889 -233764 -144100 -266349 -210330 -7721 196526 13924 7736 9838 -19828 -120938
27 -120938 -295764 -436343 -278598 -418157 -573924 -449854 -222124 -139090 -139786 -345576 -376836
16 -376836 -348440 -338907 -578863 -443504 -90679 -1147 137853 -88028 -468251 -255026 -239476
5 -239476 -175202 38630 -37693 -110591 -290924
$$ packed form
83a63152K9679j58248k5854K06832N7722k1046j58141o8734J00766M0159J32605
72b7412m8728m0125Q2039N6005n6120n7680P1647J01746m22570J6913O9599K7697
60b26989n9609L1532K97756j43481j82478q5895R8287j21992J34835M6161j50148
49c62021j81297Q2976R166j13850J27921J20293p4422J45943J48952p4562L8012
38a32889j00875Q9664j22249N6019K02609K04247j82602o188K102k9666j01110
27a20938j74826j40579J57745j39559j55767J24070K27730Q3034o96k05790l1260
16c76836K8396R533k39956J35359L52825Q9532J39000k25881l80223K13225J5550
5b39476O4274K13832p6323p2898j80333
$$ plain form
0 -290924
$$ packed form
0b90924
$$ Imaginary data points
##PAGE= N=2
##DATA TABLE= (X++(I..I)), XYDATA
$$ plain form
16383 -3158712 -3009528 -3239792 -3283116 -3175614 -2894454 -3047841 -3357053 -3351062 -3028173 -2936075
16373 -2936075 -2896567 -2847878 -2942502 -2976699 -2771539 -2494522 -2469048 -2439822 -2596568 -2513447 -2269655
16362 -2269655 -2238341 -2180139 -2251908 -2575367 -2457302 -2077312 -2156360 -2408912 -2351374 -2097387
16352 -2097387 -2005688 -2002337 -1963442 -1999482 -1980857 -1920534 -1817050 -1787304 -1881796 -1828622 -1708610
16341 -1708610 -1825947 -1767531 -1708053 -1752484 -1903518 -1900825 -1785010 -1553516 -1621409 -1728923
16331 -1728923 -1641130 -1583862 -1599416 -1676042 -1550493 -1493002 -1295570 -1099107 -1323731 -1260108
16321 -1260108 -1308890 -1260163 -1124091 -1085781 -966821 -872642 -807186 -899073 -841941 -623373 -659432
16310 -659432 -886248 -1188553 -1106353 -879384 -847514 -715417 -450053 -334222 -508014 -701694
$$ packed form
16383c158712J49184k30264m3324J07502K81160j53387l09212N991L22889R2098
16373b936075L9508M8689r4624l4197K05160K77017K5474K9226j56746Q3121K43792
16362b269655L1314N8202p1769l23459J18065L79990p9048k52552N7538K53987
16352b097387R1699L351L8895l6040J8625O0323J03484K9746r4492N3174J20012
16341a708610j17337N8416N9478m4431j51034K693J15815K31494o7893j07514
16331a728923Q7793N7268j5554p6626J25549N7491J97432J96463k24624O3623
16321a260108m8782M8727J36072L8310J18960R4179O5456r1887N7132K18568l6059
16310f59432k26816l02305Q2200K26969L1870J32097K65364J15831j73792j93680
$$ plain form
16300 -701694 -1018320 -648457 -506010 -574941 -510909 -332574 -450081 -528810 -637204 -729444
16290 -729444 -684970 -570013 -696916 -638752 -325613 128357 65839 -209748 -210764 -28168
16280 -28168 -74240 -44976 -42790 -76076 -14451 81577 162471 122456 233014 131096 -339802
16269 -339802 -217974 -54105 40483 314399 83670 -87090 135168 42787 -14598 -228788
16259 -228788 -51974 56604 378524 486085 627479 733111 575967 549215 315478 301129
16249 301129 482656 350557 383680 706118 890136 1011280 652377 668295 542044 769716
16239 769716 709300 728111 563649 697404 711388 598527 702539 741334 627168 684299
16229 684299 391372 551435 881198 1142506 894177 775383 875031 901918 832191 876235
$$ packed form
16300g01694l16626L69863J42447o8931O4032J78335j17507p8729j08394r2240
16290g29444M4474J14957j26903N8164L13139M53970o2518k75587j016J82596
16280b8168m6072K9264K186l3286O1625R6028Q0894m0015J10558j01918m70898
16269c39802J21828J63869R4588K73916k30729j70760K22258r2381n7385k14190
16259b28788J76814J08578L21920J07561J41394J05632j57144k6752k33737j4349
16249C01129J81527j32099L3123L22438J84018J21144l58903J5918j26251K27672
16239G69716o0416J8811j64462J33755J3984j12861J04012L8795j14166N7131
16229F84299k92927J60063L29763K61308k48329j18794R9648K6887o9727M4044
$$ plain form
16219 876235 795474 977611 1434186 1275040 1185929 1254578 1025840 1111536 770643 739924
16209 739924 998430 1167507 1052820 841937 948289 914602 1064540 1122391 1123014 1002770
16199 1002770 944371 1054476 1001458 1191029 1302563 1299391 1356103 1160553 1301114 1274151
16189 1274151 1469202 1490613 1301754 1244342 1297475 1534518 1402460 1340287 1227802 1160611
16179 1160611 1487889 1161093 1160103 1366446 1228965 1361486 1506757 1243781 1541772 1546779
16169 1546779 1425591 1278707 1310923 1358613 1149420 1177308 1393278 1327029 1522885 1369570
16159 1369570 1247589 1331801 1290560 1458851 1573673 1542717 1681790 1700935 1978995 1728528
16149 1728528 1556301 1467289 1692510 1611538 1501394 1838387 1828986 1688361 1745977 1719426
$$ packed form
16219H76235q0761J82137M56575j59146q9111O8649k28738Q5696l40893l0719
16209G39924K58506J69077j14687k10883J06352l3687J49938N7851O23j20244
16199A002770n8399J10105n3018J89571J11534l172N6712j95550J40561k6963
16189A274151J95051K1411j88859n7412N3133K37043j32058o2173j12485o7191
16179A160611L27278l26796r90K06343j37481J32521J45271k62976K97991N007
16169A546779j21188j46884L2216M7690k09193K7888K15970o6249J95856j53315
16159A369570j21981Q4212m1241J68291J14822l0956J39073J9145K78060k50467
16149A728528j72227q9012K25221q0972j10144L36993r401j40625N7616k6551
$$ plain form
16139 1719426 1762077 1778955 1544014 1410693 1796176 1950337 1732947 1907665 1693429 1676803
16129 1676803 1726957 1708163 1380102 1233403 1522292 1737191 1772018 2095510 2029476 2033445
16119 2033445 1679315 1487941 1561644 1680259 1718919 1484931 1550476 1993683 1892406 1809252
16109 1809252 2036312 1913964 1634925 1913640 2015871 2077616 1982112 1656737 1504646 1742357
16099 1742357 1751348 1712998 1687299 1697339 1805199 1938643 1665032 1772267 1814848 1854654 1596923
16088 1596923 1514613 1556312 1625137 1635656 1658720 1759777 1890022 1876870 1803241 1584162 1724259
16077 1724259 1584634 1715868 1903237 1703525 1847677 2058671 2140385 1924657 1912018 2082180
16067 2082180 2068918 2268119 2534779 2090467 1782848 1695718 1856199 1809830 2055228 1791053
$$ packed form
16139A719426M2651J6878k34941j33321L85483J54161k17390J74718k14236j6626
16129A676803N0154j8794l28061j46699K88889K14899L4827L23492o6034L969
16119B033445l54130j91374P3703J18615L8660k33988O5545M43207j01277q3154
16109A809252K27060j22348k79039K78715J02231O1745r5504l25375j52091K37711
16099A742357Q991l8350k5699J0040J07860J33444k73611J07235M2581L9806k57731
16088A596923q2310M1699O8825J0519K3064J01057J30245j3152p3629k19079J40097
16077A724259j39625J31234J87369j99712J44152K10994Q1714k15728j2639J70162
16067B082180j3262J99201K66660m44312l07619q7130J60481m6369K45398k64175
$$ plain form
16057 1791053 1881907 1755946 1596332 1748730 1756209 1584882 1646324 1732545 2090587 2030224
16047 2030224 1859900 1821382 1751299 1751541 2066783 2056445 1892227 1578113 1610795 1667665 1852928
16036 1852928 1736817 1956952 1934171 2027094 1544702 1484946 1767216 1902511 2006987 2030112
16026 2030112 2059679 1874631 1884880 1800053 1833375 2003496 2020159 2066004 1795923 1801587 1937528
16015 1937528 1891200 1934730 1995826 2240362 2221532 2059229 1840088 2091568 2095695 1914209
16005 1914209 1954929 2271527 2175912 2054212 1825841 1776106 1424329 1555737 1676450 1468292
15995 1468292 1631743 1917831 1933603 1788040 1589607 1398083 1746214 1711856 1687854 1736319
15985 1736319 1691359 2030160 1909070 1714146 2123510 2089465 1675328 1952987 1970311 1740793
$$ packed form
16057A791053R0854j25961j59614J52398P479j71327O1442Q6221L58042o0363
16047B030224j70324l8518p0083K42L15242j0338j64218l14114L2682N6870J85263
16036A852928j16111K20135k2781R2923m82392n9756K82270J35295J04476K3125
16026B030112K9567j85048J0249q4827L3322J70121J6663M5845k70081N664J35941
16015A937528m6328M3530O1096K44536j8830j62303k19141K51480M127j81486
16005A914209M0720L16598r5615j21700k28371m9735l51777J31408J20713k08158
15995A468292J63451K86088J5772j45563j98433j91524L48131l4358k4002M8465
15985A736319m4960L38801j21090j94924M09364l4045m14137K77659J7324k29518
$$ plain form
15975 1740793 1697397 1707643 1917501 2066281 2085717 2160746 1870671 1763770 1859871 2226197
15965 2226197 2238553 2054729 2078788 2112873 2011250 1983535 1808351 1891883 1985716 2087431
15955 2087431 2100416 2155307 1885651 1877649 1843369 1608015 1796080 2099783 2275752 2302177
15945 2302177 2045752 1971124 1947391 2026136 1890105 1706095 1706459 1946200 1859899 1597070 1722002
15934 1722002 1932294 1982311 2029864 1906660 1771912 1892073 1899579 1845395 1688955 1813874
15924 1813874 2067030 2141554 1874501 2017310 2158654 2080146 1763756 1879317 2006709 2188139
15914 2188139 2067847 1602709 1488432 1837832 1874271 1893258 1865898 2075075 1774312 1818377
$$ packed form
15975A740793m3396J0246K09858J48780J9436P5029k90075j06901R6101L66326
15965B226197J2356j83824K4059L4085j01623k7715j75184Q3532R3833J01715
15955B087431J2985N4891k69656q002l4280k35354J88065L03703J75969K6425
15945B302177k56425p4628k3733P8745j36031j84010L64K39741q6301k62829J24932
15934A722002K10292N0017M7553j23204j34748J20161P506n4184j56440J24919
15924A813874K53156P4524k67053J42809J41344p8508l16390J15561J27392J81430
15914B188139j20292m65138j14277L49400L6439J8987k7360K09177l00763M4065
$$ [...]
##END NTUPLES=NMR SPECTRUM
##END=
