##TITLE=1H_CA-8804-1
 CDCl3, 8 sc, 
 29.12.2020
##JCAMPDX= 6.0         $$ Bruker NMR JCAMP-DX V2.0
##DATA TYPE= NMR SPECTRUM
##DATA CLASS= NTUPLES
##ORIGIN= UXNMR, Bruker Analytische Messtechnik GmbH
##OWNER= root
$$ XWIN-NMR		Version 3.5
$$ Tue Dec 29 10:24:03 2020 Russian Standard Time (UT+4h)  she@DPX200
##.OBSERVE FREQUENCY= 200.1315066352
##.OBSERVE NUCLEUS= ^1H
##.ACQUISITION MODE= SIMULTANEOUS
##.ACQUISITION SCHEME= undefined
##.AVERAGES= 8
##.DIGITISER RES= 18
##SPECTROMETER/DATA SYSTEM= spect
##.PULSE SEQUENCE= zg30
##.SOLVENT NAME= CDCl3
##.SHIFT REFERENCE= (INTERNAL, CDCl3, 0, 16.0051)
##AUDIT TRAIL= $$ (NUMBER, WHEN, WHO, WHERE, WHAT)
$$ ##TITLE= Audit trail, XWIN-NMR		Version 3.5
$$ ##JCAMPDX= 5.01
$$ ##ORIGIN= Bruker BioSpin GmbH
$$ ##OWNER= she
$$ F:/spectra/data/she/nmr/H-F/1/pdata/1/auditp.txt
$$ ##AUDIT TRAIL=  $$ (NUMBER, WHEN, WHO, WHERE, WHAT)
(   1,<2020-12-29 10:22:42.23 +0400>,<she>,<DPX200>,
      <created by zg, POWCHK disabled, PULCHK disabled
       configuration hash MD5:
       00 E9 B6 7A A2 85 ED C7 34 08 36 98 17 FE 4E 26
       data hash MD5: 16K
       BB 28 B4 43 86 F7 20 79 31 31 F6 54 88 8E C3 B3>)
(   2,<2020-12-29 10:22:44.54 +0400>,<she>,<DPX200>,
      <Start of raw data processing
       efp BC_mod = 2 LB = 0.24 FT_mod = 6 PKNL = 1 PHC0 = -10759 PHC1 = 7.400953 SI = 16K 
       data hash MD5: 16K
       10 75 D0 7D 2F 13 F2 C7 D9 04 8F 71 81 EB 13 5C>)
(   3,<2020-12-29 10:23:11.35 +0400>,<she>,<DPX200>,
      <pk PHC0 = -17.55954 PHC1 = 21 
       data hash MD5: 16K
       B1 2E 73 41 06 B1 FA 71 53 A3 E6 06 C7 9C 69 BA>)
(   4,<2020-12-29 10:23:14.35 +0400>,<she>,<DPX200>,
      <abs ABSG = 5 
       data hash MD5: 16K
       93 27 D9 92 11 F2 74 A9 E1 E3 4D E6 B1 71 6C 1E>)
$$ ##END=
$$ 
$$ hash MD5
$$ D5 2D 0F 4D 38 31 FF 22 75 E8 1F 25 4E E6 3E F1
##$RELAX= 
##$RELAX= 
##$RELAX= 
##$RELAX= 
##$RELAX= 
##$RELAX= 
$$ Bruker specific parameters
$$ --------------------------
##$DU= <F:/spectra>
##$EXPNO= 1
##$NAME= <H-F>
##$PROCNO= 1
##$TYPE= <nmr>
##$USER= <she>
##$AMP= (0..31)
100 100 100 100 100 100 100 100 100 100 100 100 100 100 100 100 100 100 
100 100 100 100 100 100 100 100 100 100 100 100 100 100 
##$AQSEQ= 0
##$AQ_mod= 1
##$AUNM= <au_zg>
##$AUTOPOS= <>
##$BF1= 200.13
##$BF2= 200.13
##$BF3= 200.13
##$BF4= 200.13
##$BF5= 200.13
##$BF6= 200.13
##$BF7= 200.13
##$BF8= 200.13
##$BYTORDA= 1
##$CFDGTYP= 0
##$CFRGTYP= 5
##$CHEMSTR= <none>
##$CNST= (0..31)
1 1 145 1 1 1 1 1 1 1 1 1 1 1 1 1 1 1 1 1 1 1 1 1 1 1 1 1 1 1 1 1 
##$CPDPRG= <>
##$CPDPRG1= <>
##$CPDPRG2= <>
##$CPDPRG3= <>
##$CPDPRG4= <mlev>
##$CPDPRG5= <mlev>
##$CPDPRG6= <mlev>
##$CPDPRG7= <mlev>
##$CPDPRG8= <mlev>
##$CPDPRGB= <>
##$CPDPRGT= <>
##$D= (0..31)
0 1.2 0 0 0 0 0 0 0 0.06 0 0.03 0 0 0 0 0.0002 0 0 0 0 0 0 0 0 0 0 0 0 
0 0 0 
##$DATE= 1609222961
##$DBL= (0..7)
120 120 120 120 120 120 120 120 
##$DBP= (0..7)
150 150 150 150 150 150 150 150 
##$DBP07= 0
##$DBPNAM0= <>
##$DBPNAM1= <>
##$DBPNAM2= <>
##$DBPNAM3= <>
##$DBPNAM4= <>
$$ [...]
##$SUBNAM3= <"">
##$SUBNAM4= <"">
##$SUBNAM5= <"">
##$SUBNAM6= <"">
##$SUBNAM7= <"">
##$SUBNAM8= <"">
##$SUBNAM9= <"">
##$SW= 16.9725356469052
##$SWIBOX= (0..15)
0 0 2 0 0 0 0 0 0 0 0 0 0 0 0 0 
##$SW_h= 3396.73913043478
##$TD= 16384
##$TD0= 1
##$TE= 0
##$TE2= 300
##$TE3= 300
##$TEG= 300
##$TL= (0..7)
0 120 120 120 120 120 120 120 
##$TP= (0..7)
150 150 150 150 150 150 150 150 
##$TP07= 0
##$TPNAME0= <>
##$TPNAME1= <>
##$TPNAME2= <>
##$TPNAME3= <>
##$TPNAME4= <>
##$TPNAME5= <>
##$TPNAME6= <>
##$TPNAME7= <>
##$TPOAL= (0..7)
0.5 0.5 0.5 0.5 0.5 0.5 0.5 0.5 
##$TPOFFS= (0..7)
0 0 0 0 0 0 0 0 
##$TUNHIN= 0
##$TUNHOUT= 0
##$TUNXOUT= 0
##$USERA1= <user>
##$USERA2= <user>
##$USERA3= <user>
##$USERA4= <user>
##$USERA5= <user>
##$V9= 5
##$VALIST= <valist>
##$VCLIST= <CCCCCCCCCCCCCCC>
##$VD= 0
##$VDLIST= <DDDDDDDDDDDDDDD>
##$VPLIST= <PPPPPPPPPPPPPPP>
##$VTLIST= <TTTTTTTTTTTTTTT>
##$WBST= 1024
##$WBSW= 4
##$XGAIN= (0..3)
0 0 0 0 
##$XL= 0
##$YL= 0
##$YMAX_a= 369224
##$YMIN_a= -518289
##$ZGOPTNS= <>
##$ZL1= 120
##$ZL2= 120
##$ZL3= 120
##$ZL4= 120
##$ABSF1= 15.99164
##$ABSF2= -0.9810238
##$ABSG= 5
##$ABSL= 3
##$ALPHA= 0
##$AQORDER= 0
##$ASSFAC= 0
##$ASSFACI= 0
##$ASSFACX= 0
##$ASSWID= 0
##$AUNMP= <proc_1d>
##$AZFE= 0.1
##$AZFW= 0.1
##$BCFW= 0
##$BC_mod= 2
##$BYTORDP= 0
##$COROFFS= 0
##$CY= -3
##$DATMOD= 1
##$DC= 0
##$DFILT= <>
##$DTYPP= 0
##$F1P= 0
##$F2P= 0
##$FCOR= 1
##$FTSIZE= 16384
##$FT_mod= 6
##$GAMMA= 0
##$GB= 0
##$INTBC= 1
##$INTSCL= 2.992141e-10
##$ISEN= 128
##$LB= 0.24
##$LEV0= 0
##$LPBIN= 0
##$MAXI= 10000
##$MC2= 0
##$MEAN= 0
##$ME_mod= 0
##$MI= 1.114404
##$NCOEF= 0
##$NC_proc= -6
##$NLEV= 6
##$NOISF1= 3.799351
##$NOISF2= 2.8
##$NSP= 0
##$NTH_PI= 0
##$NZP= 0
##$OFFSET= 16.00511
##$PC= 1
##$PHC0= -10776.56
##$PHC1= 28.40095
##$PH_mod= 1
##$PKNL= yes
##$PPARMOD= 0
##$PSCAL= 0
##$PSIGN= 0
##$REVERSE= no
##$SF= 200.130001902931
##$SI= 16384
##$SIGF1= 3
##$SIGF2= 2
##$SINO= 5.538805
##$SIOLD= 16384
##$SREGLST= <1H.CDCl3>
##$SSB= 0
##$STSI= 16384
##$STSR= 0
##$SW_p= 3396.73913043478
##$SYMM= 0
##$S_DEV= 0
##$TDeff= 16384
##$TDoff= 0
##$TI= <>
##$TILT= no
##$TM1= 0
##$TM2= 0
##$TOPLEV= 0
##$USERP1= <user>
##$USERP2= <user>
##$USERP3= <user>
##$USERP4= <user>
##$USERP5= <user>
##$WDW= 1
##$XDIM= 16384
##$YMAX_p= 320284552
##$YMIN_p= -334022
$$ End of Bruker specific parameters
$$ ---------------------------------
##NTUPLES= NMR SPECTRUM
##VAR_NAME=  FREQUENCY,     SPECTRUM/REAL,   SPECTRUM/IMAG
##SYMBOL=    X,             R,               I
##VAR_TYPE=  INDEPENDENT,   DEPENDENT,       DEPENDENT
##VAR_FORM=  AFFN,          ASDF,            ASDF
##VAR_DIM=   16384,         16384,           16384
##UNITS=     HZ,            ARBITRARY UNITS, ARBITRARY UNITS
##FACTOR=    0.207333158178281, 1,           1
##FIRST=     3203.10265212639, 0,            0
##LAST=      -193.636478308391, 0,           0
##MIN=       -193.636478308391, -334022,     0
##MAX=       3203.10265212639, 320284552,    0
$$ Real data points
##PAGE= N=1
##DATA TABLE= (X++(R..R)), XYDATA
$$ [...]
7481 24711 -37475 -6616 -43616 42647 26088 4259 143920 105425 87225 53707 -24586 -28422
7469 -28422 -3838 -36833 15015 9596 20249 69897 61232 -33734 10013 55400 30685 87189
7457 87189 58805 74765 138279 97370 45639 58927 28157 11612 62320 16641 23222 72807
7445 72807 26794 -5413 -28548 2259 33141 29466 -56746 -94427 -47089 -57436 -48571 -503
7433 -503 15549 46815 72042 34716 8086 -51458 -102688 -111595 -6863 -75911 4678 7381
7421 7381 6772 134529 49811 -73501 -19292 18694 -26795 -58232 4005 17678 -82575 85195
7409 85195 109927 -44293 -21105 71589 116596 69333 61068 175133 134662 107341 34951 -2282
7397 -2282 43186 -37320 -82846 60131 46683 -4389 28450 -10013 -64711 7726 3861 41438
7385 41438 33650 -49803 6676 22732 60234 44063 96383 155268 46230 -39650 53497 54168
7373 54168 31937 161327 151205 121000 71311 129989 59937 -28218 39803 16047 -1454 -33961
7361 -33961 11539 18447 34592 89429 62445 36041 -38848 737 -59740 -126025 -118054 -76276
7349 -76276 37310 43620 81139 124417 108109 53473 46406 60959 54801 116918 75342 14754
7337 14754 84893 138674 88192 14769 -59840 18679 39752 10119 24766 -16581 10518 -32469
7325 -32469 21285 108416 146342 105108 120217 96482 66196 -49659 -59309 -100317 3966 86140
7313 86140 120566 33938 -12263 13914 2001 57170 97424 -30731 -16072 -9994 39827 191136
7301 191136 102626 -3047 -25469 2218 -31937 -22504 -85785 -24860 -9391 1046 69722 18166
7289 18166 5473 18755 87743 101229 52233 34439 -42132 -24884 87970 62995 68771 23441
7277 23441 15002 86470 87889 157768 184738 122472 90481 61806 34080 52404 116005 113999
7265 113999 39050 -73804 -69089 74648 193073 198643 202545 276987 64956 42871 15855
7254 15855 42874 64418 88934 118179 108097 111894 147169 123073 90624 89787 94807 101500 134598
7241 134598 96852 58770 149519 141794 85748 8122 32020 56287 72968 71537 -8032 38077
7229 38077 16769 74909 104901 121163 74662 68546 77440 32869 64386 93170 59100 56271
7217 56271 147259 142623 87621 119880 60307 74981 136351 54488 80009 49811 51033 42740
7205 42740 84080 139724 51672 57899 94664 189144 91232 -48259 57214 85992 179567 145084
7193 145084 30584 89764 117558 158115 157470 181924 144355 159277 212356 164736 166930 105839
7181 105839 141532 146285 158018 31498 -8044 43163 37830 48146 80966 41857 37195 -58329
7169 -58329 39062 137614 221468 248121 207437 134429 84837 172361 143220 145038 136494 87136
7157 87136 124936 74630 60915 47825 -4567 57944 24405 -30463 19545 94591 58615 25835
7145 25835 112538 63764 95393 62509 58075 148497 111194 140867 97902 -24997 -11372 16443
7133 16443 -58256 490 70818 44826 81099 16782 53857 77307 49369 61454 22918 34015
7121 34015 85884 95369 26199 80228 9346 57854 135590 153698 69167 73859 108355 131266
7109 131266 117747 107329 122381 74728 37666 89505 117989 66831 -60491 -22364 20646
7098 20646 30970 -16579 -22395 26483 83375 141350 233717 252403 127570 97942 175351 109788
7086 109788 21946 74568 121520 59667 48528 66449 124867 177602 165119 134947 114727 51703
7074 51703 76100 86650 20319 177184 259598 177007 148475 210614 146069 116741 121920 92675
7062 92675 54586 75632 87222 58816 4224 41378 8456 73633 140957 127847 130368 124875
7050 124875 177185 121877 103219 116796 129417 132622 60188 142355 82324 135326 172683 145787
7038 145787 43234 12470 100312 150920 115956 192859 155203 121229 195104 78897 82484
7027 82484 80308 152706 172831 186661 176219 130655 241990 136943 32517 71993 -3179
7016 -3179 -104 33157 97397 78373 48847 111288 94579 117717 142318 179336 187231 152554
7004 152554 130473 166507 194816 123482 78881 57800 144364 176869 73364 66233 -8907 -21166
6992 -21166 86107 156033 117226 67444 115104 60763 47164 69338 74802 133807 127687 121333
6980 121333 161270 90087 118365 147229 160269 149357 175159 113515 104583 72198 98221 15551
6968 15551 36109 13609 90687 110057 -7896 135699 74387 14837 109973 145280 153833 141799
6956 141799 178076 174877 128899 184206 153194 162751 30956 -77010 33582 74986 31422
6945 31422 59641 111498 149629 130507 76744 97242 167913 118125 181743 249016 189494 173062
6933 173062 125489 72220 48145 32034 113679 137414 162681 145984 153317 84580 16415 85677
6921 85677 215936 190318 185857 237719 146444 54148 123600 107360 70755 139603 186412 163181
6909 163181 64774 132024 151738 136913 77412 79250 95874 98115 112539 148684 80763 -3306
6897 -3306 -73398 -41954 28055 -10280 27967 31463 -8557 50781 110948 76375 118683 94343
6885 94343 50517 117110 183615 173274 81205 88533 172594 229640 176916 204261 149201 95849
6873 95849 138357 135359 91350 116300 59574 88468 166243 228476 145699 199185 189317 116078
6861 116078 157887 182016 145111 112069 211211 215691 169806 119542 165053 273422 237248 140494
6849 140494 162974 99264 139640 116111 99522 145768 114627 118430 180358 146662 172182 134995
6837 134995 112481 24640 143409 123384 167244 183769 231146 188438 210022 204592 111871 173584
6825 173584 206997 189986 188517 129258 151237 228409 135627 118868 80105 119404 183694 174499
6813 174499 141242 81046 46134 117616 164221 195448 189974 205666 181759 56167 93174 158292
6801 158292 200973 246179 188623 190309 226982 191293 89926 105857 151923 249789 225293 300880
6789 300880 259044 213607 176785 202845 200316 189317 128394 88853 157807 195854 166853 172326
6777 172326 114562 135865 186949 212681 264541 271195 167555 130702 150770 104709 168239 181767
6765 181767 72601 115433 97481 47553 84171 114353 165485 89944 119811 184917 79437
6754 79437 32812 125815 149648 79255 107371 148309 170306 217260 164123 66411 137369 125192
6742 125192 127193 93859 55844 103275 109162 168753 83345 108141 175493 272177 283409 244942
6730 244942 117847 71832 213522 322453 286798 224394 171990 202637 255462 239847 115993
6719 115993 226913 248035 236913 221334 192653 324390 219638 147841 202500 276365 306608
6708 306608 294988 294310 188942 157330 57984 127542 156633 208869 231790 255363 207132 215950
6696 215950 251289 161905 163815 133580 130323 136912 144181 88832 77326 130001 168772 193230
6684 193230 208839 176149 257484 254961 266943 229800 125076 84681 198458 217692 187724
6673 187724 209175 202318 176450 176027 209437 185123 187883 246433 222136 204425 232381 279025
6661 279025 244651 147709 162634 215181 153701 177888 161710 202875 216081 196557 201556 203851
6649 203851 166974 208135 218989 245076 230332 259722 205659 195850 239263 225260 216979 191498
6637 191498 174890 205019 254251 197136 303844 276143 169764 189077 275024 263775 191155
6626 191155 214622 216105 167670 160414 144147 127991 165687 185292 97801 169431 145597 195619
6614 195619 194970 175386 181896 132001 142382 216915 183099 185068 175131 271228 324549 240702 264312
6601 264312 247479 163032 174066 231631 300245 279333 334099 354410 253641 281979 254912
6590 254912 207322 199623 268965 208904 216932 220176 269587 336201 365960 303545 264070 306929
6578 306929 323350 303176 276860 220384 253107 245599 234720 214354 187754 210066 143207 233065
6566 233065 309512 261242 232340 345492 309010 248552 259328 235968 245013 269961 302796 334457
6554 334457 320517 241732 276265 205158 245588 174137 133669 211436 163657 218322 146004 178891
6542 178891 325933 346237 370723 437793 420542 278609 178490 234975 267085 210178 177976
6531 177976 266743 281079 221395 224700 247839 232129 294055 285639 206021 176494 236261 322006
6519 322006 275562 233552 291019 231574 276387 256238 231688 281748 247856 219450 169084 205552
6507 205552 226511 294156 237685 194644 198436 208845 182056 227168 313429 253473 208438 175528
6495 175528 267914 278798 250447 257263 283087 320926 344275 304500 163480 161712 226193 312820
6483 312820 326783 316314 302464 368866 380274 329201 298873 352577 320962 334986 346729 387811
6471 387811 374026 309275 308350 209441 196623 220453 308886 247466 217700 172785 186229 215383
6459 215383 225320 278685 266204 297371 282337 309825 341401 315992 258916 252620 288972 308912
6447 308912 241241 216677 303682 267380 315443 316530 315340 366891 305048 313107 303378 273413
6435 273413 232347 251832 277060 281956 273169 276538 239021 434431 499545 420685 274329 143680
6423 143680 331871 366044 356020 288085 333683 390506 376762 412174 292508 302612 336347
6412 336347 333448 332642 336470 322429 325067 347260 234063 214156 353497 392873 385043 462649
6400 462649 493898 480626 393328 417312 367399 363584 428685 475569 441780 354061 373052 353139
6388 353139 312680 396756 376836 365890 373306 456970 396465 299050 292538 273567 354176 386027
6376 386027 450202 412550 383307 236671 307604 362327 375349 370296 329540 249918 306154 390388
6364 390388 300400 260220 308172 352785 347009 467263 434650 381393 461653 361822 359628 324440
6352 324440 211484 261768 321172 418666 460913 425744 397397 409693 376710 397455 377391
6341 377391 358375 279145 343779 345184 426803 362902 227847 312105 330558 311562 263366 330478
6329 330478 406405 301292 315522 377599 452376 501805 471681 496245 418558 349145 408425
6318 408425 490305 429238 293119 382577 443976 440308 392711 394632 396615 382396 443389 450607
6306 450607 392633 379053 472189 497928 373027 330426 442969 486460 404735 354850 412036
6295 412036 436712 370004 355019 345506 394046 392294 387019 342030 286239 349679 397114 468369
6283 468369 457589 437124 500902 521161 380573 368235 319732 386287 317221 392970 504343
6272 504343 522884 504678 397920 436970 542230 537552 482398 436942 399855 475631 555621
6261 555621 434516 439740 381547 338765 435592 398129 390290 447049 465471 535914 484112 470019
6249 470019 447326 424851 476584 499047 412821 459901 490808 506003 510815 482260 501730 462577
6237 462577 523827 429043 456687 524577 510275 572093 582945 484819 478291 498631 564330 542743
6225 542743 519566 512987 557027 593124 625538 644572 542676 483379 502679 516239 507312 559550
6213 559550 564564 471134 487755 459584 443777 430623 344458 438830 424660 390332 441459 369535
6201 369535 436274 548015 511479 581480 542330 420243 433939 443715 491064 547468 533620
6190 533620 553104 544663 562080 542281 493949 578859 624992 648017 665329 617010 551997 568964
6178 568964 402566 440076 516160 619191 611016 544347 485752 459347 498676 450020 512521
6167 512521 612960 581617 593658 627201 559139 558567 494243 595453 619850 620603 575888 611651
6155 611651 686833 709629 739617 612136 603998 564721 545939 526073 493107 508857 531046 507950
6143 507950 539573 570113 531426 502429 462403 512783 578955 559297 590678 591592 596776 614024
6131 614024 549150 623577 642549 545846 605189 612055 573440 587394 558925 535133 706499 777602
6119 777602 725527 659368 551280 531318 523912 525808 608353 655653 641538 606177 668322 738429
6107 738429 728329 730562 686398 609402 563146 561236 568945 618272 635341 703529 714558 680125
6095 680125 646098 675505 653907 706146 735145 733414 676103 653837 667361 751903 716941 539714
6083 539714 557357 629841 650069 697475 842861 722251 604479 708040 738035 705123 601365
6072 601365 630296 654197 727016 772120 771956 681611 780923 851664 770624 707632 665540 701927
6060 701927 652349 653948 728236 817514 804367 872209 776397 736313 698138 752848 711291 743339
6048 743339 775185 718740 738665 723121 818213 741446 831824 862367 808765 815124 789284 856674
6036 856674 746261 732110 715056 725879 783652 778958 866733 908671 844270 784247 844215 816033
6024 816033 759861 742871 831515 936692 959791 872724 856944 818801 831055 871201 850893
6013 850893 798034 871584 833512 842129 813042 756002 876716 861567 894637 871342 955333 866804
6001 866804 894998 966817 861293 791049 760459 925282 950206 920227 856502 919829 902131
5990 902131 902922 900947 816288 877386 866176 904924 953556 884430 908923 946049 963325 906480
5978 906480 954207 1057535 911947 900586 969672 1016950 1042136 964682 955504 1049898 954110
5967 954110 918459 994129 1076455 1135789 1105217 1079002 1037935 1025169 972061 983197 1038643 984593
5955 984593 1003035 968817 1042523 1093871 1086565 1023647 1021043 1094676 1052182 1003315 1027352 1012893
5943 1012893 952862 998427 920576 974614 1078288 1168422 1122500 995767 1028013 960360 1008937
5932 1008937 1037200 1020062 1119909 1101131 1039083 1126015 1147073 1230086 1152050 1114557 1221462
5921 1221462 1155354 1211435 1195950 1182561 1170225 1151767 1172908 1219549 1294693 1222237 1169473
5910 1169473 1137808 1172458 1170334 1142985 1164280 1228213 1172898 1134347 1163669 1174291 1207358 1199252
5898 1199252 1272953 1359653 1267420 1216915 1215920 1259908 1274761 1337422 1292751 1253508 1238566 1279404
5886 1279404 1305876 1296144 1335946 1386658 1339396 1325590 1354763 1255733 1231596 1243555 1361123
5875 1361123 1344843 1251210 1342078 1332135 1348178 1391461 1444314 1414422 1352368 1306042 1266409 1335609
5863 1335609 1359637 1429883 1424123 1402989 1385961 1423395 1396293 1487833 1483328 1475297 1475973 1459932
5851 1459932 1412954 1443258 1466632 1464428 1441010 1518604 1586868 1546273 1544070 1596985 1552970 1596204
5839 1596204 1579932 1567501 1619209 1576758 1605662 1568369 1477322 1486057 1540272 1522480 1560334 1477632
5827 1477632 1412584 1503002 1553375 1511490 1480594 1593441 1606586 1671790 1569639 1543636 1567014
5816 1567014 1577528 1634750 1690324 1703335 1712813 1700874 1782598 1798179 1692435 1682561 1858608
5805 1858608 1813562 1650425 1592281 1572966 1642810 1660682 1707449 1605637 1645731 1721523 1835351
5794 1835351 1881278 1795300 1699176 1645703 1672769 1744416 1776382 1816593 1821905 1792645 1788726 1857738
5782 1857738 1874842 1838921 1862422 1879091 1868262 1852458 1837638 1909107 1883708 1884704 1942397 1948676
5770 1948676 1928538 1849723 1857286 1935105 1892365 1886952 1969261 2055563 2082561 1932469 1871293 1945087
5758 1945087 1969488 2035089 2026952 1998621 2118593 2246671 2207001 2079750 2016970 2005942 2050862
5747 2050862 2086297 1998474 2078370 2094858 2160338 2157209 2163682 2122491 2156795 2161561 2156790 2171374
5735 2171374 2119012 2177305 2253531 2201624 2196410 2185929 2097072 2261712 2355959 2309673 2228768
5724 2228768 2138602 2111991 2148824 2276824 2303193 2269779 2320575 2383926 2326861 2331478 2346749
5713 2346749 2385206 2324409 2307139 2308130 2314494 2310583 2336129 2410630 2391964 2376378 2438504 2512412
5701 2512412 2510533 2575674 2476896 2463417 2494703 2487428 2515716 2534245 2478459 2456558 2484082 2441881
5689 2441881 2484058 2503076 2473036 2489417 2594180 2772261 2811729 2791093 2768303 2735868 2714256
5678 2714256 2605615 2544644 2590747 2706565 2729319 2775413 2843823 2844102 2855769 2856492 2935456 2905929
5666 2905929 2814571 2767501 2952763 2926022 2930345 3017090 2968631 2916537 2944210 2909346 2954631
5655 2954631 2994608 3024813 2989511 3025641 3054195 3094353 3216267 3224634 3282082 3232291 3206857
5644 3206857 3252173 3222968 3274503 3246183 3301244 3322589 3213658 3120661 3232536 3323550 3345234
5633 3345234 3332780 3334327 3325284 3288994 3349244 3355011 3356595 3367274 3411759 3430831 3494579 3506995
5621 3506995 3528521 3555621 3539183 3599258 3608517 3649161 3706642 3719459 3647292 3710360 3689710 3784527
5609 3784527 3793100 3762622 3711861 3737904 3813887 3755868 3771619 3798556 3914500 3910904 3875973 3910205
5597 3910205 3947200 3900457 3887688 3869654 4018521 4015037 3978934 3956046 4000527 4089190 4159601
5586 4159601 4226530 4124813 4159143 4201902 4204207 4232886 4146190 4138845 4069528 4127990 4157956 4155757
5574 4155757 4244596 4258424 4157362 4121359 4167493 4253329 4186811 4259829 4279103 4392316 4344594
5563 4344594 4263432 4336615 4362840 4393076 4422254 4408856 4548241 4596723 4472934 4427302 4514413
5552 4514413 4573310 4516367 4589240 4584592 4576380 4534904 4569637 4633305 4675701 4596423 4479138 4548711
5540 4548711 4564041 4537194 4512931 4530895 4533486 4568366 4626924 4729572 4707202 4751841 4792968
5529 4792968 4774116 4773480 4870149 4915582 4865860 4834098 4780133 4828384 4804167 4843307 4849176 4925230
5517 4925230 4914178 4940429 4917471 4939641 5011566 5016361 5048040 4954409 4845986 4891580 4827037
5506 4827037 4890953 4986183 5003358 5000711 5005919 5011674 5026333 5026164 5038831 5011515 4991082 5116117
5494 5116117 5139502 5129173 5163199 5106150 5116234 5180502 5195455 5190743 5089419 5121140 5140746
5483 5140746 5065597 5146910 5166177 5167842 5157726 5186251 5218900 5175595 5248232 5244123 5192966 5270391
5471 5270391 5356097 5320204 5301261 5347440 5273846 5327288 5346239 5296576 5309899 5346801 5390583
5460 5390583 5350114 5307068 5401781 5398555 5305553 5418253 5426575 5397074 5394126 5381437 5403478 5323528
5448 5323528 5336139 5366082 5415289 5372637 5416049 5517568 5491150 5468259 5400800 5446098 5450178
5437 5450178 5444706 5500061 5424805 5434416 5420966 5392218 5339707 5383113 5446646 5410486 5322173 5393089
5425 5393089 5507401 5519959 5589696 5505452 5549463 5593208 5523224 5503752 5598768 5590529 5531973
5414 5531973 5559148 5515413 5509362 5447701 5524414 5451791 5468604 5525219 5463594 5528039 5485476 5443160
5402 5443160 5397696 5464431 5486360 5481442 5547154 5539371 5523015 5605117 5540731 5506663 5605391 5610221
5390 5610221 5503053 5436514 5415692 5523304 5475618 5516033 5551521 5565291 5463968 5528794 5414467
5379 5414467 5448610 5570398 5529094 5549857 5568912 5616860 5597289 5522258 5463321 5498769 5475342
5368 5475342 5498071 5616800 5718503 5645295 5626160 5569292 5609587 5595873 5588041 5581973 5612522
5357 5612522 5581331 5545754 5622052 5658279 5670723 5672736 5559743 5480917 5590685 5570979 5567360
5346 5567360 5623201 5613728 5649586 5703062 5747827 5727330 5675626 5712888 5787888 5847832 5820012 5775449
5334 5775449 5801155 5918829 5876203 5921949 6052858 6064296 6088467 6055040 6095719 6060128 6133683
5323 6133683 6178739 6159141 6144027 6167942 6128973 6202349 6253906 6215494 6338207 6448585 6424474
5312 6424474 6397780 6376848 6341703 6377755 6514040 6591851 6652973 6762971 6831010 6882107 7017259
5301 7017259 7029190 6974324 7118129 7235463 7349699 7453363 7498879 7597066 7738693 7902771
5291 7902771 8034608 8311976 8532618 8707453 9014849 9252383 9564210 9912059 10158479 10477986
5281 10477986 10958270 11293960 11722438 12002786 12200272 12243705 12208967 12153742 11912337 11829944
5271 11829944 11732208 11792592 11886785 11972753 12205471 12260834 12396720 12625538 12834756 13293913
5261 13293913 13729124 14133439 14739896 15509029 16320995 17224237 18226087 19482170 20813611
5252 20813611 22286749 23764373 25021642 25851088 26080093 25774336 25016021 23819675 22685728
5243 22685728 21690730 20795534 20054522 19398850 19043310 18760977 18648756 18562972 18651964 18769817
5233 18769817 19088498 19496152 20061505 20866645 21817174 22922347 24272543 25897238 27740052
5224 27740052 29761231 31786591 33549561 34798233 35358569 35041140 33883170 32105010
5216 32105010 29956487 27807863 25908047 24216819 22755766 21615640 20701773 19890356
5208 19890356 19249047 18754797 18346282 18220938 18109101 18107795 18329662 18670317 19059493 19674058
5198 19674058 20496866 21367761 22270774 23328484 24552000 25564617 26167396 26000351 25333455
5189 25333455 24112061 22555576 20846124 19190095 17768434 16516152 15407696 14481924
5181 14481924 13657010 12961600 12365588 11895544 11446380 11068521 10788080 10556294 10409384
5172 10409384 10366251 10299827 10273430 10314007 10501788 10685423 10727387 10788201 10903529 10992814 10845806
5161 10845806 10489083 9948655 9407001 8927085 8321746 7759884 7331268 7055402 6836704
5152 6836704 6548714 6351635 6134563 5903015 5701814 5595954 5500801 5377864 5218562 5036493
5142 5036493 4837248 4745725 4658708 4624809 4589817 4520576 4498343 4487051 4382741 4344972 4343927
5131 4343927 4231372 4194792 4090370 4028287 4029143 3935543 3841281 3840593 3807083 3815194 3688641 3653122
5119 3653122 3694528 3622435 3531504 3502525 3549663 3538238 3571351 3576478 3505525 3459850 3371974 3386662
5107 3386662 3521816 3521908 3529087 3413153 3413230 3452673 3352721 3237193 3047969 3025966 3092320 3091302
5095 3091302 2989956 2956059 3061039 2948610 2888891 2912599 2917225 2877804 2829499 2861817 2939119
5084 2939119 2958384 2795501 2769656 2860142 2840876 2905048 2912801 2901124 2953279 2941885 2919724
5073 2919724 3000053 2863076 2808354 2755419 2706247 2725440 2781145 2866820 2796078 2792775 2758746
5062 2758746 2742344 2763237 2669446 2662931 2704508 2687922 2655093 2685091 2678638 2609099 2604788 2575054
5050 2575054 2622887 2610829 2622016 2601774 2529724 2557847 2581436 2505311 2558701 2565439 2606922 2587687
5038 2587687 2600434 2723416 2721069 2688821 2635015 2616442 2638266 2566201 2614752 2554308 2511081
5027 2511081 2481853 2396637 2435389 2488822 2458183 2494457 2507440 2524192 2465643 2408254 2421051
5016 2421051 2421372 2409195 2500488 2502466 2410003 2440917 2393287 2475887 2545039 2484495 2451215 2486799
5004 2486799 2445078 2360525 2337698 2320392 2380176 2449534 2469355 2436736 2375912 2365279 2314623
4993 2314623 2311258 2343851 2325840 2293921 2338285 2327290 2336657 2322983 2307946 2390729 2418394 2425621
4981 2425621 2451976 2362136 2390612 2326283 2320917 2423790 2412676 2408058 2450924 2461307 2459813 2443568
4969 2443568 2350430 2298454 2361599 2423591 2383202 2347998 2371273 2344074 2434642 2467411 2451912
4958 2451912 2399432 2384168 2412974 2362514 2311998 2343297 2445477 2488404 2445998 2380871 2436332
4947 2436332 2417891 2415510 2449436 2450184 2427763 2402781 2326735 2292893 2241738 2263865 2247003 2242224
4935 2242224 2352259 2355965 2342667 2408495 2389397 2380822 2401548 2389713 2371770 2404613 2444099 2420136
4923 2420136 2336637 2387785 2402102 2309764 2347973 2381506 2477274 2500551 2490979 2488763 2447863 2538519
4911 2538519 2604907 2598216 2612652 2609227 2676287 2626341 2574949 2661826 2621379 2483572 2544201 2646864
4899 2646864 2593242 2611174 2706321 2648424 2576672 2512234 2590735 2653576 2744713 2807521 2801980 2842956
4887 2842956 2836028 2965494 3084702 3094496 3068977 3138587 3313418 3453229 3596950 3617203 3591548
4876 3591548 3626969 3549062 3322136 3194600 3185297 3155356 3155615 3085860 3048318 3132973 3062724 3079352
4864 3079352 3183055 3161784 3179036 3199889 3286909 3389334 3415718 3432962 3568462 3705739 3817737
4853 3817737 3936643 4182248 4417143 4788480 5115056 5285820 5199920 5000091 4717260 4388596
4843 4388596 4055128 3912923 3759345 3643280 3592977 3460356 3405706 3424584 3446577 3522748
4833 3522748 3485287 3512218 3510474 3418227 3451322 3613933 3803062 3869840 4051281 4287614 4539094
4822 4539094 4788215 5127238 5529485 5951982 6197587 6073428 5571173 5051678 4576626 4245339
4812 4245339 3993822 3893406 3739821 3568428 3408061 3368785 3318460 3281167 3255100 3294126
4802 3294126 3309952 3274559 3314869 3385926 3437179 3473075 3506251 3650455 3721774 3960165 4233972
4791 4233972 4504422 4834666 5122677 5195140 4787221 4341997 3960709 3678709 3432316 3323035
4781 3323035 3219016 3090404 3098598 2986717 2850098 2925450 2816276 2758559 2706609 2671845 2688043
4770 2688043 2703492 2747461 2809370 2753871 2702237 2821993 2969020 3052618 3149146 3308539 3439231
4759 3439231 3464429 3389009 3278606 3184541 3062716 2830140 2638565 2588966 2665116 2685176 2629809
4748 2629809 2596988 2545574 2608800 2549739 2495690 2404343 2402126 2473384 2491425 2411260 2452082 2507340
4736 2507340 2460851 2469671 2561772 2543360 2416861 2496123 2525731 2480014 2345337 2372223 2366375
4725 2366375 2418517 2353005 2300656 2362992 2305820 2305829 2328157 2309333 2375614 2271744 2286626 2322652
4713 2322652 2256660 2179505 2142464 2099176 2144522 2152418 2208709 2186601 2193856 2271049 2244922 2274537
4701 2274537 2227987 2340952 2278698 2300945 2298837 2273241 2218544 2204874 2297741 2321267 2293399
4690 2293399 2366877 2437579 2418162 2466720 2476851 2497531 2397435 2400441 2446626 2418633 2490641
4679 2490641 2428290 2454451 2528127 2509874 2456332 2549357 2593667 2630847 2655932 2564026 2465442
4668 2465442 2471300 2545868 2569263 2649289 2697478 2563343 2614780 2684139 2699804 2798442 2884692
4657 2884692 2952744 2931022 2940502 2970799 2927151 2911180 3028626 3081553 3049744 2970415 2990417
4646 2990417 2963265 2986617 2991188 3039349 3120232 3181495 3235847 3268754 3315277 3348556 3340815 3434901
4634 3434901 3526361 3614318 3669366 3753624 3781302 3755938 3744647 3725100 3778100 3773273 3739961 3798015
4622 3798015 3749762 3767841 3848876 3963398 4004291 3996813 3995906 4034942 4116254 4159009 4238118 4231531
4610 4231531 4290925 4352990 4474153 4463013 4453800 4507692 4650769 4677055 4641661 4504695 4424797
4599 4424797 4438821 4409330 4329844 4311718 4290967 4299692 4343871 4420077 4380286 4291790 4214742 4199330
4587 4199330 4288906 4302203 4250603 4285284 4270633 4097735 4146983 4179567 4320293 4280941 4195707
4576 4195707 4231263 4186677 4295143 4263528 4232083 4159819 4111588 4159114 4190733 4184280 4157883
4565 4157883 4170487 4190490 4300978 4324960 4254188 4334465 4341542 4297758 4310010 4535921 4728564
4554 4728564 4836002 4947967 4992687 5168818 5154841 5028018 4917037 4751311 4694314 4722610
4544 4722610 4764937 4700045 4640344 4752780 4824657 4884333 4861267 4940041 5067510 5104371 5170314
4533 5170314 5225272 5151036 5212407 5115788 4999778 4930288 4861830 4724557 4767511 4729279 4700721
4522 4700721 4799387 4799981 4771393 4788703 4838703 4867740 4973216 5081186 5116314 5308763 5520751
4511 5520751 5634680 5863697 6004381 6174736 6378859 6360281 6348611 6266242 6241678 6390972
4501 6390972 6574420 6754512 6939392 7194874 7341873 7494728 7463954 7331125 7258490 7101980
4491 7101980 6983764 7048090 6973509 6992286 6913224 7070458 7333072 7391285 7552805 7790555
4481 7790555 7904942 7937454 7944075 7827770 7720579 7558803 7398816 7227970 7144434 7058205
4471 7058205 6952261 6895924 6888286 6820753 6746888 6831899 6851600 6872188 6854722 6909132 6927556
4460 6927556 7015751 7057000 7023799 7132892 7083704 7052515 7098224 7163519 7235243 7235612 7256606 7288161
4448 7288161 7460484 7547447 7582063 7548996 7514347 7551596 7503595 7513789 7520931 7407479 7353266
4437 7353266 7399753 7349714 7288167 7278685 7386414 7448947 7480420 7536784 7667312 7839643 7906885
4426 7906885 8086260 8234103 8366538 8578479 8871197 9056894 9129654 9301714 9474186 9451881
4416 9451881 9290655 9180027 9134486 8974593 8923115 9023354 9001686 9044844 9056076 9062013 9095318
4405 9095318 9166979 9217810 9330313 9351466 9248789 9150427 9040708 9060182 9020214 9120966 9116978
4394 9116978 8958516 8918913 8854296 8778349 8656204 8497643 8453338 8403292 8372097 8393823 8399923
4383 8399923 8465769 8499086 8524310 8559691 8731288 8813485 8817072 8789366 8729636 8560947 8440130
4372 8440130 8329582 8284569 8225633 8228322 8216439 8175140 8102574 8115519 8289611 8391156 8462098
4361 8462098 8441523 8477489 8556731 8527770 8562955 8759042 8770574 8848625 9040647 9178099 9261685
4350 9261685 9380039 9428954 9394324 9439766 9511679 9506085 9491952 9519370 9451120 9365324 9312879
4339 9312879 9318687 9354196 9324039 9391577 9565070 9667298 9785330 9937031 10110960 10322657
4329 10322657 10419114 10531138 10617273 10815622 10914988 11013564 11085659 11193206 11316217 11375575
4319 11375575 11552291 11685711 11929171 11980474 12150735 12362893 12671775 12914806 13191643 13531192
4309 13531192 13877480 14241910 14596341 14941431 15300163 15664381 16169116 16694739 17276740
4300 17276740 17963915 18530969 19181548 20176223 21240307 22528813 23911298 25402283 27202835
4291 27202835 29408452 31866707 34425954 37089731 39445973 41056279 41749335 41505838
4283 41505838 40561239 39634730 38922705 38718850 38644877 38623215 38324059 37786633 36812591 35813710
4273 35813710 34851449 34114417 33643981 33577917 33660147 34022847 34625834 35563503 36892833 38552373
4263 38552373 40666030 43182638 46212191 49664516 53565412 57747369 61911103 65270439
4255 65270439 67087901 67294072 66699627 66006232 65831234 66257693 67199618 68346467 69009094
4246 69009094 68438109 66014142 61926814 57130211 52405529 48299828 44905645 42203305
4238 42203305 40091914 38299736 36953561 36011498 35398285 35043831 35048636 35467750 36193947
4229 36193947 37334144 38535335 39923954 41292179 42171484 42551942 42630297 42624753 42957720
4220 42957720 43478143 44306682 45186306 45729991 45236873 43429399 40643202 37204900 33773034
4211 33773034 30601055 27940763 25744375 23760442 22196737 20787680 19643306 18680657
4203 18680657 17692405 16928771 16350598 15837877 15311068 14853382 14277908 13724215 13133863
4194 13133863 12593133 12055864 11606034 11087380 10729068 10419572 10118610 9804885 9606383
4185 9606383 9355445 9089142 8913693 8698838 8538574 8390621 8299321 8265842 8120644 7996939
4175 7996939 7935613 8015142 7895090 7768005 7715364 7449535 7267712 7010587 6841263 6655583
4165 6655583 6471770 6352125 6264297 6125574 6090225 6066299 5955045 5817928 5779414 5692778
4155 5692778 5663476 5607145 5517566 5469187 5441950 5354045 5378283 5292776 5217922 5186325 5251514
4144 5251514 5183189 5131323 5125605 5133891 5248913 5293026 5300395 5337239 5273779 5197918 5128494 5149373
4132 5149373 5116071 5041834 4998482 4936326 4926461 4910325 4829959 4798810 4858774 4819554 4907968 4943865
4120 4943865 5063949 4999741 5017927 5097647 5167558 5333313 5309948 5235305 5458877 5610100 5679968
4109 5679968 5725462 5708262 5813296 5865264 5795258 5666076 5622125 5595221 5707588 5738457 5785777
4098 5785777 5871527 5993582 6099895 6177882 6357631 6540825 6723636 6883438 7012275 7091298
4088 7091298 7218308 7321108 7530803 7729028 7960090 8140251 8220102 8426985 8632767 8831058
4078 8831058 9069555 9111833 8998859 8930621 8775362 8743040 8955055 8950162 8930592 8824688 8791196
4067 8791196 8724237 8776376 8742140 8776290 8663430 8540883 8557765 8586395 8700570 8787578 8718903
4056 8718903 8652899 8830527 8873913 8813420 8886150 9077860 9141448 9092171 9187586 9162413 9085293
4045 9085293 9019179 8984058 9104919 9193562 9246708 9382574 9522719 9727359 9902447 10066027
4035 10066027 10185702 10272443 10529182 10879807 11150646 11212545 11422087 11732281 11984352 12297338
4025 12297338 12569509 12972511 13367167 13678979 14163112 14521943 14923315 15298480 15780044
4016 15780044 16376505 16815149 17413100 18216569 18938200 19922386 20840385 22015279 23307716
4007 23307716 24835808 26512469 28553697 31001309 33672177 36594147 39839220 43144894
3999 43144894 46168072 48275626 49254250 49026223 47927003 46590500 45397894 44655663 44193704
3990 44193704 43875505 43632361 43103045 42371109 41349966 40336028 39487559 38853225 38797047
3981 38797047 38969193 39504744 40382923 41721718 43592760 45923986 48619879 51794320 55351680
3972 55351680 58951942 62198550 64668600 65902130 66066835 65336293 64344444 63446986 62757924
3963 62757924 62456805 62206325 62031539 61814483 61054779 59684042 57535113 54465491 50963252
3954 50963252 47389199 44188562 41514974 39366042 37617148 36234248 35212014 34419745
3946 34419745 34052413 33802885 33935870 34393285 34986258 35754521 36480988 37022273 37464719
3937 37464719 37782994 38181121 38554244 39141182 39946740 40667773 40970243 40367741 38659388
3928 38659388 35946240 32970283 30172319 27727286 25649681 23907316 22417441 21165339
3920 21165339 20167914 19278927 18421271 17647805 17064773 16525892 16074690 15704834 15323495
3911 15323495 14984031 14721963 14617401 14446406 14317347 14147096 14040433 13820671 13667559
3902 13667559 13710647 13677484 13575823 13493134 13406837 13293005 13358598 13460208 13624704 13771408
3892 13771408 14013358 14260419 14626919 15005733 15324745 15405794 15154202 14846750 14680977 14730420
3882 14730420 14967875 15066016 15121261 15098064 15169125 15377525 15690205 16065790 16331006 16510474
3872 16510474 16423570 16257348 16241375 16381137 16582190 16644478 16552897 16483769 16526039 16647219
3862 16647219 16963187 17280653 17432341 17234675 16938409 16810567 16859484 17017491 17035483 16906351
3852 16906351 16693179 16580007 16575328 16792080 16991460 16889212 16697940 16387686 16253910 16227622
3842 16227622 16067540 15995050 15720923 15316123 14968795 14714582 14424134 14223371 14043889 13797387
3832 13797387 13624005 13613070 13417283 13304404 13152084 12900565 12570113 12242822 12095194 11978399
3822 11978399 11988053 11903052 11657176 11512732 11305903 11011032 10746180 10726384 10743888 10658174
3812 10658174 10504450 10236758 10041830 9900897 9924779 9874898 9790100 9840897 9842242 9866446 9918765
3801 9918765 10009446 10029774 9938163 10033831 10094358 10057339 10054708 9831821 9654714 9526670 9503746
3790 9503746 9324387 9108434 8912566 8780091 8678489 8701643 8639913 8635841 8715635 8819606
3780 8819606 8890128 8986856 9116209 9153422 9226562 9342916 9498153 9639201 9747174 9744330 9746561
3769 9746561 9700771 9538745 9262588 9042742 8784883 8539049 8354689 8335329 8314248 8265036
3759 8265036 8279106 8283659 8283324 8349422 8373694 8451194 8528501 8798813 9018023 9122819 9160798
3748 9160798 9138604 9027643 8893904 8756205 8702503 8757526 8832413 8830513 8925820 9043746 9198062
3737 9198062 9362358 9559634 9795268 9941505 10204172 10473475 10945087 11499485 12116084 12809271
3727 12809271 13326537 13668250 13933186 13877993 13546496 13183668 12839013 12550764 12259564 12128602
3717 12128602 12011704 11958393 12002709 12070873 12152022 12336819 12699095 13273606 13836131 14421331
3707 14421331 15022737 15631360 16000230 16290976 16501829 16709912 16922867 16997320 16911088 16551735
3697 16551735 16096489 15594205 14996918 14482997 14124231 13881803 13704663 13558300 13718111
3688 13718111 13898998 14046808 14373064 14819486 15480954 16288763 17139525 18148561 19205672
3679 19205672 19964129 20396287 20440099 20103518 19525621 18764579 17963064 17151367 16518937 16007727
3669 16007727 15679283 15429937 15227624 15150278 15237072 15274232 15350594 15654132 15981991 16374449
3659 16374449 16907941 17453441 18272617 19104155 20143999 21367519 22607186 23701614 24492509
3650 24492509 24972109 24899845 24817536 24554097 23870527 22902086 21798764 20864581 20160149 19850035
3640 19850035 19807109 19797360 20057443 20400517 20985062 21785054 22575696 23582822 24428087 25128904
3630 25128904 25909869 26735456 27438923 27834157 27796881 27339732 26951448 26811754 26484160 26039253
3620 26039253 25555352 24937363 24516388 24006378 23515005 23025390 22366167 21825158 21526235
3611 21526235 21594926 21749626 22017273 22197824 22029820 21753457 21389148 20986721 20465041 19629792
3601 19629792 18604748 17597183 16815145 16290812 16049451 15802003 15728687 15784999 15974909
3592 15974909 16021604 15984335 15730734 15484255 15033383 14421490 13768891 13074149 12566889 12113577
3582 12113577 11797299 11468579 11219649 10963589 10739124 10481908 10116141 9800193 9573386
3573 9573386 9343353 9127894 8896487 8648035 8478704 8466472 8345763 8214710 8110410 8075157
3563 8075157 8108319 8112042 8068777 8149599 8193960 8139234 8183608 8252825 8293007 8348875 8573463
3552 8573463 8760873 8972235 9124093 9225594 9493997 9479594 9529991 9486359 9272316 9028574
3542 9028574 8632607 8269813 7941691 7817926 7613153 7385604 7278340 7240694 7185806 7182350
3532 7182350 7172448 7187692 7116615 7091459 7148797 7181097 7236272 7399287 7640541 7673613 7870186
3521 7870186 7969956 8066845 8131378 8149635 7903525 7594850 7383856 7257858 7092661 6966889
3511 6966889 6965615 6919217 6895749 6942478 6966320 6861702 6782951 6766804 6665139 6639177 6549574
3500 6549574 6574713 6581718 6648748 6716632 6744406 6858133 6950896 7073889 7154366 7181598 7390282
3489 7390282 7576693 7761845 7885243 8075168 8251436 8500342 8652678 8582425 8536981 8515038
3479 8515038 8449648 8361369 8429741 8558264 8608274 8653138 8600065 8436997 8443221 8340574 8266810
3468 8266810 8226302 8276376 8212560 8320679 8433090 8523773 8623576 8588899 8684763 8871516 8958152
3457 8958152 9182685 9307711 9409140 9403222 9445356 9590391 9734467 9824533 9889990 9876958 10064855
3446 10064855 10269393 10523998 10934898 11298627 11843820 12555490 13317224 14265224 14884634
3437 14884634 15053243 14898200 14638333 14687362 15043024 15672690 16351906 16873468 16961730 16866010
3427 16866010 16822788 17000801 17241385 17220322 16965345 16648723 16571638 16821496 17378034 18019892
3417 18019892 18456026 18512097 18290366 17954868 17261848 16625541 16155728 15770882 15555037 15624881
3407 15624881 15955993 16078569 15970892 15557202 15252473 15078862 14851545 14480889 13954093
3398 13954093 13328549 12804006 12533909 12464405 12515182 12490749 12071413 11329384 10557293 9866728
3388 9866728 9417748 9047725 8754594 8454219 8244768 7977683 7853387 7675264 7270139 7023197
3378 7023197 6884890 6666450 6431169 6269016 6183784 5934968 5747953 5618300 5517392 5436036
3368 5436036 5266066 5127093 5064232 4975636 4862306 4825405 4715387 4718677 4574365 4399467
3358 4399467 4270986 4146983 4031215 4010572 3952351 3887605 3863763 3727560 3689298 3736600 3729344
3347 3729344 3745924 3715629 3595515 3553337 3439643 3403155 3443005 3437601 3405071 3402062 3333439
3336 3333439 3393923 3348659 3266153 3207098 3192839 3239537 3205971 3198835 3169383 3163612 3213856 3242426
3324 3242426 3242028 3137755 3047696 3056433 3036413 2928631 2883830 2874387 2915390 2964606 3008612 2956284
3312 2956284 2845750 2774499 2712882 2674493 2715432 2781695 2801153 2801530 2707788 2596640 2708634
3301 2708634 2727816 2617998 2575355 2631063 2691870 2845064 2875623 2791515 2755336 2715807 2719007
3290 2719007 2787955 2954911 2897096 2819523 2854330 2996413 3012142 2885329 2773393 2784796 2823518
3279 2823518 2904153 2977300 3015911 3039940 3018365 2946744 2842804 2873953 2877615 2903310 3022452
3268 3022452 3047336 2990280 2973740 3039345 3137451 3227883 3206392 3110412 3146431 3134053 3121246
3257 3121246 3183200 3189829 3123600 3123443 3175594 3152052 3164239 3140302 3101279 3158609 3212895 3156037
3245 3156037 3191017 3217141 3162186 3120961 3128605 3112435 3068355 2981675 3000894 2966144 2867027 2939075
3233 2939075 3000570 3012193 2981121 2935754 2879510 2889430 2837089 2834544 2789808 2703304 2708250 2754774
3221 2754774 2754471 2688917 2674084 2650328 2593450 2490379 2460345 2487794 2498336 2475928 2480339 2497399
3209 2497399 2522078 2491808 2455295 2396278 2483356 2403929 2506165 2574557 2494476 2325505 2315340
3198 2315340 2374901 2419152 2348819 2229462 2157833 2242026 2253281 2257243 2202935 2218243 2288317
3187 2288317 2239930 2278365 2246429 2257995 2273461 2238933 2255748 2256523 2214939 2277377 2231891 2200496
3175 2200496 2225356 2352430 2431591 2366843 2335181 2420876 2330809 2238082 2250057 2273213 2256214
3164 2256214 2348221 2342558 2333706 2343572 2417069 2372902 2339283 2332633 2427362 2462039 2504047 2482775
3152 2482775 2485608 2497595 2550705 2529373 2569519 2607916 2583330 2602388 2681732 2643537 2650034 2772927
3140 2772927 2712267 2727401 2767057 2738335 2783243 2926617 2887917 2857321 2831480 2927513 3059978
3129 3059978 3073280 3050297 3031117 3084239 3055393 3121744 3156972 3130547 3119499 3104803 3075346
3118 3075346 3126832 3184450 3177631 3201351 3234625 3340263 3334111 3360245 3434689 3371823 3280294 3354112
3106 3354112 3354350 3399261 3446921 3423478 3378841 3505917 3511936 3573856 3593834 3611469 3712689 3805147
3094 3805147 3862729 3829965 3813534 3911104 3960420 3922839 3956008 3994137 4058489 4009934 4089248
3083 4089248 4118177 4196491 4208512 4251791 4359777 4439234 4499924 4486437 4584426 4652539 4727997
3072 4727997 4900877 5008612 5016019 5008597 5066977 5070289 5102424 5221684 5326698 5418400 5447986
3061 5447986 5480390 5497518 5608269 5723319 5773851 5923669 5981072 6028656 6259963 6358684 6456749
3050 6456749 6514245 6630161 6919085 7018232 7126621 7304356 7368059 7506722 7731873 7931202
3040 7931202 8093682 8250880 8484432 8709793 8932699 9093788 9266119 9396585 9715921 9929049
3030 9929049 10031147 10296496 10538828 10833868 11114199 11388754 11676871 11872847 12161440 12605190
3020 12605190 12985371 13378807 13692365 14106431 14578418 14964440 15484301 16093235 16585586
3011 16585586 17158009 17754355 18322356 19013441 19785615 20441663 21124436 21841902 22614826
3002 22614826 23414354 24318890 25255036 26153902 27147222 28182760 29284188 30409717 31751936
2993 31751936 33085789 34390071 35774781 37299555 38882552 40442172 42053751 43747987
2985 43747987 45640366 47445263 49448920 51575382 53754972 56068689 58398828 60878923
2977 60878923 63398195 66025586 68684488 71279436 74091763 76863377 79717346 82511386
2969 82511386 85371412 88421930 91398573 94530367 97557725 100602022 103609944 106542442
2961 106542442 109615238 112531717 115274518 117859634 120393409 122774110 125003318 127183001
2953 127183001 129114284 130957840 132642017 134161827 135584666 136729516 137750505 138610935
2945 138610935 139208232 139763252 140010536 139834500 139383632 138757312 137830083 136677223 135322950
2936 135322950 133801991 132354238 130543732 128532106 126485306 124150853 121783164 119303892
2928 119303892 116581070 113715663 110794600 107708389 104613488 101420312 98155400 94819863
2920 94819863 91601283 88435471 85232134 82137083 79011678 75983845 72961574 70060254
2912 70060254 67197543 64291411 61577294 58976386 56346695 53758423 51204976 48856266
2904 48856266 46579475 44502454 42474200 40556665 38745593 37040232 35480971 33990688
2896 33990688 32517354 31071365 29938074 28642783 27511479 26431738 25361630 24343730
2888 24343730 23493291 22583852 21700140 21074408 20508400 19791197 19207106 18628562 18045420
2879 18045420 17539403 16995488 16557059 16037984 15592458 15201998 14775342 14370331 14010516
2870 14010516 13725549 13388598 13090597 12840362 12546444 12275018 12031349 11626673 11376435
2861 11376435 11083272 10828724 10711084 10496346 10268695 10059806 9872386 9685323 9522417
2852 9522417 9418001 9189925 9059662 8931386 8709958 8585813 8525420 8429709 8197183 7966226
2842 7966226 7882061 7887163 7778622 7666798 7608164 7465479 7362966 7420154 7284711 7213375 7150499
2831 7150499 7026624 6971940 6920270 6884870 6835236 6764505 6757561 6655972 6614323 6498819 6507813
2820 6507813 6493033 6527639 6432595 6349545 6247154 6309921 6255114 6213770 6231507 6151840 6087853
2809 6087853 6115552 6030569 5927902 5871552 5905664 5838147 5754929 5782984 5612265 5632869 5617668
2798 5617668 5623301 5633444 5583667 5541584 5607244 5501910 5414969 5406557 5420466 5357776 5259536 5238153
2786 5238153 5197070 5162221 5154797 5126106 5115028 5090226 4999497 4935708 4965548 4992994 4881177
2775 4881177 4828786 4841189 4806682 4760996 4795077 4722705 4753890 4683104 4736265 4721684 4633132
2764 4633132 4687149 4677711 4580255 4515650 4515110 4551851 4528458 4526902 4672361 4639147 4562916 4598285
2752 4598285 4737026 4696265 4641831 4609231 4688644 4748817 4852773 4878722 4989232 5037383 5186278
2741 5186278 5152288 5132988 5284823 5335537 5469530 5481467 5435099 5591166 5663948 5717028 5961578
2730 5961578 6049030 6139882 6301487 6434193 6537048 6650489 6739093 6874447 6950406 6984131
2720 6984131 6993787 7010576 7095633 7282792 7324255 7354236 7323538 7435800 7489693 7489947 7542779 7571415
2708 7571415 7682389 7695955 7726578 7674488 7795709 7852246 7840902 7914106 7971122 7914965 7967859
2697 7967859 8052785 8093898 8111327 8181988 8240692 8354806 8463014 8557615 8721484 8790672 8934413
2686 8934413 9042424 9110383 9229941 9404599 9609598 9567573 9723931 9953688 10228943 10330620
2676 10330620 10440641 10689356 10883506 11023997 11254224 11519466 11761365 11924056 12209888
2667 12209888 12343444 12519320 12852580 13039680 13332187 13602332 13861855 14127558 14423852
2658 14423852 14729287 15119338 15408785 15756564 15963500 16291642 16718913 17046770 17382776
2649 17382776 17763730 18194525 18604845 19066335 19523877 19946702 20569989 21223360 21920856
2640 21920856 22629615 22989186 23109838 23088401 23138449 23189784 23306256 23493012 23622310 23953837
2630 23953837 24265710 24729979 25108195 25587615 25997485 26428252 27070209 27694952 28290054
2621 28290054 29046809 29719202 30452520 31288068 32190408 33237884 34190444 35207465 36409735
2612 36409735 37792695 39228977 40745169 42195680 43596209 44928952 46199292 47535286
2604 47535286 49011018 50742144 52608943 54561698 56652167 58923711 61267929 63689097
2596 63689097 66266803 69138349 72095911 75265419 78580792 81990773 85515980 89170756
2588 89170756 92813524 96419763 99835046 103096602 106073465 108741838 111459418 114032113
2580 114032113 116467211 118464677 120235720 121893470 123176093 124199777 125005578 125592649
2572 125592649 125866114 125905219 125761681 125518258 125091983 124292178 123370549 122423168 121529230
2563 121529230 120554401 119357457 118158176 116953790 115571188 114078886 112456846 111090608
2555 111090608 109951932 109061178 108541745 108314691 108356302 108776744 109717850 110820403 112158171
2546 112158171 114045127 116251441 118705685 121472504 124581428 127883065 131351703 135021616
2538 135021616 138825095 142871204 146982726 151053940 155176200 159312604 163462278 167537595
2530 167537595 171665958 175699882 179790659 183738827 187752312 191743522 195538806 199202785
2522 199202785 202646541 205751155 208552092 210975541 212866012 214474289 215613312 216533422
2514 216533422 217222557 217597289 217925133 218126058 218339814 218683179 218823640 218903952 219086823
2505 219086823 219253625 219439919 219588785 219696298 219876602 220009203 220180169 220445777 220554247
2496 220554247 220691886 220765074 220592604 220413586 219924443 219282631 218672251 217922213 217343280
2487 217343280 216644649 215959681 215218133 214507067 213619115 212618291 211258084 209490171 207475943
2478 207475943 205029074 202362678 199349118 195835917 192142714 188250081 184054243 179852690
2470 179852690 175496028 171084436 166564785 162229569 158086104 154107331 150283322 146582385
2462 146582385 142972792 139318710 135643614 132082483 128588099 125289225 122214272 119359964
2454 119359964 116841995 114652974 112915502 111560388 110656459 110081939 109869423 110132624 110933416
2445 110933416 112132814 113644793 115442546 117906784 120788826 124004736 127806405 132032849
2437 132032849 136709531 141918438 147751735 154275048 161690097 169962514 179439973 189883928
2429 189883928 201467637 214299782 228085647 242718547 257496116 271676868 284850234
2422 284850234 296359094 305660296 312625508 317191931 319581946 320284552 319836505 318833365
2414 318833365 317503389 316336627 315274327 314321136 313192262 311651008 309083389 305184286
2406 305184286 299648134 291884341 281972297 270106501 256472639 241824333 226699978
2399 226699978 211562444 196941754 183080566 170161915 158176648 147273706 137184733
2392 137184733 127973738 119548866 111808289 104875375 98475918 92746991 87560546 82903177
2384 82903177 78710597 74835190 71276356 68066841 65116567 62394676 59928524 57614476
2376 57614476 55399317 53322304 51395834 49590431 48007753 46386465 44877167 43425183
2368 43425183 42018070 40715903 39612741 38470204 37370743 36271857 35305848 34349900
2360 34349900 33425288 32557218 31715539 30899878 30207885 29522410 28715922 28001249 27322697
2351 27322697 26747088 26226867 25556558 24984873 24562620 24025553 23432551 22886042 22497367
2342 22497367 22032419 21699272 21394631 21091568 20750510 20472753 20236614 19956797 19875415 19776215
2332 19776215 19698853 19805133 19779481 19770429 19460562 18962135 18390429 17827879 17398244 16986234
2322 16986234 16765914 16599580 16342183 16046932 15858445 15812506 15798860 15655855 15613816 15545682
2312 15545682 15283902 14854783 14375810 13809051 13305951 12911269 12470661 12097130 11850145
2303 11850145 11575658 11405500 11185306 10947104 10788684 10664478 10489569 10254195 10070264
2294 10070264 9993979 9767597 9730558 9706453 9553801 9374779 9250278 9145024 9028559 8992344
2284 8992344 8917109 8868301 8732980 8651523 8567395 8486097 8423298 8325259 8328921 8285724 8196487
2273 8196487 8073911 7922376 7853441 7800586 7684638 7642603 7676224 7540003 7441320 7463642 7322604
2262 7322604 7229936 7169815 7077179 7049377 7007139 6999776 6909486 6798854 6764932 6667681 6497774
2251 6497774 6530612 6411481 6365800 6355403 6230218 6141489 6122885 6116633 6110589 6016412 5938826
2240 5938826 5894948 5921784 5949814 5865899 5854281 5885267 5868298 5770497 5827676 5803803 5806275 5829390
2228 5829390 5809942 5824916 5857882 5919225 5907070 5859789 5956295 5915497 5997676 6021942 6052249
2217 6052249 6078391 6139618 6170420 6159068 6184732 6224033 6278145 6168733 6277719 6302848 6252786
2206 6252786 6334903 6455120 6496231 6549924 6510484 6399513 6330714 6237152 6198635 6285792 6174505
2195 6174505 6089769 6096418 6095584 6036113 6167201 6291873 6274071 6305289 6412180 6489318 6465579
2184 6465579 6480025 6584969 6577324 6563556 6618221 6646565 6612786 6638549 6700735 6744147 6801945
2173 6801945 6837439 6868636 6872519 6773380 6678916 6694599 6785345 6751009 6681241 6564754 6560845 6594707
2161 6594707 6621299 6591420 6534226 6634603 6770810 6793181 6892658 7050707 7138497 7320677 7427912
2150 7427912 7595308 7741328 7833402 7829460 7995888 8137480 8207505 8349416 8438502 8577228
2140 8577228 8713209 8746186 8896596 9107618 9338171 9555356 9770007 10025300 10470322 10888026
2130 10888026 11262590 11631178 12157253 12845456 13589747 14535028 15787135 17483416 19474107
2121 19474107 21854158 24743522 28428977 33261557 39208171 45146072 47045240 42302466
2113 42302466 35098256 29393534 25594622 23267090 21618874 20208688 19162080 18406728
2105 18406728 17725401 17186766 16793861 16431239 16152662 15958824 15946709 16112140 16420715 17002234
2095 17002234 17735774 18771895 20087004 21720582 23927941 26862527 30781880 35794444
2087 35794444 41489155 45811945 44460948 37797318 30894793 26260248 23165359 21176975
2079 21176975 19643613 18005564 16579007 15397187 14381886 13445508 12656559 11914631 11195208
2070 11195208 10589293 10097362 9610952 9201353 8862125 8545980 8213322 7911721 7741974
2061 7741974 7399410 7217976 6937561 6880929 6858708 6783325 6758769 6691108 6726555 6766274 6882708
2050 6882708 6924362 6917526 6642848 6395494 6067254 5921628 5829130 5699944 5604082 5595657 5472748
2039 5472748 5275596 4968904 4783920 4579152 4451456 4332203 4118803 4070532 3985560 3892139
2029 3892139 3681107 3566029 3488187 3391580 3247924 3226952 3180449 3145385 3034345 2971672 2998842
2018 2998842 2919932 2853624 2835319 2732127 2770313 2728059 2719140 2633902 2577646 2530511 2434050
2007 2434050 2474454 2457770 2437225 2311091 2295618 2324325 2348138 2273475 2248205 2249844 2236318
1996 2236318 2042558 2097418 2080337 2036058 2046856 2062513 2044078 1923892 1872869 1879388 1848164
1985 1848164 1910149 1857189 1784020 1794525 1848417 1844379 1672049 1662121 1694937 1717037 1705358 1656823
1973 1656823 1607379 1562743 1644318 1655174 1546839 1586719 1543217 1577329 1530525 1463947 1540421
1962 1540421 1571633 1623661 1607889 1548492 1578421 1616158 1481094 1425911 1514095 1537067 1537390 1539422
1950 1539422 1419227 1325262 1357006 1371073 1531368 1490087 1401620 1399041 1401478 1429517 1372906
1939 1372906 1434627 1483565 1427323 1402654 1393991 1279333 1183625 1273250 1282901 1244531 1232228 1153885
1927 1153885 1145925 1223298 1229855 1216988 1195338 1232120 1135439 1098331 1067903 1115719 1177093 1187408
1915 1187408 1115306 1135947 1148154 1113208 1054771 1036875 1103094 1169654 1139646 1068751 1105583
1904 1105583 1093618 1197028 1185917 1129708 1130555 1090380 1048386 1022080 1078050 1091487 1111190 1185756
1892 1185756 1143738 1108046 1162467 1195735 1210735 1205998 1154916 1170474 1198142 1254209 1166098 1258611
1880 1258611 1371942 1390648 1344528 1228524 1219426 1234905 1152443 1156240 1167037 1255048 1211661
1869 1211661 1156962 1180859 1240921 1204187 1161076 1234347 1233419 1163659 1134220 1214633 1249220 1312998
1857 1312998 1332542 1243331 1241845 1284043 1315297 1261239 1250558 1373593 1454124 1459434 1539818 1534399
1845 1534399 1399190 1328458 1307289 1318683 1234636 1297391 1406234 1342258 1345999 1321068 1264815
1834 1264815 1260717 1278866 1154345 1091264 1179230 1118880 1092706 1058876 1111839 1041830 1061966
1823 1061966 1151575 1088316 1085145 1107087 1065512 1144008 1201025 1280329 1270540 1350582 1460480 1433591
1811 1433591 1407373 1333830 1231020 1294428 1269061 1288013 1273854 1278637 1209945 1202620 1287432 1248553
1799 1248553 1191622 1184454 1149702 1110549 1089410 1076328 1038436 991313 985396 1006992 1060381 1030271
1787 1030271 1048896 1051407 1130789 1114341 1100510 1194956 1241702 1178663 1117568 1061181 994364 1004508
1775 1004508 1032565 997431 989802 923835 970316 1031902 1028201 925980 901029 865136 838862 880742
1763 880742 814330 834756 829644 828024 814390 765611 902540 914032 851172 888005 898267 841428
1751 841428 831305 848247 902015 924924 956180 868193 806494 887663 928650 957859 916381 930327
1739 930327 941657 892209 791474 811172 795255 820143 870436 771059 835509 830775 749288 807130
1727 807130 793072 780080 866113 858255 837585 767979 723357 654739 669046 742906 745379 794445
1715 794445 727803 675125 664839 679241 643945 646630 606202 617371 694343 672268 624587 645412
1703 645412 690387 568804 587776 590441 703164 730625 635727 575326 531344 561379 479289
1692 479289 496480 458199 502580 626379 613334 538100 514734 633228 615842 598317 596643
1681 596643 574169 597370 507561 511255 586315 529682 551230 519156 518914 593654 640469 564947
1669 564947 494440 480161 493668 552437 587698 475211 481944 525631 468670 522416 505088 466774
1657 466774 506364 525422 386056 399754 414926 494338 536409 379704 302330 371775 439000
1646 439000 497589 413164 475896 594691 572007 501875 458864 463055 466514 443858 396027 425120
1634 425120 407415 328774 390909 411249 410636 413437 449692 407332 374012 333536 397484 390115
1622 390115 358528 418653 343086 337512 337299 404657 410868 293992 352947 451157 451021 518640 409088
1609 409088 363834 380204 345835 352575 328668 459454 481799 377673 437391 405994 416079
1598 416079 403088 324190 370491 481619 528416 471948 467753 492296 482584 418232 342747 325427
1586 325427 413988 450825 416554 422598 435188 446081 383616 359067 330837 350987 354949 389638
1574 389638 390804 335172 350426 359978 392114 352916 389926 464654 403137 315146 375310 374463
1562 374463 294933 336699 367823 376110 411961 447230 501261 500910 488518 402592 384646 318892
1550 318892 323193 344701 294474 342081 283978 252384 329377 300993 242580 266272 259170 315577
1538 315577 369145 332663 326714 380007 390198 414927 415164 372786 281340 299199 343432 372142
1526 372142 333322 257971 312149 380116 311249 322812 443633 398976 364399 338899 295613
1515 295613 374908 462137 379092 347230 418814 275466 268653 299510 320236 444227 447369 404823
1503 404823 434804 430240 468917 480568 470065 447284 412964 470818 499837 489117 400119 415304
1491 415304 486776 388715 302119 297125 346323 357721 346792 330400 346560 468538 467895 444061
1479 444061 377471 438856 435026 431714 530909 514543 485037 526887 486305 482741 455522 477525
1467 477525 522666 458082 428822 428102 429839 330040 360653 272153 290682 349747 351121 348403 409289
1454 409289 379281 405775 421611 518868 446613 438632 518366 507471 571299 468519 492879 536665
1442 536665 499712 466777 409585 356917 426735 381159 392423 464551 493877 357153 242351
1431 242351 305486 365804 375445 392805 428843 436324 425121 447000 471509 506701 467353 404902
1419 404902 377476 375476 394558 434425 481331 396071 350614 458244 474988 446783 350302 406015
1407 406015 376200 389349 498124 415611 328859 355500 353181 292416 283007 356505 443672 324667
1395 324667 297840 356134 346827 299696 321038 348827 269637 275914 362593 406327 305154 275834
1383 275834 290934 245021 274673 325076 308217 266608 327776 302815 228133 248366 253195 303401
1371 303401 325029 276007 236930 302811 290504 341276 434659 443118 369143 323059 190271 142910
1359 142910 196916 230204 294120 208661 176094 176754 129271 177525 217704 234879 177667 177520
1347 177520 255651 145801 198801 240691 193497 193315 270355 217924 217975 233935 203917 222497
1335 222497 195721 201140 217031 206676 156192 185815 203972 204124 149578 155265 190985 160191
1323 160191 120854 151078 180073 122055 150092 138610 131003 240274 307136 177499 150494
1312 150494 226081 280586 300169 265806 229585 122231 135895 231885 259412 208672 209989 158427
1300 158427 262221 307024 313203 240950 218746 258122 220710 210208 184499 200884 225864 264728
1288 264728 224156 280732 299709 285964 264062 275332 180062 183083 171428 173943 138038 200629
1276 200629 277870 277144 271788 165757 109672 147644 211387 235381 210111 219236 205885 228931
1264 228931 197893 306804 285970 218098 182085 131923 147286 246710 226890 153659 91778
1253 91778 212454 207912 218533 236137 55985 121012 192949 241588 213003 284638 291391 265852
1241 265852 244330 174795 155936 197890 259898 230356 138754 152571 173361 148301 142892 168785
1229 168785 208309 192617 133344 119996 164258 268709 238606 209381 157033 214718 220271 359040
1217 359040 450744 409699 365938 224018 235131 356575 313094 222214 161585 248244 294836
1206 294836 180688 123773 137999 156625 145277 140697 130466 114664 167169 165750 183591 172638
1194 172638 143332 86576 145183 121397 151311 134409 151048 144316 140738 208403 172372 95737
1182 95737 54172 169928 127415 174701 165196 93674 70611 150971 231964 196725 77270 138663
1170 138663 134856 100125 139322 140292 194261 166563 244794 187460 232388 221737 137382 103652
1158 103652 149943 282077 353052 346700 272753 183719 129169 145504 137252 236346 171518 152157
1146 152157 190631 215092 210124 103018 130622 256524 272752 171661 110157 124579 81667
1135 81667 116345 76310 109901 132134 154344 155026 131657 205517 170443 142396 212766 233127
1123 233127 241724 132280 95405 219457 242420 205475 206210 187552 217556 280614 262751 171003
1111 171003 194111 223435 186011 166225 159567 154294 105123 101983 185838 222611 175804 171304
1099 171304 156777 203002 112567 121459 194904 157321 232919 193872 221668 235682 164548 154254
1087 154254 141109 134823 108402 195269 305630 193229 129578 130458 244142 265011 277027 378294
1075 378294 427200 335307 369878 379461 297466 306446 317662 289338 322483 380200 252071 208040
1063 208040 212510 320740 261636 316613 292638 320026 383085 322637 228524 145973 163183 227908
1051 227908 175187 215022 295828 333756 280837 244927 297192 237116 204436 332838 268188
1040 268188 288215 269285 246636 301874 331318 342616 353363 361106 243889 238884 243939 342920
1028 342920 399869 383926 435798 547261 531832 563142 527312 465802 537986 470698 453317
1017 453317 485376 534204 590825 606386 662061 549553 613718 564780 504601 623458 749491
1006 749491 703280 708884 748942 766545 820420 833084 789806 775319 776396 781885 875802 893829
994 893829 926638 966266 1004390 1020280 996461 1063809 1148622 1136345 1158765 1215114 1273627 1332021
982 1332021 1302966 1255063 1283757 1398204 1482972 1447768 1529506 1666750 1768696 1856739 1769858
971 1769858 1809755 1935771 2092834 2198884 2327287 2319002 2366356 2456415 2672182 2762185 3031184
960 3031184 3341890 3454459 3830954 4171502 4437237 4721214 5046969 5429789 5908577 6381584
950 6381584 6931775 7377890 7541027 7789708 8141663 8634711 9580120 10804609 12319661
941 12319661 14205053 16477351 19366381 22979326 27614395 33903861 41190207 46463027
933 46463027 43578003 34921001 27258395 22332123 19107237 16774196 14857525 13188176
925 13188176 11833469 10730334 9769107 8937883 8381255 7704812 7267224 6977769 6585969
916 6585969 5984307 5494624 5153376 4821984 4569353 4393899 4160862 3946716 3785112 3701022
906 3701022 3474686 3315818 3149552 3049045 3029497 2829314 2696741 2577318 2431301 2342269
896 2342269 2237400 2135923 2114205 2067746 1921624 1924859 1944120 1844256 1866274 1727954 1736274
885 1736274 1666688 1619584 1589910 1488051 1434541 1432592 1430524 1363170 1309237 1238548 1141150 1163040
873 1163040 1160843 1025315 1063424 1050129 1036181 1042268 975287 1005753 1025959 983612 940213 857183
861 857183 804453 785327 759710 810337 860072 761115 625267 678105 774664 736718 723768 680514
849 680514 683949 749899 673582 586931 573830 568527 521962 656040 690846 463880 468088 518991
837 518991 525692 491601 524312 521014 505665 552163 549045 434253 471084 427157 380819 366565
825 366565 413051 366047 387637 438095 427726 336256 376905 365952 294439 343197 353924 391858
813 391858 322835 346652 356974 268508 255616 307324 348355 391292 290727 307868 367837 204192
801 204192 185887 190424 188104 242267 273185 182891 200913 337644 256390 206898 260291 351429
789 351429 322023 239964 193222 103904 209780 224087 251454 213075 219320 244570 137678 177035
777 177035 151039 122784 185269 224489 113163 95392 108517 118255 111031 16634 23467 63662
765 63662 69739 55648 123231 157005 83908 84906 117874 166249 192526 213082 201768 78187
753 78187 80905 40813 42587 125572 109272 171055 134279 128820 52644 62774 78540 36627 132735
740 132735 115037 156064 163109 28202 63793 -3477 -35795 24385 -26601 10397 64008 -48795
728 -48795 27159 63471 -59430 -71964 140593 109088 104161 64800 -6172 48694 119907 161905
716 161905 165457 94968 97394 97621 36856 30809 -5898 40285 72395 58871 77392 44171 -36691
703 -36691 -70390 -30353 -4252 38212 93281 11336 -36931 14078 -3202 -23701 34858 74862
691 74862 -29226 3653 18169 -27014 -76980 33931 -34982 -22857 24411 71927 122617 50997
679 50997 -18922 -19571 -33826 -12206 -30154 -39519 -3634 -27111 75071 60396 -19857 -73540
667 -73540 -66782 -51900 -17334 -83268 -22053 -67066 -33605 -26918 56211 -34606 -56905 6728
655 6728 -45353 -52745 -47556 122840 155229 66691 166992 175969 126922 42657 61222 -4016
643 -4016 -24135 -53704 -46246 18758 5368 36909 77017 48892 62334 13533 -7878 -39095
631 -39095 -82922 -119333 -77125 -47615 6991 -10970 -32723 -135806 -46294 -25431 -104365 -164727
619 -164727 -111407 -24609 -24746 34446 -15265 -106884 -81601 -42272 -66960 -133833 -171498 -130965
607 -130965 -88855 -6822 -18359 -35256 2447 -29269 -25695 -15278 -48408 -100987 -175739 -138449
595 -138449 5921 -26321 29924 25405 -103584 -76009 -80013 -29742 23891 8813 -71412 -22080
583 -22080 -60192 -109894 -111505 -165317 -182187 -83240 -82272 -113072 -91675 -69458 -175926 -134678
571 -134678 -130544 -167729 -256847 -136450 -127345 -204339 -297955 -240113 -230079 -231888 -212874 -203261
559 -203261 -164406 -137809 -75635 -90996 -135822 -54169 11688 -145736 -260321 -204664 -125667
548 -125667 -213501 -209434 -177747 -177161 -161246 -172530 -121020 -147185 -179036 -245690 -163250 -110560
536 -110560 -106331 -130493 -120695 -164950 -165584 -244731 -240755 -196800 -180448 -200674 -203571 -230506 -220817
523 -220817 -165886 -131879 -160846 -227995 -212735 -229215 -149686 -181991 -138263 -89230 -156805 -202168
511 -202168 -132342 -161532 -239049 -201672 -170975 -95370 -65074 -121629 -120954 -179910 -90130 -97756
499 -97756 -113527 -107021 -127444 -187124 -188150 -129969 -195378 -140096 -86886 -110019 -175959 -203691
487 -203691 -59128 -29829 -97096 -162090 -80973 -80953 -68025 -92920 -84891 -160542 -161278 -112404 -123146
474 -123146 -185579 -200933 -116230 -113881 -138699 -99038 -212772 -232663 -212336 -273520 -271388 -295841
462 -295841 -289017 -246729 -332078 -303278 -321985 -245211 -151844 -99424 -172679 -334022 -312727 -265023
450 -265023 -200839 -215675 -248526 -295912 -264865 -202936 -221548 -283216 -273598 -333656 -316823 -214225
438 -214225 -207996 -247835 -243658 -256171 -277615 -257863 -191695 -173257 -195462 -231879 -269101 -267086
426 -267086 -161232 -192210 -265188 -303840 -250746 -155260 -192226 -291134 -221065 -173030 -214472 -200627
414 -200627 -152894 -216725 -234353 -227105 -316187 -355519 -287008 -147268 -105215 -155389 -282487 -218995
402 -218995 -194984 -215042 -232961 -238627 -196163 -249334 -239502 -302181 -240793 -207379 -158366 -211941
390 -211941 -243440 -194023 -253134 -247478 -161950 -189112 -245757 -273156 -378117 -362424 -249570 -254255
378 -254255 -312649 -235123 -175669 -172669 -138907 -108993 -152237 -236654 -321637 -342026 -265169 -264797
366 -264797 -353925 -325698 -194392 -205847 -262113 -331495 -258278 -218926 -313347 -290011 -355074 -324566
354 -324566 -218598 -282979 -304326 -322731 -229478 -234181 -287551 -204540 -342592 -320099 -237087 -215361
342 -215361 -194962 -278761 -332763 -399213 -420640 -353812 -230017 -200491 -268481 -247601 -348627
331 -348627 -319397 -215388 -243653 -327085 -384962 -346445 -337852 -259826 -343269 -375796 -340813 -368418
319 -368418 -303738 -279761 -307378 -342073 -272828 -241824 -233778 -197002 -251567 -349790 -287069 -267420
307 -267420 -207515 -278317 -352405 -330799 -269229 -231972 -233294 -284925 -341162 -264257 -192059 -298335
295 -298335 -277874 -219593 -274792 -254944 -354784 -372797 -281914 -183359 -155010 -253558 -236224 -246002
283 -246002 -314492 -359576 -399814 -351595 -383413 -303118 -199946 -239819 -315633 -344557 -301182 -328688
271 -328688 -348682 -424881 -415095 -378692 -436070 -403692 -342137 -332381 -420145 -352682 -376407 -342459
259 -342459 -423805 -332714 -324159 -256836 -320861 -398111 -415735 -365854 -244376 -211636 -345925 -401327
247 -401327 -335835 -422234 -392870 -406600 -386728 -403693 -412014 -419671 -378582 -333398 -261657 -279911
235 -279911 -282115 -292303 -315912 -341056 -241320 -214908 -226301 -363370 -415480 -333413 -355452 -415941
223 -415941 -499812 -474367 -352411 -391433 -331580 -353130 -445150 -464628 -399552 -355678 -384983 -361392
211 -361392 -370461 -266014 -307131 -304446 -264887 -376051 -369989 -384264 -439109 -433115 -393036 -357700
199 -357700 -347675 -343023 -404619 -434754 -387674 -404623 -434896 -431271 -486148 -445916 -400744 -405696
187 -405696 -356460 -322306 -424579 -425957 -374634 -428744 -359588 -365992 -397670 -407694 -421738 -402507
175 -402507 -426691 -419268 -402093 -424918 -386659 -493564 -493943 -519392 -510403 -487997 -517811 -478722
163 -478722 -418557 -375907 -421778 -420034 -358360 -372712 -384070 -368161 -414219 -424310 -341204 -335911
151 -335911 -358058 -355211 -404034 -418968 -384551 -355061 -422412 -402901 -492865 -521452 -487212 -458747
139 -458747 -462452 -469134 -418854 -449009 -509306 -519079 -528735 -440599 -468077 -438264 -438555 -454304 -455878
126 -455878 -444423 -492196 -474866 -452787 -420191 -379925 -417938 -396069 -423545 -457381 -449922 -407718
114 -407718 -405708 -437386 -521997 -461180 -430756 -455312 -475553 -446283 -485796 -459280 -404500 -502325
102 -502325 -496950 -448169 -372928 -395269 -417985 -455800 -429852 -471814 -447168 -432615 -511460 -517498
90 -517498 -501636 -510892 -502126 -443537 -435291 -488657 -472013 -490489 -517371 -484933 -472756 -398675 -422419
77 -422419 -436387 -422510 -446153 -448045 -487879 -514290 -486445 -513922 -482249 -436445 -445026 -495409
65 -495409 -455186 -498612 -552663 -531266 -441165 -444587 -408456 -444935 -477734 -489519 -499252 -543397
53 -543397 -567539 -508333 -493053 -573398 -574797 -521118 -497027 -508183 -555609 -576846 -619294 -552785
41 -552785 -480519 -500051 -547300 -508095 -511543 -499957 -484640 -491335 -477537 -525803 -528614 -481872 -497633
28 -497633 -487468 -441081 -520878 -543091 -567517 -551129 -493764 -525799 -501642 -531650 -530774 -550569
16 -550569 -521756 -551306 -577366 -594705 -630193 -620538 -558145 -588153 -593130 -509972 -513211 -522280 -523260
3 -523260 -460073 -448706 -457654
0 -457654
$$ Imaginary data points
##PAGE= N=2
##DATA TABLE= (X++(I..I)), XYDATA
16383 -3158887 -3117619 -3004332 -2955095 -2865401 -2805926 -2784927 -2750528 -2729343 -2736141 -2706101 -2653890
16372 -2653890 -2664302 -2634278 -2553445 -2483148 -2424202 -2436521 -2473247 -2412053 -2341620 -2309073 -2298915
16361 -2298915 -2322939 -2263498 -2179311 -2184232 -2160462 -2171318 -2093829 -2072720 -2012262 -1985442 -1969758
16350 -1969758 -1902302 -1869423 -1854707 -1887399 -1868507 -1797073 -1755267 -1773541 -1755309 -1683575 -1638191
16339 -1638191 -1575097 -1585554 -1571510 -1501239 -1459986 -1464470 -1419359 -1406058 -1400853 -1300979 -1278023 -1295074
16327 -1295074 -1263059 -1211440 -1181125 -1133053 -1135474 -1127804 -1029842 -969486 -977052 -1012261 -1021713 -896238
16315 -896238 -884292 -924276 -883141 -808643 -846801 -762984 -717332 -621818 -549967 -575309 -581108 -538487
16303 -538487 -566519 -503367 -470131 -454220 -403655 -353621 -339906 -405472 -405958 -341939 -238149 -294786
16291 -294786 -222687 -258086 -243676 -211660 -169743 -91963 -114776 -99941 -36050 -59506 -12963
16280 -12963 25851 26400 78025 90706 68139 77798 87866 134263 214653 202056 165837 204273
16268 204273 259304 355346 358252 399027 395444 387501 395465 399113 412311 400178 426505 446638
16256 446638 443354 454433 527198 569980 619356 642051 596649 633229 634634 676194 717602 654067
16244 654067 744543 757597 789348 813613 871787 928226 898191 868069 816492 830267 919112
16233 919112 894397 886643 863976 936476 946022 979255 1002637 995990 992817 1036075 1073928 1051418
16221 1051418 1099446 1143728 1031046 1043348 1111198 1146055 1268149 1268821 1241407 1187711 1201543
16210 1201543 1319798 1289842 1337052 1288434 1197166 1319668 1325513 1263692 1301271 1384464 1389871
16199 1389871 1334688 1328450 1397049 1477866 1435131 1392142 1492034 1453582 1400136 1457016 1557787
16188 1557787 1569638 1588397 1555085 1549341 1540740 1494639 1511509 1610462 1576665 1596057 1580511 1558087
16176 1558087 1606653 1703010 1683472 1601800 1662294 1642918 1596314 1551599 1581444 1609800 1668987
16165 1668987 1701159 1719460 1743152 1683021 1689904 1730481 1703460 1752334 1778151 1741683 1768070
16154 1768070 1728671 1723046 1773550 1817413 1761087 1701746 1681385 1680951 1789483 1888354 1928575 1885045
16142 1885045 1824711 1846263 1841438 1831703 1855304 1881383 1873277 1954431 1972809 1997109 1926826 1836333
16130 1836333 1855609 1981057 2065100 1979520 2036066 1997807 1980265 2006662 1918402 1906840 1949791
16119 1949791 1955529 1991005 1931221 1997290 1994495 1948219 2004867 2016090 2014812 2004533 2078337 2081643
16107 2081643 1951678 1911906 1983934 2011403 1968745 2050228 2073104 1979893 1968994 2025497 2049245
16096 2049245 1990969 1972214 1991405 2013487 2037958 2022521 2020803 2012967 2043071 2087485 1985175
16085 1985175 1967462 2061825 2090016 2090721 2102836 2035374 2057283 2041418 2109895 2117052 2135237 2084491
16073 2084491 1977157 1999214 1973731 1967235 1925960 2000810 2009289 2110927 2056947 2042512 2017135
16062 2017135 2056347 2123196 2121621 2124356 2100183 2055075 2050913 2058033 1986690 2077501 2082128 2140992
16050 2140992 2203048 2118202 2075751 2010702 2031231 2051958 1965779 2016257 2081861 2008239 1929501
16039 1929501 1995506 1993976 2011083 2023279 2039151 2037463 2055569 2112671 2215993 2206339 2119570 2100302
16027 2100302 2046199 2048766 2128167 2083960 2106691 2087516 2100594 2211594 2177076 2072215 2048790
16016 2048790 2148355 2159640 2084861 1984265 1977794 2080274 2081535 2114321 2184059 2097434 2097429 2062807
16004 2062807 2025920 1977739 2066109 2097544 2100102 2123219 2104280 2172455 2177551 2209029 2144305 2070554
15992 2070554 2024560 2089188 2231676 2263619 2216311 2107210 2019164 2026009 2062694 1965726 2001478
15981 2001478 2027000 2059851 1997422 2048374 2089538 2026151 1937359 1950474 2077914 2082877 2116285
15970 2116285 2130976 2087754 2108519 2126089 2021908 2097425 2039709 2030094 1981900 2016927 2097302
15959 2097302 2104307 2142551 2118593 2096460 2025097 2058379 2125061 2095204 2124643 2158175 2072960
15948 2072960 2131233 2129331 2070126 1999854 2081550 2066747 2012016 2052376 2074024 2127776 2107921
15937 2107921 2118470 2095533 2065220 2061061 2075725 2038435 1944753 2042757 2103928 2082897 2030168
15926 2030168 2039422 1979019 2006098 2019720 1982320 2017087 2051487 2131110 2145300 2165141 2051218
15915 2051218 2039483 2080470 2116995 2152226 2193632 2166441 2191738 2140529 2137239 2091793 2066766
15904 2066766 2032841 2104617 2122445 2093921 2016895 2036435 1992660 2066855 2165842 2151429 2174179
15893 2174179 2116510 2135079 2190302 2126665 2094060 2171603 2249133 2210184 2170158 2147427 2121255
15882 2121255 2188383 2179912 2056576 1995562 1988687 2062503 2196063 2139893 2127154 2145460 2224686
15871 2224686 2268594 2185353 2139243 2035227 2030293 2139773 2150883 2174520 2124181 2139804 2148639
15860 2148639 2115244 2147443 2107087 2072753 2086824 2110131 2182954 2132410 2114228 2067280 2164365
15849 2164365 2093275 2068705 2044552 2100528 2126390 2126853 2129262 2165051 2135880 1981840 1979448 2159487
15837 2159487 2190054 2038468 2029225 2119646 2110115 2059624 2103133 2010277 2001273 2087824 2076247 2094366
15825 2094366 2110080 2044726 2000659 1945554 2097055 2111087 2101497 2038346 2026597 2131598 2168396
15814 2168396 2183402 2177062 2194820 2193179 2048733 2096821 2155461 2148664 2192046 2162144 2196304 2179827
15802 2179827 2122423 2106908 2139916 2066885 2017546 2065258 2095177 2014519 2126253 2136591 2128153
15791 2128153 2109817 2092635 2109331 2144904 2159102 2153351 2139244 2075577 2146858 2146392 2170845 2174885
15779 2174885 2224546 2205259 2125937 2105074 2078495 2094057 2085463 2085720 2057080 2057727 2033984 2132174
15767 2132174 2086511 1979751 2097422 2109704 2057040 2115914 2220842 2197424 2130070 2129826 2184056
15756 2184056 2195550 2146098 2091584 2110415 2067229 2163016 2205534 2056359 2094992 2189924 2076174
15745 2076174 2028873 1961565 1925055 2123658 2185641 2115765 1979519 1997409 2093029 2114477 2071436
15734 2071436 2075744 2068513 2001717 2048832 2090565 2113732 2085001 2103186 2092173 2043946 2073482 2139675
15722 2139675 2132496 2040939 2005775 1958627 1990604 2047758 2079320 2162093 2205220 2235189 2143762
15711 2143762 2071296 2137303 2122031 2041784 1987026 2082750 2263616 2287330 2265660 2222094 2164599
15700 2164599 2118916 2216676 2217452 2171428 2148863 2102653 2115627 2191282 2142491 2121929 2066237 2059584
15688 2059584 2148159 2186225 2123144 2199735 2188947 2118686 2131829 2230506 2126365 2110124 2164105
15677 2164105 2081662 2190133 2114560 2188500 2212924 2199675 2241994 2179794 2059202 1991316 2094578
15666 2094578 2143671 2139496 2089152 2020670 2122011 2143360 2152237 2078309 2065343 2073192 2005718 2106142
15654 2106142 2134416 2214430 2203651 2186722 2208390 2236754 2201064 2110342 2125302 2123986 2221049
15643 2221049 2210729 2115840 2100446 2129085 2132611 2137860 2131006 2144970 2126024 2132137 2128435 2075538
15631 2075538 2091336 2206734 2227525 2207431 2165186 2220576 2252618 2178173 2151356 2070374 2049977
15620 2049977 2066065 2047681 2069405 2118364 2156596 2171449 2191280 2183620 2184079 2120490 2055276 2083619
15608 2083619 2118998 2105412 2073857 2057318 2091871 2131315 2162727 2077157 2120909 2124328 1944445
15597 1944445 1994040 2041033 2042796 2135329 2147730 2135594 2150300 2124889 2141314 2250888 2246057
15586 2246057 2143206 2171227 2253629 2139253 2073668 2056946 2091968 2162457 2141760 2167197 2114502
15575 2114502 2050902 2085981 2082168 2125527 2133291 2169493 2088941 2141338 2170459 2168961 2069521 2015076
15563 2015076 2001168 2004315 2107616 2194163 2204760 2195326 2227372 2121247 2105386 2063893 2173741
15552 2173741 2158301 2097397 2079284 2158989 2177588 2126493 2136136 2114812 2146669 2238205 2149058
15541 2149058 2184306 2174338 2090269 2165729 2173790 2257971 2224449 2174053 2126085 2140128 2153655 2089983
15529 2089983 2113157 2150238 2092973 2179390 2196641 2138587 2097958 2077488 2205022 2168487 2155753
15518 2155753 2148450 2261861 2224784 2179660 2119530 2003833 2089298 2166002 2209408 2162116 2124915
15507 2124915 2086341 2028652 2082862 2082748 2213192 2134331 2104430 2200192 2165554 2168693 2198900 2188926
15495 2188926 2205657 2078766 2047645 2091651 2154327 2176823 2232835 2223152 2021754 2044989 2074217
15484 2074217 2018208 2098148 2185302 2217835 2167539 2071299 2078997 2052701 2070311 2053547 2093046
15473 2093046 2214950 2172446 2138220 2184507 2190722 2217469 2130215 2175676 2174361 2148990 2249736
15462 2249736 2233025 2220966 2303091 2313446 2232133 2211847 2163222 2102782 2112879 2190446 2235709
15451 2235709 2192089 2153457 2183246 2273986 2217563 2187091 2176412 2209153 2233579 2169141 2160283
15440 2160283 2129161 2229008 2288285 2256395 2175308 2216525 2223379 2135060 2032843 2136738 2287279
15429 2287279 2293249 2209863 2170986 2178112 2194521 2250897 2190571 2177997 2140955 2066843 2125152 2196108
15417 2196108 2145544 2252098 2301761 2231526 2149502 2180645 2128427 2209102 2211258 2146419 2189879
15406 2189879 2133081 2057646 2135887 2191092 2181063 2148713 2200194 2160996 2118064 2255449 2223839
15395 2223839 2083222 2161552 2220934 2172555 2250103 2225661 2172276 2190141 2212584 2235136 2188003
15384 2188003 2183647 2203413 2265559 2256203 2186014 2215154 2210070 2198321 2151596 2115539 2181914 2238089
15372 2238089 2247784 2197338 2218607 2179283 2152721 2190854 2190103 2159005 2173599 2163610 2199177 2286551
15360 2286551 2356903 2289709 2183931 2209632 2148692 2171149 2227052 2188814 2101873 2128284 2230427
15349 2230427 2146699 2131844 2198939 2144801 2158983 2227619 2164672 2172977 2159162 2216592 2234326
15338 2234326 2227857 2264939 2222512 2241164 2201475 2198090 2199605 2239697 2271238 2211264 2177102 2151686
15326 2151686 2143155 2253044 2234894 2154369 2093475 2167393 2264014 2234398 2138429 2098603 2164604
15315 2164604 2232764 2197775 2324226 2266044 2131196 2119121 2138589 2181443 2070467 1983291 2056778
15304 2056778 2160380 2105529 2094674 2111611 2114135 2183453 2206333 2156955 2186446 2290730 2255695
15293 2255695 2236814 2128134 2110946 2130658 2207928 2217376 2215896 2224249 2169231 2220781 2220609 2187033
15281 2187033 2176904 2201480 2222099 2131532 2135748 2177889 2267741 2323869 2273565 2250617 2103484
15270 2103484 2123763 2201757 2098949 2142698 2234731 2231178 2266127 2240278 2206210 2294586 2262601
15259 2262601 2246498 2269435 2235794 2283167 2303653 2286485 2169410 2195500 2197452 2164304 2169390
15248 2169390 2183214 2278886 2289890 2223788 2213238 2268401 2273862 2346648 2291462 2234128 2219219
15237 2219219 2243528 2202368 2092771 2092658 2102123 2143841 2147600 2159030 2154380 2182187 2220743 2219456
15225 2219456 2243388 2183648 2250190 2285565 2179370 2199234 2155242 2139152 2165262 2129368 2148871
15214 2148871 2196935 2160271 2139151 2246923 2244873 2170474 2211011 2154021 2106517 2081741 2161644
15203 2161644 2192889 2161915 2163069 2239851 2216404 2181320 2175779 2228760 2201204 2167454 2178670 2228124
15191 2228124 2200269 2193865 2198723 2222710 2209211 2245737 2299465 2273521 2211271 2182121 2212827 2231736
15179 2231736 2253790 2269670 2277615 2199982 2169199 2187070 2200535 2209925 2229612 2212003 2143545 2224020
15167 2224020 2279448 2316707 2414880 2323665 2205059 2156703 2149611 2213910 2204401 2256342 2267111
15156 2267111 2276082 2368835 2326596 2254658 2240870 2222738 2215355 2307804 2180056 2167543 2143552
15145 2143552 2250611 2260242 2284683 2245437 2254181 2193427 2134398 2153168 2228310 2237531 2322024 2283611
15133 2283611 2184562 2284606 2224012 2235508 2269792 2209204 2162982 2170332 2175783 2207394 2159526
15122 2159526 2219882 2178123 2156416 2152817 2241448 2254899 2283096 2191223 2178094 2114348 2129990
15111 2129990 2251151 2292037 2267210 2208594 2297490 2225275 2212251 2267030 2330290 2297893 2170182
15100 2170182 2139786 2096461 2197578 2268333 2321358 2164166 2111175 2242877 2215815 2322559
15090 2322559 2352359 2179040 2225684 2268301 2259154 2229804 2137619 2079533 2168827 2235751 2237465
15079 2237465 2299559 2229605 2252732 2236663 2201576 2264633 2334558 2248984 2194839 2219387 2253015
15068 2253015 2249758 2194663 2081230 2165093 2292949 2215540 2291704 2225902 2202507 2168272 2157070
15057 2157070 2203423 2252697 2274746 2168879 2165276 2177074 2297444 2239528 2133750 2156871 2230714
15046 2230714 2194266 2200405 2249875 2204119 2106198 2122663 2164590 2102499 2124500 2151914 2183521
15035 2183521 2308490 2261687 2219545 2271704 2277370 2249914 2275306 2208597 2179175 2242215 2269059
15024 2269059 2252023 2283611 2236727 2303507 2265024 2307931 2308943 2400021 2439153 2370032 2317445
15013 2317445 2252823 2204400 2198138 2248499 2292027 2225881 2233720 2256974 2195064 2220530 2264796 2230148
15001 2230148 2173837 2174006 2208318 2334801 2297575 2317369 2338282 2355012 2404819 2345034 2254115
14990 2254115 2173320 2252258 2263085 2303462 2288404 2247823 2314999 2257743 2264463 2216064 2253728
14979 2253728 2233766 2139377 2179520 2309545 2234679 2221637 2193038 2134311 2150692 2128875 2191073
14968 2191073 2331734 2294764 2278156 2264675 2200930 2149346 2191359 2212014 2190863 2128748 2198970
14957 2198970 2271414 2279802 2309070 2292976 2200800 2195767 2145772 2189132 2202436 2221356 2244259 2225685
14945 2225685 2225437 2264301 2309759 2260117 2231017 2286558 2249328 2242933 2227365 2208530 2163776 2122653
14933 2122653 2218631 2269206 2214748 2227563 2232383 2176421 2178190 2215549 2126592 2078417 2178467
14922 2178467 2335121 2386195 2401585 2325004 2314086 2323878 2268723 2368117 2280822 2274378 2267019 2297753
14910 2297753 2353441 2228937 2206742 2261659 2335521 2429916 2296285 2180742 2221024 2237545 2291720
14899 2291720 2297016 2336511 2319814 2307689 2324432 2308490 2285938 2215165 2228282 2200619 2205039 2235106
14887 2235106 2265216 2354716 2355352 2255848 2252595 2247459 2291524 2302497 2214706 2158141 2261415 2303592
14875 2303592 2344426 2363415 2308932 2318522 2291766 2260253 2221960 2215757 2253387 2293908 2325678 2289677
14863 2289677 2248426 2203104 2359665 2388197 2315074 2262293 2315411 2314393 2289179 2336103 2226298
14852 2226298 2255579 2292654 2232645 2331248 2309018 2226302 2186724 2325771 2319459 2314273 2321206 2283995
14840 2283995 2260849 2258403 2248099 2220502 2253998 2285190 2315474 2257930 2190861 2181088 2232150 2259302
14828 2259302 2237915 2193115 2213167 2282817 2354377 2374716 2336949 2350688 2327537 2350949 2298336
14817 2298336 2235890 2306971 2371704 2307451 2321274 2352907 2338283 2348169 2317992 2294353 2301842 2327435
14805 2327435 2380559 2373023 2369479 2340989 2241872 2229667 2289825 2368970 2372711 2304444 2223868 2263475
14793 2263475 2368325 2412307 2306470 2274738 2295271 2348202 2280839 2191047 2233859 2230121 2237547
14782 2237547 2305449 2196984 2257755 2289842 2300048 2359436 2346639 2314305 2274377 2265703 2256009
14771 2256009 2256847 2220522 2272114 2310002 2247449 2259604 2285070 2303793 2300321 2281525 2277003 2280186
14759 2280186 2294815 2261466 2296623 2254386 2242151 2257108 2219067 2242212 2208341 2213761 2245804
14748 2245804 2276486 2270569 2242027 2291694 2234209 2260141 2387722 2343967 2310307 2244144 2142173
14737 2142173 2112819 2231791 2296876 2270238 2251262 2290502 2283524 2292372 2190901 2277803 2292028
14726 2292028 2355879 2372445 2346404 2270127 2248602 2229945 2289780 2363977 2296545 2249610 2259228
14715 2259228 2267225 2229687 2268334 2286861 2350254 2331425 2310274 2207885 2223982 2227011 2367794
14704 2367794 2481479 2427510 2290962 2292496 2305998 2308272 2322532 2272578 2285800 2295900 2188842
14693 2188842 2254512 2302874 2245466 2395652 2503284 2362700 2305960 2311318 2314461 2324226 2351940
14682 2351940 2362511 2281810 2308071 2333431 2466259 2424009 2343145 2295385 2282556 2277096 2316685
14671 2316685 2297004 2330484 2410100 2304585 2280745 2313564 2329776 2399295 2280182 2282083 2402561
14660 2402561 2417320 2427097 2458442 2381925 2256003 2367293 2377093 2324068 2284415 2334333 2272982
14649 2272982 2239024 2326466 2270889 2183594 2225020 2263870 2307437 2282951 2156770 2220076 2285792
14638 2285792 2337602 2394560 2385893 2372671 2455742 2366211 2386780 2417936 2370579 2427661 2335449
14627 2335449 2354698 2302321 2191113 2228328 2335734 2369420 2350811 2270854 2334148 2282215 2290507
14616 2290507 2275138 2269085 2288478 2323297 2333416 2368607 2312418 2248487 2296307 2305475 2289643 2432461
14604 2432461 2358332 2296659 2349488 2374156 2303218 2317784 2290549 2327067 2371237 2365414 2333942
14593 2333942 2258907 2275232 2281620 2409194 2355719 2359916 2372236 2360690 2402743 2355504 2335454
14582 2335454 2334627 2311358 2267760 2253028 2247816 2237813 2318348 2411878 2380718 2391774 2467387 2450541
14570 2450541 2377404 2356436 2262252 2273357 2336285 2364392 2363927 2367554 2406351 2312650 2396903 2415691
14558 2415691 2419116 2391370 2384668 2452861 2454990 2342186 2356594 2391127 2453299 2351465 2252204
14547 2252204 2370129 2424111 2305870 2357156 2358612 2292868 2334811 2339573 2375069 2373597 2352639
14536 2352639 2367149 2301815 2259619 2298194 2325831 2406235 2481234 2330181 2338458 2269760 2351388
14525 2351388 2402623 2444676 2487343 2424944 2395625 2404292 2346530 2284121 2256928 2228117 2384980
14514 2384980 2355171 2363279 2312118 2333455 2394976 2291800 2273694 2305192 2253269 2293794 2303147
14503 2303147 2351819 2346950 2271864 2351173 2314940 2343925 2341296 2373014 2368498 2290709 2249576 2319467
14491 2319467 2348350 2340934 2315394 2301540 2257676 2387788 2360643 2330245 2384862 2400074 2409529
14480 2409529 2382989 2386791 2296131 2313453 2338662 2321258 2396960 2422298 2374006 2429170 2389525
14469 2389525 2371248 2428917 2487102 2388058 2303963 2281659 2300548 2341236 2369033 2310041 2277014
14458 2277014 2318703 2397405 2335824 2327574 2432549 2443879 2400012 2380954 2387884 2288521 2270850
14447 2270850 2409573 2306239 2341771 2339539 2374820 2348907 2354692 2372138 2292573 2285824 2267326
14436 2267326 2316967 2487864 2502299 2485602 2406251 2358193 2335759 2286897 2326853 2316541 2291826
14425 2291826 2305009 2337272 2365463 2309602 2340388 2393884 2383712 2386897 2311690 2283894 2287465 2317136
14413 2317136 2271828 2294372 2332890 2290541 2372938 2376311 2309456 2400348 2403002 2346299 2345781 2419602
14401 2419602 2415041 2428214 2376108 2276918 2328545 2365683 2408284 2452078 2378785 2371641 2367044 2365146
14389 2365146 2391236 2404580 2395076 2353264 2387772 2339549 2249352 2305729 2355503 2394003 2434701
14378 2434701 2360702 2261082 2367950 2401786 2364621 2292851 2196232 2308766 2408636 2425443 2466312
14367 2466312 2419845 2388685 2349823 2341229 2416657 2371078 2278549 2350739 2458044 2382015 2369745
14356 2369745 2346576 2404368 2423563 2452097 2420079 2399986 2429276 2474740 2495439 2390493 2408578
14345 2408578 2484003 2474309 2437722 2314740 2379455 2499803 2452952 2457832 2485973 2447055 2315106
14334 2315106 2363302 2399117 2378881 2402341 2393482 2390483 2339192 2382916 2434974 2481959 2515467 2417218
14322 2417218 2428318 2419834 2383548 2414431 2392969 2395781 2355640 2278478 2286860 2303319 2373645 2355910
14310 2355910 2406084 2434424 2443173 2470773 2517265 2549972 2433838 2434188 2411533 2346435 2308082 2328856
14298 2328856 2455392 2469053 2396074 2382592 2350561 2445546 2440198 2418225 2382043 2306686 2273023
14287 2273023 2314111 2422420 2464923 2477654 2433234 2467612 2363074 2392722 2424533 2406072 2438439
14276 2438439 2533014 2424235 2384002 2377591 2501215 2525235 2436939 2387555 2369533 2368982 2403196
14265 2403196 2365417 2400802 2325231 2376556 2466656 2440870 2380127 2291236 2329197 2301433 2329573
14254 2329573 2420546 2385785 2355881 2359946 2350594 2420383 2411458 2354263 2294786 2307219 2329243 2346386
14242 2346386 2400805 2439434 2368133 2406825 2404401 2389035 2399348 2431587 2463845 2428840 2423858 2363505
14230 2363505 2421703 2445338 2428401 2390736 2384707 2576792 2411188 2406881 2373407 2464573 2451303
14219 2451303 2416933 2437553 2403414 2424481 2471680 2562249 2554532 2423898 2401788 2447944 2401407
14208 2401407 2390742 2448853 2478051 2367170 2319667 2335061 2370878 2462601 2492543 2461330 2445089
14197 2445089 2444191 2384479 2341483 2353650 2381740 2402136 2402913 2417027 2425147 2392532 2412564 2525034
14185 2525034 2465505 2407615 2479859 2507312 2555476 2527481 2453596 2443165 2492544 2472189 2417855
14174 2417855 2322865 2369113 2385557 2303534 2339531 2351032 2400299 2453909 2371434 2425362 2460691
14163 2460691 2469688 2434841 2410910 2397069 2416488 2443016 2403494 2400442 2371805 2457781 2487160 2535431
14151 2535431 2566751 2504252 2587925 2544197 2519473 2474542 2394902 2339503 2424308 2472757 2448065
14140 2448065 2511269 2408713 2318748 2369737 2388410 2308189 2288444 2246862 2370157 2356915 2413938
14129 2413938 2457334 2454064 2414955 2378368 2453187 2493569 2440672 2373293 2361492 2427375 2456809
14118 2456809 2401229 2393144 2485560 2482299 2436560 2454562 2515371 2467989 2423348 2441409 2489567 2423670
14106 2423670 2414485 2382032 2396863 2406155 2448923 2505206 2421702 2350564 2316698 2345803 2380117 2379486
14094 2379486 2361197 2423039 2565816 2567457 2467588 2457951 2412259 2435180 2466052 2498066 2495326 2402883
14082 2402883 2417437 2440607 2415356 2420679 2520462 2581184 2495977 2503638 2541353 2557346 2500267 2448730
14070 2448730 2501222 2472594 2455627 2467141 2485781 2497333 2441348 2442219 2424349 2533091 2564348
14059 2564348 2543814 2564967 2546123 2549525 2454754 2401066 2323624 2343947 2474595 2406622 2403679
14048 2403679 2390757 2408209 2387604 2395375 2424296 2339885 2334808 2288164 2352212 2423436 2459630 2479621
14036 2479621 2453249 2486236 2565647 2559370 2551366 2483730 2506189 2543209 2506724 2545618 2647069
14025 2647069 2562221 2550976 2571870 2533287 2532455 2542853 2525803 2551942 2539867 2442338 2407457 2451140
14013 2451140 2515710 2441822 2486784 2503760 2516129 2494436 2429055 2459871 2475109 2375259 2391597
14002 2391597 2486676 2520904 2469946 2507437 2490331 2371315 2289157 2404296 2541452 2556731 2520831
13991 2520831 2470635 2450753 2463813 2436760 2466259 2476760 2395950 2397964 2491540 2467474 2493566
13980 2493566 2598761 2532000 2571612 2594997 2577325 2537683 2540222 2588390 2530053 2467492 2455803
13969 2455803 2498972 2520363 2545600 2475528 2416494 2418237 2534362 2559990 2552506 2570572 2552300
13958 2552300 2500842 2448330 2446094 2475727 2462791 2436928 2489010 2590196 2512820 2435613 2505315
13947 2505315 2539094 2531628 2479332 2511599 2550087 2520830 2478709 2417523 2343358 2399342 2461346
13936 2461346 2480060 2568731 2490988 2472587 2495253 2490635 2405474 2376638 2424211 2364411 2379430
13925 2379430 2390099 2397868 2504757 2510787 2555821 2528647 2418144 2425629 2439493 2487337 2541908
13914 2541908 2568752 2628757 2637240 2603564 2628402 2523784 2526050 2450684 2477789 2519338 2505787
13903 2505787 2496796 2476335 2508216 2467412 2435219 2505226 2533134 2602551 2650943 2603284 2528984
13892 2528984 2429237 2422245 2490437 2505620 2576034 2554733 2529593 2571393 2572080 2616770 2656761 2639131
13880 2639131 2580082 2517019 2439095 2435259 2421964 2468844 2541184 2460984 2485368 2440633 2482961
13869 2482961 2496579 2519614 2475915 2469474 2459419 2503153 2490236 2518765 2480459 2402214 2463812
13858 2463812 2465781 2475524 2466806 2438535 2457201 2479247 2414460 2471327 2506462 2486424 2420466 2464238
13846 2464238 2470884 2507925 2516886 2524902 2522450 2514426 2478559 2386350 2449326 2496036 2458616 2482356
13834 2482356 2616642 2502463 2512599 2534256 2491017 2532116 2470654 2473693 2445986 2484289 2539998
13823 2539998 2578271 2551891 2480574 2429301 2483801 2434451 2436126 2478738 2516079 2538118 2562616
13812 2562616 2464854 2424374 2341840 2370707 2424527 2476773 2511994 2505445 2521645 2555748 2559669 2520841
13800 2520841 2481811 2513645 2521928 2551106 2493977 2470850 2514520 2570405 2608221 2539084 2526184
13789 2526184 2555545 2571231 2619847 2528324 2453176 2497779 2478451 2512162 2585974 2597060 2526837
13778 2526837 2562019 2487757 2497037 2452206 2475890 2568783 2630080 2642924 2667640 2547361 2484745
13767 2484745 2493520 2499219 2507838 2468062 2468396 2550499 2528659 2511587 2529246 2555452 2577553 2599589
13755 2599589 2558349 2561271 2584446 2473430 2549439 2591662 2540706 2541925 2513602 2586548 2590021 2578678
13743 2578678 2560442 2474117 2445800 2443449 2406709 2505635 2493071 2462675 2492104 2492168 2449175 2451581
13731 2451581 2531220 2543002 2570529 2501921 2498086 2513844 2537612 2538796 2512992 2554489 2514190 2521334
13719 2521334 2535379 2424988 2424007 2391962 2420947 2442631 2517794 2508366 2490076 2417491 2472106 2376629
13707 2376629 2373796 2387431 2408348 2433288 2357147 2433368 2423598 2414848 2407263 2363543 2467347 2612730
13695 2612730 2546951 2524282 2617477 2663643 2636449 2607018 2639505 2629628 2588396 2518760 2503082
13684 2503082 2458348 2542511 2544252 2555198 2570382 2497687 2519367 2486113 2601436 2485911 2483306
13673 2483306 2437834 2443229 2631111 2645534 2574454 2515260 2514638 2623130 2635535 2573931 2554769
13662 2554769 2552419 2645797 2637035 2611971 2609346 2617608 2569834 2460851 2482512 2487882 2496629 2535545
13650 2535545 2630921 2713120 2653884 2513139 2531902 2486141 2506482 2520059 2553122 2455837 2444490
13639 2444490 2584080 2486524 2511534 2529640 2508260 2553899 2647290 2604961 2472532 2437026 2514120
13628 2514120 2540361 2485674 2417365 2455425 2469673 2548688 2593214 2513006 2496751 2583547 2703356
13617 2703356 2680525 2729134 2577154 2544387 2528908 2539026 2560229 2580968 2584370 2577706 2570143 2519694
13605 2519694 2534089 2455330 2494448 2521896 2591757 2552808 2540198 2530213 2579840 2625783 2542439
13594 2542439 2508214 2482249 2593492 2668112 2609283 2589344 2558638 2530020 2507942 2600673 2625563
13583 2625563 2614986 2536620 2561815 2556735 2605482 2586193 2539191 2677467 2724822 2528575 2570842
13572 2570842 2639971 2618040 2587468 2602690 2559536 2511394 2635902 2659776 2740355 2667723 2700274
13561 2700274 2680016 2623350 2556449 2537003 2592217 2557148 2614801 2674524 2534352 2486144 2541174
13550 2541174 2563794 2540531 2535432 2576350 2572586 2423547 2512805 2625699 2622325 2578451 2619675
13539 2619675 2554786 2604069 2611190 2594879 2595784 2555731 2614604 2581214 2543255 2536578 2501909 2448470
13527 2448470 2413090 2418645 2430435 2439092 2460465 2530174 2594134 2634372 2667314 2532851 2589735
13516 2589735 2613383 2620409 2570983 2534118 2469891 2525409 2545714 2510948 2563652 2572052 2636881 2564774
13504 2564774 2471760 2509951 2548102 2644059 2642512 2604381 2591313 2577803 2548137 2547144 2590888 2638481
13492 2638481 2592905 2565537 2517186 2490875 2476037 2496821 2566980 2508983 2526128 2533083 2482084
$$ [...]
##END NTUPLES=NMR SPECTRUM
##END=
