##TITLE=1H_CA-8803-1
 CDCl3, 8 sc, 
 24.12.2020
##JCAMPDX= 6.0         $$ Bruker NMR JCAMP-DX V2.0
##DATA TYPE= NMR SPECTRUM
##DATA CLASS= NTUPLES
##ORIGIN= UXNMR, Bruker Analytische Messtechnik GmbH
##OWNER= root
$$ XWIN-NMR		Version 3.5
$$ Thu Dec 24 11:45:36 2020 Russian Standard Time (UT+4h)  she@DPX200
##.OBSERVE FREQUENCY= 200.1315066352
##.OBSERVE NUCLEUS= ^1H
##.ACQUISITION MODE= SIMULTANEOUS
##.ACQUISITION SCHEME= undefined
##.AVERAGES= 8
##.DIGITISER RES= 18
##SPECTROMETER/DATA SYSTEM= spect
##.PULSE SEQUENCE= zg30
##.SOLVENT NAME= CDCl3
##.SHIFT REFERENCE= (INTERNAL, CDCl3, 0, 16.0528)
##AUDIT TRAIL= $$ (NUMBER, WHEN, WHO, WHERE, WHAT)
$$ ##TITLE= Audit trail, XWIN-NMR		Version 3.5
$$ ##JCAMPDX= 5.01
$$ ##ORIGIN= Bruker BioSpin GmbH
$$ ##OWNER= she
$$ F:/spectra/data/she/nmr/H-F/1/pdata/1/auditp.txt
$$ ##AUDIT TRAIL=  $$ (NUMBER, WHEN, WHO, WHERE, WHAT)
(   1,<2020-12-24 11:43:40.62 +0400>,<she>,<DPX200>,
      <created by zg, POWCHK disabled, PULCHK disabled
       configuration hash MD5:
       00 E9 B6 7A A2 85 ED C7 34 08 36 98 17 FE 4E 26
       data hash MD5: 16K
       37 57 16 B2 D1 27 2E BD AF 87 A1 20 B0 6C 37 5E>)
(   2,<2020-12-24 11:43:43.18 +0400>,<she>,<DPX200>,
      <Start of raw data processing
       efp BC_mod = 2 LB = 0.24 FT_mod = 6 PKNL = 1 PHC0 = -10761.87 PHC1 = 13.20095 SI = 16K 
       data hash MD5: 16K
       62 6B 1F 3B EE AA F0 36 61 89 C9 87 61 C9 2C 4C>)
(   3,<2020-12-24 11:44:22.57 +0400>,<she>,<DPX200>,
      <pk PHC0 = -0.5473978 PHC1 = -0.6 
       data hash MD5: 16K
       E9 14 CA 0B 09 67 F6 B0 25 F8 CB 0A AD E6 16 02>)
(   4,<2020-12-24 11:44:25.85 +0400>,<she>,<DPX200>,
      <abs ABSG = 5 
       data hash MD5: 16K
       49 6C 19 B0 19 41 9E 5A B9 3C AD A8 96 C0 15 86>)
$$ ##END=
$$ 
$$ hash MD5
$$ 35 1B 26 E1 66 53 0D 5D D7 42 EC C3 0E 1E FB 66
##$RELAX= 
##$RELAX= 
##$RELAX= 
##$RELAX= 
##$RELAX= 
##$RELAX= 
$$ Bruker specific parameters
$$ --------------------------
##$DU= <F:/spectra>
##$EXPNO= 1
##$NAME= <H-F>
##$PROCNO= 1
##$TYPE= <nmr>
##$USER= <she>
##$AMP= (0..31)
100 100 100 100 100 100 100 100 100 100 100 100 100 100 100 100 100 100 
100 100 100 100 100 100 100 100 100 100 100 100 100 100 
##$AQSEQ= 0
##$AQ_mod= 1
##$AUNM= <au_zg>
##$AUTOPOS= <>
##$BF1= 200.13
##$BF2= 200.13
##$BF3= 200.13
##$BF4= 200.13
##$BF5= 200.13
##$BF6= 200.13
##$BF7= 200.13
##$BF8= 200.13
##$BYTORDA= 1
##$CFDGTYP= 0
##$CFRGTYP= 5
##$CHEMSTR= <none>
##$CNST= (0..31)
1 1 145 1 1 1 1 1 1 1 1 1 1 1 1 1 1 1 1 1 1 1 1 1 1 1 1 1 1 1 1 1 
##$CPDPRG= <>
##$CPDPRG1= <>
##$CPDPRG2= <>
##$CPDPRG3= <>
##$CPDPRG4= <mlev>
##$CPDPRG5= <mlev>
##$CPDPRG6= <mlev>
##$CPDPRG7= <mlev>
##$CPDPRG8= <mlev>
##$CPDPRGB= <>
##$CPDPRGT= <>
##$D= (0..31)
0 1.2 0 0 0 0 0 0 0 0.06 0 0.03 0 0 0 0 0.0002 0 0 0 0 0 0 0 0 0 0 0 0 
0 0 0 
##$DATE= 1608795820
##$DBL= (0..7)
120 120 120 120 120 120 120 120 
##$DBP= (0..7)
150 150 150 150 150 150 150 150 
##$DBP07= 0
##$DBPNAM0= <>
##$DBPNAM1= <>
##$DBPNAM2= <>
##$DBPNAM3= <>
##$DBPNAM4= <>
$$ [...]
##$SUBNAM3= <"">
##$SUBNAM4= <"">
##$SUBNAM5= <"">
##$SUBNAM6= <"">
##$SUBNAM7= <"">
##$SUBNAM8= <"">
##$SUBNAM9= <"">
##$SW= 16.9725356469052
##$SWIBOX= (0..15)
0 0 2 0 0 0 0 0 0 0 0 0 0 0 0 0 
##$SW_h= 3396.73913043478
##$TD= 16384
##$TD0= 1
##$TE= 0
##$TE2= 300
##$TE3= 300
##$TEG= 300
##$TL= (0..7)
0 120 120 120 120 120 120 120 
##$TP= (0..7)
150 150 150 150 150 150 150 150 
##$TP07= 0
##$TPNAME0= <>
##$TPNAME1= <>
##$TPNAME2= <>
##$TPNAME3= <>
##$TPNAME4= <>
##$TPNAME5= <>
##$TPNAME6= <>
##$TPNAME7= <>
##$TPOAL= (0..7)
0.5 0.5 0.5 0.5 0.5 0.5 0.5 0.5 
##$TPOFFS= (0..7)
0 0 0 0 0 0 0 0 
##$TUNHIN= 0
##$TUNHOUT= 0
##$TUNXOUT= 0
##$USERA1= <user>
##$USERA2= <user>
##$USERA3= <user>
##$USERA4= <user>
##$USERA5= <user>
##$V9= 5
##$VALIST= <valist>
##$VCLIST= <CCCCCCCCCCCCCCC>
##$VD= 0
##$VDLIST= <DDDDDDDDDDDDDDD>
##$VPLIST= <PPPPPPPPPPPPPPP>
##$VTLIST= <TTTTTTTTTTTTTTT>
##$WBST= 1024
##$WBSW= 4
##$XGAIN= (0..3)
0 0 0 0 
##$XL= 0
##$YL= 0
##$YMAX_a= 684724
##$YMIN_a= -842762
##$ZGOPTNS= <>
##$ZL1= 120
##$ZL2= 120
##$ZL3= 120
##$ZL4= 120
##$ABSF1= 15.98439
##$ABSF2= -0.9882717
##$ABSG= 5
##$ABSL= 3
##$ALPHA= 0
##$AQORDER= 0
##$ASSFAC= 0
##$ASSFACI= 0
##$ASSFACX= 0
##$ASSWID= 0
##$AUNMP= <proc_1d>
##$AZFE= 0.1
##$AZFW= 0.1
##$BCFW= 0
##$BC_mod= 2
##$BYTORDP= 0
##$COROFFS= 0
##$CY= -3
##$DATMOD= 1
##$DC= 0
##$DFILT= <>
##$DTYPP= 0
##$F1P= 0
##$F2P= 0
##$FCOR= 1
##$FTSIZE= 16384
##$FT_mod= 6
##$GAMMA= 0
##$GB= 0
##$INTBC= 1
##$INTSCL= 2.992141e-10
##$ISEN= 128
##$LB= 0.24
##$LEV0= 0
##$LPBIN= 0
##$MAXI= 10000
##$MC2= 0
##$MEAN= 0
##$ME_mod= 0
##$MI= 1.114404
##$NCOEF= 0
##$NC_proc= -4
##$NLEV= 6
##$NOISF1= 3.799351
##$NOISF2= 2.8
##$NSP= 0
##$NTH_PI= 0
##$NZP= 0
##$OFFSET= 16.05276
##$PC= 1
##$PHC0= -10762.42
##$PHC1= 12.60095
##$PH_mod= 1
##$PKNL= yes
##$PPARMOD= 0
##$PSCAL= 0
##$PSIGN= 0
##$REVERSE= no
##$SF= 200.129992367231
##$SI= 16384
##$SIGF1= 3
##$SIGF2= 2
##$SINO= 5.538805
##$SIOLD= 16384
##$SREGLST= <1H.CDCl3>
##$SSB= 0
##$STSI= 16384
##$STSR= 0
##$SW_p= 3396.73913043478
##$SYMM= 0
##$S_DEV= 0
##$TDeff= 16384
##$TDoff= 0
##$TI= <>
##$TILT= no
##$TM1= 0
##$TM2= 0
##$TOPLEV= 0
##$USERP1= <user>
##$USERP2= <user>
##$USERP3= <user>
##$USERP4= <user>
##$USERP5= <user>
##$WDW= 1
##$XDIM= 16384
##$YMAX_p= 476329008
##$YMIN_p= -801654
$$ End of Bruker specific parameters
$$ ---------------------------------
##NTUPLES= NMR SPECTRUM
##VAR_NAME=  FREQUENCY,     SPECTRUM/REAL,   SPECTRUM/IMAG
##SYMBOL=    X,             R,               I
##VAR_TYPE=  INDEPENDENT,   DEPENDENT,       DEPENDENT
##VAR_FORM=  AFFN,          ASDF,            ASDF
##VAR_DIM=   16384,         16384,           16384
##UNITS=     HZ,            ARBITRARY UNITS, ARBITRARY UNITS
##FACTOR=    0.207333158178281, 1,           1
##FIRST=     3212.63857027161, 0,            0
##LAST=      -184.100560163168, 0,           0
##MIN=       -184.100560163168, -801654,     0
##MAX=       3212.63857027161, 476329008,    0
$$ Real data points
##PAGE= N=1
##DATA TABLE= (X++(R..R)), XYDATA
$$ [...]
7892C10677o6422n6001R70M5954J3123K5573m6793j6817j7065K7807J0136L183
$$ 310677 244255 188254 189224 235178 248301 273874 227081 210264 193199 221006 231142 234325
7880B34325j8769K95J2751q032m96J1510j7969k2537l0348L2758k9909K0532k2000
$$ 234325 215556 215851 228602 220570 220074 231584 213615 191078 160730 193488 163579 184111 162111
7867A62111P365j6747p311q292J8930J2203j8697L9739m0630L5973r250k3981
$$ 162111 169476 152729 145418 137126 156056 168259 149562 189301 148671 184644 175394 151413
7855A51413j9670J1997M732r575J0212q008j8771m3826J8980R999j6604L46j1963
$$ 151413 131743 143740 148472 138897 149109 141101 122330 78504 97484 107483 90879 91225 79262
7842G9262O719O195k3810K6153j2966P317k5482J1206j8910l942k0615P326Q047
$$ 79262 85981 92176 68366 94519 81553 88870 63388 74594 55684 51742 31127 38453 46500
7829D6500J563K7103j6891J2084o7032j0877L5467L9186L7528l9024j4270n585
$$ 46500 48063 75166 58275 70359 3327 -7550 27917 67103 104631 65607 51337 45752
7817D5752J3324J0771J0084j741q772k1018L982J8896l5855j837m5911N3451r51
$$ 45752 59076 69847 79931 78190 69418 48400 52382 71278 35423 33586 -12325 41126 40175
7804D0175p852l564l8990r844l6197K9416O2468k6891q660J2319J4163j4813m1626
$$ 40175 32323 28759 -10231 -20075 -56272 -26856 35612 8721 61 12380 26543 11730 -29896
7791b9896R416k3488o420J5736N6217J9758q9749Q384L6587l8320J5442K5519
$$ -29896 -20480 -43968 -50388 -34652 21565 41323 -48426 -40042 -3455 -41775 -26333 -814
7779h14P499o626j4652K1498N6743j0990j5785k4321k7852r639l118j341K9279
$$ -814 6685 59 -14593 6905 63648 52658 36873 12552 -15300 -24939 -28057 -29398 -119
7766a19Q494l7052K4724J4201R705J6475k2364M9070p0021j4510k667O532L3435
$$ -119 8375 -28677 -3953 10248 19953 36428 14064 63134 -6887 -21397 -24064 -17532 15903
7753A5903M010k227J732Q683n07j9281k7106O967K4407M3721N2382l6113k1171
$$ 15903 19913 17686 19418 28101 27594 8313 -18793 -11826 12581 56302 108684 72571 51400
7740E1400k1644K6804M141k7559J508k9051J1144L4271l062j9891k2473m1814
$$ 51400 29756 56560 60701 33142 34650 5599 16743 51014 47952 28061 5588 -36226
7728c6226J3072K0368j5325n610r962K788j25p131J9440j3957j5906M3407m407
$$ -36226 -23154 -2786 -18111 -23721 -33683 -30895 -31020 -38151 -18711 -32668 -48574 -5167 -9574
7715i574k3693J4339j6864M70r799P227K2593K2815K2308k382q528M512l0263
$$ -9574 -33267 -18928 -35792 -35322 -45121 -37894 -15301 7514 29822 27440 18912 23424 -6839
7702f839k7510M93L7089Q972K2161R707K4637j1318l7307n6711N0514l0939m748
$$ -6839 -34349 -33856 3233 12205 34366 44073 68710 57392 20085 -36626 13888 -17051 -21799
7689b1799j123K8336K0913l8469J1491J9412n4616k852Q510L9639N663N675j5102
$$ -21799 -22922 5414 26327 -12142 -651 18761 -35855 -38707 -30197 9442 15105 20780 5678
7676E678l891k5625O630k5274m192K4561J0936J8571M177j2542j4466j9676L8299
$$ 5678 1787 -23838 -17208 -42482 -46674 -22113 -11177 7394 11571 -971 -15437 -35113 3186
7663C186K6362j775j4037K667K135k5585k0908L493k2830n830M8217M6523L0549
$$ 3186 29548 27773 13736 16403 18538 -7047 -27955 -24462 -47292 -53122 -4905 41618 72167
7650G2167l7806k1931k8326l624J0850N2905k280j3175j0330k6581J3188j2852
$$ 72167 34361 12430 -15896 -19520 -8670 44235 41955 28780 18450 -8131 5057 -7795
7638g795l9962N4305J0588L3365m0581N576M008p716n02N3133k9105j3443m8802
$$ -7795 -47757 6548 17136 50501 9920 15496 19504 11788 11286 64419 35314 21871 -26931
7625b6931K9530K086o981j6891j5166m3452J1356L1198M3621J9034j8449m0932
$$ -26931 2599 4685 -2296 -19187 -34353 -77805 -66449 -35251 8370 27404 8955 -31977
7613c1977J1861O186k8679J1148k2498L5563L2869p326m9791j5308j4473N870
$$ -31977 -20116 -13930 -42609 -31461 -53959 -18396 14473 7147 -42644 -57952 -72425 -66555
7601f6555j5017L4888l0528K1036K6024L2518K89l6059j2391j6042J4705K0201
$$ -66555 -81572 -46684 -77212 -56176 -30152 2366 2655 -33404 -45795 -61837 -47132 -26931
7589b6931K0398M289J60k4594j4711j4618K290P138L2629L5159j4795j7003J5804
$$ -26931 -6533 -2244 -2084 -26678 -41389 -56007 -53717 -46579 -13950 21209 6414 -10589 5215
7576E215j5571r14k3526P025K1352K2842k5758k1241l08J2713r414J9335M381
$$ 5215 -10356 -11270 -34796 -27771 -6419 16423 -9335 -30576 -30884 -18171 -27585 -8250 -3869
7563c869k9104j4665k6193K8934N2851j0982l9725k3231j5640K6361r510N597
$$ -3869 -32973 -47638 -73831 -44897 7954 -3028 -42753 -65984 -81624 -55263 -64773 -59176
7551e9176j2318N497q824J6355j3532L63l326K3615j8173k8583k975L1564p336
$$ -59176 -71494 -65997 -74821 -58466 -71998 -71635 -74961 -51346 -69519 -98102 -101077 -69513 -76849
7538g6849K0632l3248m1948J3976O0221O398l455l701n8762k3422J8434L7622
$$ -76849 -56217 -89465 -131413 -117437 -57216 -50818 -54273 -57974 -116736 -140158 -121724 -84102
7526h4102M8984L3236K3700m4911m2239k7805k7666N123j0634J9798O5141K3283
$$ -84102 -35118 -1882 21818 -23093 -65332 -93137 -120803 -115680 -126314 -106516 -41375 -18092
7514a8092j129n277k6811L0052j6660J5821J7658l410j3800L9611k7353J0009
$$ -18092 -19221 -24498 -51309 -21257 -37917 -22096 -4438 -7848 -21648 17963 -9390 619
7502F19m2769j4866q193L8693K3500p851K187l2671r211L7729K6340L1584K3806
$$ 619 -42150 -57016 -65209 -26516 -3016 -10867 -8680 -41351 -50562 -12833 13507 45091 68897
7489F8897k9642l0986j2021R080k186j4142l410j7685N746J8440M0518L530o1824
$$ 68897 39255 8269 -3752 5328 3142 -11000 -14410 -32095 -26349 -7909 32609 36139 -25685
7476b5685K1436L48k811l9046L3521J5339J9630R191J5644l7666J7179R838O906
$$ -25685 -4249 -3901 -6712 -45758 -12237 3102 22732 31923 47567 9901 27080 36918 43824
7463D3824K8388m6974j8770l0408J1855J4237l881K7962K1290J853m1837n4873
$$ 43824 72212 25238 6468 -23940 -12085 2152 -1729 26233 47523 49376 7539 -47334
7451d7334k0440j4821K4357L5422K7680j7852j1871k0636J6403l395k555O530
$$ -47334 -67774 -82595 -58238 -22816 4864 -12988 -24859 -45495 -29092 -32487 -35042 -28512
7439b8512j7260K8342K1646M8492k5107j3053l8654r805P474J0170j4042l910
$$ -28512 -45772 -17430 4216 52708 27601 14548 -24106 -33911 -26437 -16267 -30309 -34219
7427c4219L6308M2121M9786j9722k3972j5459k6490J4450l3903k6651l0870L2724
$$ -34219 2089 44210 93996 74274 50302 34843 8353 22803 -11100 -37751 -68621 -35897
7415c5897M9787O7790l8068n2812J0351p768K0764J7490j072j6803J1696L8637
$$ -35897 13890 81680 43612 -9200 1151 -6617 14147 31637 30565 13762 25458 64095
7403F4095j5490o2932l5571p468L6286j2275Q668m1314R890Q2437J3106K948k7803
$$ 64095 48605 -14327 -49898 -57366 -21080 -33355 -24687 -66001 -56111 26326 39432 42380 14577
7390A4577p5815J0903N0038M436r310l1113k1981J6793k0589O650o798K6158K5201
$$ 14577 -61238 -50335 -297 4139 -5171 -36284 -58265 -41472 -62061 -55411 -62209 -36051 -10850
7377a0850j7219M269l799M479K532K6330O261K744l7863k0143j0327k2072L93
$$ -10850 -28069 -23800 -27599 -23120 -20588 5742 12003 14747 -23116 -43259 -53586 -75658 -75265
7364g5265k2005K1881N987L6290j8920R816L7181J5139j3328J9619p503J4488
$$ -75265 -97270 -75389 -69402 -33112 -52032 -42216 -5035 10104 -3224 16395 8892 23380
7352B3380k3021j4002j9485K6497k2207L0799K8384P07j3359l0641J9422P170
$$ 23380 359 -13643 -33128 -6631 -28838 1961 30345 31052 17693 -12948 6474 13644
7340A3644M7355J6284o745P160m3222J2411j6578p692K595K5786J935n284o0139
$$ 13644 60999 77283 70538 77698 34476 46887 30309 22617 25212 50998 52933 47649 -12490
7327a2490q417O3059M6454K3031l4774J5956l6993P463K3031m8666R164j7561
$$ -12490 -20907 42152 88606 111637 76863 92819 55826 63289 86320 37654 46818 29257
7315B9257o211N3563k4656m8758o1153M1050K4282M145n656L2854j9978k972o556
$$ 29257 23046 76609 51953 3195 -57958 -16908 7374 11519 5863 38717 18739 15767 9211
7302I211m467P113m3374l7876J1758J5675Q494P407l0202N605l5770j8706M7731
$$ 9211 4744 11857 -31517 -69393 -57635 -41960 -33466 -26059 -56261 -50656 -86426 -105132 -57401
7289e7401n154L477J7229J2959J3556p708n8775K159K4355q906l1098o0769J8673
$$ -57401 -62555 -59078 -41849 -28890 -15334 -23042 -81817 -79658 -55303 -64209 -95307 -156076 -137403
7276a37403J5394R717O5783j01j666m040M1289J1404q081j9544j2299o4Q21k3229
$$ -137403 -122009 -112292 -46509 -46610 -48276 -52316 -11027 377 -7704 -27248 -39547 -39611 -38790 -62019
7262f2019p068j111K4983J005j6130k2073K5016M103M3918J5902J3550N846q055
$$ -62019 -69087 -70198 -45215 -44210 -60340 -82413 -57397 -53294 -9376 6526 20076 25922 17867
7249A7867j5826q31l3552k9805O715M5614j8892M047j523j4545J9002N6575j3514
$$ 17867 2041 1210 -32342 -62147 -55432 -9818 -28710 -24663 -26186 -40731 -21729 34846 21332
7236B1332l6311L0328K3026J9760k5081k8373l5571k1131N1974P684k2255P543
$$ 21332 -14979 15349 38375 58135 33054 4681 -30890 -52021 -47 7637 -14618 -7075
7224g075k7683l5472l5618O3039M0771J0437N1160l5474q3254K9567n1007j2586
$$ -7075 -34758 -70230 -105848 -42809 -2038 8399 59559 24085 -59169 -29602 -80609 -93195
7212i3195J8836l628R325J9201j4189l1190l734K7237L744J5696K3893n1860K0353
$$ -93195 -74359 -77987 -68662 -49461 -63650 -94840 -98574 -71337 -67593 -51897 -28004 -79864 -59511
7199e9511N6721k042k0090k0873j7258k6597J6851j2589n729k7745K0144L0663
$$ -59511 -2790 -4832 -24922 -45795 -63053 -89650 -72799 -85388 -91117 -118862 -98718 -68055
7187f8055Q611p295M376J0260J7250J9819L881m9731k373j1786j6439N4913L2172
$$ -68055 -59444 -66739 -62363 -52103 -34853 -15034 -11153 -60884 -63257 -75043 -91482 -36569 -4397
7174d397k9202j9793n532J6636J3527j103J4134O112p746L3262k1929K7808j771
$$ -4397 -33599 -53392 -58924 -42288 -28761 -29864 -15730 -9618 -17364 15898 -6031 21777 20006
7161B0006p00p592j6240m5732L3209M3370J6336j624k0992k9509O580k4277l23
$$ 20006 19306 11714 -4526 -50258 -17049 26321 42657 41033 20041 -9468 -2888 -27165 -27488
7148b7488J8171k1349k4191K1353m245J2797m0808K9252J8933n5915m669j4894
$$ -27488 -9317 -30666 -54857 -33504 -37749 -24952 -65760 -36508 -17575 -73490 -78159 -93053
7136i3053K0387M3531l933k6783j1998L4173P83k0574k2790J7232p327n6926M5151
$$ -93053 -72666 -29135 -33068 -59851 -71849 -37676 -36893 -57467 -80257 -63025 -70352 -127278 -82127
7123h2127m98J3120j6179L9691J5808j5213m1035K9956j3190J8300M1094l1476
$$ -82127 -82625 -69505 -85684 -45993 -30185 -45398 -86433 -56477 -69667 -51367 -10273 -41749
7111d1749j7137P323j1775m51L8146n514j4188L0885j5369M632P296m86l40O543
$$ -41749 -58886 -51563 -63338 -63789 -25643 -31157 -45345 -14460 -29829 -25197 -17901 -18387 -18727 -12184
7097a2184l1677O0611l1545k3454m2090J7398M5585j4200k0617m527j5668J4599
$$ -12184 -43861 16750 -14795 -38249 -80339 -62941 -17356 -31556 -52173 -56700 -72368 -57769
7085e7769M8296O565k3598m1617J610O3528j6730l0594Q269n308J4911n91n450
$$ -57769 -9473 -2908 -26506 -68123 -66513 -2985 -19715 -50309 -42040 -47348 -32437 -33028 -38478
7072c8478p424l1806p94K750O1653n794j8369R253l3458k5772K62J0560j7139
$$ -38478 -45902 -77708 -78502 -75752 -14099 -19893 -38262 -29009 -62467 -88239 -87977 -77417 -94556
7059i4556K9509j4374j7779J7725j0214K3371Q529M1358l5595J7386m0068j520
$$ -94556 -65047 -79421 -97200 -79475 -89689 -66318 -57789 -16431 -52026 -34640 -74708 -76228
7047g6228J4072k1982J9021K4427k1099P499l04m4621K0369K7097j471J6614k4415
$$ -76228 -62156 -84138 -65117 -40690 -61789 -54290 -54594 -99215 -78846 -51749 -53220 -36606 -61021
7034f1021j0070L2389L0357k8006J7612K5213k7411J677n3598k5493n213P9139
$$ -61021 -71091 -38702 -8345 -36351 -18739 6474 -20937 -19260 -72858 -98351 -103564 -24425
7022b4425K3934K0593m3788j6031l4234O4495l2561j831l7037N5085L6632m860
$$ -24425 -491 20102 -23686 -39717 -73951 -9456 -42017 -43848 -80885 -25800 10832 5972
7010E972k3003m6985l1894M6735J8221l210m8400L1506O7400N767R585l2222m7783
$$ 5972 -17031 -64016 -95910 -49175 -30954 -34164 -82564 -51058 16342 22109 31694 -528 -48311
6997d8311J8173L2250j96k6395o3723R791M486J02522j1167n5983m6171J7628
$$ -48311 -30138 2112 1916 -24479 -88202 -78411 -73925 28597 17430 -38553 -84724 -67096
6985f7096J3134M1599K03m8770J5519M4989K5346m3949k0401j4205J4651K0552
$$ -67096 -53962 -12363 -12160 -60930 -45411 -422 24924 -19025 -39426 -53631 -38980 -18428
6973a8428j5614l1102n412J2282Q252Q347K2651J5308k2559k8493r312j9608K7326
$$ -18428 -34042 -65144 -70556 -58274 -50022 -41675 -19024 -3716 -26275 -54768 -64080 -83688 -56362
6960e6362k6261L1036N352J3110Q55r205k8508k104j9880L8234K7555N169P189
$$ -56362 -82623 -51587 -46235 -33125 -32270 -41475 -69983 -72087 -91967 -53733 -26178 -21009 -13820
6947a3820q503j531M5556j6241j3053m1116j0392M6103n979r63m0594K8372L3702
$$ -13820 -22323 -23854 21702 5461 -7592 -48708 -59100 -12997 -18976 -19939 -60533 -32161 1541
6934A541K9914j8535k3410k978O3764R728o858n7740l4670o568M3863j08j6331
$$ 1541 31455 12920 -10490 -13468 50296 60024 53166 -4574 -39244 -45812 -1949 -2057 -18388
6921a8388l2363o297o88P0690m2592m3155J1949J3492O432J5406J5843k8155L7158
$$ -18388 -50751 -57048 -57736 12954 -29638 -72793 -60844 -47352 -40920 -25514 -9671 -37826 -668
6908f68J1396L455m5162n5710j840n451L1575L9116m2654K88j6168J1163L1190
$$ -668 10728 14183 -30979 -86689 -88529 -93980 -62405 -23289 -65943 -65655 -81823 -70660 -39470
6895c9470j2290J106l1555L226J2717R317k6718L846k8278K1952K8118J9690n414
$$ -39470 -51760 -50654 -82209 -78983 -66266 -56949 -83667 -79821 -108099 -86147 -58029 -38339 -43753
6882d3753m2391n2283j4783Q7323N6198M932J7828l6152J7881l2410k6325k7524
$$ -43753 -86144 -138427 -153210 -65887 -9689 -4757 13071 -23081 -5200 -37610 -63935 -91459
6870i1459M209K0674P3535L1920m2428j5367n9163K8301N6435J5440j6471m3788
$$ -91459 -87250 -66576 6959 38879 -3549 -18916 -78079 -49778 6657 22097 5626 -38162
6858c8162K231J8026L6886m707l3892m0332L2525K2742j4678j2359n4229M877
$$ -38162 -35931 -17905 18981 14274 -19618 -59950 -27425 -4683 -19361 -31720 -85949 -81072
6846h1072M5130J8244J1669o792m2524L2969j072J4983k7709J0684j1565L8530
$$ -81072 -35942 -17698 -6029 -12821 -55345 -22376 -23448 -8465 -36174 -25490 -37055 1475
6834A475j5677l3597o061L7608J9144L6430n1982m1384k227r012L7670K7924k1637
$$ 1475 -14202 -47799 -53860 -16252 2892 39322 -12660 -54044 -56271 -65283 -27613 311 -21326
6821b1326M857k1230P904j2513J1062k771j6730M5656L2243k5681o749J0528n0577
$$ -21326 -16469 -37699 -29795 -42308 -31246 -34017 -50747 -5091 27152 1471 -5278 5250 -45327
6808d5327j9622j7523M6661K9094l0793m6359j9384J5217L1995J5984k5395j5277
$$ -45327 -64949 -82472 -35811 -6717 -37510 -83869 -103253 -88036 -56041 -40057 -65452 -80729
6796h0729M8127J6144J7808m3384l3718n961N5322K964K353j1655k7233M8159
$$ -80729 -32602 -16458 1350 -42034 -75752 -81713 -26391 -23427 -21074 -32729 -59962 -11803
6784a1803J9416k8346n7851n5616K3289Q4942O2410J4821p6418o8619N800L107
$$ -11803 7613 -20733 -78584 -134200 -110911 -25969 36441 51262 -25156 -93775 -87975 -84868
6772h4868L8113l7085k3981Q0426Q978j9793l2814j6241L2298K8750J1419j7712
$$ -84868 -46755 -83840 -107821 -27395 -18417 -38210 -71024 -87265 -54967 -26217 -14798 -32510
6760c2510m6261M230Q515J9668k4345k5047J781M0793o93j6470k8362K7732J1644
$$ -32510 -78771 -74541 -66026 -46358 -70703 -95750 -93969 -53176 -53869 -70339 -98701 -70969 -59325
6747e9325Q689K3407j7738P176J9683J9126k4170R700m401Q950J6862j0621k8551
$$ -59325 -50636 -27229 -44967 -37791 -18108 1018 -23152 -13452 -17853 -8903 7959 -2662 -31213
6734c1213j1465L8180L8715k0110O359J1354j8805m6856M3013J106K5015k0449
$$ -31213 -42678 -4498 34217 14107 20466 31820 13015 -33841 9172 10278 35293 14844
6722A4844R083J5713J3679j9492k6888L3643l8353j5938k3716L6798M3159L9408
$$ 14844 23927 39640 53319 33827 6939 40582 2229 -13709 -37425 -627 42532 81940
6710H1940k8084j3461m3169K4523J3130m9908j8150O368K2150K5651j3108l1648
$$ 81940 53856 40395 -2774 21749 34879 -15029 -33179 -26811 -4661 20990 7882 -23766
6698b3766p837L2973J598M758l2422k4128k9641M3809k2373J0859j5891K1555
$$ -23766 -31603 1370 2968 7726 -24696 -48824 -78465 -34656 -57029 -46170 -62061 -40506
6686d0506N0812K048m5384r6670N554K9289P8153M3510J6416m2390l7627l7349
$$ -40506 10306 12354 -33030 -129700 -124146 -94857 -16704 26806 43222 832 -36795 -74144
6674g4144J3554K9201n491K2991N0791l6302l8579p0O067L4549K9996K5310L4726
$$ -74144 -60590 -31389 -36880 -13889 36902 600 -37979 -38049 -31982 2567 32563 57873 92599
6661I2599l7280p244j2137j0732l396J0686J0195j867O05k6908J2792L3326j9912
$$ 92599 55319 48075 35938 25206 21810 32496 42691 40824 41429 14521 27313 60639 40727
6648D0727k1059J935N1479K8965l6636o9642K8069K0730N5262q443N048n4131
$$ 40727 19668 21603 73082 102047 65411 -4231 23838 44568 99830 91387 96435 42304
6636D2304p1464l403L8448K2469j1620J2201K4896l822J6960p7309j2981k9016
$$ 42304 -29160 -32563 5885 28354 16734 28935 53831 50009 66969 -10340 -23321 -52337
6624e2337r547J1959P400N361l582J4558k6847J9242l6667n3583J0243P1001K1629
$$ -52337 -61884 -49925 -42525 -37164 -40746 -26188 -53035 -33793 -70460 -124043 -113800 -42799 -21170
6611b1170J535l0534n6085K0957K4457J7384j9236j6661j4355R534M9625n6620
$$ -21170 -19635 -50169 -106254 -85297 -60840 -43456 -62692 -79353 -93708 -84174 -34549 -91169
6599i1169k5285O363P2871N1659M231l6066k0757k9825j7234K1455L1277L2877
$$ -91169 -116454 -110091 -37220 14439 18670 -17396 -38153 -67978 -85212 -63757 -32480 397
6587C97L4809Q053k7822m0372l369L4824o103p994P922n793Q372k5073K6251k863
$$ 397 35206 43259 15437 -24935 -28304 6520 417 -7577 345 -5448 2924 -22149 4102 1239
6573A239L3899m0985l871k6485K2482o123J3775O261m3258l0430J8091K5195K6526
$$ 1239 35138 -5847 -9718 -36203 -13721 -19844 -6069 192 -43066 -73496 -55405 -30210 -3684
6560c684m4222J6589k299M955p673K1715k4920r871p435K8686J0508m5751p16
$$ -3684 -47906 -31317 -33616 -28661 -36334 -14619 -39539 -49410 -56845 -28159 -17651 -63402 -64118
6547f4118l88M6481q307k3601l6349M7010M0638l904k4437n7305J1726K9924k72
$$ -64118 -64506 -18025 -26332 -49933 -86282 -39272 1366 -2538 -26975 -84280 -72554 -42630 -42902
6534d2902K5556l0196k419K3675L1894l4676J0451l1868N4665J6099M0424k631
$$ -42902 -17346 -47542 -49961 -26286 5608 -29068 -18617 -50485 4180 20279 60703 58072
6522E8072o4920k4960O481J4469K5739k1307R5M497o33m7447L430j6760J8708
$$ 58072 -6848 -31808 -25327 -10858 14881 -6426 -6331 -1834 -2467 -49914 -46484 -63244 -44536
6509d4536K2087L033k0971J2796L6277l7367j5215l4152M2504K5154L485l1723
$$ -44536 -22449 -19416 -40387 -27591 8686 -28681 -43896 -78048 -35544 -10390 -6905 -38628
6497c8628k1465l0186J1357L4258k156m64k401k7047K2466K899j999m5289K9840
$$ -38628 -60093 -90279 -78922 -44664 -46820 -47284 -49685 -76732 -54266 -51367 -53366 -98655 -68815
6484f8815L8927K4554O6n0994k5077J4032M1662L2924J6509j7696j1441M24k4158
$$ -68815 -29888 -5334 -5268 -56262 -81339 -67307 -25645 7279 23788 6092 -5349 -4925 -29083
6471b9083j3073p063K4693L5367L5341M0342l4467l6988k7072M4367K276o133
$$ -29083 -42156 -49219 -24526 10841 46182 86524 52057 15069 -12003 32364 34640 28507
6459B8507O531J3920J0789K2139l6365l6917o967K132K0644L2554j4324l2257
$$ 28507 35038 48958 59747 81886 45521 8604 1637 3769 24413 56967 42643 10386
6447A0386j1685J8862K3115l128l613k6381p291J5995l5569l4723n361L4267n844
$$ 10386 -1299 17563 40678 37550 33937 7556 265 16260 -19309 -54032 -59393 -25126 -30970
6434c0970q078K4515o477j8862m1135j1903L5027j4124j0759K6027k2734K2016
$$ -30970 -39048 -14533 -21010 -39872 -81007 -92910 -57883 -72007 -82766 -56739 -79473 -57457
6422e7457J291o063r821k3077l7008J1352M2193J5583K7842j6664k5089J4358
$$ -57457 -56166 -62229 -72050 -95127 -132135 -120783 -78590 -63007 -35165 -51829 -76918 -62560
6410f2560j4957Q845K6577J0606N759n1009J6214l3619j5507K6650M1195P758
$$ -62560 -77517 -68672 -42095 -31489 -25730 -76739 -60525 -94144 -109651 -83001 -41806 -34048
6398c4048J7946q975J0167k4867k5572J3114L0298J9233K8369j809j3546n029
$$ -34048 -16102 -25077 -14910 -39777 -65349 -52235 -21937 -2704 25665 23856 10310 5281
6386E281L366o00J4757j708l6991n751P730k4937O842m42L2436J3886m3733m817
$$ 5281 8647 8047 22804 21096 -15895 -21646 -13916 -38853 -32011 -32453 -17 13869 -29864 -34681
6372c4681n2213K7706k5548K2390j5371K5379J7096M8299m1010j6481k2367L7318
$$ -34681 -86894 -59188 -84736 -62346 -77717 -52338 -35242 13057 -27953 -44434 -66801 -29483
6360b9483K8485J0614n7500j6293K1115L7987k6976j3951n8984K1216J7688k0253
$$ -29483 -998 9616 -47884 -64177 -43062 -5075 -32051 -46002 -104986 -83770 -66082 -86335
6348h6335j9562o020K4942O0906N1825n3423j5642l3486J8047N577N498k0951
$$ -86335 -105897 -111917 -86975 -26069 25756 -27667 -43309 -76795 -58748 -53171 -47673 -68624
6336f8624l0049J8683K9267j5192K7370p259k6377k065K6743j6348M5074n629
$$ -68624 -98673 -79990 -50723 -65915 -38545 -45804 -72181 -74246 -47503 -63851 -18777 -24406
6324b4406L8920r822j4843K1651j9794j7221m8861j2741n71O2949j0394m221j4566
$$ -24406 14514 4692 -10151 11500 -8294 -25515 -74376 -87117 -87688 -24739 -35133 -39354 -53920
6311e3920K338K1419J5331J6644m4580J0589L2219J5087j3069k3852p3430K8420
$$ -53920 -51582 -30163 -14832 1812 -42768 -32179 40 15127 2058 -21794 -95224 -66804
6299f6804M1981j8312j9732M72K5925K6899K5010P466q54l1054j5656K4393n969
$$ -66804 -24823 -43135 -62867 -62395 -36470 -9571 15439 22905 22051 -9003 -24659 -266 -6235
6286f235M781J1677L389k7682j5011k2183J4060O397L0114Q418k204Q98j2490
$$ -6235 -1454 10223 13612 -14070 -29081 -51264 -37204 -30807 -693 7725 5521 6419 -6071
6273f071m916N0326j6086j9310r025R09n23j6506J8494o318J4149L781o104L5758
$$ -6071 -10987 39339 23253 3943 -5082 -4173 -4696 -21202 -2708 -9026 5123 8904 2800 38558
6259C8558l307j1605l4780j0356K2388K2857M1768k3617m4286l9655J1325j8205
$$ 38558 35251 23646 -11134 -21490 898 23755 65523 41906 -2380 -42035 -30710 -48915
6247d8915K3107K1092K8092j2313J3416k454J3885J5207l8604j06l288n158o571
$$ -48915 -25808 -4716 23376 11063 24479 22025 35910 51117 12513 12407 9119 3961 -2610
6234b610j6872K108n58M9611M060m4621k0166j5327j2385L7708L298J1869K4994
$$ -2610 -19482 -17374 -17932 31679 35739 -8882 -29048 -44375 -56760 -19052 -15754 -3885 21109
6221B1109K9745J3440q3285l1699j9595K3379L5917K5717k0412k2916o102L591
$$ 21109 50854 64294 -18991 -50690 -70285 -46906 -10989 14728 -5684 -28600 -34702 -31111
6209c1111M0568L9456j1514l8217J9590K814j7815m6395k5487L9402O2546K5999
$$ -31111 9457 48913 37399 -818 18772 21586 3771 -42624 -68111 -28709 33837 59836
6197E9836o6317l6416k0915M4827L3880l2364j4295J57L0719K3184k3335j3550
$$ 59836 -6481 -42897 -63812 -18985 14895 -17469 -31764 -31607 -888 22296 -1039 -14589
6185a4589j7738k8393J0497K9723P705k3487o0391J6126K1385O1101j7161m366
$$ -14589 -32327 -60720 -50223 -20500 -12795 -36282 -96673 -80547 -59162 1939 -15222 -19588
6173a9588L4591j255l9996n3609q306k9968L0494K7276L9497J4895m9933l4584
$$ -19588 15003 13748 -26248 -79857 -88163 -118131 -87637 -60361 -20864 -5969 -55902 -90486
6161i0486J2287K7376k8187K813l7513K5624J1501N8126K3058l4097k4215n3853
$$ -90486 -78199 -50823 -79010 -76197 -113710 -88086 -76585 -18459 4599 -29498 -53713 -107566
6149a07566R909K0580J2500m4762j619N244P7181O7289k5839n4511j9167l870
$$ -107566 -97657 -77077 -64577 -109339 -110958 -105714 -28533 38756 12917 -41594 -60761 -64631
6137f4631Q263j1267o0931l1171O1603N1648L3421l9462n743L847K9194l0192
$$ -64631 -56368 -67635 -128566 -159737 -98134 -46486 -13065 -52527 -58270 -54423 -25229 -55421
6125e5421m72r498K0468K8297n342j8499l7349l1938M1655R045l8866l248j8361
$$ -55421 -55893 -65391 -44923 -16626 -21968 -40467 -77816 -109754 -68099 -59054 -97920 -101168 -119529
6112a19529K5255M9861N710K8820l6586q489o669j7537k9920j4331L4662M2857
$$ -119529 -94274 -44413 -38703 -9883 -46469 -54958 -61627 -79164 -109084 -123415 -88753 -45896
6100d5896J1109n0885k9990L781L9024O4076k4933L62j0694J9796k193J0554l7901
$$ -45896 -34787 -85672 -115662 -111881 -72857 -8781 -33714 -33352 -44046 -24250 -26443 -15889 -53790
6087e3790J1730L8588O802M1332p3692l2713P773K3709K1991n0879k9910P5968
$$ -53790 -42060 -3472 3330 44662 -29030 -61743 -53970 -30261 -8270 -59149 -89059 -13091
6075a3091M1939K1253n1400n9237r221P3377J8484k1143l7156k7470r54N1558
$$ -13091 28848 50101 -1299 -60536 -69757 3620 22104 961 -36195 -63665 -64619 -13061
6063a3061j5851J7040m2896l288J7476j562K1472M405J4462K3787o3048k47k9517
$$ -13061 -28912 -11872 -54768 -58056 -40580 -42142 -20670 -16265 -1803 21984 -41064 -41311 -70828
6050g0828L3115J5265p444m790J1854k5564N055J7934j2809J3677L2300n346m0631
$$ -70828 -37713 -22448 -29892 -34682 -22828 -48392 -43337 -25403 -38212 -24535 7765 2419 -38212
6037c8212k1101j8992m258O094K0933N1660J027M393j5219M050N399j4047L1573
$$ -38212 -59313 -78305 -82563 -76469 -55536 -3876 -2849 1544 -13675 -9625 -4226 -18273 13300
6024A3300k5532N350K235Q027K0702j4921j0932J6173j6007L7795n3369K0050
$$ 13300 -12232 -6882 -4647 3380 24082 9161 -1771 14402 -1605 36190 -17179 2871
6012B871k958L2360M8600K05k9804l9420o1871J7271P0722K4040l550k6141l0358
$$ 2871 -87 32273 80873 81078 51274 11854 -50017 -32746 37976 62016 58466 32325 1967
5999A967m67k4191L961q404J0254L5048K9828k3022q4218k6962J4912Q4868j6120
$$ 1967 1500 -22691 -18730 -27134 -16880 18168 47996 24974 -59244 -86206 -71294 13574 -2546
5986b546k9999j9512k5227L9779L5040j9789l2330j079J1831M5363J0058n5589
$$ -2546 -32545 -52057 -77284 -37505 -2465 -22254 -54584 -55663 -43832 1531 11589 -44000
5974d4000l4360n120N7330J6551k6860n1398j0439R165j629L5597l1083J1898
$$ -44000 -78360 -83480 -26150 -9599 -36459 -87857 -98296 -89131 -90760 -55163 -86246 -74348
5962g4348p211k6478J7027J0125J3579L2189N2475k1981n0052l2724k5681L6189
$$ -74348 -81559 -108037 -91010 -80885 -67306 -35117 17358 -4623 -54675 -87399 -113080 -76891
5950g6891J1172K1670j358p7102m274O9387K7255k7842j1658L142Q735j0329L1180
$$ -76891 -65719 -44049 -45407 -122509 -126783 -57396 -30141 -57983 -69641 -66499 -57764 -68093 -36913
5937c6913j6382L5642K7903l3298m4709l3987j6005J3N3243q671l252J9321J5991
$$ -36913 -53295 -17653 10250 -23048 -67757 -101744 -117749 -117736 -64493 -73164 -76416 -57095 -41104
5924d1104J5258k0183l7482Q213J2713R842N968n2215j4799O906K2299M7725k3528
$$ -41104 -25846 -46029 -83511 -75298 -62585 -52743 -46775 -98990 -113789 -106883 -84584 -36859 -60387
5911f0387k628q918r422K5605l7174J3063J1181K1156M2080p343l1190p6850k3343
$$ -60387 -63015 -71933 -81355 -55750 -92924 -79861 -68680 -47524 -5444 -12787 -43977 -120827 -144170
5898a44170N584M9739J9394l837J9008N0382r918m2471k0093l181l563K0977J332
$$ -144170 -138586 -88847 -69453 -73290 -54282 -3900 -13818 -56289 -76382 -79563 -83126 -62149 -60817
5885f0817N186l9136L4474M045J2407o7164J811L9843M3478M8411n1105K0729
$$ -60817 -55631 -94767 -60293 -56248 -43841 -111005 -109194 -69351 -25873 22538 -28567 -7838
5873g838O038l0534J1152K384K4874l4773J4374j5013j9141L6214j6048k2393
$$ -7838 -1800 -32334 -21182 -18798 6076 -28697 -14323 -29336 -48477 -12263 -28311 -50704
5861e0704n918R591L4046O6788j7298j9218n5512L8381J2015j5039l362j0067
$$ -50704 -56622 -47031 -12985 53803 36505 17287 -38225 156 12171 -2868 -6230 -16297
5849a6297j1334p229j3967J4500O825L5477l8879M8855k3708l1161L1715M1379
$$ -16297 -27631 -34860 -48827 -34327 -27502 7975 -30904 17951 -5757 -36918 -5203 36176
5837C6176M1479O941p7831M3350l0676j2847j9341k2600K9916o9J3645M4j5378
$$ 36176 77655 84596 6765 50115 19439 6592 -12749 -35349 -5433 -5502 8143 8187 -7191
5824g191L974N0524P790K4858m6027j2072l6476L7316L3880j456K1447l9157k3413
$$ -7191 -3217 47307 55097 79955 33928 21856 -14620 22696 56576 55120 76567 37410 13997
5811A3997j2810J1528J1310j1884L2372J9254L4774P028m9888j6243K7123k114
$$ 13997 1187 12715 24025 12141 44513 63767 98541 105569 55681 39438 66561 64447
5799F4447k222J3721j6345o894Q545N3031n766R707K511m0484n3033m125L0984
$$ 64447 62225 75946 59601 52707 61252 114283 108517 118224 120735 80251 27218 23093 54077
5786E4077N4804J8096K2181j385j7631m7710k9321J840K9709M7821L2095L9930
$$ 54077 108881 126977 149158 147773 130142 82432 53111 54951 84660 132481 164576 204506
5774B04506Q684q999K9287M4909L4181k2594l6585L7200n6022N900m4776o8118
$$ 204506 213190 204191 233478 278387 312568 289974 253389 290589 234567 240467 195691 127573
5762A27573j0488R733K0269K9359n1569q49l5441N2954M3873N0675o271L1811
$$ 127573 117085 126818 147087 176446 124877 124028 88587 141541 185414 236089 229818 261629
5750B61629n832k7433l5534O9611P9123J4372L5842K7696m2552k7607l8630l4958
$$ 261629 255797 228364 192830 262441 341564 355936 391778 419474 376922 349315 310685 275727
5738B75727m2693m25j8869l8757j9347j3124L4562O548J2531n1288n891K1333
$$ 275727 233034 232609 213740 174983 155636 142512 177074 183622 196153 144865 138974 160307
5726A60307L0155j2818K6477Q248M4574n286Q6942M3985k0868o2908p9049j5440
$$ 160307 190462 177644 204121 212369 256943 251657 338599 382584 361716 298808 219759 204319
5714B04319l3456p4664k2818j1680K6685k1828q045J0143m2485L1504M306K0457
$$ 204319 170863 96199 73381 61701 88386 66558 58513 68656 26171 57675 61981 82438
5702H2438k8121l4511J6384K3654M0486j0558l7062m996K0779Q303j108n1759
$$ 82438 54317 19806 36190 59844 100330 89772 52710 47714 68493 76796 75688 23929
5690B3929k2292J8135K6273N4650j8166j7791J9992N935K4428m6632l0294l927
$$ 23929 1637 19772 46045 100695 82529 64738 84730 90665 115093 68461 38167 34240
5678C4240l9086j6039K0677L6301J1512P847L5237k0650k3560k4332K885J076
$$ 34240 -4846 -20885 -208 36093 47605 55452 90689 70039 46479 22147 25032 26108
5666B6108O49O174K4826J1111m0536k1752j7462k8202M208m1846N3246L1157L7917
$$ 26108 26757 32931 57757 68868 28332 6580 -10882 -39084 -34876 -76722 -23476 7681 45598
5653D5598N1290j2101j1987j1123Q857J4194l5558l9330k8880r479K8592N2455
$$ 45598 96888 84787 72800 61677 70534 84728 49170 9840 -19040 -28519 73 52528
5641E2528n184L416j9585R719j0000j5313k0638j3183L9543K8861p201k9290L1353
$$ 52528 47344 50760 31175 40894 30894 15581 -5057 -18240 21303 50164 42963 13673 45026
5628D5026k1015p693M999k6487q7053L4762N5290L1543K5505j6118j4131L5515
$$ 45026 24011 16318 21317 -5170 -92223 -57461 -2171 29372 54877 38759 24628 60143
5616F0143l1394l8919l0443N0675J2390j4941j3219P411j6921K5269n285J9699
$$ 60143 28749 -10170 -40613 10062 22452 7511 -5708 1703 -15218 10051 4766 24465
5604B4465Q913j3510J6108n167J32j9988r432M1259P438m1064l5644j6030j8285
$$ 24465 33378 19868 35976 30809 30941 10953 1521 42780 50218 9154 -26490 -42520 -60805
5591f0805K3626P672J6754j8127J6680O5519M377k9419o5363J3424P4381r970
$$ -60805 -37179 -29507 -12753 -30880 -14200 51319 55696 26277 -39086 -25662 48719 38749
5579C8749k3572k794n2655J5690K4186k3211M956k0660M2070L1870j2793n9929
$$ 38749 15177 12383 -40272 -24582 -396 -23607 -18651 -39311 2759 34629 21836 -38093
5567c8093k1653K9603M0554J3638j193J0334J6161l1404o3828j216Q814j5191
$$ -38093 -59746 -30143 10411 24049 22856 33190 49351 17947 -45881 -47097 -38283 -53474
5555e3474l455M6152J7302J5274J2117l5654K3376J3169l5230J588k0170p268
$$ -53474 -56929 -10777 6525 21799 33916 -1738 21638 34807 -423 1165 -19005 -26273
5543b6273J3347L0890l4610j5279m11L0531q460m9672j4437J7425L1008O2706
$$ -26273 -12926 17964 -16646 -31925 -32336 -1805 -10265 -59937 -74374 -56949 -25941 36765
5531C6765J4568L138k199k3284o5920n3229o6756K3774K0348M9930K5981j5125
$$ 36765 51333 54471 52272 28988 -36932 -90161 -156917 -133143 -112795 -62865 -36884 -52009
5519e2009J910p252p482N774Q663K1458k5931M2904o1573M299K0378j7672l3477
$$ -52009 -50099 -57351 -64833 -59059 -50396 -28938 -54869 -11965 -73538 -69239 -48861 -66533 -100010
5506a00010p618k375Q894P797j2472K5333p838P1116L2358n6548j0061O928K5784
$$ -100010 -107628 -110003 -101109 -93312 -105784 -80451 -88289 -17173 15185 -41363 -51424 -44496 -18712
5493a8712l8896J6853Q476M5148l416o728N4382k9035Q422n7232N163J3153k4857
$$ -18712 -57608 -40755 -32279 12869 9453 2725 57107 28072 36494 -20738 -15575 -2422 -27279
5480b7279j192M8662K8138j4349m1739R778r498R838J957J8094J5155L591k7029
$$ -27279 -28471 20191 48329 33980 -7759 2019 -7479 2359 4316 22410 37565 41156 14127
5467A4127K0582k0142r870p840K9146k194l1180R165j428K2458J1019K3171J9658
$$ 14127 34709 14567 4697 -3143 26003 23809 -7371 1794 366 22824 33843 57014 76672
5454G6672l5434m8524p380P366K4718M7296j6649K5534L784m0376L350L2040j9432
$$ 76672 41238 -7286 -14666 -7300 17418 64714 48065 73599 77383 37007 40357 72397 52965
5441E2965k275k5721L2074L1868M7022k2699j0013j0789l4748M1816M228J8716
$$ 52965 50690 24969 57043 88911 135933 113234 103221 92432 57684 99500 103728 122444
5429A22444q704p902m613j3483r865o725P3791J8512l4660m3074j2443L1343K6117
$$ 122444 113740 105838 101225 87742 77877 71152 144943 163455 128795 85721 73278 104621 130738
5416A30738R481j6915K1394K545k3555l4M9104m6375k3196L2419n56M9184j1900
$$ 130738 140219 123304 144698 147243 123688 123654 172758 126383 103187 135606 135050 184234 172334
5403A72334K5750K4681Q310p264J7440N9115O3725O3948K4914N9944N3225R2468
$$ 172334 198084 222765 231075 223811 241251 300366 364091 428039 452953 512897 566122 658590
5391F58590Q4711J33408J75908J59380N5141j08001j49539j86179j08794m9277
$$ 658590 743301 876709 1052617 1211997 1267138 1159137 1009598 823419 714625 665348
5381F65348o2223n5891j04026o5702n1778l3924k7335L256p975J2822N57l3246
$$ 665348 603125 547234 443208 377506 325728 291804 264469 267725 259750 272572 273129 239883
5369B39883k4812j295l9522k3263R510K2754K364o5262j7583K745o829J7317J632
$$ 239883 215071 213776 174254 150991 160501 183255 185619 120357 102774 105519 98690 116007 117639
5356A17639j089k7866j2731J3810N333j7982J3226J5544l666k266k7784L769m3533
$$ 117639 116550 88684 75953 89763 95096 77114 90340 105884 102218 99952 72168 75937 32404
5343C2404l9190K6961N8334L7971j2776J1486o2230k526j4163K838k820L3510
$$ 32404 -6786 20175 78509 116480 103704 115190 52960 50434 36271 39109 36289 69799
5331F9799k1785j6214n2359n1048j169L2287M2035L405p550m4395J0328K2399
$$ 69799 48014 31800 -20559 -71607 -72776 -40489 1546 4951 -2599 -46994 -36666 -14267
5319a4267L618j0681L6527J0185K2744J5314j8320o0450j906l3544O7062K084
$$ -14267 -10649 -21330 15197 25382 48126 63440 45120 -15330 -17236 -50780 16282 18366
5307A8366J0222P050M9567Q362K9824k2216j2313J7915m186O2593M0641l6775
$$ 18366 28588 35638 85205 93567 123391 101175 88862 106777 102591 165184 205825 169050
5295A69050m2085M840j8975j6958j2897J5729k6887J4159k9264L1392o050J0708
$$ 169050 126965 131805 112830 95872 82975 98704 71817 85976 56712 88104 82054 92762
5283I2762K3906P5710j5597j5483r7590K679P132J3861M5364L8958K5319o079
$$ 92762 116668 192378 176781 161298 63708 66387 73519 87380 132744 171702 197021 190942
5271A90942j5919o963R969m5460k1848j2554J1441N673l376P816O6301l3776q7612
$$ 190942 175023 168060 178029 132569 110721 98167 109608 115281 111905 119721 186022 152246 64634
5258F4634m1471J2792j961M5767m554M8175M44J9484l4490P593j6140n693j6737
$$ 64634 23163 35955 33994 79761 75207 123382 123826 143310 108820 116413 100273 94580 77843
5245G7843K730K6018j8661j4286J7107q615j715j6107m5334j6923J9721M8336
$$ 77843 80573 106591 87930 73644 90751 82136 80421 64314 18980 2057 21778 70114
5233G0114r568o099M655l484l2174L2145l6742K4945l2940N453M115N0753l207
$$ 70114 60546 54447 59102 55618 23444 55589 18847 43792 10852 16305 20420 71173 67966
5220F7966K475k3935j3971M2029K4937J6011J0632L687m932m4520K9810k5865
$$ 67966 70441 46506 32535 74564 99501 115512 126144 129831 124899 80379 110189 84324
5208H4324N378j5444O9729P8035k6413n928k9945K4289k378K1327N438N2648j1702
$$ 84324 89702 74258 143987 222022 195609 189681 159736 184025 181647 202974 208412 261060 249358
5195B49358J5558J4301J1833J6390K9843p105l7963n9357l7267j6170J9313Q314
$$ 249358 264916 279217 291050 307440 337283 330178 292215 232858 195591 179421 198734 207048
5183B07048P2219k2386L23k5242m484m4697j6305l387J7830L3556j4946k373j2872
$$ 207048 279267 256881 257204 231962 227478 182781 166476 163089 180919 214475 199529 197156 184284
5170A84284j2124l5197j0678N008n281L9160n434P27j8482J6682m6141m3818l4077
$$ 184284 172160 136963 126285 131293 126012 165172 159738 160465 141983 158665 112524 68706 34629
5157C4629k7258j2908N81N8466o218k134J6096L9817k3241J1064p390m5822k8711
$$ 34629 7371 -5537 -4956 53510 47292 45158 61254 101071 77830 88894 81504 35682 6971
5144F971K8814N6649K6386o946m6038l3343O269J6272L4909K7946L5477n645L8352
$$ 6971 35785 92434 118820 111874 65836 32493 38762 55034 89943 117889 153366 147721 186073
5131A86073j3646p454J851j3122m7491l1636J8030K0404M0182L3561R343k1454
$$ 186073 172427 164973 166824 153702 106211 74575 92605 113009 153191 186752 196095 174641
5119A74641R194O602j8914k807L522k7936l2147K8584k343j1444j9123Q460j4922
$$ 174641 183835 190437 171523 168716 172238 144302 112155 140739 138396 126952 107829 116289 101367
5106A01367m3904j4015o973K2156K7218M4330J0636O008k1652n2516J3137k5987
$$ 101367 57463 43448 36475 58631 85849 130179 140815 146823 125171 72655 85792 59805
5094E9805L2015L4024k2148J3898K3753L9534k9205j8190K758K7350L2085J9796
$$ 59805 91820 125844 103696 117594 141347 180881 151676 133486 136244 163594 195679 215475
5082B15475j5207l7678M2208J4098O5639k3962k2832n4476j5655K8138K423N0683
$$ 215475 200268 162590 204798 218896 284535 260573 237741 183265 167610 195748 198171 248854
5070B48854L3637K4807K1404j8380o016R851K089j6843j6661K4823p879j4619
$$ 248854 282491 307298 328702 310322 304306 314157 316246 299403 282742 307565 299686 285067
5058B85067J4950k3709K919O980J8409j7572j3218K3828p776L0447M830M902J2270
$$ 285067 300017 276308 279227 286207 304616 287044 273826 297654 289878 320325 325155 330057 342327
5045C42327K3659N9731j6034p3933r0909l8478L9084O0135N2527R355N109M5038
$$ 342327 365986 425717 409683 335750 244841 206363 245447 305582 358109 367464 372573 417611
5033D17611K4853k7447R429l1150K3190M7155k2190k8463n7259R289O7185J9069
$$ 417611 442464 415017 424446 393296 416486 463641 441451 412988 355729 365018 432203 451272
5021D51272L864j7837J0756N524P0473N4590l5058O859L4079J4734K0189J0845
$$ 451272 455136 437299 448055 453579 524052 578642 543584 550443 584522 599256 619445 630290
5009F30290k0484k6440n5866l4472J0323J1211N3610K8518K7296O2702J547O701
$$ 630290 609806 583366 527500 493028 503351 514562 568172 596690 623986 686688 688235 694936
4997F94936n5821l7344K2013M9695M6339L8989o296Q305j3075j8581n478K650
$$ 694936 639115 601771 623784 673479 719818 758807 752511 760816 747741 729160 723682 726332
4985G26332M1921L0766L3527M2363R676J9344N4886K4094L1390k0429k5624n995
$$ 726332 768253 799019 832546 874909 884585 903929 958815 982909 1014299 993870 968246 962251
4973I62251K6026L3362M7973J5694P8038M6126R2919N4432K2117Q449M5709L5427
$$ 962251 988277 1021639 1069612 1085306 1163344 1209470 1302389 1356821 1378938 1387387 1433096 1468523
4961A468523N8594J1234L7507J13995J20974J30817J27162J21967J67765K09639
$$ 1468523 1527117 1538351 1575858 1689853 1810827 1941644 2068806 2190773 2358538 2568177
4951B568177K86493L38303M33426M91231N16748O25821N44428L01205J04979j47770
$$ 2568177 2854670 3192973 3626399 4117630 4634378 5260199 5804627 6105832 6210811 6063041
4941F063041l38474n41697n42164m60620l60720l03873k36137r2115o1533j9139
$$ 6063041 5724567 5182870 4640706 4180086 3819366 3515493 3279356 3187241 3125708 3106569
4931C106569L8964K0774P9632J90620K19546K99411L34091L75155N54414O73098
$$ 3106569 3145533 3166307 3245939 3436559 3656105 3955516 4289607 4664762 5219176 5892274
4921E892274P90706Q43055P11840K96081l40406q20345j061111r30896p83226
$$ 5892274 6682980 7526035 8237875 8533956 8193550 7373205 6312094 5381198 4597972
4912D597972n83796m95711l88562l56907k91519k51191j78134j17962j33590n8154
$$ 4597972 4014176 3518465 3129903 2772996 2481477 2230286 2052152 1934190 1800600 1742446
4902A742446q7013q8151p6796r0860q6042l1905J2780j1112P942m9438n6055o9318
$$ 1742446 1655433 1567282 1490486 1399626 1313584 1281679 1294459 1283347 1291289 1241851 1185796 1116478
4890A116478n7956l4902m5121q7202k3626j5333J3089L1780j9074O255L5505o464
$$ 1116478 1058522 1023620 978499 891297 867671 852338 865427 897207 878133 884388 919893 913429
4878I13429Q94n1980k5701n3300k187L4995j3912M9292L1747l3684k0068l5105
$$ 913429 914323 862343 836642 783342 781155 816150 802238 851530 883277 849593 829525 794420
4866G94420J0611K2380K2767K8014O7308P8181K3431n4264k5053n485L624K4674
$$ 794420 805031 827411 850178 878192 945500 1023681 1047112 992848 967795 962310 965934 990608
4854I90608K4398K0581j6765R194O6293J07785Q9643L8985N6954J19977R7577
$$ 990608 1015006 1035587 1018822 1028016 1094309 1202094 1291737 1330722 1387676 1507653 1605230
4843A605230P5104R0459P1914L8821J3857P956l6298j16340k9910J2430J7285
$$ 1605230 1680334 1770793 1842707 1881528 1895385 1903341 1867043 1750703 1720793 1733223 1750508
4832A750508N2838O9467Q8472J05367J35093R7450P7508K385J5025J0739L2018
$$ 1750508 1803346 1872813 1961285 2066652 2201745 2299195 2376703 2379088 2394113 2404852 2436870
4821B436870J11012J50434K35482J90304J83063J34514J36799J06532K1251q1828
$$ 2436870 2547882 2698316 2933798 3124102 3307165 3441679 3578478 3685010 3706261 3624433
4811C624433j87226j99318j28781q6256j01010p5961n9233j27814m4598l0153
$$ 3624433 3437207 3237889 3109108 3022852 2921842 2845881 2786648 2658834 2614236 2584083
4801B584083J3124L2191O4708J25791J63333K20769K03537J96235J81065J88631
$$ 2584083 2597207 2629398 2694106 2819897 2983230 3203999 3407536 3603771 3784836 3973467
4791C973467J50750J30544L5018o1132p9330j13803j64388k15682k13938k40147
$$ 3973467 4124217 4254761 4289779 4228647 4149317 4035514 3871126 3655444 3441506 3201359
4781C201359k58727k11636j93564j02233l5305m5723n5060l5015J278J8974j951
$$ 3201359 2942632 2730996 2537432 2435199 2399894 2354171 2299111 2264096 2265374 2284348 2282397
4770B282397N6483J07082O9037J79952J72822J03087O3066J4379K0252q8791j50926
$$ 2282397 2338880 2445962 2514999 2694951 2867773 2970860 3033926 3048305 3068557 2979766 2828840
4759B828840j93728k14227j79420j67324j67391j21074j29455n6056K1337p6616
$$ 2828840 2635112 2420885 2241465 2074141 1906750 1785676 1656221 1600165 1621502 1544886
4749A544886n8388K34J6328L4728Q707J4821j1638L3923J01608Q0467K7732n8968
$$ 1544886 1486498 1486732 1503060 1537788 1546495 1561316 1549678 1583601 1685209 1765676 1793408 1734440
4737A734440q4652m8870q5308p4354r3622r2894L7118L3308K5274m0867q1554
$$ 1734440 1649788 1600918 1515610 1441256 1347634 1254740 1291858 1325166 1350440 1309573 1228019
4726A228019l0443L4089K1426Q157m5328j7436o3848K7547J316k9390o1030k9543
$$ 1228019 1197576 1231665 1253091 1261248 1215920 1198484 1134636 1162183 1163499 1134109 1073079 1043536
4714A043536p135L796M7546J9347j0452L0690l624M3679m4365j5263J8351K6721
$$ 1043536 1036401 1040197 1087743 1107090 1096638 1127328 1123704 1167383 1123018 1107755 1126106 1152827
4702A152827L8286J9741L8296M7058O7923O5975Q874m680K9338k6673J1773M3049
$$ 1152827 1191113 1210854 1249150 1296208 1364131 1430106 1438980 1434300 1463638 1436965 1448738 1491787
4690A491787n127k4213j7497M9697n490M4121M651o1371O8738k0018L8948L2769
$$ 1491787 1486660 1462447 1444950 1494647 1489157 1533278 1537929 1476558 1545296 1525278 1564226 1596995
4678A596995P3391R7631O8805j5169n6186m589o49N202j9914k4446k477N6910
$$ 1596995 1670386 1768017 1836822 1821653 1765467 1760878 1760229 1765431 1745517 1721071 1718594 1775504
4666A775504O8599M0089N7916K1830p014o5871k2356n493K4708N7201J2545P2
$$ 1775504 1844103 1884192 1942108 1963938 1956924 1891053 1868697 1863204 1887912 1945113 1957658 1957730
4654A957730n4004o2964q9989m0581K615M0483P9332J03406J06221R5653J16083
$$ 1957730 1903726 1840762 1750773 1710192 1712807 1753290 1832622 1936028 2042249 2137902 2253985
4643B253985L9142M1335J2804L4756N771k5661l0895n2432j1597L8022N6968M5283
$$ 2253985 2293127 2334462 2347266 2382022 2387793 2362132 2331237 2278805 2267208 2305230 2362198 2407481
4631B407481p2383m5766m7738N4031P7750M6331J4257l082j4450J8096L8257P4565
$$ 2407481 2335098 2289332 2241594 2295625 2373375 2419706 2433963 2430881 2416431 2434527 2472784 2547349
4619B547349q600l2481m9767L3395O2232J38338J51011J83939J42022J79989M8518
$$ 2547349 2538749 2506268 2456501 2489896 2552128 2690466 2841477 3025416 3167438 3347427 3395945
4608C395945N6759P3620L7500P9152N7045L5423O794J0281N068k1995J6672K9645
$$ 3395945 3452704 3526324 3563824 3642976 3700021 3735444 3742238 3752519 3757587 3735592 3752264 3781909
4596C781909J03572J01825J60780J76569J19280R0625O9331R1325J04287N9589
$$ 3781909 3885481 3987306 4148086 4324655 4443935 4534560 4603891 4695216 4799503 4859092
4586D859092L6901Q9145R1470J18410J12492J96717K56915J66571Q0092N2755
$$ 4859092 4895993 4985138 5076608 5195018 5307510 5504227 5761142 5927713 6007805 6060560
4576F060560p6612j01697k0713Q4905O0861R3088O8546J2736M5933N4418M0701
$$ 6060560 5983948 5882251 5861538 5946443 6007304 6100392 6168938 6181674 6227607 6282025 6322726
4565F322726L2913L8200O3118J60263K27035K87562K98261L25515L06720K61386
$$ 6322726 6355639 6393839 6456957 6617220 6844255 7131817 7430078 7755593 8062313 8323699
4555H323699J69835J33448J49612Q1829Q824m558K7188J4717K6807L0270P6021
$$ 8323699 8493534 8626982 8776594 8858423 8867247 8862689 8889877 8904594 8931401 8961671 9037692
4544I037692J08754R0336J86991K67668K89465L83654M28070L46261K48700K54347
$$ 9037692 9146446 9236782 9423773 9691441 9980906 10364560 10792630 11138891 11387591 11641938
4534A1641938L28758N15543N74338O53928O36008N11114L44932L72967L31570
$$ 11641938 11970696 12486239 13060577 13714505 14350513 14861627 15206559 15579526 15911096
4525A5911096L47360K89600L22638L36050K92735K39306K00376J74334L40330
$$ 15911096 16258456 16548056 16870694 17206744 17499479 17738785 17939161 18113495 18453825
4516A8453825L00887L56651L13682M75551N67633P69771O50130O76575O46629
$$ 18453825 18754712 19111363 19425045 19900596 20468229 21238000 21888130 22564705 23211334
4507B3211334O52669O60563O82799M70419N60075N80829Q72293R51610R85716
$$ 23211334 23864003 24524566 25207365 25677784 26237859 26818688 27690981 28642591 29628307
4498B9628307J036838J176370J198453J462962J691214J896272J980697K055324
$$ 29628307 30665145 31841515 33039968 34502930 36194144 38090416 40071113 42126437
4490D2126437K016260K118738K090871K079584K031790K036887K030588K396371
$$ 42126437 44142697 46261435 48352306 50431890 52463680 54500567 56531155 58927526
4482E8927526K843220L209658L414690L843276M340884N423368O604719P690537
$$ 58927526 61770746 64980404 68395094 72238370 76579254 82002622 88607341 96297878
4474I6297878Q807340J0449200J2092586J4223126J7237458K1579114K6362937
$$ 96297878 105105218 115554418 127647004 141870130 159107588 180686702 207049639
4467B07049639L2937222M1109493N0584455O1484397O5087554J8076248o0689644
$$ 207049639 239986861 281096354 331680809 393165206 458252760 476329008 415639364
4460D15639364q0325217o3147737m6355600l4664985k8195703k2430394j7929421
$$ 415639364 335314147 272166410 225810810 191145825 162950122 140519728 122590307
4453A22590307j4393401j1642182r276423p259633n683323m891533m375986l951861
$$ 122590307 108196906 96554724 87278301 80018668 74335345 69443812 65067826 61115965
4445F1115965l432642l229410l238850l148480k780786k420015j936603j847167
$$ 61115965 57683323 54453913 51215063 48066583 45285797 42865782 40929179 39082012
4437C9082012j566263j322930j126168r61796o98905p01985n54563m02994l39497
$$ 39082012 37515749 36192819 35066651 34104855 33405950 32703965 32149402 31746408 31406911
4428C1406911m86413n16148n60765o75082r98820j072882j181336j063887q63967
$$ 31406911 30920498 30404350 29843585 29168503 28169683 27096801 25915465 24851578 23987611
4419B3987611p10387p99977q32310q52204p99111p15376o02555m95665m47717
$$ 23987611 23277224 22477247 21644937 20792733 19993622 19278246 18675691 18180026 17732309
4410A7732309l40078k62164j42296K7133o374j37936l84000l69495m08394k08153
$$ 17732309 17392231 17130067 16987771 17014904 17008530 16870594 16486594 16117099 15708705 15500552
4400A5500552p3992L5997n996j98656l56079j88314K4560L8579R2196J14593J17419
$$ 15500552 15426560 15462557 15456561 15257905 14901826 14713512 14738072 14776651 14868847 14983440 15100859
4389A5100859N1320m10088n93296n78972m40204l40861k14528k69410k43763k14128
$$ 15100859 15152179 14742091 14148795 13569823 13129619 12788758 12574230 12304820 12061057 11846929
4379A1846929r5847J9110J09037J61374K37519L36517N13646O26403Q38549Q91963
$$ 11846929 11751082 11770192 11879229 12040603 12278122 12614639 13128285 13754688 14593237 15485200
4369A5485200P11730M97836N41937O66505Q83985P65051L20489k66888n50160
$$ 15485200 16196930 16694766 17236703 17903208 18787193 19552244 19872733 19605845 19055685
4360A9055685n07610l80278n55966q93136j132574j220981j018410p30126n36937
$$ 19055685 18548075 18167797 17611831 16718695 15586121 14365140 13346730 12616604 12079667
4351A2079667l96090k07863j2914J08951K62603L72040M53524N84240P59112P87023
$$ 12079667 11683577 11475714 11462800 11571751 11834354 12206394 12659918 13244158 14003270 14790293
4341A4790293O40376O03417P95283R52471O74487M2053m52282o23649o60391q52818
$$ 14790293 15430669 16034086 16829369 17781840 18456327 18498380 18046098 17422449 16762058 15909240
4331A5909240j224483j521181j537982j229104r56415p28984o35384n89588l96490
$$ 15909240 14684757 13163576 11625594 10396490 9440075 8711091 8075707 7486119 7089629
4322G089629k64208k66790k59272k31133j56001m0069J9948q2701j83467k17988
$$ 7089629 6825421 6558631 6299359 6068226 5912225 5872156 5892104 5809403 5625936 5407948
4312E407948j15526j21056o8124j64609j50353j30104r2656o0210m9665q7727
$$ 5407948 5292422 5171366 5103242 4938633 4788280 4658176 4565520 4505310 4455645 4367918
4302D367918j33617q2417j54884j67962j85360j89559p3559m2291m3486j03106
$$ 4367918 4234301 4151884 3997000 3829038 3643678 3454119 3380560 3338269 3294783 3191677
4292C191677j14955p4290L104m458J135p865q7447o2516r0221j44300j19558j12483
$$ 3191677 3076722 3002432 3005536 3001078 3002213 2994348 2906901 2844385 2754164 2609864 2490306 2377823
4280B377823m1894Q133K9813K0420j8739o3496q6915j53541q9816k3366m0612
$$ 2377823 2335929 2344062 2373875 2394295 2375556 2312060 2225145 2071604 1981788 1958422 1917810
4269A917810k3292j5569r716j8284l2642j247J710p0167j24104n2023p6141n9837
$$ 1917810 1894518 1878949 1869233 1850949 1818307 1817060 1818770 1748603 1624499 1572476 1496335 1436498
4257A436498r950L445K3972K0090j259m7244k6175q322L32K9561m8098m2913n7582
$$ 1436498 1426548 1429993 1453965 1474055 1472796 1425552 1399377 1391055 1391387 1420948 1372850 1329937 1272355
4244A272355K0799R375l5897j2823l3641l5285l9395l2258N006L7253j6200J7457
$$ 1272355 1293154 1302529 1266632 1253809 1220168 1184883 1145488 1113230 1118236 1155489 1139289 1156746
4232A156746K6940m326l4904n4705j4037j2721J9274L3445O3881j6213M3179O8091
$$ 1156746 1183686 1179360 1144456 1089751 1075714 1062993 1082267 1115712 1179593 1163380 1206559 1274650
4220A274650L9265N3167K6467N484m9173n7789m2599n2513r8329j02579k8664
$$ 1274650 1313915 1367082 1393549 1399033 1349860 1292071 1249472 1196959 1098630 996051 967387
4209I67387q009N3820M7157Q505J53J24l954N9293N3372M435N5598M7913N5786
$$ 967387 959378 1013198 1060355 1068860 1069013 1069137 1065183 1124476 1177848 1182283 1237881 1285794 1341580
4196A341580O3438K795N6056J1269L372P759k2729k2439j473L5171K8001N6862
$$ 1341580 1405018 1407813 1463869 1475138 1478510 1486269 1463540 1441101 1439628 1474799 1502800 1559662
4184A559662L2300L2936O4013M2143N4237J00072O4191P7967R1531N2745J04733
$$ 1559662 1591962 1624898 1688911 1731054 1785291 1885363 1949554 2027521 2119052 2171797 2276530
4173B276530J33942K17625K62405K51552L04439J53488j45911k98579k55594k01460
$$ 2276530 2410472 2628097 2890502 3142054 3446493 3599981 3454070 3155491 2899897 2698437
4163B698437j28958j53261j46566p3262n257L9548M8452L2418J00945R7965J73164
$$ 2698437 2569479 2416218 2269652 2196390 2191133 2230681 2279133 2311551 2412496 2510461 2683625
4152B683625K14586J95739J96807K95692L23291M34605M26611K19276O6250q2728
$$ 2683625 2898211 3093950 3290757 3586449 3909740 4344345 4770956 4990232 5056482 4973754
4142D973754k62692l74653l80181l19593k50471j36905j31375j26283j59606j13472
$$ 4973754 4711062 4336409 3956228 3636635 3386164 3249259 3117884 2991601 2831995 2718523
4132B718523r2518o5126k7446j4056J4742N7073N8906J32115J56552J32340J61246
$$ 2718523 2626005 2560879 2533433 2519377 2534119 2591192 2650098 2782213 2938765 3071105 3232351
4121C232351K02108J85820Q4829j65028k44435j89939j36327j64414k03639j60378
$$ 3232351 3434459 3620279 3705108 3540080 3295645 3105706 2969379 2804965 2601326 2440948
4111B440948j58600j07859q5749n7649n9831j04019j6126k5333k423M8665J6167
$$ 2440948 2282348 2174489 2088740 2031091 1971260 1867241 1851115 1825782 1823359 1872024 1888191
4100A888191L0078M7496L3815R6173J13734J8407l0676j05268j26319j18358p9726
$$ 1888191 1918269 1965765 1999580 2095753 2209487 2227894 2197218 2091950 1965631 1847273 1767547
4089A767547n8166n904Q188l56N8543M0843Q5338l357j7066L223n3153l5672k1806
$$ 1767547 1709381 1703477 1711665 1711309 1769852 1810695 1896033 1892676 1875610 1878833 1825680 1790008 1768202
4076A768202n1566k7073J5741N5472J13541Q6369J36082J07301P9258J03660J00072
$$ 1768202 1716636 1689563 1705304 1760776 1874317 1960686 2096768 2204069 2283327 2386987 2487059
4065B487059J10291l8597o0985r7497j27027n0102k2965Q7850R6752J19353J25631
$$ 2487059 2597350 2558753 2497768 2400271 2273244 2223142 2200177 2288027 2384779 2504132 2629763
4054B629763J46764J43602P6734k1158j7624O2922J23822J89776J02462j2665
$$ 2629763 2776527 2920129 2996863 2975705 2958081 3021003 3144825 3334601 3437063 3424398
4044C424398o2980m0195J33106J51692K18965J58450q121r1130k004O1327L0126
$$ 3424398 3361418 3321223 3454329 3606021 3824986 3983436 3975315 3884185 3882181 3943508 3973634
4033C973634o7494o7727n1541K2360J18584J52128J42476m5462j53729q0204l2355
$$ 3973634 3906140 3838413 3786872 3809232 3927816 4079944 4222420 4176958 4023229 3943025 3910670
4022C910670R1927J17373R0811j53180k71649j79363q4288J1456O5581O6046L5858
$$ 3910670 4002597 4119970 4210781 4057601 3785952 3606589 3522301 3533757 3599338 3665384 3701242
4011C701242J9499J18786J64820N5518k04170k67055k05891j31244q0042p8116
$$ 3701242 3720741 3839527 4004347 4059865 3855695 3588640 3382749 3251505 3171463 3093347
4001C093347n3608j38131k24131j20573p2476n5946K315l8939j66821j54910j40794
$$ 3093347 3039739 2901608 2677477 2556904 2484428 2428482 2430797 2391858 2225037 2070127 1929333
3990A929333o5328n5113j2731L331n1615J4756O6947N4879K0054q6441j37148
$$ 1929333 1864005 1808892 1796161 1799492 1747877 1762633 1829580 1884459 1904513 1818072 1680924
3979A680924j08168r7630j20121j13538n9558o0973l4744m4063n165O588k0058
$$ 1680924 1572756 1475126 1355005 1241467 1181909 1120936 1086192 1042129 1036964 1043552 1023494
3968A023494J9421o1717m8518j2796l431n4210o1841M535M5599L8365l2520p1411
$$ 1023494 1042915 981198 932680 919884 916453 862243 800402 804937 850536 888901 856381 784970
3956G84970n8837M526M9867L3732k7497j3636J154N0657K428R92q2324K4097m24
$$ 784970 726133 730659 780526 814258 786761 773125 774279 824936 827364 828356 746032 770129 769705
3943G69705K263q1271k3429l2866j4195K4903K9178M5891K8546J0330J6377L832
$$ 769705 771968 690697 667268 634402 620207 645110 674288 720179 748725 759055 775432 779264
3931G79264N0339l9348r946L1116J2691l9520n0724l2538j3863J1263k5615J9095
$$ 779264 829603 790255 780309 811425 824116 784596 733872 701334 687471 698734 673119 692214
3919F92214O796M0616K1100q808j8832j5024N2150Q3500o097K078m245l249j092
$$ 692214 699010 739626 760726 751918 733086 718062 770212 853712 847615 849693 845448 842199 841107
3906H41107n3725J1938j303M7594M9559L2493k8612J2454K0624K5928M314l0441
$$ 841107 787382 799320 798017 845611 895170 927663 899051 911505 932129 958057 962371 931930
3894I31930j1992J5257j0725r079J1913L6044l523K0129p137l9853m8514M0422
$$ 931930 919938 935195 924470 915391 927304 963348 959825 979954 972817 932964 884450 924872
3882I24872Q9241O1736k3m0197L3512j963L7288n6469K7804K9773K1127K9210
$$ 924872 1014113 1075849 1075826 1035629 1069141 1067178 1104466 1047997 1075801 1105574 1126701 1155911
3870A155911L2086j2644J2363M833J7596J4966Q932L5684J5173K0565K0796M12
$$ 1155911 1187997 1175353 1187716 1192549 1210145 1225111 1234043 1269727 1284900 1305465 1326261 1326673
3858A326673r652Q498N0270J433j4817k0322K585J8644L4245K8002O513L945L3672
$$ 1326673 1317021 1325519 1375789 1377222 1362405 1342083 1344668 1363312 1397557 1425559 1432072 1436017 1469689
3845A469689m393J4236L8436L9917R0878P8511K1991j311l4492R153k6120K5634
$$ 1469689 1465296 1479532 1517968 1557885 1648763 1727274 1749265 1747954 1713462 1722615 1696495 1722129
3833A722129J6241P6599Q1590P9243K2974M568N3271Q788M4284L8037M8227R8098
$$ 1722129 1738370 1814969 1896559 1975802 1998776 2003344 2056615 2065403 2109687 2147724 2195951 2294049
3821B294049J58037R1722L7229J9091R8276J52376R3674L0789J6797M5505J27465
$$ 2294049 2452086 2543808 2581037 2600128 2698404 2850780 2944454 2975243 2992040 3037545 3165010
3810C165010J11372J21391M0228N1545N1773J36938N3539N0577Q8452J81587K06650
$$ 3165010 3276382 3397773 3438001 3489546 3541319 3678257 3731796 3782373 3870825 4052412 4259062
3799D259062J43520J20858O9768Q8312P5583J02578J15568J47243J74697K37287
$$ 4259062 4402582 4523440 4593208 4681520 4757103 4859681 4975249 5122492 5297189 5534476
3789E534476K63201K00966J83677K83077L40222K96549K93031L48791L62093L99322
$$ 5534476 5797677 5998643 6182320 6465397 6805619 7102168 7395199 7743990 8106083 8505405
3779H505405M08714M57484M18562M16002L94135M26931M42394N36814O05760O93585
$$ 8505405 8914119 9371603 9790165 10206167 10600302 11027233 11469627 12006441 12612201 13305786
3769A3305786Q27651R90839J138452J344144J554734J776288K037846K385168
$$ 13305786 14133437 15124276 16262728 17606872 19161606 20937894 22975740 25360908
3761B5360908K843642L427641M163699N271878O721875Q353918R890247R311318
$$ 25360908 28204550 31632191 35795890 41067768 47789643 56143561 66033808 75345126
3753G5345126M740143q56624o025763j0383944j0944580q903506o705373n045065
$$ 75345126 80085269 79228645 73202882 62818938 51874358 42970852 36265479 31220414
3745C1220414l978364l184134k507879k023952j655743j354427j083912r20614
$$ 31220414 27242050 24057916 21550037 19526085 17870342 16515915 15432003 14511389
3737A4511389q13111o77727n84051n00223m73127m22952m12809k79578k46527
$$ 14511389 13698278 13020551 12436500 11936277 11463150 11040198 10627389 10347811 10101284
3728A0101284k21100k06181j93827r4736l1746K6426J6745L443N3849J09461J00993
$$ 10101284 9880184 9674003 9480176 9385440 9353694 9380120 9396865 9400308 9454157 9563618 9664611
3717I664611J11672J68155K47630L50373M19866M05980L37700J08564j06726k52857
$$ 9664611 9776283 9944438 10192068 10542441 10962307 11368287 11705987 11814551 11707825 11454968
3707A1454968k48315j28297J1544J44518J95738K95440L41778L79799M71937M97489
$$ 11454968 11206653 11078356 11089900 11234418 11430156 11725596 12067374 12447173 12919110 13416599
3697A3416599N89260O43147Q09233R50631J024888R96929Q92492Q56051R19619
$$ 13416599 14005859 14649006 15458239 16408870 17433758 18430687 19323179 20179230 21098849
3688B1098849R82718J017697R77089R93982J233871J762591K306443L030334L859912
$$ 21098849 22081567 23099264 24076353 25070335 26304206 28066797 30373240 33403574 37263486
3679C7263486M992270O329077P867116R207744P939209L076049n38354k273403
$$ 37263486 42255756 48584833 56451949 65659693 73598902 76674951 76136597 73863194
3671G3863194o368990r704195r281735p448786n860590m913045m053745l264851
$$ 73863194 67494204 57790009 48508274 41059488 35198898 30285853 26232108 22967257
3663B2967257k652579k126870j720332j412446j148973r15877p94762p62387o64732
$$ 22967257 20314678 18187808 16467476 15055030 13906057 12990180 12195418 11433031 10768299
3654A0768299o07655n48613n17424m81762l73445l65146l12688k76959k48668
$$ 10768299 10160644 9612031 9094607 8612845 8239400 7874254 7561566 7284607 7035939
3645G035939k46127k46385k39546k51989k26320k16013j67554j32304j00032j43825
$$ 7035939 6789812 6543427 6303881 6051892 5825572 5609559 5442005 5309701 5209669 5065844
3635E065844j18212j57371j62289j54090j51197j11915j53981j19916q8054q9583
$$ 5065844 4947632 4790261 4627972 4473882 4322685 4210770 4056789 3936873 3848819 3759236
3625C759236j28534q4481n5633r2164q8690j58855j41369j17668k5755k0941q9875
$$ 3759236 3630702 3546221 3490588 3398424 3309734 3150879 3009510 2891842 2866087 2845146 2755271
3614B755271j9930m9565j0231r0672o2697q4593n8058J9163K0435n797l6993l3915
$$ 2755271 2735341 2685776 2675545 2584873 2522176 2437583 2379525 2398688 2419123 2413326 2376333 2342418
3602B342418j110L6165L3255M500r285o9654m5365k6029k6790r1433n4232p7842
$$ 2342418 2341308 2377473 2410728 2415228 2405943 2336289 2290924 2264895 2238105 2146672 2092440 2014598
3590B014598p820k9246o9991j09764o2354m7225M8134J7584K3864q212J4697L5574
$$ 2014598 2006778 1977532 1907541 1797777 1735423 1688198 1736332 1753916 1777780 1769568 1784265 1819839
3578A819839P5667p921n5305r5685j7759n7853l9198n0943k7287j2088L985m131
$$ 1819839 1895506 1887585 1832280 1736595 1718836 1660983 1621785 1570842 1543555 1531467 1535452 1531321
3566A531321j7496p9945m6118k5535k1111L1150o468K0889P249q200k8627m702
$$ 1531321 1513825 1433880 1387762 1362227 1341116 1372266 1365798 1386687 1393936 1385736 1357109 1352407
3554A352407m641P162m0806J2603K6205L2668m0365L3488j7720K7564j5308k0408
$$ 1352407 1347766 1354928 1314122 1326725 1352930 1385598 1345233 1378721 1361001 1388565 1373257 1352849
3542A352849m6060j8472m2822L7279M0091P1598p540L2326J6759N7136M3818l3501
$$ 1352849 1306789 1288317 1245495 1282774 1322865 1394463 1386923 1419249 1436008 1493144 1536962 1503461
3530A503461r339O2327J9883L3441K4975N2999N5845N6060R7485R9502M9299J51845
$$ 1503461 1494122 1556449 1576332 1609773 1634748 1687747 1743592 1799652 1897137 1996639 2045938 2197783
3518B197783J66131J49436K45943K78213L17928L42432M48905N25297N54540M02842
$$ 2197783 2363914 2513350 2759293 3037506 3355434 3697866 4146771 4672068 5226608 5629450
3508E629450M1077k81008m77342l77286j94578m4299O3519J34813K60303L69112
$$ 5629450 5670527 5389519 4912177 4534891 4340313 4296014 4359533 4494346 4754649 5123761
3498E123761M36229K46838k3062l63278m41261l39512k17668j06636j1018J35179
$$ 5123761 5559990 5806828 5783766 5420488 4979227 4639715 4422047 4315411 4304393 4439572
3488D439572K01521L34757L44660P4000k29966m53756l13041k62664j64513j08464
$$ 4439572 4641093 4975850 5320510 5394510 5164544 4710788 4397747 4135083 3970570 3862106
3478C862106j7488J73008J82291K64886J50360n2907l87851n02565m37643l68986
$$ 3862106 3844618 4017626 4199917 4464803 4615163 4562256 4174405 3671840 3234197 2865211
3468B865211k76053k27579j53873j89756j32803j38191n9803j6351o214l6772
$$ 2865211 2589158 2361579 2207706 2017950 1885147 1746956 1687153 1670802 1664588 1627816
3458A627816p1301m2139p0582k235O677j9343j3068p5751L6536M1647Q0590M7508
$$ 1627816 1556515 1514376 1443794 1441559 1448236 1428893 1415825 1340074 1376610 1418257 1498847 1546355
3446A546355R532k9545n5942j2014p6631m5622k3970p4226k7461l3818l2294j7182
$$ 1546355 1555887 1526342 1470400 1458386 1381755 1336133 1312163 1237937 1210476 1176658 1144364 1127182
3434A127182L589K3629O4808J3696k018l4687K7196K0465K4927L5034l9897M962
$$ 1127182 1130771 1154400 1219208 1232904 1230886 1196199 1223395 1243860 1268787 1303821 1263924 1268886
3422A268886o736N4804J8585L108j6127m1744j04999l4850k0945p9762p6346K4127
$$ 1268886 1262150 1316954 1335539 1338647 1322520 1280776 1175777 1140927 1119982 1040220 963874 988001
3410I88001Q881j5368n5157o5573l3298L0792n271k4770k6833j6734J2142l4582
$$ 988001 996882 981514 926357 860784 827486 858278 853007 828237 801404 784670 796812 762230
3398G62230J2646N1493O1481l221j0264j3349K5873O65j0737J4448J0711Q091
$$ 762230 774876 826369 887850 884629 874365 861016 886889 887554 876817 891265 901976 910067
3386I10067l4039l5740m7284l6571k4520m6684J0278l7421k542j1564j4449J9520
$$ 910067 876028 840288 793004 756433 731913 685229 695507 658086 655544 643980 629531 649051
3374F49051k1660m7140l6444l5263J8519J2621L3084o5730P182J0960o466N6902
$$ 649051 627391 580251 543807 508544 527063 539684 572768 507038 514220 525180 518714 575616
3362E75616j3845N2378l1517m5176k8599L1258K6959k2845l4977l7253J0052k9006
$$ 575616 561771 614149 582632 537456 508857 540115 567074 544229 509252 471999 482051 453045
3350D53045p124P9766N6516j6644j8550J4923j6317N0016J1887J04442L2415R357
$$ 453045 445921 525687 582203 565559 547009 561932 545615 595631 607518 711960 744375 753732
3338G53732j224j9390J092j6673n3956k5544o1484k9228o199j2975k4656j9550
$$ 753732 752508 733118 734210 717537 663581 638037 576553 547325 541126 528151 503495 483945
3326D83945k7871L334l3686l9228L554K938l4321n9989J2568Q546O0215j0318
$$ 483945 456074 459408 425722 386494 390048 392986 358665 298676 311244 319790 380005 369687
3314C69687N4107J7827q294J8170N864j3788K0200p819R795j4538p188k5642l6641
$$ 369687 423794 441621 433327 451497 457361 443573 463773 455954 465749 451211 444023 418381 381740
3301C81740J6757P1534L5303Q005J6968R001K2274P206L8763K020L1166k7913
$$ 381740 398497 470031 505334 513339 530307 539308 561582 568788 607551 609571 640737 612824
3289F12824o940N557l7367l8467J690M0895Q757k210J8645k724L716O2927K0202
$$ 612824 605884 611441 574074 535607 537297 578192 586949 584739 603384 600660 604376 667303 687505
3276F87505J8992L5480k5047p366m3905k0156J5907J4755M2440j5260N7935K5295
$$ 687505 706497 741977 716930 709564 665659 645503 661410 676165 718605 703345 761280 786575
3264G86575O4697p7295k1839M6063N5852N7850N954L7716R169m0263r5110m0507
$$ 786575 851272 773977 752138 798201 854053 911903 917857 955573 964742 924479 829369 788862
3252G88862R564M2106O4557L8629N9510m1470J4672K2772P5517J6935J7950K6684
$$ 788862 798426 840532 905089 943718 1003228 961758 976430 999202 1074719 1091654 1109604 1136288
3240A136288k3726m689k8647K6860K3628J9145K0441L0004J5876O712J6084N6789
$$ 1136288 1112562 1107873 1079226 1106086 1129714 1148859 1169300 1199304 1215180 1221892 1237976 1294765
3228A294765Q1322N2863N2585M2124j8184L3822j8231k3814m4957l9122J0956
$$ 1294765 1376087 1428950 1481535 1523659 1505475 1539297 1521066 1497252 1452295 1413173 1424129
3217A424129R7580L1508Q31J1281M2769M4011N5096l2435J9666K6857L3011O3793
$$ 1424129 1521709 1553217 1554048 1565329 1608098 1652109 1707205 1674770 1694436 1721293 1754304 1818097
3205A818097m974Q873L538L3886K8556J5551l014q010M5831P5233Q2416L2567
$$ 1818097 1813123 1821996 1825534 1859420 1887976 1903527 1900513 1892503 1938334 2013567 2095983 2128550
3193B128550J0090P1459M2633L1166K2816j8400J0032K7661J9899m134j6753L7560
$$ 2128550 2138640 2210099 2252732 2283898 2306714 2288314 2298346 2326007 2345906 2341772 2325019 2362579
3181B362579O9113K1874L2424K3891K5946K9332L5323M828N0633L3063O4384J2567
$$ 2362579 2431692 2453566 2485990 2509881 2535827 2565159 2600482 2605310 2655943 2689006 2753390 2765957
3169B765957O0786M7014o389J6053L4512O6405N2165O8152N7128O0491M1904K4959
$$ 2765957 2826743 2873757 2867368 2883421 2917933 2984338 3036503 3104655 3161783 3222274 3264178 3289137
3157C289137Q2355P6375N5673M3541O9847M3004L4341N6798J10294J05058Q5896
$$ 3289137 3371492 3447867 3503540 3547081 3616928 3659932 3694273 3751071 3861365 3966423 4052319
3146D052319J41320R3899R5390P9424M9662N1994J24799J33823J38097J25362
$$ 4052319 4193639 4287538 4382928 4462352 4512014 4564008 4688807 4822630 4960727 5086089
3136E086089Q4168Q5101R7413J04229J57015J55240J75973J37940J72743J52211
$$ 5086089 5170257 5255358 5352771 5457000 5614015 5769255 5945228 6083168 6255911 6408122
3126F408122J74977K04893J57496J36933J93851K33541J97655J87500K08242J96166
$$ 6408122 6583099 6787992 6945488 7082421 7276272 7509813 7707468 7894968 8103210 8299376
3116H299376L03153K61919K39428K10165L13441L02098L29123L88392L56806L89590
$$ 8299376 8602529 8864448 9103876 9314041 9627482 9929580 10258703 10647095 11003901 11393491
3106A1393491L63426L89338M00577M19923M65156M58670M98467N07037N85526
$$ 11393491 11756917 12146255 12546832 12966755 13431911 13890581 14389048 14896085 15481611
3097A5481611N94615O63626O91106O85129P03186P43261Q12159Q05828Q57624
$$ 15481611 16076226 16739852 17430958 18116087 18819273 19562534 20374693 21180521 22038145
3088B2038145Q69210R51893R58549J012782J024289R97719J033045J032111J007356
$$ 22038145 22907355 23859248 24817797 25830579 26854868 27852587 28885632 29917743 30925099
3079C0925099R75438R09709R03627P88442O81235N60233M10303J94622k054k17330
$$ 30925099 31900537 32810246 33713873 34502315 35183550 35743783 36154086 36348708 36346654 36129324
3069C6129324l81735n40277o65794p97784q98916r88718j027128j049733j106710
$$ 36129324 35747589 35207312 34541518 33743734 32844818 31856100 30828972 29779239 28672529
3060B8672529j116929j076208j064572j061422r99589r71804r09802q88538q37093
$$ 28672529 27555600 26479392 25414820 24353398 23353809 22382005 21472203 20583665 19746572
3051A9746572p99840q00878p34923o79857o16247n95414n32071n30825n42085
$$ 19746572 18946732 18145854 17410931 16731074 16114827 15519413 14987342 14456517 13914432
3042A3914432m65512m41382m00211l80016l78121l78912l16753l31458k66492
$$ 13914432 13448920 13007538 12607327 12227311 11849190 11470278 11153525 10822067 10555575
3033A0555575k90484l02474k23206k32688k21949k66416j55249j86067j96451
$$ 10555575 10265091 9962617 9739411 9506723 9284774 9018358 8863109 8677042 8480591
3024H480591j30375j34922j91603j55914r1757q3156q7444j68788j23962q6133
$$ 8480591 8350216 8215294 8023691 7867777 7776020 7692864 7605420 7436632 7312670 7226537
3014G226537j09909q6703o2354o3242n2390p635m9550p1405k0179k4649K2171
$$ 7226537 7116628 7029925 6967571 6904329 6851939 6844304 6794754 6723349 6703170 6678521 6700692
3003F700692k8906J0450m3812r129M4956O4305N8329P9569J26117J62253J82247
$$ 6700692 6671786 6682236 6638424 6629295 6674251 6738556 6796885 6876454 7002571 7164824 7347071
2992G347071J96578K53070L65369L60256K62613l6771j08388m0838P8986k6584
$$ 7347071 7543649 7796719 8162088 8522344 8784957 8748186 8639798 8598960 8677946 8651362
2982H651362k11529l69668l69970k00233k02619j10935r9227l3813o252J2615
$$ 8651362 8439833 8070165 7700195 7499962 7297343 7186408 7087181 7053368 7047116 7059731
2972G059731j7985p4502m5301M0124Q732M1783L7373O4240R8802O7389N1825Q1637
$$ 7059731 7041746 6967244 6921943 6962067 6970799 7012582 7049955 7114195 7212997 7280386 7332211 7413848
2960G413848o32N5051Q9988J08077P2110J13407J49659J54003J75447J20454R7220
$$ 7413848 7413216 7468267 7558255 7666332 7738442 7851849 8001508 8155511 8330958 8451412 8548632
2949H548632J75386J79715J63375J91194K43694K59115L68531L46278L08229L23392
$$ 8548632 8724018 8903733 9067108 9258302 9501996 9761111 10129642 10475920 10784149 11107541
2939A1107541L46292M16562M96851N42448O79358P56481R16576Q59273M04524
$$ 11107541 11453833 11870395 12367246 12909694 13589052 14345533 15262109 16121382 16525906
2930A6525906n9962l4989K25373N01577O53914Q35624R97982J132648J281149
$$ 16525906 16465944 16430955 16656328 17157905 17811819 18647443 19645425 20778073 22059222
2921B2059222J500582J926460K384774K839517L294515L085126J166147j727582
$$ 22059222 23559804 25486264 27871038 30710555 34005070 37090196 38256343 36528761
2913C6528761k920204k427325j687167j052082p47710m58519k02499L7984J39389
$$ 36528761 33608557 31181232 29494065 28441983 27694273 27235754 27033255 27071239 27210628
2904B7210628K63007L63093N08049O00136O50577O10931O64053P46400P70567
$$ 27210628 27473635 27836728 28344777 28944913 29595490 30206421 30870474 31616874 32387441
2895C2387441Q07351Q75860Q40973Q84361Q22647P37809O91388O84259N47077
$$ 32387441 33194792 34070652 34911625 35795986 36618633 37356442 38047830 38732089 39279166
2886C9279166O42899N62078M89858M81296M17634L86027L96589L49888L71277
$$ 39279166 39922065 40484143 40974001 41455297 41872931 42258958 42655547 43005435 43376712
2877D3376712K68449J98047J02246k6476j77502k59615l58399l87641m51824m41954
$$ 43376712 43645161 43843208 43945454 43918978 43741476 43481861 43123462 42735821 42283997 41842043
2867D1842043m92331n06586n38577n65790n82403n47307n91338p19184q11069
$$ 41842043 41349712 40843126 40304549 39738759 39156356 38609049 38017711 37298527 36487458
2858C6487458r11789r55543j004661r98848j104870j059795j060753j053381r31666
$$ 36487458 35575669 34620126 33615465 32616617 31511747 30451952 29391199 28337818 27406152
2849B7406152r39679r23115r32275r33954q66431r19274q67590q69675p26757
$$ 27406152 26466473 25543358 24611083 23677129 22810698 21891424 21023834 20154159 19427402
2840A9427402o62901o70900n74962n84204q22549r74343r30859q41693p71028
$$ 19427402 18764501 18093601 17518639 16934435 16111886 15137543 14206684 13364991 12593963
2831A2593963o57410n88025n10428n12567m98249m52789m16132l94726l30537
$$ 12593963 11936553 11348528 10838100 10325533 9827284 9374495 8958363 8563637 8233100
2822H233100l24797k64621l09235k86961k51904j87114j93462k19627j53198j24114
$$ 8233100 7908303 7643682 7334447 7047486 6795582 6608468 6415006 6195379 6042181 5918067
2812E918067j70152j21568j08920j38998j46470j21246j09236q9375r5804j16373
$$ 5918067 5747915 5626347 5517427 5378429 5231959 5110713 5001477 4912102 4816298 4699925
2802D699925j32706r4441j18206p6858n9050j02038j06512m5708j3227l5943k5511
$$ 4699925 4567219 4472778 4354572 4277714 4218664 4116626 4010114 3964406 3951179 3915236 3889725
2791C889725o5250n0664j7389r989O187M882M217r0717p2662Q259J6071l8098
$$ 3889725 3824475 3773811 3756422 3746433 3752620 3757502 3761719 3671002 3598340 3606599 3622670 3584572
2779C584572m3994K0284O7743L8300M2896j3094k5395o406M4742O3551Q60m9813
$$ 3584572 3540578 3560862 3628605 3666905 3709801 3696707 3671312 3664906 3709648 3773199 3774059 3724246
2767C724246q8450q251k7268m2405n8904m3869r529J6638J2603M135J3746k0520
$$ 3724246 3635796 3627545 3600277 3557872 3498968 3455099 3445570 3462208 3474811 3478946 3492692 3472172
2755C472172o8176K4190o7114l0125l3164N806j0614j0865n8226p9042p622l745
$$ 3472172 3403996 3428186 3361072 3330947 3297783 3303589 3292975 3282110 3223884 3144842 3137220 3133475
2743C133475m247l2340m5498q7824n9619n3204M8972K7831o1765n7457m0612l3327
$$ 3133475 3129228 3096888 3051390 2963566 2903947 2850743 2899715 2927546 2865781 2808324 2767712 2734385
2731B734385n9922n2173o3213o0729J3054j0714l915j7941o0527n0013o4669o6243
$$ 2734385 2674463 2622290 2559077 2498348 2511402 2500688 2496773 2478832 2418305 2368292 2303623 2237380
2719B237380l3922J3030Q718j9651l6540K6557l4728k7962n1133n668J216k8998
$$ 2237380 2203458 2216488 2225206 2205555 2169015 2195572 2160844 2132882 2081749 2076081 2077297 2048299
2707B048299j6352J8110j2754N9269N9088O7952j76k4953q1308o540M7557J3188
$$ 2048299 2031947 2050057 2037303 2096572 2155660 2223612 2223436 2198483 2117175 2110635 2158192 2171380
2695B171380M7674k5456L5922j3014L4236K6553M3176O7641N6830P5974Q8917
$$ 2171380 2219054 2193598 2229520 2216506 2250742 2277295 2320471 2388112 2444942 2520916 2609833
2684B609833R4360N0677O6338M8533K3101N2118l0941n5302n8226K596K9739M9489
$$ 2609833 2704193 2754870 2821208 2869741 2892842 2944960 2914019 2858717 2800491 2803087 2832826 2882315
2672B882315K8380M877r745j568j2861j5598l3741o2042R656m1173l9995m6047
$$ 2882315 2910695 2915572 2905827 2904259 2891398 2875800 2842059 2780017 2789673 2748500 2708505 2662458
2660B662458o2502n1826o4413m3548p1208J474m0478J3794L4573p149l4660l2730
$$ 2662458 2599956 2548130 2483717 2440169 2368961 2370435 2329957 2343751 2378324 2371175 2336515 2303785
2648B303785l3848L166P2316o104j5527J1459r563r284P3250M9426J5807J4994
$$ 2303785 2269937 2273103 2345419 2339315 2323788 2335247 2325684 2316400 2389650 2439076 2454883 2469877
2636B469877k0018K1296J5344m587R515K0467N2764K2680K7110k4192K8235M1110
$$ 2469877 2449859 2471155 2486499 2481912 2491427 2511894 2564658 2587338 2614448 2590256 2618491 2659601
2624B659601K5600N4141N6222r00N4356L7126L495L3618K1361J3932M3701J11279
$$ 2659601 2685201 2739342 2795564 2794664 2849020 2886146 2889641 2923259 2944620 2958552 3002253 3113532
2612C113532J5608O9419K1711N1936N7819Q1039Q7061R5249J00951N2748Q4553
$$ 3113532 3129140 3198559 3220270 3272206 3330025 3411064 3498125 3593374 3694325 3747073 3831626
2601C831626Q2708L1082K2886P8426Q0683Q0039P6200O5405J22328R3411J39998
$$ 3831626 3914334 3945416 3968302 4046728 4127411 4207450 4283650 4349055 4471383 4564794 4704792
2590D704792R3421J22184N9600R2077J21418O1926J39015J31226J17360J32235
$$ 4704792 4798213 4920397 4979997 5072074 5193492 5255418 5394433 5525659 5643019 5775254
2580E775254J28689O7441J01317J40496J59489J89667J58583J48128J05548J78746
$$ 5775254 5903943 5971384 6072701 6213197 6372686 6562353 6720936 6869064 6974612 7153358
2570G153358J65856J50211J90542J45452K10606J75712K02134J91611K46936K28953
$$ 7153358 7319214 7469425 7659967 7805419 8016025 8191737 8393871 8585482 8832418 9061371
2560I061371L09998K76595K45745K79239L01321L44919L65459L89805M38001M15180
$$ 9061371 9371369 9647964 9893709 10172948 10474269 10819188 11184647 11574452 12012453 12427633
2550A2427633M02392L91927M46100L98825M21148M31793M61328M41345M61645
$$ 12427633 12830025 13221952 13668052 14066877 14488025 14919818 15381146 15822491 16284136
2541A6284136M81248M37657M12236M27553L89661M18833M06910M31255M37647
$$ 16284136 16765384 17203041 17615277 18042830 18432491 18851324 19258234 19689489 20127136
2532B0127136L82630M03711L18995L60602L11838K37466K00938J71133J76384
$$ 20127136 20509766 20913477 21232472 21593074 21904912 22142378 22343316 22514449 22690833
2523B2690833J50385J20193J27668J31848J48715J61669J71858J87275J51648
$$ 22690833 22841218 22961411 23089079 23220927 23369642 23531311 23703169 23890444 24042092
2514B4042092J82811J99723J96654J88547J81341K76237L04949L61545M30873
$$ 24042092 24224903 24424626 24621280 24809827 24991168 25267405 25572354 25933899 26364772
2505B6364772M28933M32160N24507O15121O92443P38238Q07605Q75291R63570
$$ 26364772 26793705 27225865 27750372 28365493 29057936 29796174 30603779 31479070 32442640
2496C2442640J030827J150766J247618J389793J522305J689658J781641J856668
$$ 32442640 33473467 34624233 35871851 37261644 38783949 40473607 42255248 44111916
2488D4111916J969166K080307K154397K183937K236844K185278K126262K119275
$$ 44111916 46081082 48161389 50315786 52499723 54736567 56921845 59048107 61167382
2480F1167382K120637K174776K221104K292593K401103K511997K663621K826831
$$ 61167382 63288019 65462795 67683899 69976492 72377595 74889592 77553213 80380044
2472H0380044K851114K926058K959827K898565K720484K691820K552817K472186
$$ 80380044 83231158 86157216 89117043 92015608 94736092 97427912 99980729 102452915
2464A02452915K327205K125734K033333K042341K127052K138530K239108K327522
$$ 102452915 104780120 106905854 108939187 110981528 113108580 115247110 117486218 119813740
2456A19813740K525030K873412L191769L567335M007886M412781M929977N468992
$$ 119813740 122338770 125212182 128403951 131971286 135979172 140391953 145321930 150790922
2448A50790922N885750O112760N937625N265031M324054L061342J711226K12428
$$ 150790922 156676672 162789432 168727057 173992088 178316142 181377484 183088710 183301138
2440A83301138j131773k342365l211876l642841l655171l402775k943507k421777
$$ 183301138 182169365 179827000 176615124 172972283 169317112 165914337 162970830 160549053
2432A60549053j945109j603306j691988k155194l007066m134342n476299o785306
$$ 160549053 158603944 157000638 155308650 153153456 150146390 146012048 140535749 133750443
2424A33750443q000335q840431r184341r150974q746699q139279p284295o348065
$$ 133750443 125750108 116909677 107725336 98574362 89827663 81688384 74404089 68056024
2416F8056024n469845m641984m067243l560568l114701k712083k346828k060176
$$ 68056024 62586179 57944195 53876952 50316384 47201683 44489600 42142772 40082596
2408D0082596j861698j585795j407721j210985j036268r45681q47910q31781q11138
$$ 40082596 38220898 36635103 35227382 34016397 32980129 32034448 31186538 30354757 29543619
2399B9543619q09041o93856o82241o49394n83680n44462n10624m95559l81856
$$ 29543619 28734578 28040722 27358481 26709087 26125407 25580945 25070321 24574762 24192906
2390B4192906k99990k83317l05269l33091l27742l96686m15412m49323m71449
$$ 24192906 23892916 23609599 23304330 22971239 22643497 22246811 21831399 21382076 20910627
2381B0910627n09522n37938n48721o17157n96783n33470n11008m31233m22979
$$ 20910627 20401105 19863167 19314446 18697289 18100506 17567036 17056028 16624795 16201816
2372A6201816m21947m05269l63322l56291m06383m07448n19180m70288m70400
$$ 16201816 15779869 15374600 15011278 14654987 14248604 13841156 13321976 12851688 12381288
2363A2381288m07280l77361m06673m45142l72313l59111l82806l03353k81877
$$ 12381288 11974008 11596647 11189974 10744832 10372519 10013408 9630602 9327249 9045372
2354I045372k45775k32871k28265k28314k06793k07189j91561j76098j48803j80902
$$ 9045372 8799597 8566726 8338461 8110147 7903354 7696165 7504604 7328506 7179703 6998801
2344F998801j69535j74025j50395j70987j44317j54867q3393j36736r4114j00268
$$ 6998801 6829266 6655241 6504846 6333859 6189542 6034675 5951282 5814546 5720432 5620164
2334E620164m9393r8714r1940j24313m3428q2359j13820j13965q2880j12140p5054
$$ 5620164 5570771 5472057 5380117 5255804 5212376 5130017 5016197 4902232 4819352 4707212 4632158
2323D632158l2829o7632q1942r6503p0329l5516q0915r4992o2741m0919m6970
$$ 4632158 4599329 4531697 4449755 4353252 4282923 4247407 4166492 4071500 4008759 3967840 3920870
2312C920870r5931k4454n8001p6651j17557n7402q7869l8132l7402o9293m9431
$$ 3920870 3824939 3800485 3742484 3665833 3548276 3490874 3403005 3364873 3327471 3258178 3208747
2301C208747j8148r5472o4637r2913l0902o6609m9762p2616o9475p3602l2034
$$ 3208747 3190599 3095127 3030490 2937577 2906675 2840066 2790304 2717688 2648213 2574611 2542577
2290B542577m7476j1594m7972m7793p9686m7296l3366k5993k0057J0583k5144
$$ 2542577 2495101 2483507 2435535 2387742 2308056 2260760 2227394 2201401 2181344 2191927 2166783
2279B166783r902o5502p5586n1347l7778j1732o1857l593j5068l6592k0904m6703
$$ 2166783 2156881 2091379 2015793 1964446 1926668 1914936 1853079 1849486 1834418 1797826 1776922 1730219
2267A730219k5089p4170p762o852q198k0797p2807k7401j8029J8886O824o2102
$$ 1730219 1705130 1630960 1623198 1616346 1608148 1587351 1514544 1487143 1469114 1488000 1494824 1432722
2255A432722r1467p3440k5653M8459m361o862p957J3126m3219r723K7642j3943
$$ 1432722 1341255 1267815 1242162 1290621 1286260 1279398 1271441 1284567 1241348 1231625 1259267 1245324
2243A245324j0971J7531n3227l9968j8349N445O337j5603j7320o368j2128k3838
$$ 1245324 1234353 1251884 1198657 1158689 1140340 1145785 1152122 1136519 1119199 1112831 1100703 1076865
2231A076865k1297J0421l8892J0951K2174n0901n613P586n406m249R632m4292
$$ 1076865 1055568 1065989 1027097 1038048 1060222 1009321 1003708 1011294 1005888 1001639 1011271 966979
2219I66979J419K754K6528L2385m4193m0865l6859j885l2360j808o670n695n659
$$ 966979 968398 971152 997680 1030065 985872 945007 908148 906263 873903 872095 865425 859730 854071
2206H54071K0905k0924k7314k9966R176J579J5653l3244L7487J060q290N968K3307
$$ 854071 874976 854052 826738 796772 805948 807527 823180 789936 827423 828483 820193 826161 849468
2193H49468j1653R44J3019J9052j9183j0507l9064K1088J4675p146O1142K5647
$$ 849468 837815 838759 851778 870830 851647 841140 802076 823164 837839 830693 891835 917482
2181I17482P637L0689M0792J6450J5957l7229j7699L1992L8895M6195J1100J7954
$$ 917482 925119 955808 996600 1013050 1029007 991778 974079 1006071 1044966 1091161 1102261 1120215
2169A120215K1946l702J6233L3985K8104L2775M7642R148N7480K1012o912M632
$$ 1120215 1142161 1138459 1154692 1188677 1216781 1249556 1297198 1306346 1363826 1384838 1377926 1382558
2157A382558n236l611J6782n87K0745J3464M5875n960M0866K2657L3296L6165
$$ 1382558 1377322 1373711 1390493 1389906 1410651 1424115 1469990 1464030 1504896 1527553 1560849 1597014
2145A597014O3617J5574J3716k6216J3967K8033M0582N7525O2691N517l7049j5022
$$ 1597014 1660631 1676205 1689921 1663705 1677672 1705705 1746287 1803812 1866503 1872020 1834971 1819949
2133A819949k8108J4848K6195P054k1251M666P275j4951l6649m9907J8644J6025
$$ 1819949 1791841 1806689 1832884 1839938 1818687 1823353 1830628 1815677 1779028 1729121 1747765 1763790
2121A763790q314l2407l2852J5087j9280m1011j6590L6421j6751k5601k5660r640
$$ 1763790 1755476 1723069 1690217 1705304 1686024 1645013 1628423 1664844 1648093 1622492 1596832 1587192
2109A587192k6511K146M8361O723K6800n7311K5445l7386m8516l4321m3548n3559
$$ 1587192 1560681 1562827 1611188 1617911 1644711 1587400 1612845 1575459 1526943 1492622 1449074 1395515
2097A395515n6242q2925l6099p8866p8606l2674k6594l9810k3021o7483o1491
$$ 1395515 1339273 1256348 1220249 1141383 1062777 1030103 1003509 963699 940678 873195 811704
2086H11704j0256k6184J7315j1470k9012m1868n23j3215P188l1948k5326m6603
$$ 811704 801448 775264 792579 781109 752097 710229 709706 696491 703679 671731 646405 599802
2074E99802l8962k0345L6889j6872k529n4895K2337q921o310p3724l0025K7872
$$ 599802 560840 540495 577384 560512 557983 503088 525425 516504 510194 436470 406445 434317
2062D34317J1689K7492l5938k4332o8662r162L6298M707j3090r1078J3506r19
$$ 434317 446006 473498 437560 413228 344566 335404 371702 376409 363319 272241 285747 284828
2050B84828k4630j9425l8400J4193O3463K7014n7250n2964k9319J0694K3309j0415
$$ 284828 260198 240773 202373 216566 280029 307043 249793 196829 167510 178204 201513 191098
2038A91098m1971k3090K8445K581J4912o557q371j3933l4776j775n990L791J0605
$$ 191098 149127 126037 154482 157063 171975 165418 157047 143114 108338 106563 100573 104364 114969
2025A14969L9314Q015K532m0470k9712l0732j8125M9179l203j98M689l0906K6826
$$ 114969 154283 162298 164830 124360 94648 63916 45791 94970 91767 91569 96258 65352 92178
2012I2178j6697L3199j6044K0426J651k5688L258k1663J6715k3561j8944L9138
$$ 92178 75481 108680 92636 113062 114713 89025 92283 70620 87335 63774 44830 83968
2000H3968M7464N5587k0584p1703l6062Q545N4235L2113K0129j6768l4044k1150
$$ 83968 131432 187019 166435 94732 58670 67215 121450 153563 173692 156924 122880 101730
1988A01730R354J4358k6070k8973N0615N1650j222l1470l6659Q111p211N7873
$$ 101730 111084 125442 99372 70399 121014 172664 171442 139972 103313 111424 104213 162086
1976A62086l0606o870m549Q725J489j6559k3726J206N3071j3092J6503l3197J8149
$$ 162086 131480 124610 120061 128786 130275 113716 89990 91196 144267 131175 147678 114481 132630
1963A32630n612k2830L8597K5380J2108j7682o867k1984K3069K7331j9736M1951
$$ 132630 127018 104188 142785 168165 180273 162591 155724 133740 156809 184140 164404 206355
1951B06355l8718K1875m341N817l2094K7333M4315L1646j5933n4629j9481J9219
$$ 206355 167637 189512 185171 190988 158894 186227 230542 262188 246255 191626 172145 191364
1939A91364J7766L6922p617j4984J132O2007K4106l5537l1523n4331N8288L0185
$$ 191364 209130 246052 238435 223451 224583 286590 310696 275159 243636 189305 247593 277778
1927B77778M6528k0438k8851k1122K3982O5289J5220p3908l875k761O2445O915
$$ 277778 324306 303868 275017 253895 277877 343166 358386 284478 280603 277842 340287 347202
1915C47202n8225m6703M6533L0930J6277j7750J543j8048J8166Q458l3048j9516
$$ 347202 288977 242274 288807 319737 336014 318264 319807 301759 319925 328383 295335 275819
1903B75819l4875N4903O4237j1833l4069o4079K2326m530o134K5793J3383k3550
$$ 275819 240944 295847 360084 348251 314182 250103 272429 267899 261765 287558 300941 277391
1891B77391l2696O647K7720K6104j5931l9436j6631j8493J9011J5158K646J6661
$$ 277391 244695 251342 279062 305166 289235 249799 233168 214675 233686 248844 251490 268151
1879B68151k1943O069k0047j9926j097K9989M3503O339k0734k6453l2255K7143
$$ 268151 246208 252277 232230 212304 211207 241196 284699 291038 270304 243851 211596 238739
1867B38739N769r824K9008K5162n526K1101J7771R713k8246J7219J303K8796K5870
$$ 238739 244508 234684 263692 288854 283328 304429 322200 331913 303667 320886 322189 350985 376855
1854C76855K5249J2097j0687n4504O2807R8509N2648R021n777O497p461L0515
$$ 376855 402104 414201 403514 349010 411817 510326 562974 571995 566218 572715 565254 595769
1842E95769K2113N237j0749l6837k903j0136k4131n7867j4244J3341M1752N162
$$ 595769 617882 623119 612370 575533 572630 562494 538363 480496 466252 479593 521345 526507
1830E26507j5805o9545l9990P664K4697N737K0096o0276N3972K5516P9490K3627
$$ 526507 510702 441157 401167 408831 433528 439265 459361 399085 453057 478573 558063 581690
1818E81690k622q621K4439N5735J7647K7651K9310N2706J13598J14294O2718l4824
$$ 581690 579068 570447 594886 650621 668268 695919 725229 777935 891533 1005827 1068545 1033721
1806A033721O656L1267J7300n506o6488o687k5181j8563q2207j942m8364r704
$$ 1033721 1040377 1071644 1088944 1083438 1016950 1010263 985082 966519 884312 882370 834006 824302
1794H24302o5603m0256r9480l5378m054R743l0529m0619k3763l1901k7629J8964
$$ 824302 758699 718443 618963 583585 579531 589274 558745 518126 494363 462462 434833 453797
1782D53797M0291O7765k0798l1822J952J4327O7928J150N433J4481N6689O1474
$$ 453797 494088 561853 541055 509233 511185 525512 593440 594590 600023 614504 671193 732667
1770G32667J4699K9977n354R305k483j0727l4076J4667R384j3037n9858r1672
$$ 732667 747366 777343 771989 781294 778811 768084 734008 748675 758059 745022 685164 593492
1758E93492j6548o87j4791n7013p1436r457n8186M1k1535K3003R835K6944k4810
$$ 593492 576944 576257 561466 504453 433017 423560 365374 365415 343880 366883 376718 403662 378852
1745C78852m7184m1292J3922M4240N457j6724P553j8016J3586o494k2118L486
$$ 378852 331668 290376 304298 348538 353995 337271 344824 326808 340394 333900 311782 315268
1733C15268m5283n2986J3108j4133K196O3223M4932j7076l0520l469R858m6831
$$ 315268 269985 216999 230107 215974 218170 281393 326325 309249 278729 275260 285118 238287
1721B38287J1453J6601M1641O8643l7845M301n1342K084N4784j13o4062J1819
$$ 238287 249740 266341 307982 376625 338780 343081 291739 293823 348607 348494 284432 296251
1709B96251K9598K5037K2428n3587J7163k43k7042M4585l0755j8272k7502L9518
$$ 296251 325849 350886 373314 319727 336890 336647 309605 354190 323435 305163 277661 317179
1697C17179K7907N0172o5034j7805n8579l2063P2293L5950J2211l5900k8874J663
$$ 317179 345086 395258 330224 312419 253840 221777 294070 330020 342231 306331 277457 279120
1685B79120k9414j8965l3153J0909N242L934l5213j7351P521J8046j1244P550
$$ 279120 249706 230741 197588 208497 213739 217673 182460 165109 172630 190676 179432 186982
1673A86982l6657l7601r301j6193Q95M735K513K0357L8627J6557n2123k7307m0012
$$ 186982 150325 112724 103423 87230 88125 92860 95373 115730 154357 170914 118791 91484 51472
1660E1472J1216J418K830R340n100l9342l3481k5058j04L3790L1847j5993m8884
$$ 51472 62688 64106 66936 76276 71176 31834 -1647 -26705 -26809 6981 38828 22835 -26049
1647b6049j149O0871n288M0425l4200m7222J7132m9801k7065O523J9089J1165
$$ -26049 -27198 33673 28385 68810 34610 -12612 4520 -45281 -72346 -65823 -46734 -35569
1635c5569P9022n3586l3077k1847o558L1889K6223j689k3440j2952j544K5248
$$ -35569 43453 -10133 -43210 -65057 -71615 -39726 -13503 -15192 -38632 -51584 -53128 -27880
1623b7880J1381R159N885o0746J3690l2222L5232K2501k9465l3823K5424M4439
$$ -27880 -16499 -7340 -1455 -62201 -48511 -80733 -45501 -23000 -52465 -86288 -60864 -16425
1611a6425L8746n356n8272n886K6211n271K698r351l6182P642m2816j0963M278
$$ -16425 22321 16965 -41307 -47193 -20982 -26253 -23555 -32906 -69088 -61446 -104262 -115225 -110947
1598a10947q705L6492K6704O880l4731m6120l515K029L5094L1620M888l8475k4164
$$ -110947 -119652 -83160 -56456 -49576 -84307 -130427 -133942 -131913 -96819 -65199 -60311 -98786 -122950
1585a22950L772J1450J3978k3462j272K673J7892N780k2920p0730Q602L3952L6637
$$ -122950 -119178 -107728 -93750 -117212 -118484 -115811 -97919 -92139 -115059 -185789 -177187 -143235 -106598
1572a06598K0323L975j1309j3100J932K1524j9799k1968L2859K7744l0044j2989
$$ -106598 -86275 -82300 -93609 -106709 -104777 -83253 -103052 -125020 -92161 -64417 -94461 -107450
1560a07450n720j5081L5523K6599k6223J8843q39L4032j636n914K0945k1562r825
$$ -107450 -113170 -128251 -92728 -66129 -92352 -73509 -74348 -40316 -41952 -47866 -26921 -48483 -58308
1547e8308j7376K762Q2050L6180j8550m1895k9464J1602M4004j515J2968j1680
$$ -58308 -75684 -72922 9128 45308 26758 -15137 -44601 -32999 11005 9490 22458 10778
1535A0778l655j5610N937K670J7557K2358K896k368m9320j7040P466M7466J4229
$$ 10778 7123 -8487 -2550 120 17677 40035 42931 40563 -8757 -25797 -18331 29135 43364
1522D3364o82k1680K5842R178l5081j9492R859M6728J4929l3827k549O836L6030
$$ 43364 42682 21002 46844 56022 20941 1449 11308 58036 72965 39138 36589 43425 79455
1509G9455m498l4269o350K2863K408J2660J1801k8502k6728K9303N2758L8684
$$ 79455 74957 40688 34338 57201 59609 72269 84070 55568 28840 58143 110901 149585
1497A49585k8998k8473o1586K1801L5582N4181K4613M378K960l3382l5564k2233
$$ 149585 120587 92114 30528 52329 87911 142092 166705 171083 174043 140661 105097 82864
1485H2864M78l183M1722Q345k3987N135j7301N3563r18j5097l1194L605K6809
$$ 82864 83342 80159 121881 130226 106239 111374 94073 147636 146718 131621 100427 104032 130841
1472A30841L4214L2333k2854o5318L702M5294q786k3671N610l2822N3424K3160
$$ 130841 165055 197388 174534 109216 112918 158212 149426 125755 131365 98543 151967 175127
1460A75127l1004l9492L0083K8276P5704J801l6706l1012r26L1274n3031M00J6071
$$ 175127 144123 104631 134714 162990 238694 240495 203789 172777 171851 203125 150094 150494 166565
1447A66565N8848L7427K6040p756k3753m332P335K2599P0600M1298m535l0745
$$ 166565 225413 262840 288880 281124 257371 253039 260374 282973 353573 394871 390336 359591
1435C59591j5190k6966J4758o697J5562K069L1931M596l6156k1117j1932Q105
$$ 359591 344401 317435 332193 325496 341058 343127 375058 379654 343498 322381 310449 318554
1423C18554M5860K437J663K944r315k8893O894k4041l7918k6104M8489M7943J2743
$$ 318554 364414 366851 368514 371458 362143 333250 340144 316103 278185 252081 300570 348513 361256
1410C61256K8445j2753j3139J0244J4092L225r417k524Q13J3075l280j0227l6995
$$ 361256 389701 376948 363809 374053 388145 391370 381953 379429 380242 393317 390037 379810 342815
1397C42815p2514p825Q673j0206m300K8501q772k4762J1376j9146k4231l0731
$$ 342815 270301 262476 271149 260943 256643 285144 276372 251610 262986 243840 219609 188878
1385A88878M9180K1612j3384r095k6636M4933M129k7170r878J9397k37p251N305
$$ 188878 238058 259670 246286 237191 210555 255488 259617 232447 222569 241966 241729 234478 239783
1372B39783L603J8476o172N4729K5284K1948Q895k5242j8673l6520m7122j9750
$$ 239783 243386 261862 255690 310419 335703 357651 366546 341304 322631 286111 238989 219239
1360B19239N0602q888k4356j6541l1199q87n164l5674n2202j5021L8118N3032
$$ 219239 269841 260953 236597 220056 188857 187970 182806 147132 94930 79909 118027 171059
$$ [...]
##END NTUPLES=NMR SPECTRUM
##END=
