##TITLE=1H_CA-8802-8
 CDCl3, 8 sc, 
 29.12.2020
##JCAMPDX= 6.0         $$ Bruker NMR JCAMP-DX V2.0
##DATA TYPE= NMR SPECTRUM
##DATA CLASS= NTUPLES
##ORIGIN= UXNMR, Bruker Analytische Messtechnik GmbH
##OWNER= root
$$ XWIN-NMR		Version 3.5
$$ Wed Dec 30 10:21:46 2020 Russian Standard Time (UT+4h)  she@DPX200
##.OBSERVE FREQUENCY= 200.1315066352
##.OBSERVE NUCLEUS= ^1H
##.ACQUISITION MODE= SIMULTANEOUS
##.ACQUISITION SCHEME= undefined
##.AVERAGES= 8
##.DIGITISER RES= 18
##SPECTROMETER/DATA SYSTEM= spect
##.PULSE SEQUENCE= zg30
##.SOLVENT NAME= CDCl3
##.SHIFT REFERENCE= (INTERNAL, CDCl3, 0, 15.9833)
##AUDIT TRAIL= $$ (NUMBER, WHEN, WHO, WHERE, WHAT)
$$ ##TITLE= Audit trail, XWIN-NMR		Version 3.5
$$ ##JCAMPDX= 5.01
$$ ##ORIGIN= Bruker BioSpin GmbH
$$ ##OWNER= she
$$ F:/spectra/data/she/nmr/H-F/1/pdata/1/auditp.txt
$$ ##AUDIT TRAIL=  $$ (NUMBER, WHEN, WHO, WHERE, WHAT)
(   1,<2020-12-30 10:20:22.82 +0400>,<she>,<DPX200>,
      <created by zg, POWCHK disabled, PULCHK disabled
       configuration hash MD5:
       00 E9 B6 7A A2 85 ED C7 34 08 36 98 17 FE 4E 26
       data hash MD5: 16K
       BA AF 36 3B 52 B1 68 D0 75 93 1D 85 96 B5 10 93>)
(   2,<2020-12-30 10:20:30.01 +0400>,<she>,<DPX200>,
      <Start of raw data processing
       efp BC_mod = 2 LB = 0.24 FT_mod = 6 PKNL = 1 PHC0 = -10762.25 PHC1 = 10.40095 SI = 16K 
       data hash MD5: 16K
       28 40 06 8A F5 28 EE 5E A0 BD 3B EA 7F 51 F3 57>)
(   3,<2020-12-30 10:20:52.01 +0400>,<she>,<DPX200>,
      <pk PHC0 = -1.240508 PHC1 = -0.1999998 
       data hash MD5: 16K
       2B A0 0E AA F8 2F 55 E3 CC 95 D0 97 15 F0 84 5A>)
(   4,<2020-12-30 10:20:57.28 +0400>,<she>,<DPX200>,
      <abs ABSG = 5 
       data hash MD5: 16K
       8C A1 D2 24 15 02 6A 44 D7 0F 44 BD 6E FF 55 26>)
$$ ##END=
$$ 
$$ hash MD5
$$ CB C9 E9 99 CC 59 28 75 63 4C F2 A5 03 F5 B4 A7
##$RELAX= 
##$RELAX= 
##$RELAX= 
##$RELAX= 
##$RELAX= 
##$RELAX= 
$$ Bruker specific parameters
$$ --------------------------
##$DU= <F:/spectra>
##$EXPNO= 1
##$NAME= <H-F>
##$PROCNO= 1
##$TYPE= <nmr>
##$USER= <she>
##$AMP= (0..31)
100 100 100 100 100 100 100 100 100 100 100 100 100 100 100 100 100 100 
100 100 100 100 100 100 100 100 100 100 100 100 100 100 
##$AQSEQ= 0
##$AQ_mod= 1
##$AUNM= <au_zg>
##$AUTOPOS= <>
##$BF1= 200.13
##$BF2= 200.13
##$BF3= 200.13
##$BF4= 200.13
##$BF5= 200.13
##$BF6= 200.13
##$BF7= 200.13
##$BF8= 200.13
##$BYTORDA= 1
##$CFDGTYP= 0
##$CFRGTYP= 5
##$CHEMSTR= <none>
##$CNST= (0..31)
1 1 145 1 1 1 1 1 1 1 1 1 1 1 1 1 1 1 1 1 1 1 1 1 1 1 1 1 1 1 1 1 
##$CPDPRG= <>
##$CPDPRG1= <>
##$CPDPRG2= <>
##$CPDPRG3= <>
##$CPDPRG4= <mlev>
##$CPDPRG5= <mlev>
##$CPDPRG6= <mlev>
##$CPDPRG7= <mlev>
##$CPDPRG8= <mlev>
##$CPDPRGB= <>
##$CPDPRGT= <>
##$D= (0..31)
0 1.2 0 0 0 0 0 0 0 0.06 0 0.03 0 0 0 0 0.0002 0 0 0 0 0 0 0 0 0 0 0 0 
0 0 0 
##$DATE= 1609309222
##$DBL= (0..7)
120 120 120 120 120 120 120 120 
##$DBP= (0..7)
150 150 150 150 150 150 150 150 
##$DBP07= 0
##$DBPNAM0= <>
##$DBPNAM1= <>
##$DBPNAM2= <>
##$DBPNAM3= <>
$$ [...]
##$SUBNAM3= <"">
##$SUBNAM4= <"">
##$SUBNAM5= <"">
##$SUBNAM6= <"">
##$SUBNAM7= <"">
##$SUBNAM8= <"">
##$SUBNAM9= <"">
##$SW= 16.9725356469052
##$SWIBOX= (0..15)
0 0 2 0 0 0 0 0 0 0 0 0 0 0 0 0 
##$SW_h= 3396.73913043478
##$TD= 16384
##$TD0= 1
##$TE= 0
##$TE2= 300
##$TE3= 300
##$TEG= 300
##$TL= (0..7)
0 120 120 120 120 120 120 120 
##$TP= (0..7)
150 150 150 150 150 150 150 150 
##$TP07= 0
##$TPNAME0= <>
##$TPNAME1= <>
##$TPNAME2= <>
##$TPNAME3= <>
##$TPNAME4= <>
##$TPNAME5= <>
##$TPNAME6= <>
##$TPNAME7= <>
##$TPOAL= (0..7)
0.5 0.5 0.5 0.5 0.5 0.5 0.5 0.5 
##$TPOFFS= (0..7)
0 0 0 0 0 0 0 0 
##$TUNHIN= 0
##$TUNHOUT= 0
##$TUNXOUT= 0
##$USERA1= <user>
##$USERA2= <user>
##$USERA3= <user>
##$USERA4= <user>
##$USERA5= <user>
##$V9= 5
##$VALIST= <valist>
##$VCLIST= <CCCCCCCCCCCCCCC>
##$VD= 0
##$VDLIST= <DDDDDDDDDDDDDDD>
##$VPLIST= <PPPPPPPPPPPPPPP>
##$VTLIST= <TTTTTTTTTTTTTTT>
##$WBST= 1024
##$WBSW= 4
##$XGAIN= (0..3)
0 0 0 0 
##$XL= 0
##$YL= 0
##$YMAX_a= 231060
##$YMIN_a= -84824
##$ZGOPTNS= <>
##$ZL1= 120
##$ZL2= 120
##$ZL3= 120
##$ZL4= 120
##$ABSF1= 15.98335
##$ABSF2= -0.9893122
##$ABSG= 5
##$ABSL= 3
##$ALPHA= 0
##$AQORDER= 0
##$ASSFAC= 0
##$ASSFACI= 0
##$ASSFACX= 0
##$ASSWID= 0
##$AUNMP= <proc_1d>
##$AZFE= 0.1
##$AZFW= 0.1
##$BCFW= 0
##$BC_mod= 2
##$BYTORDP= 0
##$COROFFS= 0
##$CY= -3
##$DATMOD= 1
##$DC= 0
##$DFILT= <>
##$DTYPP= 0
##$F1P= 0
##$F2P= 0
##$FCOR= 1
##$FTSIZE= 16384
##$FT_mod= 6
##$GAMMA= 0
##$GB= 0
##$INTBC= 1
##$INTSCL= 2.992141e-10
##$ISEN= 128
##$LB= 0.24
##$LEV0= 0
##$LPBIN= 0
##$MAXI= 10000
##$MC2= 0
##$MEAN= 0
##$ME_mod= 0
##$MI= 1.114404
##$NCOEF= 0
##$NC_proc= -8
##$NLEV= 6
##$NOISF1= 3.799351
##$NOISF2= 2.8
##$NSP= 0
##$NTH_PI= 0
##$NZP= 0
##$OFFSET= 15.98335
##$PC= 1
##$PHC0= -10763.49
##$PHC1= 10.20095
##$PH_mod= 1
##$PKNL= yes
##$PPARMOD= 0
##$PSCAL= 0
##$PSIGN= 0
##$REVERSE= no
##$SF= 200.13000625738
##$SI= 16384
##$SIGF1= 3
##$SIGF2= 2
##$SINO= 5.538805
##$SIOLD= 16384
##$SREGLST= <1H.CDCl3>
##$SSB= 0
##$STSI= 16384
##$STSR= 0
##$SW_p= 3396.73913043478
##$SYMM= 0
##$S_DEV= 0
##$TDeff= 16384
##$TDoff= 0
##$TI= <>
##$TILT= no
##$TM1= 0
##$TM2= 0
##$TOPLEV= 0
##$USERP1= <user>
##$USERP2= <user>
##$USERP3= <user>
##$USERP4= <user>
##$USERP5= <user>
##$WDW= 1
##$XDIM= 16384
##$YMAX_p= 491442321
##$YMIN_p= -1012241
$$ End of Bruker specific parameters
$$ ---------------------------------
##NTUPLES= NMR SPECTRUM
##VAR_NAME=  FREQUENCY,     SPECTRUM/REAL,   SPECTRUM/IMAG
##SYMBOL=    X,             R,               I
##VAR_TYPE=  INDEPENDENT,   DEPENDENT,       DEPENDENT
##VAR_FORM=  AFFN,          ASDF,            ASDF
##VAR_DIM=   16384,         16384,           16384
##UNITS=     HZ,            ARBITRARY UNITS, ARBITRARY UNITS
##FACTOR=    0.207333158178281, 1,           1
##FIRST=     3198.74789550988, 0,            0
##LAST=      -197.9912349249, 0,             0
##MIN=       -197.9912349249, -1012241,      0
##MAX=       3198.74789550988, 491442321,    0
$$ Real data points
##PAGE= N=1
##DATA TABLE= (X++(R..R)), XYDATA
$$ [...]
5960A3004838q54578l52082n32379k82265m21567n70127K00211k54813o20590
5951I316648N7964j51417m30062n0889k10704m59435J20294j26123o30570J183
5941G436889J44910n51301J4158K5976Q2519r2338j4452k9732n30204n41917m3319
5930E901189L23313Q817J72326p6742l66032p8557k58719j47220L9891J33141
5920E651407r4221n32186M23759J41861m23192K30730K25356k45359r2582k30882
5910E054691l387j83217m31889J06921l0868q4681k2135M95437l10922j51216
5900D438734L28553n69353P7850M76394n4741N1870L9338m01740l20064J72509
5890D239350j16906j71733L15376K1173n2671k27601M37096Q0733k43749n3884
$$ plain form
5960 13004838 12150260 11798178 11265799 10983534 10561967 9991840 10192051 9937238 9316648
5951 9316648 9374612 9223195 8793133 8742244 8531540 8072105 8192399 8066276 7435706 7436889
5941 7436889 7581799 7030498 7044656 7070632 7153151 7060813 7046361 7016629 6486425 5944508 5901189
5930 5901189 6224502 6233319 6405645 6328903 5962871 5884314 5625595 5478375 5518266 5651407
5920 5651407 5557186 5025000 5448759 5590620 5167428 5398158 5623514 5378155 5285573 5054691
5910 5054691 5051304 4868087 4436198 4543119 4512251 4427570 4405435 4900872 4589950 4438734
5900 4438734 4767287 4197934 4275784 4752178 4697437 4749307 4788645 4386905 4066841 4239350
5890 4239350 4122444 3950711 4266087 4287260 4234589 4006988 4444084 4524817 4281068 4227184
5880D227184J23764k11999k24870L79682m52537n1331M5641j93945j34344L71621
5870C878866m03059p535J79362m5023K7285j39586j63176R2376l7621r3766K068
5859C290191j88675k73316K59916J30789n4180N16945k53294n63368L8913M37965
5849C341886l22464o0988m0631k69314r2220l01224K54565M95013m31633J0766
5839B583756L54888j60592M90376M36414m24657l88341L19739k67842k84814M56642
5829C115569r04896J19143M6802j50243K02503r8607L63605L50641l52571r5276
5819B596670M6117j46728k56217k2618k75790j34286P1418K78134L33621j5969
5809B474352j48074M0299M54551l78461l8194P4760j77401L68443K29637R7059
$$ plain form
5880 4227184 4350948 4138949 3914079 4293761 3841224 3789893 3835534 3641589 3507245 3878866
5870 3878866 3475807 3468272 3647634 3602611 3629896 3490310 3327134 3419510 3381889 3288123 3290191
5859 3290191 3101516 2828200 3088116 3218905 3164725 3681670 3428376 2865008 2903921 3341886
5849 3341886 3019422 2958434 2917803 2648489 2556269 2255045 2509610 3004623 2572990 2583756
5839 2583756 2938644 2778052 3268428 3704842 3280185 2891844 3211583 2943741 2658927 3115569
5829 3115569 2210673 2329816 2376618 2226375 2428878 2330271 2693876 3044517 2691946 2596670
5819 2596670 2642787 2496059 2239842 2217224 1941434 1807148 1878566 2156700 2490321 2474352
5809 2474352 2326278 2366577 2821128 2442667 2404473 2479233 2301832 2670275 2899912 2996971
5799B996971l47960J3952k87939J80179J43826Q4117M84143p35744p845L32443
5789B856143k19392l72673J35026J48548l3858N49895j47565l31112J72992K30120
5779B988124K73886n4303j97620k69363L56078J81682m40992J69201L22672k22439
5769C106926K07775k07185p1355K43346j75909M3566K8717j44186L5767j17071
5759B950391J2656k08378J44692k95827l65209N42911K08554l06939j80454J25920
5749B628317m43778J67654L09096J37744L7390R9972K70617p5902j78468k87064
5739B665578l32457l42187M11143J23310k17976J3183K61020K3934J7757k14798
5729B408507m55790N32961L90689l68628L5587j98353P5841k71816K02586J66037
$$ plain form
5799 2996971 2649011 2662963 2375024 2555203 2699029 2783146 3267289 2531545 2523700 2856143
5789 2856143 2636751 2264078 2399104 2547652 2513794 3063689 2916124 2585012 2758004 2988124
5779 2988124 3262010 3207707 3010087 2740724 3096802 3278484 2837492 3006693 3329365 3106926
5769 3106926 3314701 3107516 3036161 3279507 3103598 3147164 3175881 3031695 3067462 2950391
5759 2950391 2963047 2754669 2899361 2603534 2238325 2781236 2989790 2682851 2502397 2628317
5749 2628317 2184539 2352193 2661289 2799033 2836423 2936395 3207012 3131110 2952642 2665578
5739 2665578 2333121 1990934 2402077 2525387 2307411 2320594 2581614 2605548 2623305 2408507
5729 2408507 1952717 2485678 2876367 2507739 2543326 2344973 2420814 2148998 2351584 2517621
5719B517621R8208J41351J97166k00398m42950K85028l75m4777l18607K62147
5709B494414j21991k42213N25519J1232m06401J49774j19709R8549m755n11427
5699A872992J19045M33538L8385n2829r0457M3377K00025j50360M4163J05580
5689B563459l90642m8564Q7814j95639j74336L36192K76729l5032l94748p3105
5679A952128J33445J55229m35639J4707J95624m30521q0731J71928K89854J13337
5669B079361p940K37138J3741R3609k40704n6832K6087j74559m0383K21501O965
5658B157984J42372M336n80442J16422L84418K89215l47080k89090p9833j2205
5648A786097L13039M16283l25522k33724M45748j38272k77279j92215j10250J44269
$$ plain form
5719 2517621 2615829 2757180 2954346 2753948 2310998 2596026 2595651 2550874 2232267 2494414
5709 2494414 2372423 2130210 2655729 2666961 2260560 2410334 2290625 2389174 2384419 1872992
5699 1872992 1992037 2425575 2463960 2411131 2320674 2364051 2564076 2413716 2457879 2563459
5689 2563459 2172817 2124253 2212067 2016428 1842092 2178284 2455013 2419981 2025233 1952128
5679 1952128 2085573 2240802 1805163 1819870 2015494 1584973 1504242 1676170 1966024 2079361
5669 2079361 2071421 2308559 2322300 2415909 2175205 2118373 2144460 1969901 1929518 2151019 2157984
5658 2157984 2300356 2304692 1724250 1840672 2225090 2514305 2167225 1878135 1798302 1786097
5648 1786097 2099136 2515419 2189897 1956173 2401921 2263649 1986370 1794155 1683905 1828174
5638A828174K9976P2654j81303L19494K42967m38450j75052L55757j44255m96006
5628A413956L12716O18742M4408l32784o0732J20960K31538k21176m68934l5023
5618A623671M04736l9154j29646j00178j35199J80460j7554m4953J12442K9799
5608A884424K78573J60716j60018P529k37591p3637K24701N4068J51665L3213
5598B323643l01949p7164K38272j08221l5609O12235k94783j81824L41230k67055
5588B248775k98673J21054N4461k39176N4798k2965k2081p1092O0385L08300J33838
5577B327624J2179l20414j623M8202K26326o09083j9322O21966p180l22353L42419
5566B298741L36731j47789j76583J45325L7621k12340k01814j42400p6099K42813
$$ plain form
5638 1828174 1858150 1930804 1749501 2068995 2311962 1873512 1698460 2054217 1909962 1413956
5628 1413956 1726672 2345414 2389822 2057038 1996306 2117266 2348804 2127628 1658694 1623671
5618 1623671 2028407 1989253 1859607 1759429 1624230 1804690 1787136 1742183 1854625 1884424
5608 1884424 2162997 2323713 2163695 2171224 1933633 1859996 2084697 2138765 2290430 2323643
5598 2323643 2021694 1944530 2182802 2074581 2038972 2651207 2356424 2174600 2515830 2248775
5588 2248775 1950102 2071156 2125617 1886441 1941239 1918274 1896193 1825101 1885486 2193786 2327624
5577 2327624 2339803 2019389 2017766 2065968 2292294 1683211 1663889 2285855 2278675 1956322 2298741
5566 2298741 2635472 2487683 2311100 2456425 2494046 2281706 2079892 1937492 1861393 2104206
5556B104206Q0345J7040J70236m9222j59084j909k59673K43765k76697L61779
5546B230786K75565k53782j98690K92083J3198j98669Q4707j58493K92123l50658
5536B028170K17691j97218o99710J47430M50838j25969L666K29056J00437l23235
5526A831156N9238n3310J61570j34692K4205K48789J32908q0502P2921K08566
5516B470849N6547m26270k27049L6009L05795P615j11093k57549q00j87391J10149
5505A776812J20714J80049k41380l16914Q7943k36310k1066L88863L7819K36250
5495B012780K02289k72791K9983K25082o5386R7897l7396k75529o3447J9882m19661
5484A453703n6167J76063M7133j74563L51710J08290j70259O0256K5491M62044
$$ plain form
5556 2104206 2184551 2201591 2371827 2322605 2163521 2161612 1901939 2145704 1869007 2230786
5546 2230786 2506351 2252569 2053879 2345962 2359160 2160491 2245198 2086705 2378828 2028170
5536 2028170 2245861 2048643 1348933 1496363 1947201 1821232 1824898 2053954 2154391 1831156
5526 1831156 1890394 1837084 1998654 1863962 1888167 2136956 2269864 2189362 2262283 2470849
5516 2470849 2527396 2101126 1874077 1910086 2215881 2223496 2112403 1854854 1854054 1666663 1776812
5505 1776812 1897526 2077575 1836195 1519281 1607224 1370914 1349848 1738711 1776530 2012780
5495 2012780 2215069 1942278 1972261 2197343 2131957 2229854 2192458 1916929 1853482 1873364 1453703
5484 1453703 1397536 1573599 1620732 1446169 1797879 1906169 1735910 1796166 1821657 2283701
5474B283701K6362j34296l22525r3441K37994K62411j22003o0952J24191m36504
5464A764938K82646J75358l14942L69183p02588P7987N52559j98828J03094K4937
5454B134344n2814K3550J6640J14641J97616j02219k32368J41325J27486j97240
5444B170961j05033Q9279P6943j46461K65248j29530j12320L00535k90336N00097
5434B619383L6098j79319m80900J81844J54476j97781L44855J05873n5876k28935
5424B299718k11417j58541k82515L52858R5266M61579Q8459r4263l45463J81487
5414B387168J1200Q584k01574k51365K17514k57213K86642J18279k49206N4884
5404B124913R4128j6070o5487q685j48402J97735j7870j52230R8609l2559L64722
$$ plain form
5474 2283701 2310063 2175767 1853242 1759801 1997795 2260206 2138203 2077251 2201442 1764938
5464 1764938 2047584 2222942 1908000 2277183 1574595 1652582 2205141 2006313 2109407 2134344
5454 2134344 2081530 2105080 2121720 2236361 2433977 2331758 2099390 2240715 2368201 2170961
5444 2170961 2065928 2155207 2232150 2085689 2350937 2221407 2109087 2409622 2119286 2619383
5434 2619383 2655481 2476162 1995262 2177106 2331582 2133801 2478656 2584529 2528653 2299718
5424 2299718 2088301 1929760 1647245 2000103 2095369 2556948 2645407 2551144 2205681 2387168
5414 2387168 2398368 2406952 2205378 1954013 2171527 1914314 2200956 2319235 2070029 2124913
5404 2124913 2219041 2202971 2137484 2128799 1980397 2178132 2160262 2008032 2106641 2074082 2438804
5393B438804k3969k43032O55835P0960k94678O3146m2814j50595r0288m46237
5383A937132J37085M21022n0624j0991J06772Q8726J5036J09940j83440j51777
5373B418881m4421N8045J11971p0997N4011j50910M69548J74373l42893N22950
5363C200558j70077L93999J36101l82866j25499j06150N9934J78746j28219j55485
5353B901042J89699L39756k47194K67644l25787k23131r7767K40215L5165N35150
5343C614792j86883j10638K1016J92107j68829o8889J65084l77795K45099J39274
5333C464338l9732K6322m8802K27132K62467j92429k93368K36869J88599k75368
5323C556028L8338M3962P5991j14178O34781l079n4172K01353L87415j87947m43595
$$ plain form
5393 2438804 2414835 2171803 2827638 2898598 2603920 2667066 2624252 2473657 2383369 1937132
5383 1937132 2074217 2495239 2444615 2433624 2540396 2629122 2644158 2754098 2570658 2418881
5373 2418881 2374460 2432505 2544476 2473479 2527490 2376580 2846128 3020501 2677608 3200558
5363 3200558 3030481 3424480 3560581 3177715 3052216 2946066 3006000 3184746 3056527 2901042
5353 2901042 3090741 3430497 3183303 3450947 3125160 2902029 2804262 3044477 3079642 3614792
5343 3614792 3427909 3317271 3338287 3530394 3361565 3292676 3457760 3079965 3325064 3464338
5333 3464338 3424606 3450928 3402126 3629258 3891725 3699296 3405928 3642797 3831396 3556028
5323 3556028 3594366 3638328 3714319 3600141 4234922 4231843 4177671 4379024 4766439 4578492 4134897
5312D134897k41278n6015k20332j36276J39830j59768J40480K05144Q4636O36298
5302D527616N4339m95107L04855M04858m67080k48104L50436j32789k56931k44756
5292C797337P86096J89063o55793L70876j3101k17850N530j3108l64354J77541
5282D062237O06675j35658N68147j9464m22452m8057L47475J00623O568l4573
5272E031521k03000J65403n73503J46082k23851j12767L75358O05322j77668o41687
5262D391210M22276l62415j69336j25492k70423O93343P4971J34863o6144J38870
5252D861723J01539k71293m00432M8106P31589j09384l24170J58311j99913j15150
5242D480926P58700J43487o33302k52511L38969J063r3076N40792J07l00316J77109
$$ plain form
5312 4134897 3893619 3837604 3617272 3480996 3620826 3461058 3601538 3806682 3891318 4527616
5302 4527616 4581955 4086848 4391703 4796561 4329481 4081377 4431813 4299024 4042093 3797337
5292 3797337 4583433 4772496 4116703 4487579 4474478 4256628 4262158 4249050 3884696 4062237
5282 4062237 4668912 4533254 5101401 5081937 4659485 4611428 4958903 5059526 5066094 5031521
5272 5031521 4828521 4993924 4420421 4566503 4342652 4229885 4605243 5210565 5032897 4391210
5262 4391210 4813486 4451071 4281735 4156243 3885820 4579163 4654134 4788997 4722853 4861723
5252 4861723 4963262 4691969 4291537 4339643 5071232 4961848 4637678 4795989 4596076 4480926
5242 4480926 5239626 5383113 4749811 4497300 4836269 4837332 4744256 5285048 5285155 4984839 5161948
5231E161948l00422K033M23687r3091m60004M6201L19824J75563j08820R4334
5221E261253j96996n87236J68490K44947j93088J63764J9143M6723k76663J78670
5211D829007l44415j89445R2823j41019N83678j06807L23100K49j5604L40471
5201E372038J13936l87985j26619Q6737j19536P0760J48922L45018j81725P5479
5191E397025L4886j08806M6830M707J65631J48997n63683R866m9459l00331k13901
5180D571762K35453n8061o6129J84395j9043j05327Q1020J56857J23304j79381
5170D924850p9436K50023K12570Q3412m24104J86086L14945J36959j09754K38469
5160E734020q3835M5262k30826J02257J3476k86663k85462O39575N75568k80993
$$ plain form
5231 5161948 4861526 4863559 5287246 5194155 4734151 4780352 5100176 5275739 5166919 5261253
5221 5261253 5064257 4477021 4645511 4890458 4697370 4861134 4880277 4927000 4650337 4829007
5211 4829007 4484592 4295147 4387970 4246951 4830629 4723822 5046922 5047171 5031567 5372038
5201 5372038 5485974 5097989 4971370 5058107 4938571 5009331 5158253 5503271 5321546 5397025
5191 5397025 5431911 5323105 5369935 5374642 5540273 5689270 5125587 5135453 5085994 4785663 4571762
5180 4571762 4807215 4749154 4683025 4867420 4848377 4743050 4824070 4980927 5104231 4924850
5170 4924850 4845414 5095437 5308007 5391419 4967315 5153401 5468346 5605305 5495551 5734020
5160 5734020 5650185 5695447 5464621 5566878 5580354 5293691 5008229 5647804 6223372 5942379
5150E942379n85704J24999L6072n06337J58793L23390k27951l54055j60046K57289
5140E008829l5020L91625J6536k52245J53213R7176J77923k7254j51431m4573
5130E334779N8852J13110k1860l00210j09427J34063L26122K33231P8358p1793
5120E775225o18525m7985M08917M9505J43484r1943K29232q2357o8295J27966
5110E825224q8067j77445J28418N1380J11921L82089m06810j56093K85084k08591
5100E747110l88835k72035O13534J09010N397Q84341m10735k34956Q7285J75494
5090F315610Q7914N636L14807m622j08770l79651M20251O4871J3830m1896k28827
5079F459153k8960K11779J30462J05213J056k40556k13420M66842j04596j42952
$$ plain form
5150 5942379 5356675 5481674 5517746 5011409 5170202 5493592 5265641 4911586 4751540 5008829
5140 5008829 4973809 5365434 5381970 5129725 5282938 5380114 5558037 5530783 5379352 5334779
5130 5334779 5393631 5506741 5484881 5184671 5075244 5209307 5535429 5768660 5847018 5775225
5120 5775225 5156700 5108715 5517632 5567137 5710621 5618678 5847910 5765553 5697258 5825224
5110 5825224 5737157 5559712 5688130 5739510 5851431 6233520 5826710 5670617 5955701 5747110
5100 5747110 5358275 5086240 5699774 5808784 5814181 6698522 6287787 6052831 6140116 6315610
5090 6315610 6403524 6409160 6723967 6719345 6610575 6230924 6651175 6716046 6729876 6687980 6459153
5079 6459153 6430193 6641972 6772434 6877647 6878703 6638147 6424727 6891569 6786973 6644021
5069F644021J14007J48003p082J21016k21122k1135J10385N8530L03688k00091
5059G050220k10618O58315k8863j95809M16358J81945j37723k8014L7793P3781
5049G817385M86031K51629k90049M6252N08036j37006M5257R3573L74023N19760
5039I714891n7393q9125N73317n4876M15083M49560j32479K48469K36738K19216
5029A1523401K12351J26602J9221J47444N2591L10932j01196J26905J98617j81644
5019A2435224j52680K48659K98812K53499N5080K31001M4055q6956N78427Q82498
5009A4787619O47666N96220P72293N76980M57888P18077L91332O70386R68426
5000B0586887P49575J52972q9318J6164l17482N58473K61865r3233K73829Q169
$$ plain form
5069 6644021 6758028 6906031 6898949 7019965 6798843 6777708 6888093 6946623 7250311 7050220
5059 7050220 6839602 7497917 7469054 7273245 7689603 7871548 7733825 7705811 7743604 7817385
5049 7817385 8303416 8555045 8264996 8311248 8819284 8682278 8727535 8821108 9195131 9714891
5039 9714891 9657498 9568373 10141690 10086814 10501897 10951457 10818978 11067447 11304185 11523401
5029 11523401 11735752 11862354 11881575 12029019 12081610 12392542 12291346 12418251 12616868 12435224
5019 12435224 12282544 12531203 12830015 13083514 13138594 13369595 13413650 13326694 13905121 14787619
5009 14787619 15435285 16031505 16803798 17380778 17838666 18556743 18948075 19618461 20586887
5000 20586887 21336462 21489434 21400116 21416280 21098798 21657271 21919136 21825903 22099732 22107901
4990B2107901k53705j22832m1792K80510J75628M78557P28311J509017Q94069
4981B5755664Q63279N97524P08000O70786m72755j025449r16513r80087j252566
4972B3947883j152232j095682j086331o68006o58906l42241r5999k18561j50767
4963A8479158q07546l77370j77700j6073o3278j35764l99293j89098N33756j97569
4953A6649223k46534j69975n10002l77224o9133n2873k41443l76466j62968n16967
4943A3925638L689q1939K49556k4992j65836n56559m56389N8384L4233m00513
4933A2585272k14009M43991k01265l43915K02152M01940j7653o819q8229j81833
4923A2579632P31024j95436j28763K73844r1293K37767J8610n54163m58925K51405
$$ plain form
4990 22107901 21854196 21731364 21689572 21970082 22145710 22624267 23352578 24861595 25755664
4981 25755664 26618943 27216467 27924467 28595253 28122498 27097049 26180536 25200449 23947883
4972 23947883 22795651 21699969 20613638 19945632 19286726 18944485 18848486 18629925 18479158
4963 18479158 17671612 17294242 17116542 17100469 17037191 16901427 16502134 16313036 16846792 16649223
4953 16649223 16402689 16232714 15722712 15345488 15276355 15223482 14982039 14605573 14442605 13925638
4943 13925638 13929327 13847388 14096944 14071952 13906116 13349557 12893168 12951552 12985785 12585272
4933 12585272 12371263 12815254 12613989 12270074 12472226 12874166 12856513 12849694 12761465 12579632
4923 12579632 13310656 13115220 12986457 13260301 13169008 13406775 13425385 12871222 12412297 12663702
4913A2663702j14896j23613k9928L09686j1095k19107l98512l60644J55492K14252
4903A2085337J51121k1171l05670j68119p1549K8812J50209J55092l43577M35769
4893A2096254O7986O456k4608J17851K195n5761M1226j05612K74336N86004P663
4882A3013990q9731j11323O33596m1845j97422j24154K78241K74588o844M32110
4872A4061206l55998K84672K05844N1767n8543K20884L18406M11756M17854k44869
4862A5312979p6265J61367J28860M99515J27332L08174J38218j88273K02025K08143
4852A6822075L73489J45214M4667K68171L59623M29320L94605j13859J76248L18234
4842A9217787l82874M74314P04341l48018J02255J53347K35609L79063l200L04280
$$ plain form
4913 12663702 12548806 12425193 12395265 12704951 12693856 12474749 12076237 11715593 11871085 12085337
4903 12085337 12236458 12215287 11909617 11741498 11669949 11698761 11848970 12004062 11660485 12096254
4893 12096254 12164240 12170696 12146088 12263939 12266134 12210373 12251599 12145987 12420323 13006327 13013990
4882 13013990 12924259 12812936 13446532 13404687 13207265 13083111 13361352 13635940 13629096 14061206
4872 14061206 13705208 13989880 14195724 14247491 14188948 14409832 14728238 15139994 15557848 15312979
4862 15312979 15236714 15398081 15526941 16026456 16153788 16461962 16600180 16411907 16613932 16822075
4852 16822075 17195564 17340778 17385445 17653616 18013239 18442559 18837164 18723305 18899553 19217787
4842 19217787 18834913 19309227 20013568 19665550 19767805 19921152 20156761 20535824 20532624 20836904
4832B0836904N32672R6046l1611k49880N46949M16654N16021p3346K06765M16814
4822B3213988Q1205J55440J93619k28096J1068K7316J25666N58670J26946j14521
4812B4151301k00578L29946K94370L95383R1502l29561j56107K60777o7818K84826
4802B5054041M4145L95792L94161M7980K6158K9385L13222K81662l60762n13793
4792B5711991M84763L31525k18357M43225l421J33486l42566M64319Q1052m93737
4782B6592280M13916l2223l39800j35109L09473q6485j89173K16400j19516N3831
4772B6683594k72707K8368J66063j4259J85682k18771R4065P6118k86315l18453
4762B6123385j53592j76417l3301M2149j81038J86399j98694Q6688m31421j07908
$$ plain form
4832 20836904 21369576 21465622 21434011 21184131 21731080 22147734 22663755 22590409 22797174 23213988
4822 23213988 23295193 23450633 23644252 23416156 23427224 23454540 23580206 24138876 24265822 24151301
4812 24151301 23950723 24280669 24575039 24970422 25061924 24732363 24576256 24837033 24769215 25054041
4802 25054041 25098186 25493978 25888139 25936119 25962277 25991662 26304884 26586546 26225784 25711991
4792 25711991 26196754 26528279 26309922 26753147 26749726 26883212 26540646 27004965 27086017 26592280
4782 26592280 27006196 26973973 26634173 26499064 26808537 26722052 26532879 26749279 26629763 26683594
4772 26683594 26410887 26439255 26605318 26591059 26776741 26557970 26652035 26728153 26441838 26123385
4762 26123385 25969793 25793376 25760075 25802224 25621186 25807585 25608891 25695579 25264158 25156250
4752B5156250m31821k49807K72284j53842l00693J23830M8955k01263j11233p2544
4742B4080116J08637j00410j55125k46810K06837k63534k22318K49878J96872
4733B3854143R4335j12470M2201K64103j52506l62157J41916L22753j39410J27791
4723B4080699j13217K37434N0263K25464j21083j56226K44250J89486M67677M42003
4713B5546750k20618J15801K84592k0323K05820j77840N3881K48606L65779K81230
4703B6683678M0938j06518q9052O03227M34820j3385O11184J77459M60861O24336
4693B9427548J40991K13623L42536P96170P39395K82070K77757M45890P81107
4684C3447087P30416M89525Q01121P51190J246166Q08240K55569J200741J427544
$$ plain form
4752 25156250 24724429 24474622 24746906 24593064 24292371 24416201 24465156 24263893 24152660 24080116
4742 24080116 24188753 24088343 23933218 23686408 23893245 23629711 23407393 23657271 23854143
4733 23854143 23948478 23836008 23878209 24142312 23989806 23627649 23769565 24092318 23952908 24080699
4723 24080699 23967482 24204916 24255179 24480643 24359560 24203334 24447584 24637070 25104747 25546750
4713 25546750 25326132 25441933 25726525 25706202 25912022 25734182 25788063 26036669 26402448 26683678
4703 26683678 26724616 26618098 26529046 27132273 27567093 27553708 28164892 28342351 28803212 29427548
4693 29427548 29568539 29782162 30124698 30920868 31660263 31942333 32220090 32665980 33447087
4684 33447087 34177503 34667028 35468149 36219339 37465505 38273745 38529314 39730055 41157599
4675D1157599R36509J502526J378671J706112J478739K268205K634207K476746
4667E5539314L063350M296693M545908M181835M103532L276005J847343L97726
4659H1251706j17230k92524K10116J589158J898028K098446K500393K166434K272606
4650I3577133J349753J641131J421434O56754l14920j087538k844332m790890
4642H9608525m656711n019870l555696k440634k367668j691095o78463j71244
4634F9027144p7445L45769J00217O64553J88402l9629n6989j163230j658995j867984
4624F5461813j913117k004043j735564j808064j806809j200261j179469j010277
4616E2804209m34311n26046l04908O4782L33892j55392l67112Q7319M40606L37003
$$ plain form
4675 41157599 42094108 43596634 44975305 46681417 48160156 50428361 53062568 55539314
4667 55539314 58602664 62899357 67445265 71627100 75730632 79006637 80853980 81251706
4659 81251706 81134476 80841952 81052068 82641226 84539254 86637700 89138093 91304527 93577133
4650 93577133 94926886 96568017 97989451 98646205 98331285 97243747 94399415 89608525
4642 89608525 84951814 79931944 76376248 73935614 71567946 69876851 69198388 69027144
4634 69027144 68949699 69295468 69395685 70060238 70248640 70209011 70152022 68988792 67329797 65461813
4624 65461813 63548696 61544653 59809089 58001025 56194216 54993955 53814486 52804209
4616 52804209 52369898 51843852 51538944 51603726 51937618 51782226 51415114 51502433 51943039 52280042
4606E2280042O92088P25252N66625J025894L67047P27369R1074N70167O99276
4597E7744834R53395J205027J400012J877396K242975K982633L359255M494895
4589G6260422N115652N512498M824578L584684J332178j348100l585272m693740
4581H7002900l580747k813362j935823m13034N54740J526851K087557L108531
4573H5537613L743304L890665L612896K600549k32041l202133n110958o605034
4565H4234861o963737o049423m613285l759058k939087k318128j829149j550091
4557E4212903j488715j247511o38949m58855r40867p48711r7075m8486m7212o41294
4547D7855228K68057K88196m0489M42251K31578N11808l2692L76675M14826M87894
$$ plain form
4606 52280042 52972130 53697382 54264007 55289901 55656948 56384317 56475391 57045558 57744834
4597 57744834 58698229 59903256 61303268 63180664 65423639 68406272 71765527 76260422
4589 76260422 81376074 86888572 91713150 95297834 96630012 95281912 91696640 87002900
4581 87002900 83422153 80608791 78672968 78259934 78814674 80341525 82429082 85537613
4573 85537613 89280917 93171582 96784478 99385027 99152986 95950853 90839895 84234861
4565 84234861 77271124 71221701 66608416 62849358 59910271 57592143 55762994 54212903
4557 54212903 52724188 51476677 50837728 50378873 49438006 48689295 48592220 48543734 48496522 47855228
4547 47855228 48123285 48411481 48370992 48813243 49044821 49556629 49523937 49900612 50315438 50803332
4537E0803332N87999J200417J059576J120592J113520k2134P68109L47061o86371
4528E6292101j070984o74933q57228j073257j186893o77163m90089o02103j09617
4519D9549834O190j2515n7115m56198m19258k87157P9046q02817l93167N4773
4509D7261616l25634r8678o6547K54686K2852K45527K18764M42875O26369Q20900
4499D9402730P12908N80785N78968N24649P7514K00134N53719L08218n83047j92918
4489E2163660j50013m54239j97598n94808p99153o10032J39198p157p9709L5801
4479D9445950M63897n29623o99264L280p96108q17730j010212j243742j540638
4470D3275810j167722j785886r64303q64166j096467p10880p75427m82189p97746
$$ plain form
4537 50803332 51391331 52591748 53651324 54771916 55885436 55863302 56631411 56978472 56292101
4528 56292101 55221117 54546184 53688956 52615699 51428806 50751643 50261554 49659451 49549834
4519 49549834 49556024 49543509 49486394 49030196 48610938 48323781 48402827 47600010 47206843 47261616
4509 47261616 46935982 46837304 46770757 47025443 47048295 47293822 47512586 47955461 48581830 49402730
4499 49402730 50115638 50696423 51275391 51800040 51877554 52077688 52631407 52939625 52356578 52163660
4489 52163660 52013647 51559408 51361810 50767002 49967849 49357817 49497015 49489858 49410149 49445950
4479 49445950 49909847 49380224 48680960 48684240 47888132 47070402 46060190 44816448 43275810
4470 43275810 42108088 40322202 39357899 38493733 37397266 36686386 35910959 35428770 34631024
4461C4631024p70263n18578q30161l16439j52134K9505N6810m93987J10752l92950
4451C1353579o25460l86728L02383j01239j3289n34183l53418p2317j1267l6051
4441B9522010l9521K03257M9394M72725J38634M91507K04400j30951J52004N50270
4431C1613729L90104O20420M10286O61728P22806O76864P22354R63638Q97990
4422C7679919J158845R20518J144960J037761J168356J394027J017069J766091
4414D7287546J916902K259063K603049L759993M135946M959748N124150L594711
4406G5641108Q82852k754460n119501n771335n552074m360381l429063k712646
4398D6824500k018552j205134j560034r52079q78654o48996K00612m43667M3209
$$ plain form
4461 34631024 33860761 33342183 32512022 32195583 32043449 32072954 32129764 31635777 31746529 31353579
4451 31353579 30728119 30341391 30643774 30542535 30529246 29995063 29641645 29569328 29558061 29522010
4441 29522010 29482489 29685746 29735140 30207865 30346499 30838006 31042406 30911455 31063459 31613729
4431 31613729 32003833 32624253 33034539 33696267 34419073 35095937 35818291 36781929 37679919
4422 37679919 38838764 39759282 40904242 41942003 43110359 44504386 45521455 47287546
4414 47287546 49204448 51463511 54066560 57826553 61962499 66922247 72046397 75641108
4406 75641108 76523960 73769500 68649999 62878664 57326590 52966209 49537146 46824500
4398 46824500 44805948 43600814 42040780 41088701 40210047 39561051 39761663 39317996 39361205
4389C9361205J6327L71545J056903J206346J112475J744909K677289K834463L742569
4380E4124031M435530N554735M875622L723531O92607l901042o111906o686058
4372E6707050o084052m477616l460260l014282k430001j931583j537864j674515
4364C2096877j303842n20683r14156r00880j65493n91887p12331o97677Q6972
4355B6376900l72942k86707k84037L6550k94012j64935L66898n94635J19668M42450
4345B5345198N8871J56210O63553M64106K9885Q47513P49991J012569J566344
4336C0894240J725781J626843K145538K555471K838681K296284J006116r66623
4328D4122331k692433l432776l024216k437647k254338j437094p64327r04777
$$ plain form
4389 39361205 39377532 39749077 40805980 42012326 43124801 44869710 47546999 50381462 54124031
4380 54124031 58559561 64114296 68989918 72713449 73406056 69505014 63393108 56707050
4372 56707050 50622998 46145382 42685122 39670840 37240839 35309256 33771392 32096877
4364 32096877 30793035 30272352 29358196 28457316 28291823 27699936 26987605 26289928 26376900
4355 26376900 26003958 25717251 25433214 25469764 25175752 25010817 25377715 24783080 24902748 25345198
4345 25345198 25404069 25560279 26223832 26687938 26717823 27565336 28315327 29327896 30894240
4336 30894240 32620021 34246864 36392402 38947873 41786554 44082838 45088954 44122331
4328 44122331 41429898 37997122 34972906 32535259 30280921 28843827 28079500 27174723
4320B7174723j11337p47902m71641j55906o46463J28470q3096j83540L19421P63980
4310B5986709M27799O48668O33176J313769J746376J985555K484546L218485K876602
4301D1321685K828641J251829j633094l630502l999216m290119k358200k144601
4293B7346423k156017j230334j554734j216457j040305o72824j139372j98492
4285A8137888k78617q87902l42199l59733l64944k61992J6632n66344k40931R9443
4275A4951301j9413k03349l76867J05719q0360j28998j59874j98652J8290o3239
4265A3844558J43679k88439o1426K24627n71521j17075J18039l12730k33785J95131
4255A2941058K12340k43441j44721K56372p0482l47454Q4536k85964p2140K1833
$$ plain form
4320 27174723 27063386 26315484 25843843 25687937 25041474 25169944 25086848 24903308 25222729 25986709
4310 25986709 26414508 27063176 27696352 29010121 30756497 32742052 35226598 38445083 41321685
4301 41321685 44150326 45402155 43769061 40138559 36139343 31849224 29491024 27346423
4293 27346423 25190406 23960072 22405338 21188881 20148576 19475752 18336380 18137888
4285 18137888 17859271 16971369 16629170 16269437 15904493 15642501 15659133 15092789 14851858 14951301
4275 14951301 14931888 14728539 14351672 14457391 14377031 14248033 14088159 13889507 13907797 13844558
4265 13844558 13988237 13699798 13638372 13862999 13291478 13174403 13292442 12979712 12745927 12941058
4255 12941058 13153398 12909957 12765236 13021608 12951126 12603672 12688208 12402244 12330104 12351937
4245A2351937k25472r6321r6079r2920m25846N7692K10870j32869n96123K70335
4235A1225204K49231j54646l05786k64122o7605l86872P6123M5207N0317k7118
4225A0439933M687n1158k97610j2916n2909J89942Q9467k31508m5558N2134M5331
4214A0129835k478j17510l6924q4718q1123P4207J77316r0559k62812o8098j24751
4203I512385J23495n7714q8889q336j14306j84204M2933j49737N6153q9609k59766
4192H782405J97397K85949k22890j35811M00004m30127L09497K31172k07832q9168
4182I120596J1243K80188j19728J2963K59352m91441r4134j57510j30881J89040
4172H879688J58411p0322k379j85007J92532K07618n07401P0156j10175o1166
$$ plain form
4245 12351937 12126465 12030144 11934065 11841145 11415299 11472991 11683861 11550992 10954869 11225204
4235 11225204 11474435 11319789 11014003 10749881 10682276 10295404 10371527 10416734 10467051 10439933
4225 10439933 10444620 10393462 10095852 10082936 10030027 10219969 10309436 10077928 10032370 10084504 10129835
4214 10129835 10127357 10009847 9972923 9888205 9807082 9881289 10058605 9968046 9705234 9637136 9512385
4203 9512385 9635880 9578166 9489277 9480941 9366635 9182431 9225364 9075627 9131780 9042171 8782405
4192 8782405 8979802 9265751 9042861 8907050 9307054 8876927 9186424 9417596 9209764 9120596
4182 9120596 9131839 9412027 9292299 9305262 9564614 9073173 8979039 8821529 8690648 8879688
4172 8879688 9038099 8967777 8965398 8780391 8972923 9180541 8673140 8743296 8633121 8571955
4162H571955L68802K31740J41339n4126j05917j30136L1813k13510Q4402K76181
4152I202543l23289m70677K01832L45272L00262K37261j03967N51053N053k44405
4142I700938K41924K93866J60318J69998r1357k37P02280M26918j61901K40681
4132A1683428J27488n6361M03894K31003L87306R00635J54073o7429P64132P68303
4122A5296472P46411Q41394M10423O15612N07759k1519p23l03379n23498m69548
4112A7099404m35587m51881o83428l78959m36921k65183N8969J0687K43627J88067
4102A4948795j52424N60304N15499J16946Q33722O42066K57875M10906m57680
4093A7676009l44161j85227p66602o42484r59758p30471j38359j72200o98379
$$ plain form
4162 8571955 8940757 9172497 9313836 9259710 9153793 9023657 9055470 8841960 8926362 9202543
4152 9202543 8879254 8408577 8610409 8955681 9255943 9493204 9389237 9940290 9945343 9700938
4142 9700938 9942862 10236728 10397046 10567044 10475687 10475450 11177730 11604648 11442747 11683428
4132 11683428 11810916 11754555 12158449 12389452 12776758 13677393 13831466 13764037 14528169 15296472
4122 15296472 16042883 16884277 17294700 17910312 18418071 18396552 18395829 18092450 17568952 17099404
4112 17099404 16663817 16211936 15528508 15149549 14712628 14447445 14506414 14517101 14760728 14948795
4102 14948795 14796371 15356675 15872174 15989120 16822842 17464908 17722783 18133689 17676009
4093 17676009 17331848 17146621 16380019 15737535 14777777 14047306 13908947 13736747 13038368
4084A3038368j002858k45630j52608l75518m33876k34781J12755k42983o7025
4075A0395844k43080N07027L11572l95828K00043n12276m89743K32927k23296
4066I783190R226R0735l76231j50345J41981j42831J39408J49458k39390J56398
4056I561599N6545j04321n2107m29593l41080L36393J38179j45802k29069j8993
4046H771751k28174J1921L125O5437r3548K68678Q4682n1413M4478o4900m27129
4035H384908j81932j56665J29602k31469K58978M65144k30634j25844q3888L9467
4025H267667j23605l3421l15035K60594K63295n3182L2922j5585m04040N67435
4015H447045j08039k42715K94281J50687k82121k25861m8774k67366J90980Q6688
$$ plain form
4084 13038368 12035510 11789880 11637272 11261754 10827878 10593097 10705852 10462869 10395844
4075 10395844 10152764 10659791 10971363 10575535 10775578 10263302 9773559 10006486 9783190
4066 9783190 9792416 9883151 9506920 9356575 9498556 9355725 9495133 9644591 9405201 9561599
4056 9561599 9618144 9513823 9461716 9032123 8691043 9027436 9165615 9019813 8790744 8771751
4046 8771751 8543577 8555498 8558623 8624060 8530512 8799190 8883872 8832459 8876937 8812037 8384908
4035 8384908 8202976 8046311 8175913 7944444 8203422 8668566 8437932 8312088 8228200 8267667
4025 8267667 8144062 8110641 7795606 8056200 8319495 8266313 8299235 8283650 7879610 8447045
4015 8447045 8339006 8096291 8390572 8541259 8259138 8033277 7984503 7717137 7908117 7994805
4005G994805j20818L85671k91344j01178L25371j45947k01872L11234k99248j36865
3995G719809M05085l43536O1095j67003m38943J24007R5009K4042J41593J18731
3985G739889j54617J66397L51641P3862l39445l91472j79102q9924J58569J50632
3975G486430L74126m5422k84520K21243J79818m53566P44314j09663m76208J63900
3965G800452j79228j39568J2610L4605r5366K31478l9121m7371j41672L27461
3955G764280L82073l98820m42292K209J21965J54632l98016N6279M28686j47207
3945G523789n1474l2227l20809Q6318k45282k38518K77220o2173l27254L51773
3935F961363K59922K98334k6900M61347Q8012n70113j13523j39251n8778O0047
$$ plain form
4005 7994805 7873987 8259658 7968314 7867136 8192507 8046560 7844688 8155922 7856674 7719809
3995 7719809 8124894 7781358 7842453 7675450 7236507 7360514 7455523 7479565 7621158 7739889
3985 7739889 7585272 7751669 8103310 8177172 7837727 7446255 7267153 7177229 7335798 7486430
3975 7486430 7860556 7815134 7530614 7751857 7931675 7478109 8222423 8112760 7636552 7800452
3965 7800452 7621224 7481656 7494266 7528871 7433505 7664983 7625862 7578491 7436819 7764280
3955 7764280 8146353 7747533 7305241 7307450 7429415 7584047 7186031 7242310 7670996 7523789
3945 7523789 7472315 7440088 7119279 7205597 6960315 6721797 6999017 6936844 6609590 6961363
3935 6961363 7221285 7519619 7492719 7954066 8042078 7471965 7358442 7219191 7160413 7220460
3925G220460J776j67281N6214N63058j31167k21461l94752L83396J39202l31305
3915G118140L76570M0531j35362k20057J45546J01184J1952Q5306M5362K8217
3905G597389j61489o30934J67090L44209K61006k89422k67795n0180j50630J57396
3895F976640M01187j35668l4802l41861j5393J31403j11602j17450J30259j43275
3885F739438j05580J08468K92293r2889J8539j84877k10427K99584j49297j49447
3875F565805O63543P9916k38609j12034J40736K72749j0264m60958k86444J95999
3865F810439R7520L4764j36404J62152L75731o28588k18942L76344j67624m7981
3855F657411j86672J49805K96107J92636J7679K15308K32026k13891j71243K56142
$$ plain form
3925 7220460 7222236 7054955 7111169 7674227 7543060 7321599 6926847 7310243 7449445 7118140
3915 7118140 7494710 7535241 7399879 7179822 7325368 7426552 7438504 7523810 7569172 7597389
3905 7597389 7435900 6804966 6972056 7316265 7577271 7287849 7020054 6969874 6819244 6976640
3895 6976640 7377827 7242159 7207357 6865496 6850103 6981506 6869904 6752454 6882713 6739438
3885 6739438 6633858 6742326 7034619 6941730 6960269 6775392 6564965 6864549 6715252 6565805
3875 6565805 7229348 7309264 7070655 6958621 7099357 7372106 7361842 6900884 6614440 6810439
3865 6810439 6907959 6942723 6806319 6968471 7344202 6715614 6496672 6873016 6705392 6657411
3855 6657411 6470739 6620544 6916651 7109287 7126966 7342274 7574300 7360409 7189166 7445308
3845G445308J00831p6043J10125J11028O01537j25672m91584j38913R9958P3429
3835G710004M24662J62700J11390K19020o9461k55391N6311L5865K1203M39360
3825H855663j42669N17770J478j3720J65860q1718J38526O39808K37675J02593
3815A0421266J7811N50952r0865K53405N27154Q9863M85177P56646M46646L08664
3805A3766719N42727L95095P34619K61750L85366Q03733m57284m70590j32560
3796A5829575k00216k68242j67420k54403K10570O75866N5721L3845M34255l7102
3786A6312449J23498M73903M57989N27865K93456L25320P42930N37857J07691
3777A9902958K02078K46889O9834K47933j57260J14144K35407P03652P35081O55768
$$ plain form
3845 7445308 7546139 7470096 7580221 7691249 8292786 8167114 7675530 7536617 7636575 7710004
3835 7710004 8134666 8297366 8408756 8627776 8558315 8302924 8359235 8395100 8416303 8855663
3825 8855663 8712994 9230764 9232242 9218522 9384382 9302664 9441190 10080998 10318673 10421266
3815 10421266 10439077 10990029 10899164 11152569 11679723 11769586 12254763 13011409 13458055 13766719
3805 13766719 14309446 14704541 15439160 15700910 16086276 16890009 16432725 15962135 15829575
3796 15829575 15629359 15361117 15193697 14939294 15149864 15825730 15881451 15915296 16349551 16312449
3786 16312449 16435947 16909850 17367839 17895704 18189160 18514480 19257410 19795267 19902958
3777 19902958 20105036 20351925 20421759 20669692 20512432 20626576 20861983 21565635 22300716 22956484
3767B2956484J125679J233843J317409J374642L28913N315l15387n31712J05581
3758B7600767J54911P04695Q04439J431356J767050J935610K237847K351137J709658
3749D0697470J053242J162224J032367L85881M3262J60964k58192j288702r64190
3740D2024326l76277O46152J443493J910034K420432L045216K313027J070684
3732E4497087L17677q01750j488511j244236r17979m10087j413048j866581m61215
3723D6211357O15166R42969J343030Q01342O06183J196512J305012O17638N80095
3714E4219304j252657l208075l242379l085885k113611p87675p22230M94570J185747
3705D1487109O03293R41329P57732k14345k94671j111319j571315r22176k157730
$$ plain form
3767 22956484 24082163 25316006 26633415 28008057 28336970 28342285 28026898 27495186 27600767
3758 27600767 27755678 28460373 29264812 30696168 32463218 34398828 36636675 38987812 40697470
3749 40697470 41750712 42912936 43945303 44331184 44374446 44535410 44277218 42988516 42024326
3740 42024326 41648049 42294201 43737694 45647728 48068160 51113376 53426403 54497087
3732 54497087 54814764 54013014 52524503 51280267 50362288 49952201 48539153 46672572 46211357
3723 46211357 46826523 47769492 49112522 49913864 50520047 51716559 53021571 53639209 54219304
3714 54219304 52966647 49758572 46516193 43430308 41316697 40529022 39806792 40301362 41487109
3705 41487109 42090402 43031731 43789463 43575118 43280447 42169128 40597813 39675637 37517907
3696C7517907k427163j716819k012329j300541l27712l11782q23568m4513O27744
3687B9181224J09491N17678J80085o89310j552492j466398j426552q41663j357669
3678B2654394j017454J19675n38441m25680k11721m97282j06765N07136P7872
3669B0561734J1883M8027m22436j88070P64148p1528k20637l42570J24336M08308
3659B0673195l76099m26639L02900Q7678n73312P469j8897K79227J11749k26449
3649A9840822n75361K56660J67513q44267l61615m04372M7373J67086k5727J95770
3639A8463882j30798K603K12639o8789m16803J50638m69621n38938N05403K46004
3629A7956220k76858K84037q2964J08221n96038J56723M28896n60852k38206L11643
$$ plain form
3696 37517907 35090744 33373925 31361596 30061055 29733343 29421561 28597993 28553480 29181224
3687 29181224 29290715 29808393 29988478 29299168 27746676 26280278 24853726 24012063 22654394
3678 22654394 21636940 21756615 21218174 20792494 20580773 20083491 19976726 20483862 20561734
3669 20561734 20573617 20621644 20199208 20011138 20775286 20703758 20483121 20140551 20264887 20673195
3659 20673195 20297096 19870457 20173357 20261035 19687723 19695192 19676295 19955522 20067271 19840822
3649 19840822 19265461 19522121 19689634 18845367 18483752 18079380 18126753 18293839 18268112 18463882
3639 18463882 18333084 18335687 18548326 18479537 18062734 18213372 17743751 17204813 17710216 17956220
3629 17956220 17679362 17963399 17880435 17988656 17392618 17549341 17978237 17417385 17179179 17490822
3619A7490822r0748J2096j12119j08046l27002k74979j72403J98587M77969n165
3609A7089012K12869J50792J4350j00502P2183O91309J73993m95164k05492N24556
3599A8127906P30237O81677L84825J48144M93962K15155q8873K69745Q59983P6079
3589B1898840P77777R93742L01624K08094R7933K06297J17772m05038K7125K66722
3579B4490888j05364p1165Q0607K07239K07706M41971L82349K99068M95988L30754
3569B6760041M56760P86013N82826N37262O95053J73271M08379M03449O92077
3560C1495131Q11104K03162K98673J299067Q48496Q68087J592081J949527K206297
3551D1571625K527902L299135M148570N460586N664746N943004M173460j566228
$$ plain form
3619 17490822 17400074 17412170 17300051 17192005 16865003 16590024 16417621 16616208 17094177 17089012
3609 17089012 17301881 17452673 17467023 17366521 17438704 18130013 18304006 17808842 17603350 18127906
3599 18127906 18858143 19539820 19924645 20072789 20566751 20781906 20693033 20962778 21822761 21898840
3589 21898840 22676617 23670359 23971983 24180077 24278010 24484307 24602079 24197041 24224166 24490888
3579 24490888 24385524 24314359 24394966 24602205 24809911 25251882 25634231 25933299 26429287 26760041
3569 26760041 27216801 28002814 28585640 29122902 29817955 29991226 30399605 30803054 31495131
3560 31495131 32306235 32509397 32808070 34107137 34955633 35823720 37415801 39365328 41571625
3551 41571625 44099527 47398662 51547232 57007818 62672564 68615568 72789028 71222800
3543G1222800n678871n896306m735332l346552k132909r35051r9748L59352O23887
3534D9381270J092509J436540K637859L542048M430351N793644O964423P940196
3526H3218840P727790O675856L185783k5974l305937p834146j0372399r244777
3518G0025036p065149n476237l906308k903852k237597j369437m19610L33937
3510D6980783L53622J006970K098058K648709L150673M255658M632363K879608
3502F8006444j123199n014487p068715n936227m448051l844021k135619k107839
3494C6328286j880810j227178j311503j206871q18563n21619q98499r68073r57589
3485B6537581n83173k81q78226m13491m35635l62499k47331l59689k33470k77820
$$ plain form
3543 71222800 65543929 59647623 54912291 51565739 49432830 48497779 48398031 48757383 49381270
3534 49381270 50473779 51910319 54548178 58090226 62520577 68314221 75278644 83218840
3526 83218840 90946630 97622486 100808269 100782295 97476358 89642212 79269813 70025036
3518 70025036 62959887 57483650 53577342 50673490 48435893 47066456 46646846 46980783
3510 46980783 47334405 48341375 50439433 53088142 56238815 60494473 65126836 68006444
3502 68006444 66883245 61868758 54800043 48863816 44415765 40571744 38436125 36328286
3494 36328286 34447476 33220298 31908795 30701924 29883361 29361742 28463243 27495170 26537581
3485 26537581 25954408 25954127 25075901 24662410 24226775 23864276 23616945 23257256 23023786 22745966
3475B2745966L13658q2991q1776n20923L4062k95025k95547k67958j91048j3375
3465B1345043l81175m57026j39990k39873P1927N4105j57446m72434k11888M29935
3455A9841178O57468R5654l81298J18394o47001l84800j50332j10550j98145k08438
3445A8632130k61682R1060l14378L33008k3670j16221J19084J38356p3566J4011
3435A8538132j95405n4023K90209J76223J55445P0702j55276L81798K84546L08141
3425A9800492R26175l06183k89767q40j39132k58446k6012J62526K39027K43789
3415B0351629m7135L7777j2723R9037R5452N76971j48356l28783K25593l67405
3405B0482057k33209K40013J47351O7253j48778n17905n9293j68616j99222K39228
$$ plain form
3475 22745966 23059624 22976633 22894857 22373934 22407996 22112971 21817424 21549466 21358418 21345043
3465 21345043 20963868 20506842 20366852 20126979 20198906 20253011 20095565 19623131 19411243 19841178
3455 19841178 20498646 20594300 20213002 20331396 19684395 19299595 19149263 19038713 18840568 18632130
3445 18632130 18370448 18461508 18147130 18480138 18456468 18340247 18459331 18597687 18524121 18538132
3435 18538132 18342727 18288704 18578913 18755136 18910581 18981283 18826007 19207805 19492351 19800492
3425 19800492 20726667 20420484 20130717 20129877 19990745 19732299 19706287 19868813 20107840 20351629
3415 20351629 20304494 20342271 20329548 20428585 20524037 21101008 20952652 20623869 20849462 20482057
3405 20482057 20248848 20488861 20636212 20703465 20554687 20036782 19977489 19808873 19609651 19848879
3395A9848879o31997l11260J27722p21892n42877m26782L38467R4344n60660k31157
3385A6982787O1804Q309m0117J0073J41097j42834m6328l75327l1340J28135J16221
3374A6812480K34927J52633k05306L4729M42642q1361N5903l71580j4662J01266
3364A7161671M90328l60618K33673N31368k22420O19028N18025k88399P7304Q06960
3354A9566920l03201j9183J88390r9744M86071L68795J8230j78002J47245M92195
3344B0667716N0563j06714J47931L06765J0475l10516K62749L03351J67683m08569
3334B1091434L82761m3455R6956K24610l9412K60526J60072k78158Q0276O33675
3324B2569285M7324N3682l10574J41071r381l30130j03747n817j3257M01797m69970
$$ plain form
3395 19848879 19216882 18905622 19033344 18311452 17768575 17341793 17680260 17774604 17213944 16982787
3385 16982787 17044591 17052900 17012783 17022856 17163953 17021119 16974791 16599464 16568124 16696259 16812480
3374 16812480 17047407 17200040 16994734 17029463 17472105 17390744 17446647 17075067 17060405 17161671
3364 17161671 17651999 17291381 17525054 18056422 17834002 18453030 18971055 18682656 18759960 19566920
3354 19566920 19263719 19244536 19432926 19333182 19819253 20188048 20206278 20028276 20175521 20667716
3344 20667716 20718279 20611565 20759496 21066261 21076736 20766220 21028969 21332320 21500003 21091434
3334 21091434 21474195 21430740 21527696 21752306 21712894 21973420 22133492 21855334 21935610 22569285
3324 22569285 22616609 22670291 22359717 22500788 22491407 22161277 22057530 22051713 22038456 22440253 21970283
3313B1970283k33258k65763K82781j7665j26173K78022O13395K2158L40426M42536
3303B3306742L62691q7945M93893K47059L4836J70780k85941N52855j60738K14229
3293B4848461K88188j1557M57668J59257K56850P47295J30469P4689O27841K13899
3283B7793060M88972L26874M02325J75910L10965N86395K75793O11090K31531
3274C1202915K7675L28884K10476P22569N45412L00592O69788L74803P30329L33330
3264C5446773K10425N43147R08208O55280R52248N93509L96704M78288O03788
3255D0788370R57646N27996N48836J089293Q24692J061567R83681N34380Q20222
3246D8136683J065876Q41043J374545J036288J398204J183783J670195J706743
$$ plain form
3313 21970283 21737025 21471262 21754043 21736378 21610205 21888227 22501622 22523780 22864206 23306742
3303 23306742 23669433 23581488 24075381 24322440 24357276 24528056 24242115 24794970 24634232 24848461
3293 24848461 25136649 25125092 25582760 25742017 25998867 26746162 26876631 26951320 27579161 27793060
3283 27793060 28282032 28608906 29011231 29187141 29498106 30084501 30360294 30971384 31202915
3274 31202915 31230590 31559474 31769950 32492519 33037931 33338523 34008311 34383114 35113443 35446773
3264 35446773 35657198 36200345 37108553 37763833 38716081 39309590 39706294 40184582 40788370
3255 40788370 41746016 42274012 42822848 43912141 44736833 45798400 46782081 47316461 48136683
3246 48136683 49202559 50043602 51418147 52454435 53852639 55036422 56706617 58413360
3238E8413360J614189J832419K110720K407160K388081K280878L293314L644751
3230G7984872M014658N288206N120703N900480P247206P508576O591092L128804
3222A22784597j301367l298306k751413l50368J334673K665488M569990O404744
3214A30058038P135105R051193R666383P481338L876530J424711J466631L810407
3206A73970336O585449P793635R357371R953668R192344O560278J289377k681301
3198B22021157l421892k566989k36709K063877N351915Q112167J2136036J6850875
3190B60310437K1119192K5845159K8161112L0961753L7295241M1640344L4592266
3183D79925504J1516817p809284q151982p725063k2114510m5263792n2919150
$$ plain form
3238 58413360 60027549 61859968 63970688 66377848 68765929 71046807 74340121 77984872
3230 77984872 81999530 87287736 92408439 98308919 105556125 113064701 119655793 122784597
3222 122784597 121483230 118184924 115433511 115083143 116417816 119083304 123653294 130058038
3214 130058038 137193143 146244336 155910719 163392057 167268587 168693298 170159929 173970336
3206 173970336 180555785 188349420 197706791 207660459 216852803 223413081 224702458 222021157
3198 222021157 218599265 216032276 215795567 217859444 223211359 231323526 243459562 260310437
3190 260310437 281429629 307274788 335435900 366397653 403692894 445333238 479925504
3183 479925504 491442321 483633037 475481055 467755992 445641482 400377690 347458540
3176C47458540m4067866l3025718k4332650j8546449j3789864r984709p481718
3169A96229566m609961k688010q02418J763016L547838M709504N209075M280830
3161B07639440K527597r50084l431597m601380p720921j0495586j0459191r925614
3153A62582664r807260q391390o873548n611809l887776k985942k952084j465425
3145A20607430o72076j363272j543669j545605j410389j565800q59968n60495
3137A11086156n05337N6376k84675j111896p51615m87710q81515n66184m45874
3128A06107726r5831l29478m6675J94033P16083J180591J230811M31408j36706
3119A09251962o37693j154712j615258j109351q52132m40867o9624Q19896J163642
$$ plain form
3176 347458540 303390674 270364956 246032306 227485857 213695993 203711284 196229566
3169 196229566 191619605 188931595 188129177 189892193 193440031 198149535 203358610 207639440
3161 207639440 210167037 209216953 205785356 201183976 193463055 182967469 172508278 162582664
3153 162582664 152775404 144384014 137510466 131898657 128010881 125024939 122072855 120607430
3145 120607430 119935354 118572082 117028413 115482808 114072419 112506619 111646651 111086156
3137 111086156 110580819 110637195 110352520 109240624 108489009 108001299 107119784 106553600 106107726
3128 106107726 106011895 105682417 105635742 105829775 106545858 107726449 108957260 109388668 109251962
3119 109251962 108614269 107459557 105844299 104734948 103882816 103441949 103372325 104192221 105355863
3110A05355863R94513J175755K200251K070550L023139M416066M757233N631252
3102A29624622P020607Q829751J0471149J2516857J4797176J5846153J4623787
3095B13730102R391745o26203j1136967j7450428j7942360j6824447j3247361
3088A45894081j0947730r604216q311219o581442o353568n152068m868208l957999
3080I0117631l153891l376776l103701k956922k243486j322034j901579k100955
3072F9958287j078148j317706j041331o11703p58905l06887n29891o39300j72973
3063F3501443K05152K59045N35177L34341R85671K404958K150549K703414L525694
3054G6605444M778873N582532O220651O384104K920212k831167p884499r941059
$$ plain form
3110 105355863 106350376 107526131 109726382 111796932 114820071 119236137 123993370 129624622
3102 129624622 136645229 145474980 155946129 168462986 183260162 199106315 213730102
3095 213730102 223121847 222495644 211358677 193908249 175965889 159141442 145894081
3088 145894081 134946351 125342135 117030916 110449474 104095906 98943838 94075630 90117631
3080 90117631 86963740 83586964 80483263 77526341 75282855 73960821 72059242 69958287
3072 69958287 68880139 67562433 66521102 65909399 65150494 64843607 64313716 63674416 63501443
3063 63501443 63706595 63965640 64500817 64835158 65820829 68225787 70376336 73079750 76605444
3054 76605444 81384317 86966849 93187500 99571604 102491816 99660649 91776150 81835091
3046H1835091q781919o291792m726103l650323l119273l131022k398363k104483
3038D7631813j915583j589550j589420j126473o00344j182858p45035p10908k88699
3029C7882943o71026n82965k23551k00342n48245p52160r9470m92138l90311p26403
3019C3196332j17684L7122l88367p4786l32459N9767k59799L6199n4154j77741
3009C1924430k76359n5341k85269j40634j57185j63343P804M04196N54666j46153
2999C1666812j30961r7018j9300o0720q7692n0826o75893n18868L60160K67590
2989C0653284m05923n34124j90757Q706J86868J63117n88851J82821L82820L88619
2979C0246580M15057O87480L88519O99155R68836O72181L14240l62653j003620
$$ plain form
3046 81835091 73053172 66761380 62035277 58384954 55265681 52134659 49736296 47631813
3038 47631813 45716230 44126680 42537260 41410787 40810443 39627585 38882550 38171642 37882943
3029 37882943 37211917 36628952 36405401 36205059 35656814 34904654 34805184 34313046 33922735 33196332
3019 33196332 33078648 33115770 32727403 32652617 32320158 32379925 32120126 32156325 32102171 31924430
3009 31924430 31648071 31592730 31307461 31166827 31009642 30846299 30854103 31258299 31812965 31666812
2999 31666812 31535851 31438833 31419533 31358813 31271121 31220295 30544402 30025534 30385694 30653284
2989 30653284 30247361 29713237 29522480 29531186 29718054 29881171 29292320 29475141 29857961 30246580
2979 30246580 30661637 31349117 31737636 32436791 33405627 34077808 34392048 34029395 33025775
2970C3025775q41085j268192j092450m90344p77935k79210r77297J20087K22063
2961B7641412m05502j0213Q7420j00647l37278o34647q4330L18485l01225p06363
2951B5467112p30223p90509k75595l1186n37717o45343j19222m3746n06056k72440
2941B1515075M51097m12612j95638j38021j94726K32651K77349j32538j37716
2932B1264921j09663M34865K65252J94298K93121K20693O6212o6880j16536l42882
2922B2103401K61550k5807K785j66059m64992m26945p22197j79433K21541k57265
2912B0346579k9208K98028l09952K34000K62508m88324j82796N05418K37911j69569
2902B0704595k06920L22648k32667j01386j48635j25222L9528M3389k33493o18645
$$ plain form
2970 33025775 32184690 30916498 29824048 29333704 28555769 28276559 27299262 27419349 27641412
2961 27641412 27235910 27225697 27313117 27212470 26875192 26240545 26156215 26474700 26173475 25467112
2951 25467112 24736889 23946380 23670785 23639599 23101882 22456539 22337317 22293571 21787515 21515075
2941 21515075 21966172 21553560 21357922 21219901 21025175 21257826 21535175 21402637 21264921
2932 21264921 21155258 21590123 21855375 22049673 22342794 22563487 22629699 22562819 22446283 22103401
2922 22103401 22364951 22339144 22341929 22175870 21710878 21283933 20561736 20382303 20603844 20346579
2912 20346579 20317371 20615399 20305447 20539447 20801955 20313631 20130835 20636253 20874164 20704595
2902 20704595 20497675 20820323 20587656 20486270 20337635 20212413 20251941 20295330 20061837 19443192
2892A9443192K48117r6819o53978j77088K65844j48201m86359k1834J50553l52415
2882A8171012R1405L56534K65975M90849L9267l6921M24173k17045l23383k29520
2872A9032346Q3974j01525K20453n51803k92709o8055m28842l24909K5566j8051
2862A7576445m90590o1771k19663m20405M45364k93866n31290K0283O2580m04013
2852A5683074J33857j56270l41580K14742n35544K7027j37143j81385J12743J20793
2842A4940314j28541j29140o86300n13296J08799K1063k34613M08133J24956L7559
2832A3948934J28792O13284k6676n84467o68395l24794n82437j26741L74637l71065
2822A2381072N6713p9073m73280j58322M1804R4510l25326l02583O62580J95466
$$ plain form
2892 19443192 19691309 19594490 18940512 18763424 19029268 18881067 18394708 18372874 18523427 18171012
2882 18171012 18262417 18618951 18884926 19375775 19415042 19378121 19802294 19585249 19261866 19032346
2872 19032346 19116320 19014795 19235248 18683445 18390736 18322681 17893839 17568930 17594496 17576445
2862 17576445 17085855 17024084 16804421 16384016 16829380 16535514 16004224 16024507 16087087 15683074
2852 15683074 15816931 15660661 15319081 15533823 14998279 15025306 14888163 14706778 14819521 14940314
2842 14940314 14811773 14682633 13996333 13483037 13591836 13612899 13378286 13786419 13911375 13948934
2832 13948934 14077726 14691010 14664334 14079867 13411472 13086678 12504241 12377500 12752137 12381072
2822 12381072 12437785 12358712 11885432 11727110 11768914 11863424 11538098 11235515 11898095 12093561
2812A2093561r0740j51779L74461L85976K1359q60255j25210L47487j07002k74964
2802A1612894j55375N49171q2236m84555k2245q9214p08378l58594K27850P834
2792A0497152m40412J1787K84925m99645L20093k42513j93586P0350m56909J12718
2782I463960J87712K69543R0896m68223j14948j26152n8819J06634J96934l46601
2772I200936k19406l8525j81438M842l0080K19676o30500J89879m87096j29424
2762G898864O16231R025r4598p17387J38011R004M22687Q1822j42532L63482J41445
2751H726054j25216k90432Q3183J5277j02479m90850L13728N57705j33657n65561
2741G987752P8199J19556n40705J01682J70595n1182J21383m75622J8516L08304
$$ plain form
2812 12093561 12002821 11851042 12225503 12611479 12632838 11772583 11647373 11994860 11887858 11612894
2802 11612894 11457519 12006690 11924454 11439899 11417654 11328440 10620062 10261468 10489318 10497152
2792 10497152 10056740 10068527 10353452 9853807 10173900 9931387 9737801 9808151 9351242 9463960
2782 9463960 9651672 9921215 10012111 9543888 9428940 9302788 9243969 9350603 9547537 9200936
2772 9200936 8981530 8943005 8761567 8766409 8736329 8956005 8325505 8515384 8028288 7898864
2762 7898864 8515095 8524120 8429522 7712135 7850146 7859150 8281837 8363659 8221127 8584609 8726054
2751 8726054 8600838 8310406 8393589 8408866 8306387 7815537 8129265 8686970 8553313 7987752
2741 7987752 8065951 8185507 7644802 7746484 7917079 7865897 7987280 7511658 7530174 7838478
2731G838478L18909q35652n35993N45244n2516j04421k65739N8850P3979o3312
2721F977827j08685j48661J82391l52149k03364l18908p4125N03325n34209J96201
2711F119643O99670k57215l93251N90853l50601P8775j09628j86161l4929l61317
2701E795839j39459J51819q7077j43191L11816k68687m80999K38096J52749J60375
2691E691281K4353J501k15548j76138J66980k37205P7053j68455J93001l76117
2681D980706l76194j72112M30279K00313k99967k33522k3741R0972k80204k13585
2671D102945M51501l14261m5487J72799P2453l61917j85092j21553K09075M30158
2661D410621O6166l94016l89566J48766j47270o635o1021K82862j35564L3951
$$ plain form
2731 7838478 8157387 7321735 6785742 7330986 7278470 7174049 6908310 6967160 7041139 6977827
2721 6977827 6869142 6720481 6902872 6550723 6347359 6028451 5954326 6457651 5923442 6119643
2711 6119643 6819313 6562098 6168847 6759700 6409099 6487874 6378246 6192085 6157156 5795839
2701 5795839 5656380 5808199 5721122 5577931 5889747 5621060 5140061 5378157 5530906 5691281
2691 5691281 5715634 5717135 5501587 5325449 5492429 5255224 5332277 5163822 5356823 4980706
2681 4980706 4604512 4432400 4862679 5062992 4763025 4529503 4505762 4596734 4316530 4102945
2671 4102945 4554446 4240185 4194698 4367497 4439950 4078033 3892941 3771388 3980463 4410621
2661 4410621 4476787 4082771 3693205 3841971 3694701 3688066 3627045 3909907 3774343 3808294
2651C808294J07733l85368j34201J59363j58127P2408O02279k7761q0354q4772
2641C879494j88999J85690k53711j63815K55081o3988J98520Q4312l0223k969
2631C899392L51004k22630n41956R8289m6932K44535L52844o1663n05155J56877
2621C724605M30720k31915l77008l0437K45310k45670k81704K79621j47937K34353
2611C599938J59924J04414N1772N41763j99518p78767L54369J13130j84295j91088
2601C571642J65022k8976k42907N04182K75840l08336m78291J34311N4056q7382
2591C559161L81395L15770k21573k41574j84304k14052K26172R6372m02326N1587
2581C366628L32611k18928k99044M46432j08158k51059p0820J78340j11420k7116
$$ plain form
2651 3808294 3916027 3530659 3396458 3555821 3397694 3470102 4072381 4044620 3964266 3879494
2641 3879494 3690495 3876185 3622474 3458659 3713740 3649752 3848272 3932584 3902361 3899392
2631 3899392 4250396 4027766 3485810 3584099 3537167 3781702 4134546 4072883 3567728 3724605
2621 3724605 4155325 3923410 3546402 3515965 3761275 3515605 3233901 3513522 3365585 3599938
2611 3599938 3759862 3864276 3916048 4457811 4258293 3479526 3833895 3947025 3762730 3571642
2601 3571642 3736664 3707688 3464781 3968963 4244803 3936467 3458176 3592487 3646543 3559161
2591 3559161 3940556 4256326 4034753 3793179 3608875 3394823 3620995 3717367 3315041 3366628
2581 3366628 3699239 3480311 3181267 3627699 3519541 3268482 3197662 3376002 3264582 3237466
2571C237466J95611N0832p6118o02068M43682o46113j51868M0940J68894l680
2561B657578J71822J84552k97912N56289L36693n1134m05362J03137n98230k89439
2551B367994K7858P5367J12540J80975J21418j52021m11943L72755J50783k5634
2541B820092p2887k44175L50945n2323J21435l14145j15654k2233J46898n6677
2531B561276J69566l7926k99576J13100j3832J60811M3903o5528n90606m2298
2521A998890J49318J46714j20914n5878K76628K04464o06155N6688J20113m84473
2511A685395j65810M40478J01523k56352L52922k21828J91717K019J33948j50862
2501B113150L18609l13460R6662L78804m41454Q3527o5420L0492k9897l25571
$$ plain form
2571 3237466 3433077 3483909 3407791 2805723 3249405 2603292 2451424 2492364 2661258 2657578
2561 2657578 2829400 3013952 2716040 3272329 3609022 3557888 3152526 3255663 2657433 2367994
2551 2367994 2395852 2471219 2583759 2764734 2886152 2734131 2322188 2694943 2845726 2820092
2541 2820092 2747205 2503030 2853975 2801652 2923087 2608942 2493288 2471055 2617953 2561276
2531 2561276 2730842 2692916 2393340 2506440 2492608 2653419 2697322 2631794 2041188 1998890
2521 1998890 2148208 2294922 2174008 2118130 2394758 2599222 1993067 2049755 2169868 1685395
2511 1685395 1519585 1960063 2061586 1805234 2158156 1936328 2128045 2130064 2264012 2113150
2501 2113150 2431759 2118299 2214961 2593765 2152311 2235838 2170418 2200910 2171013 1845442
2491A845442L42682o7256l77439j37136K20404o1504M8570J73857k35170J55892
2481A908342k50181Q002j47379M32551M84486l68942j12535J25191J23724k57488
2471A945771j06241j6510J81799k25454j36660j6894j16928J71179J51450J63811
2461A995323j54891l51482k67610N57210L97520l43306Q3677k93754l17844K37834
2451A542677q4925K53939j77609K72537j2599l91609J16834K86179l3056m88656
2441A283712L38842K29723p707q4878q0715Q6272M07676l56912J77540j54972
2431A838581m06376j01087q2230K55006O4004o14745k75390L85252M07258j23856
2421A346417J08263J18876n86208J93796L93710Q0982k74202J06651J36819k63178
$$ plain form
2491 1845442 2188124 2120868 1743429 1606293 1826697 1765193 1813763 1987620 1752450 1908342
2481 1908342 1658161 1666163 1518784 1951335 2435821 2066879 1954344 2079535 2203259 1945771
2471 1945771 1839530 1823020 2004819 1779365 1642705 1625811 1508883 1680062 1831512 1995323
2461 1995323 1840432 1488950 1221340 1778550 2176070 1832764 1916441 1622687 1304843 1542677
2451 1542677 1457752 1711691 1534082 1806619 1794020 1402411 1519245 1805424 1772368 1283712
2441 1283712 1622554 1852277 1844570 1759692 1678977 1765249 2172925 1816013 1993553 1838581
2431 1838581 1432205 1331118 1248888 1503894 1567898 953153 677763 1063015 1470273 1346417
2421 1346417 1454680 1573556 987348 1181144 1574854 1655836 1381634 1488285 1625104 1361926
2411A361926k73530L47839J0173j91774J20718j42579N26360L24559l48290k45299
2401A490103l91N26813n86132j50080K64896N13635j84027j79591O49m01879K56396
2390A550392L76934l19874P464Q25J497o6849J20529j82269j15301R9846j7845
2379A455349L57795l26386l51795J21401J9679j5530j13644K5313p6513P33618
2369A829287L8534k70094L4430l43193M56374M1874O8983k46126j68170j16881
2359A325018M5568r8676L10998K74025L24253j03149o47807o2704k14824k73614
2349H79088O8402J22717L23136j78184j94029M64600q010k32848J97369m10785
2339A031456L80663L26768j07374l56929J04175J82525m02499L02964p5770K32247
$$ plain form
2411 1361926 1088396 1436235 1446408 1254634 1375352 1232773 1759133 2083692 1735402 1490103
2401 1490103 1489712 2016525 1430393 1280313 1545209 2058844 1874817 1695226 1695875 1293996 1550392
2390 1550392 1927326 1607452 1614916 1615741 1617238 1550389 1670918 1488649 1373348 1473194 1455349
2379 1455349 1813144 1486758 1134963 1256364 1276043 1260513 1146869 1172182 1095669 1829287
2369 1829287 1867821 1597727 1632157 1288964 1745338 1787212 1856195 1610069 1441899 1325018
2359 1325018 1370586 1271910 1582908 1856933 2181186 2078037 1430230 1367526 1152702 879088
2349 879088 947490 1070207 1393343 1215159 1021130 1485730 1477720 1244872 1442241 1031456
2339 1031456 1412119 1738887 1631513 1274584 1378759 1561284 1158785 1461749 1385979 1618226
2329A618226J15340j46089k09309J46409M00823J6469n990N9435j77138k74483
2319A543693k85739O9832L48458l08690J80585K31015j78121K05988L58289k79031
2309A886279k63795j42495K18906J65485k07651n4742k05953L09600L83353j25338
2299A963649l66037o9792J19167o0248J24240j91043O8929j56063L02582j65766
2289A569618r1553L49270j81884n16016K41411N61666k49501k38655O50401P9327
2279B174084o14308L5941M82880j30962j31517L13721j66397K99448k60398J20680
2269B123172O445K74442j63318N0142m3725K43209J7463n66937N14314K91733
2259B746940j87016j08716K2763K98224R3062J71660j69671O0894l94226P8136
$$ plain form
2329 1618226 1733566 1587477 1378168 1524577 1925400 1941869 1935879 1995314 1818176 1543693
2319 1543693 1257954 1327786 1676244 1367554 1548139 1779154 1601033 1807021 2165310 1886279
2309 1886279 1622484 1479989 1698895 1864380 1656729 1601987 1396034 1705634 2088987 1963649
2299 1963649 1597612 1527820 1646987 1586739 1710979 1519936 1588865 1432802 1735384 1569618
2289 1569618 1478065 1827335 1645451 1129435 1370846 1932512 1683011 1444356 2094757 2174084
2279 2174084 1559776 1595717 2078597 1947635 1816118 2129839 1963442 2262890 2002492 2123172
2269 2123172 2129617 2404059 2240741 2290883 2247158 2490367 2507830 1940893 2455207 2746940
2259 2746940 2559924 2451208 2473971 2772195 2865257 3036917 2867246 2928140 2533914 2612050
2249B612050K93147j54554R9837M8488l55749L2286K47023M1588M25786J71078
2239C460980l47912J66858J95718k74885K36518p373l47675O39974R8873l40917
2229C480159L18264l61274L29278J34580n17278o0469J16692L21006N81923l2814
2219D310067j39002p1477k59860J28040K05876N7578l68598J99087M09581m54890
2209D016402M8218J82022J79467J39967J6113J88876M67059K07712l7255Q971
2199E417552J65689j74222L71042J55884L73044L59821j75651M69379L69494k07866
2189G124166K47697K56283M08502J79806K49605L43955j14843K6103L59721N78128
2179I659123O55682M29225J11447P2869P65791Q03477L38583J021882Q81330P98005
$$ plain form
2249 2612050 2905197 2750643 2850480 2898968 2543219 2575505 2822528 2864116 3289902 3460980
2239 3460980 3113068 3279926 3475644 3200759 3437277 3429904 3082229 3722203 3821076 3480159
2229 3480159 3798423 3437149 3766427 3901007 3383729 3323260 3439952 3760958 4342881 4310067
2219 4310067 4171065 4099588 3839728 3967768 4173644 4231222 3862624 4061711 4471292 4016402
2209 4016402 4064620 4246642 4426109 4566076 4582189 4771065 5238124 5445836 5408581 5417552
2199 5417552 5583241 5409019 5780061 5935945 6308989 6668810 6493159 6962538 7332032 7124166
2189 7124166 7371863 7628146 8036648 8216454 8466059 8810014 8695171 8721274 9080995 9659123
2179 9659123 10314805 10744030 10855477 10928346 11694137 12497614 12836197 13858079 14739409 15537414
2169A5537414K35044P07946K27872K25328j49680r21986j102428j009800p25073
2160A3024637r66406p40113o55685l69834o72829n31059n55497l40052K19594
2151H412756m86639m55506K40797j70890k69098l64989n06464k84553L1302j52046
2141E994670N8282j89745o55655K6507M89244k58748l18340O5977j85744j75621
2131D850827K1912j90240j55678O0120J0219o8365m07145j21784k4693K31521
2121D206694J21609J7435R2343J24515L38606K66919l38329j30718j65510r1909
2111D441655j17123p18459p7128k143l43847r3363L3933r6699j50474J08274q8953
2100B895673j02188R3938k82197k38956j61082L59714j276o7237L5439O5731j52419
$$ plain form
2169 15537414 15772458 16480404 16708276 16933604 16783924 15861938 14759510 13749710 13024637
2160 13024637 12058231 11318118 10662433 10292599 9619770 9088711 8533214 8193162 8412756
2151 8412756 7926117 7470611 7711408 7540518 7271420 6906431 6399967 6115414 6146716 5994670
2141 5994670 6052952 5863207 5207552 5234059 5723303 5464555 5146215 5212192 5026448 4850827
2131 4850827 4872739 4682499 4526821 4586941 4597160 4528795 4121650 3999866 3975173 4206694
2121 4206694 4328303 4345738 4438081 4562596 4901202 5168121 4829792 4699074 4533564 4441655
2111 4441655 4324532 3606073 3528945 3526802 3182955 3089592 3123525 3026826 2876352 2984626 2895673
2100 2895673 2793485 2887423 2605226 2366270 2205188 2564902 2563626 2496389 2531828 2597559 2445140
2089B445140K34278j92164Q8707J54143j72327l47L89511K878j21893K52143l49377
2078B730692m83197l98105K90303k50762j69448o9035J7249J32292N7972J91983
2068B049944R4655l58626J09201J8298k29105k26937K63284J44206J31355l6261
2058A960014l74110K0K5330l89311q104J82363M0107j87426n4401K38313O08666
2047B041461k63121j12553J20664l25279n95364L27536M74112p3976L4480k14622
2037A413338L09994m9067J0219j34757l05561k41968J70070N8133j66846L58276
2027A421831m31303j92312M56236m8653m7068R0109J53183k07749J32499J41598
2017A468371k93427k70888R2522L74966o78452j3124P12731k23933l7274K49684
$$ plain form
2089 2445140 2679418 2487254 2575961 2730104 2557777 2557430 2946941 2949819 2827926 3080069 2730692
2078 2730692 2247495 1849390 2139693 1888931 1719483 1650448 1667697 1799989 1857961 2049944
2068 2049944 2144599 1785973 1895174 1913472 1684367 1457430 1720714 1864920 1996275 1960014
2058 1960014 1585904 1585924 1611254 1221943 1213839 1396202 1436309 1248883 1194482 1432795 2041461
2047 2041461 1778340 1665787 1786451 1461172 865808 1193344 1667456 1593480 1627960 1413338
2037 1413338 1723332 1674265 1684484 1549727 1244166 1002198 1172268 1230401 1063555 1421831
2027 1421831 990528 798216 1254452 1205799 1158731 1248840 1402023 1194274 1326773 1468371
2017 1468371 1174944 904056 996578 1371544 693092 679968 1392699 1168766 1131492 1381176
2007A381176k32820j14351N75979k76372m88635L87137J00088k15685Q5254l29391
1997H72380j17142M53119J26766q8914J26105j58862M929O0150o6904m21266R1874
1986H82235P9908j37886l44131P3905L02227J74949N1630J04163l31853j77489
1976F77658M76800o6359k01024p1760M49397R6820l03576k6100j01017N7085l24501
1965F63423J57884o9365j5546J85272p5765l13616k8237O4752k04583L54961j07151
1954F12029l22179K32163L10775k7872l51418R5092j65855o4395K05098J77637
1944G01075O94936n20720k85533M95376j58131j68446l14899j42389M0044L61937
1934G03250j77012m31049K22374K5515N08701j61351j62431R8312P445r3141m2463
$$ plain form
2007 1381176 1148356 1034005 1609984 1333612 844977 1232114 1332202 1116517 1201771 872380
1997 872380 755238 1208357 1335123 1246209 1372314 1213452 1218381 1278531 1211627 790361 882235
1986 882235 962143 824257 480126 554031 856258 1031207 1082837 1187000 855147 677658
1976 677658 1154458 1088099 887075 815315 1264712 1361532 1057956 1031856 930839 987924 663423
1965 663423 821307 751942 736396 921668 845903 532287 504050 568802 364219 719180 612029
1954 612029 289850 522013 832788 804916 453498 548590 382735 318340 523438 701075
1944 701075 1396011 875291 589758 1085134 927003 758557 443658 301269 341313 703250
1934 703250 526238 95189 317563 343078 851779 690428 527997 626309 633754 540613 498150
1923D98150o8257J73060M580J15247l4004L99260Q1702o66404Q0686L31582l41466
1912E74136J71500L66184j34855o1584j2873k50219j82988L96161Q2295l55714
1902E92043K5043J9751k44796M2635j0221J01551R9156L56736J43591m84573k25308
1891D15608L59440j81629k23161J54849J54356M7999K93281L77203k98529m22514
1881F76903K68077L07637K15962J6116M2699k98646N1077J63720n07316M33916
1871A370145J87652k49146l19185L24062O9173o1499J14419q4573o19945J40860
1861H71963L64668k79592L78717n0397n1308J28444j9090k20858K69684J06962
1851A499193k35919L72973n6027K41903M81231q7087m776Q0863n53092j12310
$$ plain form
1923 498150 429893 602953 607533 722780 688776 1088036 1169738 503334 584020 915602 574136
1912 574136 745636 1111820 976965 915381 902508 652289 469301 865462 947757 592043
1902 592043 617086 636837 392041 434676 424455 526006 625162 981898 1125489 640916 415608
1891 415608 775048 593419 370258 525107 679463 727462 1020743 1397946 1099417 676903
1881 676903 944980 1252617 1468579 1484695 1527394 1228748 1279825 1443545 936229 1370145
1871 1370145 1557797 1308651 989466 1313528 1382701 1321202 1435621 1351048 731103 871963
1861 871963 1236631 957039 1335756 1285359 1234051 1362495 1343405 1122547 1392231 1499193
1851 1499193 1263274 1636247 1580220 1822123 2303354 2216267 2211491 2292354 1739262 1626952
1841A626952M04370j6451k75411k41080K21021J25110K10451Q5056k70033j987
1831A867998J27580j71628J33803K69410k42285O1685K16627j08874k36958j00758
1821A816600O20817l5686j04053L63456k52480l00647O00522M14751J7390j7965
1811C122705p1699l8622n840j50087j28456K49698K51154K28543k26572j27846
1801C102978J45423l01836j48042L23824O2070n61957o4957j36571j963L35733
1791B754702k79584j80707L61065L14980k3169K31074K76682j47931n29800k56688
1781B520624k38127O3455K22246j33445J467J67408R0563n6915k65169L57581
1771B729688m0495j47183l18069J38362R6565j41926j02556k39243K37471L64433
$$ plain form
1841 1626952 2031322 2014871 1739460 1498380 1719401 1844511 2054962 2140018 1869985 1867998
1831 1867998 1995578 1823950 1957753 2227163 1984878 2046563 2263190 2154316 1917358 1816600
1821 1816600 2437417 2401731 2297678 2661134 2408654 2108007 2708529 3123280 3140670 3122705
1811 3122705 3051006 3012384 3006544 2856457 2728001 2977699 3228853 3457396 3230824 3102978
1801 3102978 3248401 2946565 2798523 3122347 3184417 2622460 2557503 2420932 2418969 2754702
1791 2754702 2475118 2294411 2655476 2970456 2947287 3178361 3455043 3307112 2777312 2520624
1781 2520624 2282497 2345952 2568198 2434753 2436220 2603628 2694191 2637276 2372107 2729688
1771 2729688 2689193 2542010 2223941 2362303 2458868 2316942 2214386 1975143 2212614 2577047
1761B577047k75731n16666K15499k81552R3637J57497o7136k93034l2362L12681
1751A889880J38154j25881o02469K17437K00235k11196l23649j92457K88754K27163
1741A505971K92369l18404O1420j11630k28988l86223K86164k57067R0225J06128
1731A039965l45298M04290k4937j92128O45265k2337k49274j86886k21325Q8823
1721I36158k73259k02075J28047K01417l76643K5762Q7674j16884k43363P430
1711A74264J25498J03463J56073j43193j75203M24474k46288j18260N6590R7594
1701D55012l4776Q2170k03605l5088L85107j81361j29650k8216j49516J28623
1691B88700k14052l41387K73758L80592j49073J49967K16647j94311j67967p0984
$$ plain form
1761 2577047 2301316 1784650 2000149 1718597 1812234 1969731 1902595 1609561 1577199 1889880
1751 1889880 2028034 1902153 1299684 1517121 1717356 1506160 1182511 990054 1278808 1505971
1741 1505971 1798340 1479936 1541356 1429726 1200738 814515 1100679 843612 933837 1039965
1731 1039965 694667 1098957 1074020 881892 1527157 1504820 1255546 1068660 847335 936158
1721 936158 662899 460824 588871 790288 413645 439407 527081 410197 166834 174264
1711 174264 299762 403225 559298 416105 240902 665376 419088 300828 357418 455012
1701 455012 420236 502406 298801 263713 648820 467459 337809 309593 160077 288700
1691 288700 74648 -266739 7019 387611 238538 388505 605152 410841 242874 171890
1681A71890J7574J28585J58700o1758K96860k56824l0900L42923o3584j36219
1671E67247q264j77548n20866Q3279J33290J70016J1739j18026O0943J56092K29069
1660E86971k88365l73096j26105M64174K18072o01550N4762K63859l41512j010
1650a43800K95722M05948l17906k04651m8899O7652j21043L11593L81256k04720
1640D21152J51843l59565m61276k9505P53740m42676j01376J7937J90565K85269
1630D26108K00680q3198n08975M08801l62856k82508Q8841L9562J99153j28144
1620b536l6900o0835j34082k34089r3492M74965n1120j66325L11066J44645n55107
1609d03810J42054R8403k99149K78234j83614q3253O36109j56855k18976M19869
$$ plain form
1681 171890 189464 318049 476749 414991 711851 455027 424127 767050 703466 567247
1671 567247 558983 381435 -139431 -56152 77138 247154 258893 140867 201810 357902 586971
1660 586971 298606 -74490 -200595 263579 481651 -119899 -65137 198722 -142790 -143800
1650 -143800 151922 557870 239964 35313 -13586 54066 -66977 244616 625872 421152
1640 421152 572995 213430 -247846 -277351 476389 33713 -67663 -49726 140839 426108
1630 426108 626788 543590 34615 443416 80560 -201948 -113107 -73545 125608 -2536
1620 -2536 -39436 -100271 -234353 -468442 -561934 -86969 -138089 -304414 6652 151297 -403810
1609 -403810 -261756 -163353 -462502 -184268 -367882 -451135 184974 28119 -190857 229012
1599B29012o7884k27191j86461j03612J03180j4894K19449K94922j93556m33110
1589c80145l3263q7398j07300M33830P6307o7183J55178j41381l08698K55042
1579b05011j10401j61108R6457k48091K47897K43203P1520K49162n45677r7195
1569d59244J28561J15197P23j54707L57370m09822k7502K50725k82172R0322k6628
1558d17177l17283L56397J13876r4052J42313K28340J40464K57664j12945l52867
1548e5270j54612j03027k29069j00500J9093J90492J37642K35446J79926l04669
1538a84548l8716k14027n38968O92842K91317k22732o7414j58278J43234j42782
1528d40072K04268J93282O64854J7842n94837k66045o4506J16470k81404J25320
$$ plain form
1599 229012 161128 -66063 -252524 -356136 -252956 -267850 -48401 246521 52965 -380145
1589 -380145 -413408 -500806 -608106 -174276 -97969 -165152 -9974 -151355 -460053 -205011
1579 -205011 -315412 -476520 -380063 -628154 -380257 -137054 -65534 183628 -362049 -459244
1569 -459244 -330683 -215486 -214763 -369470 -12100 -421922 -449424 -198699 -480871 -390549 -417177
1558 -417177 -734460 -378063 -264187 -358239 -215926 12414 152878 410542 297597 -55270
1548 -55270 -209882 -312909 -541978 -642478 -623385 -432893 -295251 -59805 120121 -184548
1538 -184548 -223264 -437291 -976259 -283417 7900 -214832 -282246 -440524 -297290 -440072
1528 -440072 -235804 -42522 622332 640174 45337 -220708 -285214 -168744 -450148 -324828
1518c24828J10590J10451J2019j70732p7402j59283K143J39282L01826J38161
1508H2227M4619K00620j6366k93037o581j57324k77870k51953M79395k93228R0876
1497c98622L00615K7938J73373m27332l62349K80087L91609l73602K05711r2950
1487b75522k39151L71876n6514k6228r46r9507p0356L70214J84783o62135K04494
1476b98992L93533j69344j58860K23423J16446m20102l52965Q54533J2043o33113
1466d33398M81898P6382j92681k09315J62744R8937J44751K35333k70269k70617
1456a76235l2148j13905J97469K75995j42271m39525n04480J24358P35109R0591
1446A4958j67077N9751l71960J90942r652l30115p6523N28509p6871k07622N9326
$$ plain form
1518 -324828 -214238 -103787 -91768 -262500 -339902 -499185 -497042 -357760 -55934 82227
1508 82227 126846 327466 311100 18063 11482 -145842 -423712 -675665 -196270 -489498 -398622
1497 -398622 -98007 -70069 103304 -324028 -686377 -406290 -14681 -388283 -182572 -275522
1487 -275522 -514673 -142797 -199311 -225539 -226485 -325992 -396348 -26134 158649 -503486 -298992
1476 -298992 94541 -74803 -233663 -10240 106206 -313896 -666861 187672 199715 -433398
1466 -433398 48500 124882 -67799 -277114 -114370 -15433 129318 364651 94382 -176235
1456 -176235 -208383 -322288 -124819 151176 8905 -430620 -935100 -810742 -75633 14958
1446 14958 -152119 -92368 -464328 -273386 -283038 -613153 -689676 -161167 -238038 -445660 -386334
1435c86334K08739r6187k15078L94914L45986j59899k37353Q9606K58924J08265
1425C11583m9321l99153J36209j68810j50913k74190L91661K52251j25284L01433
1415B25466L8190j31691k89368K42198K44695q1894m17731J35713m8828m21116
1405e04366P0814M38460j04260K9368k71167n279j14145J28948J1580L87753P4236
1394A41942m23356O3704M07187J77099n24520j73555N2381l00454J09950P3833
1384c95789K37264J8166L68000q6213L849Q053J55162k74865l459k3826L6811
1373D3153N8206l03245j86680o3649J07433K32419o2303M1789N4211J23325k18067
1362a73408j0277Q5678n04611L82399Q5064L33538o45463P7693M19279L50582
$$ plain form
1435 -386334 -177595 -273782 -488860 -93946 252040 92141 -145212 -55606 203318 311583
1425 311583 262262 -136891 -682 -169492 -320405 -594595 -202934 49317 -75967 225466
1415 225466 263656 131965 -157403 84795 329490 247596 -170135 -34422 -83250 -504366
1405 -504366 -433552 4908 -99352 -69984 -341151 -346430 -460575 -331627 -320047 67706 141942
1394 141942 -281414 -217710 189477 366576 -157944 -331499 -279118 -579572 -469622 -395789
1384 -395789 -158525 -140359 227641 141428 145277 153330 308492 33627 30168 6342 43153
1373 43153 101359 -201886 -388566 -452215 -344782 -112363 -174666 -132877 -78666 44659 -173408
1362 -173408 -183685 -98007 -602618 -220219 -135155 198383 -447080 -369387 49892 400474
1352D00474j99831q1174j47897j85746o0029Q3076P4915J08248k61892k10354
1342d80210o9122K52811R9121m06377N4277J1636M86431J70642R6343j70093k54512
1331b09053J73976O7331m47024J87775P5017K1590J80321j82146j86704j94032
1321e12949K35323j25036L83516l34816k08947L31558J50540j2337k55898R4691
1311b54355K39500K98429l6567l1608R8808m23048j2401L41146m5870o3475j11093
1300e34m10988R7361M25800k53851N5704N8506J88831M02939q388r1055m90337
1289b6012J96636k99403K28547l70697j62226K85362L541J73893j58758M24111
1279B94994k51385l36472K34836j71386j65970K37329L3677j95595K15945K10109
$$ plain form
1352 400474 200643 119469 -28428 -214174 -274203 -191127 -116212 -7964 -269856 -480210
1342 -480210 -549332 -296521 -197400 -603777 -549500 -537864 -51433 119209 215552 45459 -209053
1331 -209053 -35077 32254 -414770 -226995 -151978 -130388 49933 -132213 -318917 -512949
1321 -512949 -277626 -402662 -19146 -353962 -562909 -231351 -80811 -93148 -349046 -254355
1311 -254355 -14855 283574 247007 215399 314207 -108841 -121242 219904 174034 110559 -534
1300 -534 -411522 -314161 111639 -142212 -86508 -28002 160829 563768 555380 464325 -26012
1289 -26012 170624 -128779 99768 -270929 -433155 -147793 -144252 29641 -129117 294994
1279 294994 43609 -292863 -58027 -229413 -395383 -158054 -124377 -319972 -104027 106082
1269A06082m75801L20991K13838J34323l99201j06524K6068j66972K45377J81120
1259G9301j61900O0614K02351k04930M55126k23000j06797l65341J31949J38052
1249E425J08682K14058N3575N8038m21585J52232M86793j05234Q1157j3057j6930
1238F03154J20036k07126J64222M7875J64918o65450J9401l32165K56782K69534
1228D41181j62412J62427J26575k67899j77543J06721n6226j73247p3514L53655
1218B79718l18716l80993L63760R9589j57702o8703L49222k28979K0719N0929
1208H844K6410M10701J0419l53090M63916l86400j12853M5768j70441j32091K70093
1197H1276O3273J31558k10736l47325L55835M97490k52908l99114K99218n125
$$ plain form
1269 106082 -369719 -48728 165110 299433 -99768 -206292 -180224 -347196 -101819 79301
1259 79301 -82599 -21985 180366 -24564 430562 207562 100765 -264576 -132627 5425
1249 5425 114107 328165 381740 439778 18193 170425 657218 551984 633141 620084 603154
1238 603154 723190 516064 680286 728161 893079 227629 247030 -85135 171647 441181
1228 441181 278769 441196 567771 299872 122329 229050 172824 -423 -73937 279718
1218 279718 -38998 -419991 -56231 43358 -114344 -183047 166175 -62804 -42085 8844
1208 8844 35254 445955 456374 103284 567200 180800 67947 113715 -56726 -188817 81276
1197 81276 144549 276107 65371 -281954 73881 571371 318463 -80651 218567 213442
1187B13442k99247l04265M34570O0332J37131k94675K31027k1088l25508O3254
1177a05027j68372K86119M60526l04868Q3027L53824O2682n97720J48520k66619
1167d7908k00894L10694j5814k79743J25304O5369M58979K50789l31897j15606
1157B19273J98062n10557J08871J24964j20965J75277K40039j64079r8275J89259
1147C61869l53821R5653j05974L47548p9987L7050L16235q2557k91970m24013
1137a79967K85626J4007j22904J74719M8459L16661J64195j59706m06676M2306
1127A76720K93362q7915K32778J8275r4899k57155l79264L14594M59362k42948
1117D32910j52257J44399L0860J1021l37455o5345K16418L52397q4592J25837
$$ plain form
1187 213442 -85805 -390070 44500 104832 241963 -52712 178315 157227 -168281 -105027
1177 -105027 -273399 12720 473246 168378 251405 605229 667911 70191 218711 -47908
1167 -47908 -248802 61892 46078 -233665 -108361 -42992 415987 666776 334879 219273
1157 219273 417335 -93222 15649 140613 19648 194925 434964 270885 172610 361869
1147 361869 8048 103701 -2273 345275 265288 302338 618573 536016 244046 -179967
1137 -179967 105659 119666 -3238 171481 219940 536601 700796 541090 134414 176720
1127 176720 470082 382167 614945 633220 538321 281166 -98098 216496 675858 432910
1117 432910 280653 425052 455912 466933 129478 64133 280551 632948 548356 674193
1107F74193k1153m05401J94570J13280k86954L31604R1579j76927l02241K23723
1097D36273p5756q5567M62003j09464l0739L48088l00903m51254J86591J64747
1087E44019o8710J23746L8176J33664K67615k20112K60380n2946K03553N6002
1077A285387n18170K72263M09097j21498l91246K3809K62200J10104j18930j6863
1067A196153l0269J82290J95652n38917N6317J7895J35054L9327n7236O4273L68706
1056A629245n14067K36854L20992P1407l0205j60555L5842J78686K9400m12448
1046A385151j5441l7452K57221J97747m91379M10432J88102j63694L71199Q5928
1036B187814L35535j2316j92246k0343Q9278j98405M80358J10085k18552k14209
$$ plain form
1107 674193 653040 247639 442209 555489 268535 600139 691718 514791 212550 436273
1097 436273 360517 274950 736953 627489 596750 944838 643935 192681 379272 544019
1087 544019 475309 599055 637231 770895 1038510 818398 1078778 1025832 1229385 1285387
1077 1285387 767217 1039480 1448577 1327079 935833 959642 1221842 1331946 1213016 1196153
1067 1196153 1165884 1348174 1543826 1004909 1061226 1079121 1214175 1253502 1196266 1260539 1629245
1056 1629245 1115178 1352032 1673024 1744431 1714226 1553671 1589513 1768199 1797599 1385151
1046 1385151 1369710 1332258 1589479 1787226 1295847 1706279 1894381 1730687 2101886 2187814
1036 2187814 2523349 2511033 2318787 2298444 2387722 2189317 2669675 2779760 2561208 2346999
1026B346999N76470j47722r0370P9010n317K93176j88945J64511J66712o1677
1016C132847j19165K07376K94296K05610L11514j73584L95432N23297k95577n06780
1006C975266Q7509L41747R1781R2502K65203M48701q0722k70460K77344N9590
996E288461J81922k94239J55697N53503M15931j03231K78508Q08980M21272J63213
986G870017L63413K37984O43353M88681J031117L26721M21800J156318Q96781
977A3436185O89252P91094J193225J002526R16258J248073J725536J747811J596350
968B4346310J039651R17235J285359J833187K502465L057788M206753N363733
960D4552481O598067Q526114J0630576J2421870J7549883K2361188K1482840M298416
$$ plain form
1026 2346999 2923469 2775747 2685377 2764387 2759070 3052246 2863301 3027812 3194524 3132847
1016 3132847 3013682 3221058 3515354 3720964 4032478 3858894 4254326 4777623 4482046 3975266
1006 3975266 4062775 4404522 4496303 4588805 4854008 5302709 5221987 4951527 5228871 5288461
996 5288461 5470383 5176144 5331841 5885344 6301275 6198044 6476552 7285532 7706804 7870017
986 7870017 8233430 8471414 9114767 9603448 10634565 10961286 11383086 12539404 13436185
977 13436185 14125437 14916531 16109756 17112282 18028540 19276613 21002149 22749960 24346310
968 24346310 25385961 26303196 27588555 29421742 31924207 34981995 39188748 44552481
960 44552481 51150548 59676662 70307238 82729108 100278991 122640179 144123019 148421435
952A48421435k5255080l0538970k1233821j3820332r307935p320156n860193m667220
944C0417728l938339k808613k252122j556273j368690o90604r91942j072375j342070
935A4396700j638806j251201r81735m22595j99398l82456q84979K87953l68697
926H554786q60563k13092k53822k74445m68561n53374l84913l2529p6015J23503
916E560975K3947l20209j5681l54374l73570j20297p3430l76564o38090K460m34824
905B880343l29810J27008L6517k74021K39006J78880o57386J10386K01055j33785
895B378193r2423p938l0235m06449k56153M55345l80247P0401L49973J15147m04413
884A791201m7762J8435j24398k3991o3228P290J21736J387j47000k4774L30948
$$ plain form
952 148421435 123166355 92627385 71393564 57573232 48265297 40945141 35084948 30417728
944 30417728 26479389 23670776 21418654 19862381 18493691 17803087 16811145 15738770 14396700
935 14396700 12757894 11506693 10524958 10102363 9902965 9520509 8635530 8923483 8554786
926 8554786 7694223 7481131 7227309 6952864 6484303 5930929 5546016 5513487 5437472 5560975
916 5560975 5584922 5264713 5249032 4894658 4521088 4400791 4327361 3950797 3312707 3315167 2880343
905 2880343 2550533 2677541 2714058 2440037 2679043 2857923 2200537 2310923 2511978 2378193
895 2378193 2285770 2277832 2247597 1841148 1584995 2040340 1660093 1730494 2080467 2195614 1791201
884 1791201 1743439 1761874 1637476 1613485 1550257 1557547 1679283 1680670 1533670 1508896 1839844
873A839844k49857n89002L12259L23839j67655p46650L88892N13087m62839j86976
863I74942n2839j18788j23888o9179L60537m1145j31387M5678J0208m1272J10628
852I23495L18040j1363K60012n32896m63546J44924k16930j57493O2037L61126
842F87406K0024j33603j7137j1560p5587n0272K58330j98247Q8791j091l822R3180
830F56412j42278L42575k4434j69027J35956k15598k90201o5053q5312j29489
820A3551L04198k4403k63412l18505K93386j16940J20486K55284k40671r7148
810g4174J17220J09863O4562k72864L2185L19025k58828K37567J17100l13112
800G8544j85770k01843q2877J8729J44249K69193J5882K05128j38533J07075Q907
$$ plain form
873 1839844 1589987 1000985 1313244 1637083 1469428 722778 1111670 1624757 1161918 974942
863 974942 922103 803315 679427 610248 970785 929640 798253 843931 854139 812867 923495
852 923495 1241535 1230172 1490184 957288 493742 638666 421736 264243 326280 687406
842 687406 707430 573827 556690 545130 469543 419271 677601 479354 568145 567054 563232 656412
830 656412 514134 856709 832275 663248 799204 583606 293405 228352 143040 13551
820 13551 317749 293346 29934 -288571 4815 -112125 8361 263645 22974 -74174
810 -74174 43046 152909 217471 -55393 -23208 295817 36989 274556 391656 78544
800 78544 -107226 -309069 -391946 -373217 -228968 40225 56107 261235 122702 229777 238684
789B38684r0470r0193l67258R1193J44865P1275j1502J04362m21468n6024M17042
778C0506J05977j75926j13192p3531K2325K02940k36695J24068K12136n7012j82471
767a40875M30176l28960m89251K6790P4407K19051K31451j80741l24595K1540
757d61007J41103J49203l34270K99933L07664J51248j32959r3342J51391k39748
747f0784j58260J44588J74745J64581O9169l23007l85155k66487O30657M8514
737C8561q0333k5645K30339l020m76009K28732J32892r1433k15241J5423J48103
726i7631N8080J71254J50784j88411l05617j36187q6890J18927k70476J51296
716d34871K58158L36601j88523K7445l2328j05278K08642L6777l91666q279Q6462
$$ plain form
789 238684 148214 58021 -309237 -218044 -73179 -1904 -13406 90956 -330512 -386536 30506
778 30506 136483 -39443 -152635 -226166 -203841 -901 -237596 -113528 98608 41596 -140875
767 -140875 289301 -39659 -528910 -502120 -427713 -208662 22789 -157952 -482547 -461007
757 -461007 -319904 -170701 -504971 -205038 102626 253874 120915 27573 178964 -60784
747 -60784 -219044 -74456 100289 264870 334039 11032 -374123 -640610 -9953 38561
737 38561 -41772 -67417 162922 159902 -316107 -87375 45517 -45916 -261157 -245734 -97631
726 -97631 -39551 131703 282487 94076 -211541 -347728 -434618 -315691 -586167 -434871
716 -434871 -176713 159888 -28635 -1190 -33518 -138796 69846 106623 -285043 -293322 -206860
705b06860O9699J85722l56965j73995o3538K35974j33830j1219J44001L02025
695h986m9398n9898P6871k53312R1439K50182j04413n9355J18242n0525k26744
684b75897J16093K79370j33756k0979J46106K84211J51862k74797m57906L72396
674A86703J86812R6684r1602l36175K91608R7393M9163j7787J62625k49355K73132
663F49201J92484m87828m69649L98561K5321m83385L12169l3237N8078j44421
653A7294K47451k1410m28317Q2722l76429J53817L86715m6359l18685K24019N9273
642a9909l44105J54271j47735K31830j93126n19737O75627O28779m12416l49186
632b95707L63822k64431j89992K17497J32030o38734Q1251M3531l21731K89116
$$ plain form
705 -206860 -137161 48561 -308404 -482399 -545937 -309963 -443793 -455012 -311011 -8986
695 -8986 -58384 -118282 -41411 -294723 -203284 46898 -57515 -116870 1372 -49153 -275897
684 -275897 -159804 119566 -14190 -35169 110937 395148 547010 272213 -185693 186703
674 186703 373515 470199 378597 42422 334030 431423 480586 462799 625424 376069 649201
663 649201 841685 353857 -115792 282769 308090 -175295 136874 103637 161715 17294
653 17294 264745 243335 -184982 -102260 -478689 -324872 61843 15484 -303201 -79182 -19909
642 -19909 -364014 -209743 -357478 -125648 -318774 -838511 -162884 465895 53479 -295707
632 -295707 68115 -196316 -386308 -168811 -36781 -675515 -594264 -550733 -872464 -583348
622e83348L22374J05365j57734k35500L37091J58426m60907j46467L54149Q4474
612b22077J01346m46837K2527M88024k8355k07451N31391L0955j60808j85036
602g6321l97374N5771J08300N05609L02990j86420l15676k14986K19159J38078
592A39130k67816P1666K85867J36314n03957m46996J05553N0602j28592N04204
582e4025k16138j40333m2752J78235N63104m20674m59017M60993L17131j24370
572F2154k66073P391K98163k04420m46179L9608L80935j69230l15951L11560K14998
561h7044J11459j91014j12615J07570J50035J24867R5635m80570k53605J81186
551c54096J40324j4608M00498l44070r228j97149l33946K19966K28269K52181
$$ plain form
622 -583348 -260974 -155609 -313343 -548843 -211752 -53326 -514233 -660700 -306551 -222077
612 -222077 -120731 -567568 -545041 -57017 -85372 -292823 238568 269523 108715 -76321
602 -76321 -473695 -417924 -309624 195985 498975 312555 -3121 -218107 1052 139130
592 139130 -128686 -57020 228847 365161 -138796 -585792 -480239 -429637 -558229 -54025
582 -54025 -270163 -410496 -453248 -275013 288091 -132583 -591600 -130607 186524 62154
572 62154 -203919 -196528 101635 -102785 -548964 -509356 -128421 -297651 -613602 -302042 -87044
561 -87044 24415 -166599 -279214 -171644 -21609 103258 198893 -281677 -535282 -354096
551 -354096 -213772 -228380 172118 -171952 -181180 -378329 -712275 -492309 -264040 -11859
541a1859j07577j72342J39364K22977j95799j33079L4309l5656J21082J27613
531a0967j32175q4229L79211j77688q1622Q2866l77244M0984J56944K52848P4481
520A23409j50496m42424M913K31952K11624l67881R6754J05949r864l1908m60958
509f88930N20084O6934J78950K05900o40731j0689N51058j73377l08382J38562
499a60621J38283k35539J23751L74543j31199j10537L2486K7347L37586k30557
489A65543l39810J36633k07127J66934J31113k18635K63221k01096m00476M61173
479d2527M4568j8538Q9469K9422j42075m76016q0660J89848K51688M74106n44594
468b25309r2723L1019O1596k39619j25409K32755Q0974j43119K67709j46315M3345
$$ plain form
541 -11859 -119436 -291778 -152414 70563 -125236 -258315 -224006 -259662 -138580 -10967
531 -10967 -143142 -227371 151840 -25848 -107470 -24604 -401848 -360864 -203920 48928 123409
520 123409 -27087 -469511 -464598 -232646 -21022 -388903 -292149 -186200 -196064 -227972 -688930
509 -688930 -168846 -101912 77038 282938 -357793 -368482 182576 9199 -299183 -160621
499 -160621 -22338 -257877 -134126 240417 109218 -1319 31167 58514 396100 165543
489 165543 -174267 -37634 -244761 -77827 53286 -165349 97872 -103224 -503700 -42527
479 -42527 2041 -16497 72972 102394 -39681 -515697 -596357 -406509 -154821 319285 -225309
468 -225309 -318032 -287013 -225417 -465036 -590445 -357690 -276716 -419835 -152126 -298441 -255096
457b55096J55389L8745K92430R5593k31485j97540M93578M9058k58070j5036k01911
446c4345J09924n14435j89622L78921K92372p7929l82354r5874K79449K97950
436F4057m23365L84290k46891O5334k8686k73037j68395L51314n8528m44386P06007
425g2286M69405l60386j55153k47140K8787r8320k93695L5373J82513J64518J50574
414a95810L23676J7806J14469J38536K066l89256j25111k65470J74579N36127
404C31612j57932k95272l34375J50629j29028k58510K94692M90757m13751l76654
394f97832L76088O2137j5648o8760O0908P2363l28884n8673M72900K08354l49965
383b67012m4186q3454K99680K12150r7835O906m10841J85833l69581L59720K27817
$$ plain form
457 -255096 -99707 -60962 231468 327061 95576 -101964 391614 440672 182602 167566 -34345
446 -34345 75579 -438856 -628478 -249557 42815 -35114 -417468 -513342 -233893 64057
436 64057 -359308 24982 -221909 -156575 -185261 -458298 -626693 -275379 -333907 -778293 -72286
425 -72286 397119 36733 -118420 -365560 -336773 -435093 -728788 -693415 -510902 -346384 -195810
414 -195810 127866 145672 260141 398677 400743 11487 -113624 -379094 -204515 331612
404 331612 173680 -121592 -455967 -305338 -434366 -692876 -398184 92573 -321178 -697832
394 -697832 -321744 -259607 -275255 -344015 -283107 -210744 -539628 -598301 -125401 82953 -267012
383 -267012 -311198 -394652 -94972 117178 19343 26249 -384592 -198759 -568340 -208620 19197
372A9197K3846K32325k82156K76785L26976o5257n29759j82443l1058k17653p5028
361e04225J38297K59264N0136K3527l8351K42226n87201o39996O98286L55255
351b782k51052k64798N48881P3909J85100p8507m78717P0424j08798J44812K65350
340A03822j61876l0295l66990J39165M13713N497n93523n2136K97482l43045r8865
329f87051L42162J93876k35667j19793K5349M98276q6043m38422J40666L74489
319G842L9421j28524j44607r5287q1770J40893Q4081M59977k46157l91325K6708
308c28748J516j16041j38591J59544J03645L9453M4012Q9146j57826R5686Q5506
297a22698k32215j54111N37809r4114m53267J3701J13116j15800j26961K26216
$$ plain form
372 19197 43043 275368 -6788 269997 596973 531716 1957 -180486 -211544 -429197 -504225
361 -504225 -365928 -106664 -56528 -33001 -71352 170874 -416327 -1056323 -358037 -2782
351 -2782 -253834 -518632 30249 104158 289258 210751 -267966 -197542 -306340 -161528 103822
340 103822 -58054 -88349 -455339 -316174 97539 103036 -490487 -542623 -245141 -588186 -687051
329 -687051 -344889 -151013 -386680 -506473 -481124 17152 -68891 -507313 -366647 7842
319 7842 47263 -81261 -225868 -321155 -402925 -262032 -177951 282026 35869 -355456 -328748
308 -328748 -327232 -443273 -581864 -422320 -318675 -279222 -235210 -146064 -303890 -208204 -122698
297 -122698 -354913 -509024 28785 -65329 -518596 -504895 -391779 -507579 -634540 -408324
$$ [...]
##END NTUPLES=NMR SPECTRUM
##END=
