##TITLE=1H_CA-8802-7
 CDCl3, 8 sc, 
 29.12.2020
##JCAMPDX= 6.0         $$ Bruker NMR JCAMP-DX V2.0
##DATA TYPE= NMR SPECTRUM
##DATA CLASS= NTUPLES
##ORIGIN= UXNMR, Bruker Analytische Messtechnik GmbH
##OWNER= root
$$ XWIN-NMR		Version 3.5
$$ Wed Dec 30 10:31:25 2020 Russian Standard Time (UT+4h)  she@DPX200
##.OBSERVE FREQUENCY= 200.1315066352
##.OBSERVE NUCLEUS= ^1H
##.ACQUISITION MODE= SIMULTANEOUS
##.ACQUISITION SCHEME= undefined
##.AVERAGES= 8
##.DIGITISER RES= 18
##SPECTROMETER/DATA SYSTEM= spect
##.PULSE SEQUENCE= zg30
##.SOLVENT NAME= CDCl3
##.SHIFT REFERENCE= (INTERNAL, CDCl3, 0, 16.0051)
##AUDIT TRAIL= $$ (NUMBER, WHEN, WHO, WHERE, WHAT)
$$ ##TITLE= Audit trail, XWIN-NMR		Version 3.5
$$ ##JCAMPDX= 5.01
$$ ##ORIGIN= Bruker BioSpin GmbH
$$ ##OWNER= she
$$ F:/spectra/data/she/nmr/H-F/1/pdata/1/auditp.txt
$$ ##AUDIT TRAIL=  $$ (NUMBER, WHEN, WHO, WHERE, WHAT)
(   1,<2020-12-30 10:29:44.67 +0400>,<she>,<DPX200>,
      <created by zg, POWCHK disabled, PULCHK disabled
       configuration hash MD5:
       00 E9 B6 7A A2 85 ED C7 34 08 36 98 17 FE 4E 26
       data hash MD5: 16K
       04 7A 17 E5 24 E4 24 3F 35 A1 4F 3C A5 FE BF 0A>)
(   2,<2020-12-30 10:29:47.25 +0400>,<she>,<DPX200>,
      <Start of raw data processing
       efp BC_mod = 2 LB = 0.24 FT_mod = 6 PKNL = 1 PHC0 = -10763.49 PHC1 = 10.20095 SI = 16K 
       data hash MD5: 16K
       7D 47 81 83 B9 1C E6 89 34 06 3A E7 67 51 7A C2>)
(   3,<2020-12-30 10:30:12.37 +0400>,<she>,<DPX200>,
      <pk PHC0 = 3.398536 PHC1 = -4.4 
       data hash MD5: 16K
       73 62 F5 9E 3A CF 2C 38 10 30 F1 0C 29 10 75 94>)
(   4,<2020-12-30 10:30:16.12 +0400>,<she>,<DPX200>,
      <abs ABSG = 5 
       data hash MD5: 16K
       1E E1 05 A6 62 74 AB A5 ED 88 A9 77 31 14 2E 40>)
(   5,<2020-12-30 10:30:33.50 +0400>,<she>,<DPX200>,
      <pk PHC0 = -0.7326822 PHC1 = 1.4 
       data hash MD5: 16K
       79 C3 5E 74 1A 07 13 9B 5A 46 6D E2 58 4D AA 1B>)
(   6,<2020-12-30 10:30:36.67 +0400>,<she>,<DPX200>,
      <abs ABSG = 5 
       data hash MD5: 16K
       B8 21 D7 B1 A0 46 98 1B F1 3D A7 B5 93 CA 84 F6>)
$$ ##END=
$$ 
$$ hash MD5
$$ 38 44 4C F9 E6 D0 BC 51 85 2A 6D 27 00 42 25 AB
##$RELAX= 
##$RELAX= 
##$RELAX= 
##$RELAX= 
##$RELAX= 
##$RELAX= 
$$ Bruker specific parameters
$$ --------------------------
##$DU= <F:/spectra>
##$EXPNO= 1
##$NAME= <H-F>
##$PROCNO= 1
##$TYPE= <nmr>
##$USER= <she>
##$AMP= (0..31)
100 100 100 100 100 100 100 100 100 100 100 100 100 100 100 100 100 100 
100 100 100 100 100 100 100 100 100 100 100 100 100 100 
##$AQSEQ= 0
##$AQ_mod= 1
##$AUNM= <au_zg>
##$AUTOPOS= <>
##$BF1= 200.13
##$BF2= 200.13
##$BF3= 200.13
##$BF4= 200.13
##$BF5= 200.13
##$BF6= 200.13
##$BF7= 200.13
##$BF8= 200.13
##$BYTORDA= 1
##$CFDGTYP= 0
##$CFRGTYP= 5
##$CHEMSTR= <none>
##$CNST= (0..31)
1 1 145 1 1 1 1 1 1 1 1 1 1 1 1 1 1 1 1 1 1 1 1 1 1 1 1 1 1 1 1 1 
##$CPDPRG= <>
##$CPDPRG1= <>
##$CPDPRG2= <>
##$CPDPRG3= <>
##$CPDPRG4= <mlev>
##$CPDPRG5= <mlev>
##$CPDPRG6= <mlev>
##$CPDPRG7= <mlev>
$$ [...]
##$SUBNAM3= <"">
##$SUBNAM4= <"">
##$SUBNAM5= <"">
##$SUBNAM6= <"">
##$SUBNAM7= <"">
##$SUBNAM8= <"">
##$SUBNAM9= <"">
##$SW= 16.9725356469052
##$SWIBOX= (0..15)
0 0 2 0 0 0 0 0 0 0 0 0 0 0 0 0 
##$SW_h= 3396.73913043478
##$TD= 16384
##$TD0= 1
##$TE= 0
##$TE2= 300
##$TE3= 300
##$TEG= 300
##$TL= (0..7)
0 120 120 120 120 120 120 120 
##$TP= (0..7)
150 150 150 150 150 150 150 150 
##$TP07= 0
##$TPNAME0= <>
##$TPNAME1= <>
##$TPNAME2= <>
##$TPNAME3= <>
##$TPNAME4= <>
##$TPNAME5= <>
##$TPNAME6= <>
##$TPNAME7= <>
##$TPOAL= (0..7)
0.5 0.5 0.5 0.5 0.5 0.5 0.5 0.5 
##$TPOFFS= (0..7)
0 0 0 0 0 0 0 0 
##$TUNHIN= 0
##$TUNHOUT= 0
##$TUNXOUT= 0
##$USERA1= <user>
##$USERA2= <user>
##$USERA3= <user>
##$USERA4= <user>
##$USERA5= <user>
##$V9= 5
##$VALIST= <valist>
##$VCLIST= <CCCCCCCCCCCCCCC>
##$VD= 0
##$VDLIST= <DDDDDDDDDDDDDDD>
##$VPLIST= <PPPPPPPPPPPPPPP>
##$VTLIST= <TTTTTTTTTTTTTTT>
##$WBST= 1024
##$WBSW= 4
##$XGAIN= (0..3)
0 0 0 0 
##$XL= 0
##$YL= 0
##$YMAX_a= 498213
##$YMIN_a= -225215
##$ZGOPTNS= <>
##$ZL1= 120
##$ZL2= 120
##$ZL3= 120
##$ZL4= 120
##$ABSF1= 15.98335
##$ABSF2= -0.9893122
##$ABSG= 5
##$ABSL= 3
##$ALPHA= 0
##$AQORDER= 0
##$ASSFAC= 0
##$ASSFACI= 0
##$ASSFACX= 0
##$ASSWID= 0
##$AUNMP= <proc_1d>
##$AZFE= 0.1
##$AZFW= 0.1
##$BCFW= 0
##$BC_mod= 2
##$BYTORDP= 0
##$COROFFS= 0
##$CY= -3
##$DATMOD= 1
##$DC= 0
##$DFILT= <>
##$DTYPP= 0
##$F1P= 0
##$F2P= 0
##$FCOR= 1
##$FTSIZE= 16384
##$FT_mod= 6
##$GAMMA= 0
##$GB= 0
##$INTBC= 1
##$INTSCL= 2.992141e-10
##$ISEN= 128
##$LB= 0.24
##$LEV0= 0
##$LPBIN= 0
##$MAXI= 10000
##$MC2= 0
##$MEAN= 0
##$ME_mod= 0
##$MI= 1.114404
##$NCOEF= 0
##$NC_proc= -6
##$NLEV= 6
##$NOISF1= 3.799351
##$NOISF2= 2.8
##$NSP= 0
##$NTH_PI= 0
##$NZP= 0
##$OFFSET= 16.00511
##$PC= 1
##$PHC0= -10760.82
##$PHC1= 7.20095
##$PH_mod= 1
##$PKNL= yes
##$PPARMOD= 0
##$PSCAL= 0
##$PSIGN= 0
##$REVERSE= no
##$SF= 200.130001903495
##$SI= 16384
##$SIGF1= 3
##$SIGF2= 2
##$SINO= 5.538805
##$SIOLD= 16384
##$SREGLST= <1H.CDCl3>
##$SSB= 0
##$STSI= 16384
##$STSR= 0
##$SW_p= 3396.73913043478
##$SYMM= 0
##$S_DEV= 0
##$TDeff= 16384
##$TDoff= 0
##$TI= <>
##$TILT= no
##$TM1= 0
##$TM2= 0
##$TOPLEV= 0
##$USERP1= <user>
##$USERP2= <user>
##$USERP3= <user>
##$USERP4= <user>
##$USERP5= <user>
##$WDW= 1
##$XDIM= 16384
##$YMAX_p= 386501039
##$YMIN_p= -336541
$$ End of Bruker specific parameters
$$ ---------------------------------
##NTUPLES= NMR SPECTRUM
##VAR_NAME=  FREQUENCY,     SPECTRUM/REAL,   SPECTRUM/IMAG
##SYMBOL=    X,             R,               I
##VAR_TYPE=  INDEPENDENT,   DEPENDENT,       DEPENDENT
##VAR_FORM=  AFFN,          ASDF,            ASDF
##VAR_DIM=   16384,         16384,           16384
##UNITS=     HZ,            ARBITRARY UNITS, ARBITRARY UNITS
##FACTOR=    0.207333158178281, 1,           1
##FIRST=     3203.10265213542, 0,            0
##LAST=      -193.636478299364, 0,           0
##MIN=       -193.636478299364, -336541,     0
##MAX=       3203.10265213542, 386501039,    0
$$ Real data points
##PAGE= N=1
##DATA TABLE= (X++(R..R)), XYDATA
$$ [...]
6076C423553l7763O5721K5897r8922o5741K4753P0638K7882j6065L1264L3724
$$ 3423553 3385790 3451511 3477408 3378486 3312745 3337498 3408136 3436018 3419953 3451217 3484941
6065C484941J11364L1430j88543K8917P5218J01972R0297j14740O4106J22033
$$ 3484941 3596305 3627735 3439192 3468109 3543327 3645299 3735596 3620856 3684962 3806995
6055C806995J98735R5167N8756J09480J51078J07515K05280K40488K30982L60397
$$ 3806995 4005730 4100897 4159653 4269133 4420211 4527726 4733006 4973494 5204476 5564873
6045E564873L99952M20762N34972N54920P86550R25578R38254Q63413O11089J12744
$$ 5564873 5964825 6385587 6920559 7475479 8262029 9187607 10125861 10989274 11600363 11713107
6035A1713107o32441q40614j061558q20368p34561o29437n54776m30713j80543
$$ 11713107 11080666 10240052 9178494 8358126 7623565 6994128 6439352 6008639 5828096
6026E828096k04833j57865j28877k58301j64045m5357j19655r3404k59139j73680
$$ 5828096 5623263 5465398 5336521 5078220 4914175 4868818 4749163 4655759 4396620 4222940
6016D222940j02742r2076j67848j59235m0607J1262n0233m1257O9894k1913J0843
$$ 4222940 4120198 4028122 3860274 3701039 3660432 3671694 3621461 3580204 3650098 3628185 3639028
6005C639028l3587j8207j05704j37705j48628j54640o1147Q23R186n3546r8039
$$ 3639028 3605441 3587234 3481530 3343825 3195197 3040557 2979410 2980233 2989419 2935873 2837834
5994B837834j3793M6614J12504n0847j39638P5527R6728o0186J04270k6253m1613
$$ 2837834 2824041 2870655 2983159 2932312 2792674 2868201 2964929 2904743 3009013 2982760 2941147
5983B941147O9241J34149l2349K0582J20490K00588J58894J43418K58018J26733
$$ 2941147 3010388 3144537 3112188 3132770 3253260 3453848 3612742 3756160 4014178 4140911
5973D140911K99628M14061M14052L36721N12844N70255N95970N63597N75065O48946
$$ 4140911 4440539 4854600 5268652 5605373 6118217 6688472 7284442 7848039 8423104 9072050
5963I072050N94696N62936L12435J77600P1417k50675k64545o05091p16067p87825
$$ 9072050 9666746 10229682 10542117 10719717 10791134 10540459 10275914 9670823 8954756 8166931
5953H166931p51229o46651n73949n97462n83458l41708k92521l83102k71559k36908
$$ 8166931 7415702 6769051 6195102 5597640 5014182 4672474 4379953 3996851 3725292 3488384
5943C488384j18418j81913k27632r3136l1804j59578j21752j27369j14755o1070
$$ 3488384 3369966 3188053 2960421 2867285 2835481 2675903 2554151 2426782 2312027 2250957
5933B250957p9814k7257N2802r8977j73398M469M8232j06617l6255M1765J7624
$$ 2250957 2171143 2143886 2196688 2097711 1924313 1928782 1977014 1870397 1834142 1875907 1893531
5922A893531m5318j58629j02335J8372M6092K2679l8671j24940l4245L3041M3959
$$ 1893531 1848213 1689584 1587249 1605621 1651713 1674392 1635721 1510781 1476536 1509577 1553536
5911A553536o2716N5436k3012j55153M3992j8470R8236P730j33995j7163M501
$$ 1553536 1490820 1546256 1523244 1368091 1412083 1393613 1491849 1499579 1365584 1348421 1352922
5900A352922J15603O5712m3667n1870K679p0191j3088r915m6936K5616M2074j03937
$$ 1352922 1468525 1534237 1490570 1438700 1441379 1371188 1358100 1348185 1301249 1326865 1368939 1265002
5888A265002n6216o731J32143j6791m7894j8424K5113k3723R9227m4999r3978
$$ 1265002 1208786 1202055 1334198 1317407 1269513 1251089 1276202 1252479 1351706 1306707 1212729
5877A212729K9896n8557J22149P306k6046o983P187L108o7417K0445P6881M5253
$$ 1212729 1242625 1184068 1306217 1313523 1287477 1280494 1287681 1290789 1223372 1243817 1320698 1365951
5865A365951j21319r2674K0361K2096M0221p9235r0356q970P6199L3306P8061
$$ 1365951 1244632 1151958 1172319 1194415 1234636 1155401 1065045 1056075 1132274 1165580 1243641
5854A243641m6437m9744j37925J6134J94482j22293l063N2088M8666j2593p095
$$ 1243641 1197204 1147460 1009535 1025669 1220151 1097858 1094795 1146883 1195549 1182956 1175861
5843A175861r178o9215Q6313K2570j32857P0188l7521P534n81o7891J2582L5217
$$ 1175861 1166683 1097468 1183781 1206351 1073494 1143682 1106161 1113695 1113114 1045223 1057805 1093022
5831A093022L7899M2359j18713o1627j2262o5943o371l7100R5209o1855l6170
$$ 1093022 1130921 1173280 1054567 992940 980678 914735 908364 871264 966473 904618 868448
5820H68448l7895j08389J48691N2640n4203k9566M876j0234J1680K1824M1972
$$ 868448 830553 722164 870855 923495 869292 839726 844602 834368 846048 867872 909844
5809I09844r504Q9140K3805r1248p4714j0355R7594K2500K5806o9276O9040k9352
$$ 909844 900340 989480 1013285 922037 847323 836968 934562 957062 982868 913592 982632 953280
5797I53280j3873J1468O1811k5931L437K7664K3842J2705j30025Q8094R7070m1627
$$ 953280 939407 950875 1012686 986755 990192 1017856 1041698 1054403 924378 1012472 1109542 1067915
5785A067915K8878N6279n861M6679K5390o8312J0161R4893L3663O3113L6951l1057
$$ 1067915 1096793 1153072 1147211 1193890 1219280 1150968 1161129 1256022 1289685 1352798 1389749 1358692
5773A358692J19476j7513m8216m0755j1695P9034L1832k7646k8789l1456Q4626
$$ 1358692 1478168 1460655 1412439 1371684 1359989 1439023 1470855 1443209 1414420 1382964 1467590
5762A467590R3761j70l3871R3147J62928K651p4549n8292R1228J41118l7580j30138
$$ 1467590 1561351 1561181 1527310 1620457 1783385 1786036 1711487 1653195 1744423 1885541 1847961 1717823
5750A717823Q5350J42080J27355J01913J53180M9682J6765L8980o0861K3255R4043
$$ 1717823 1803173 1945253 2072608 2174521 2327701 2377383 2394148 2433128 2372267 2395522 2489565
5739B489565o2425j39670M1708O4813J04625M3444j00289n5698J33116n202k3565
$$ 2489565 2427140 2287470 2329178 2393991 2498616 2542060 2441771 2386073 2519189 2513987 2490422
5728B490422o0268j06215k4710j08307O6061R0191l3358J1802K0259J07383Q5071
$$ 2490422 2430154 2323939 2299229 2190922 2256983 2347174 2313816 2325618 2345877 2453260 2538331
5717B538331j047n0279J0271L3737q1140l5458M2842j03097K9533N3765J43276
$$ 2538331 2537284 2487005 2497276 2531013 2449873 2414415 2457257 2354160 2383693 2437458 2580734
5706B580734Q9153l7985J01883l6199j49001q5032j11818n616m9258m2944L9988
$$ 2580734 2669887 2631902 2733785 2697586 2548585 2463553 2351735 2346119 2296861 2253917 2293905
5695B293905r1538M9035J38847J723P4047R4238R543j53221j06360K6265j25502
$$ 2293905 2202367 2251402 2390249 2391972 2466019 2560257 2569800 2416579 2310219 2336484 2210982
5684B210982l9768L2633N9575m6089p7145m9812J06873O6544q4537j41386q4129
$$ 2210982 2171214 2203847 2263422 2217333 2140188 2090376 2197249 2263793 2179256 2037870 1953741
5673A953741M8661Q5748j1849j41244P115j5458m5526Q9651K9546j7798k2498
$$ 1953741 2002402 2088150 2076301 1935057 1942172 1926714 1881188 1970839 2000385 1982587 1960089
5662A960089L2093J7902p3054j73579o6140k3568j45956q2511M1453K772M0974
$$ 1960089 1992182 2010084 1937030 1763451 1697311 1673743 1527787 1445276 1486729 1489501 1530475
5651A530475j7835l3644n9448P9927J45542k0114j50765j4481j22349J4912n0791
$$ 1530475 1512640 1478996 1419548 1499475 1645017 1624903 1474138 1459657 1337308 1352220 1301429
5640A301429k21872m1994k9664N8256q734J8754O0963r5329M374K2568k673N420
$$ 1301429 1079557 1037563 1007899 1066155 1057421 1076175 1137138 1041809 1046183 1068751 1066078 1071498
5628A071498n4153j2848l7460j00778O7886R7847P6230n019l0458k2914O0845
$$ 1071498 1017345 1004497 967037 866259 934145 1031992 1108222 1103203 1072745 1049831 1110676
5617A110676P217m7035J0431j079O4890J1731j28222j5945J23749J2543J8736
$$ 1110676 1117893 1070858 1081289 1080210 1145100 1156831 1028609 1012664 1136413 1148956 1167692
5606A167692l875p729m9534q418K8674j1785M4146J07031l5686n0696J6875K9953
$$ 1167692 1163817 1156088 1106554 1098136 1126810 1115025 1159171 1266202 1230516 1179820 1196695 1226648
5594A226648K1678N0667N3135r661j6616N0751o7097M4288K6173m6581L3775K5766
$$ 1226648 1248326 1298993 1352128 1342467 1325851 1376602 1309505 1353793 1379966 1333385 1367160 1392926
5582A392926M2251k5818k4768J689p0509J06941M197L9208N4338J7179o9805K2822
$$ 1392926 1435177 1409359 1384591 1386280 1315771 1422712 1426909 1466117 1520455 1537634 1467829 1490651
5570A490651K2498k6990l4892K7556O442K4215L322n6825M064m838l0772k1652
$$ 1490651 1513149 1486159 1451267 1478823 1485265 1509480 1512802 1455977 1460041 1455203 1424431 1402779
5558A402779k044l0681N3878j169P430L7901M7891j8216k8088l8582L9533j04558
$$ 1402779 1400735 1370054 1423932 1422763 1430193 1468094 1515985 1497769 1469681 1431099 1470632 1366074
5546A366074k7381R1015k3996k4346n0472J2780K2785j5698m1802o46J3291L6532
$$ 1366074 1338693 1429708 1405712 1381366 1330894 1343674 1366459 1350761 1308959 1308313 1321604 1358136
5534A358136j7184p7058K2736l358M3569R3637k9240j8468j17690L8044N0605
$$ 1358136 1340952 1263894 1286630 1283272 1326841 1420478 1391238 1372770 1255080 1293124 1343729
5523A343729j00117P5645j4754J9303o8591l8663L8936J4242k0395j3370j5664
$$ 1343729 1243612 1319257 1304503 1323806 1255215 1216552 1255488 1269730 1249335 1235965 1220301
5512A220301m0659k064p8671n1111o1103n4871L0631M9677j5534O232K430O0756
$$ 1220301 1179642 1177578 1098907 1047796 986693 931822 962453 1012130 996596 1002828 1005258 1066014
5500A066014q7941l2287J7828M7523J5983l6797J4811m6738L1602J8335P1879
$$ 1066014 978073 945786 963614 1011137 1027120 990323 1005134 958396 989998 1008333 1080212
5489A080212O8159r4205j28588M9172J21011r183j09696r0892N893n0952L0714
$$ 1080212 1148371 1054166 925578 974750 1095761 1086578 976882 885990 891883 840931 871645
5478H71645J01804k5853r8606N5457k1781K3790J3237q6542N4573j17333M9022
$$ 871645 973449 947596 848990 904447 882666 906456 919693 833151 887724 770391 819413
5467H19413m2017L6042L1456k2891r584l515k9620j3162m3717K5479K853R9444
$$ 819413 777396 813438 844894 822003 812419 808904 779284 766122 722405 747884 750737 850181
5455H50181O1961j50746r821K0310P4367R943r873o2714K32N0831N119o2521m2697
$$ 850181 912142 761396 751575 771885 846252 856195 846322 783608 783840 834671 839790 777269 734572
5442G34572p668J17670J173j45231j43452L0715Q0412Q5135N5289q1133j6757
$$ 734572 726904 844574 845747 700516 557064 587779 668191 753326 808615 727482 710725
5431G10725K5844M7972q8227L6303o9451K2822K7987q1765M8053J14025J190L8376
$$ 710725 736569 784541 696314 732617 663166 685988 713975 632210 680263 794288 795478 833854
5419H33854j05626L453N5383j4523M8106r9291l3907J01601J09571l0088r7834
$$ 833854 728228 731681 787064 772541 820647 721356 687449 789050 898621 868533 770699
5408G70699M1515j3580J17665Q302p8677n7614N7586P2533k4694p1777J1115J26745
$$ 770699 812214 798634 916299 924601 845924 788310 845896 918429 893735 821958 833073 959818
5396I59818p1246k7408o3959J34248M9277j04481q5547n5500J32163R7663r1870
$$ 959818 888572 861164 797205 931453 980730 876249 790702 735202 867365 965028 873158
5385H73158j2155j5923Q6157J8635K5336L7838M959l27N6874j09780R932J13010
$$ 873158 861003 845080 931237 949872 975208 1013046 1018005 1017678 1074552 964772 974704 1087714
5373A087714K7420j10155m6777m7635J00516R2195k0779p1889L4613K3300N1502
$$ 1087714 1115134 1004979 958202 910567 1011083 1103278 1082499 1010610 1045223 1068523 1120025
5362A120025M1228l3287n1641L5018N4548m1950L8624O4995R40N7872J9576j29911
$$ 1120025 1161253 1127966 1076325 1111343 1165891 1123941 1162565 1227560 1228500 1286372 1305948 1176037
5350A176037N5232J6725K438l5527J9162Q7954l6539p1798l120O950M3220O0841
$$ 1176037 1231269 1247994 1250432 1214905 1234067 1322021 1285482 1213684 1210564 1217514 1260734 1321575
5338A321575N2935M736M4565k0688j8097J15202O4832m6029M0320L8276K0632
$$ 1321575 1374510 1379246 1423811 1403123 1385026 1500228 1565060 1519031 1559351 1597627 1618259
5327A618259r1260L6860J38807l0465m6480K6649J928N2928K4352M1134O9475
$$ 1618259 1526999 1563859 1702666 1672201 1625721 1652370 1654298 1707226 1731578 1772712 1842187
5316A842187R4039n0948N3752N8888R2772J14392m4755j0859J744Q7335R7775
$$ 1842187 1936226 1885278 1939030 1997918 2090690 2205082 2160327 2149468 2151212 2238547 2336322
5305B336322J8558j2716Q77Q3543O7338J6762J04040J23349K9353p186R2040J04581
$$ 2336322 2354880 2342164 2343041 2426584 2493922 2510684 2614724 2738073 2767426 2760240 2852280 2956861
5293B956861J32693J89104J17364Q3678J81506J38899J93985l1459j83776j48530
$$ 2956861 3089554 3278658 3396022 3479700 3661206 3800105 3994090 3962631 3778855 3630325
5283C630325q1183j76245L977P7228j3167Q7931K1303Q7282L182k8729O6973J19060
$$ 3630325 3549142 3372897 3376874 3454102 3440935 3528866 3550169 3637451 3640633 3611904 3678877 3797937
5271C797937J18088L5923Q8120J10051P807M131m8040J60433M7396P5073L3502
$$ 3797937 3916025 3951948 4040068 4150119 4157926 4162057 4114017 4274450 4321846 4396919 4430421
5260D430421l865P6171J23418N3823P1217P0868J38647K36358K86880K86448K06425
$$ 4430421 4426556 4502727 4626145 4679968 4751185 4822053 4960700 5197058 5483938 5770386 5976811
5249E976811L44904L91561M12760K36937j2359k30549j96917k42043j18893p4701
$$ 5976811 6321715 6713276 7126036 7362973 7350614 7120065 6923148 6681105 6562212 6487511
5239F487511j89250N2178n9263j23041r7730P3604M9646q8897N4870J0605J40086
$$ 6487511 6298261 6350439 6291176 6168135 6070405 6144009 6193655 6104758 6159628 6170233 6310319
5228F310319N0641l0956l7559Q6343K28444M2240j5514J95711J17586J76937J66141
$$ 6310319 6360960 6330004 6292445 6378788 6607232 6649472 6633958 6829669 6947255 7124192 7290333
5217G290333N9951J37636K16772K30836K12635J30151K06467K55608M10764K45616
$$ 7290333 7350284 7487920 7704692 7935528 8148163 8278314 8484781 8740389 9151153 9396769
5207I396769J93254L45108L54908K72675j01561r7402L7894j56454q3154l8094
$$ 9396769 9590023 9935131 10290039 10562714 10461153 10363751 10401645 10245191 10162037 10123943
5197A0123943R807Q4495p359O1636K6719M0423N631M1476P5459J0204p62p3566
$$ 10123943 10133750 10218245 10210886 10272522 10299241 10339664 10345295 10386771 10462230 10472434 10471672 10398106
5185A0398106O5982J61329r9288l4127k3044j7342o625q5366j19778O7269k2153
$$ 10398106 10464088 10625417 10526129 10492002 10468958 10451616 10444991 10359625 10239847 10307116 10284963
5174A0284963j63490o7394r9738j1277r5212k12322k47930j72077j25266n8684
$$ 10284963 10121473 10054079 9954341 9943064 9847852 9635530 9387600 9215523 9090257 9031573
5164I031573k62011j81243j18350j15802j65775k33944q7473j61573k53038j74521
$$ 9031573 8769562 8588319 8469969 8354167 8188392 7954448 7866975 7705402 7452364 7277843
5154G277843j05746o5081q4041j08685o2675k85135k41406Q644Q957r3233r7745
$$ 7277843 7172097 7107016 7022975 6914290 6851615 6566480 6325074 6333718 6342675 6249442 6151697
5143F151697j17422r0666j38568o6006j8091K2797j67000m3315j41820j16910
$$ 6151697 6034275 5943609 5805041 5739035 5720944 5743741 5576741 5533426 5391606 5274696
5133E274696j6994n4329k1808j35919j15248N6108L003k7715M8976L4594J15782
$$ 5274696 5257702 5203373 5181565 5045646 4930398 4986506 4989509 4961794 5010770 5045364 5161146
5122E161146Q7626K41989K41645R9645Q1368Q2309j61693l59430j70126j75010
$$ 5161146 5248772 5490761 5732406 5832051 5913419 5995728 5834035 5474605 5304479 5129469
5112E129469j52022j50004j18039l8568M1653m5938l9342m2646l051J38769R08
$$ 5129469 4977447 4827443 4709404 4670836 4712489 4666551 4627209 4584563 4581512 4720281 4721189
5101D721189O9225L1222k0120O6503K37533L17869J65042J35593R2797R3700J12987
$$ 4721189 4790414 4821636 4801516 4868019 5105552 5423421 5588463 5724056 5816853 5910553 6023540
5090F023540r0201j84979q2595j59507k25099r7489N9151n4941L797J60727j30667
$$ 6023540 5933339 5748360 5665765 5506258 5281159 5183670 5242821 5187880 5191677 5352404 5221737
5079E221737L8692k737q3508l9069o811k21826j23645j20993j97663k23880l761
$$ 5221737 5260429 5257692 5174184 5135115 5128304 4906478 4782833 4661840 4464177 4240297 4236536
5068D236536k6228K2481j31438j71549N7613K5693n1504m6703Q1808J17385L7311
$$ 4236536 4210308 4232789 4101351 3929802 3987415 4013108 3961604 3914901 3996709 4114094 4151405
5057D151405n6711Q2580K0095L5580J79179K73535Q3612K41394K63380J24659
$$ 4151405 4094694 4177274 4197369 4232949 4412128 4685663 4769275 5010669 5274049 5398708
5047E398708Q3039o9668J07212R0832J91191K48049P4066J6031j95464p1885j56646
$$ 5398708 5481747 5412079 5519291 5610123 5801314 6049363 6123429 6139460 5943996 5872111 5715465
5036E715465k06088l2357n606m0891P4816R2063J44991J13946J04030J57569p1898
$$ 5715465 5509377 5477020 5471414 5430523 5505339 5597402 5742393 5856339 5960369 6117938 6046040
5025F046040j72948r7734j83852k02104q9804k4541q8793n2366j09044m5823L4631
$$ 6046040 5873092 5775358 5591506 5389402 5299598 5275057 5186264 5133898 5024854 4979031 5013662
5014E013662O5518L5582N8754L5202P3772j6086j2599O5234m8780M2317P9686
$$ 5013662 5079180 5114762 5173516 5208718 5282490 5266404 5253805 5319039 5270259 5312576 5392262
5003E392262J3134J0194J22146k9367R2549j820N1618J39596L6018L3517M271
$$ 5392262 5405396 5415590 5537736 5508369 5600918 5599098 5650716 5790312 5826330 5859847 5864118
4992E864118J24201P0059R7996Q3528O4034R8985Q1788J87878J75032J95695J20753
$$ 5864118 5988319 6058378 6156374 6239902 6303936 6402921 6484709 6672587 6847619 7043314 7164067
4981G164067M341J28355J30748J90985J75241M0422J20973K17962K13326J23249
$$ 7164067 7168408 7296763 7427511 7618496 7793737 7834159 7955132 8173094 8386420 8509669
4971H509669Q7682J50059K33024L02117J43545J10182K34507M18804K49821J38271
$$ 8509669 8597351 8747410 8980434 9282551 9426096 9536278 9770785 10189589 10439410 10577681
4961A0577681K22041K78308K68179K89618K40207K94076K98345L19618M36238
$$ 10577681 10799722 11078030 11346209 11635827 11876034 12170110 12468455 12788073 13224311
4952A3224311M60558L30848L69986L93763L42877N14951N81938O67383P22325
$$ 13224311 13684869 14015717 14385703 14779466 15122343 15637294 16219232 16886615 17608940
4943A7608940P37198Q13070P65220R44343J015514R55747J196750J261407J457081
$$ 17608940 18346138 19159208 19924428 20868771 21884285 22840032 24036782 25298189 26755270
4934B6755270J538696J771792J941502K068808K281943K362784K606883K767932
$$ 26755270 28293966 30065758 32007260 34076068 36358011 38720795 41327678 44095610
4926D4095610K851940L078979L042745K918001K708160K591364K332582J939672
$$ 44095610 46947550 50026529 53069274 55987275 58695435 61286799 63619381 65559053
4918F5559053J159879L97058l67765o76704r22767r55444j014453j374556j862140
$$ 65559053 66718932 67115990 66748225 66071521 65148754 64193310 63178857 61804301 59942161
4909E9942161k305539k787419l244557l243910l094061k910677k674948k448221
$$ 59942161 57636622 54849203 51604646 48360736 45266675 42355998 39681050 37232829
4901C7232829k142256j936824j860068j795818j647906j585533j438395j416129
$$ 37232829 35090573 33153749 31293681 29497863 27849957 26264424 24826029 23409900
4893B3409900j229201j002286q79742p40837p55780n64526n65339n54909n03285
$$ 23409900 22180699 21178413 20298671 19557834 18802054 18237528 17672189 17117280 16613995
4884A6613995m66684l50099l83482l85056k66287l18207j98625l49455l48126
$$ 16613995 16147311 15797212 15413730 15028674 14762387 14444180 14245555 13896100 13547974
4875A3547974l89541m08423m16653k74995k08716l14871k51676j43024k48469
$$ 13547974 13158433 12750010 12333357 12058362 11849646 11534775 11283099 11140075 10891606
4866A0891606k13677k64777j55848R794q5465j54294m2027j14246k13691k94964
$$ 10891606 10677929 10413152 10257304 10267098 10181633 10027339 9985312 9871066 9657375 9362411
4856I362411k68406j87959j44479k50430j25246m5418n3767m9164j27139j95366
$$ 9362411 9094005 8906046 8761567 8511137 8385891 8340473 8286706 8237542 8110403 7915037
4846G915037j25586o3594M3716r5210j79065o0519p1921k0424n6547j12937K2168
$$ 7915037 7789451 7725857 7769573 7674363 7495298 7434779 7362858 7342434 7285887 7172950 7195118
4835G195118q5124j82920o6934l1653j8054j8843p6303o1184n9339p0678K6984
$$ 7195118 7109994 6927074 6860140 6828487 6810433 6791590 6715287 6654103 6594764 6524086 6551070
4824F551070j5819k0167n1429P3043R3961l5842r5502J2899K649n0576m5492j21245
$$ 6551070 6535251 6515084 6463655 6536698 6630659 6594817 6499315 6512214 6514863 6464287 6418795 6297550
4812F297550j0741R5852p2186j10936j38747q7605J06500N7104j47691k3869n2803
$$ 6297550 6286809 6382661 6310475 6199539 6060792 5973187 6079687 6136791 5989100 5965231 5912428
4801E912428j924j0856P001m2766m5796l1036l447O8896n2936j05497O8285P0283
$$ 5912428 5910504 5899648 5906649 5863883 5818087 5787051 5783604 5852500 5799564 5694067 5762352 5832635
4789E832635J3972j22075l9011R6246Q275l8919M3074P7891K2281j36118J8175
$$ 5832635 5846607 5724532 5685521 5781767 5790042 5751123 5794197 5872088 5894369 5758251 5776426
4778E776426l1902q746M0411q1519q0698p3962N4025J37520m3836k6544J00815
$$ 5776426 5744524 5735778 5776189 5694670 5613972 5540010 5594035 5731555 5687719 5661175 5761990
4767E761990Q7547o3301o1983l457J3036J06582l0721m9627O0956O2919J0248
$$ 5761990 5849537 5786236 5724253 5720796 5733832 5840414 5809693 5760066 5821022 5883941 5894189
4756E894189Q2868l4228K8994M7973M1404L7990k8073j48202J9451k8623m1057
$$ 5894189 5977057 5942829 5971823 6019796 6061200 6099190 6071117 5922915 5942366 5913743 5872686
4745E872686q8855k2543J02127J07128n8992O2902J34780K8223K988q2763N5443
$$ 5872686 5783831 5761288 5863415 5970543 5911551 5974453 6109233 6137456 6140444 6057681 6113124
4734F113124N8382J13183l1062o9624K4470K8604K6292J529L8275P4550O1571
$$ 6113124 6171506 6284689 6253627 6184003 6208473 6237077 6263369 6264898 6303173 6377723 6439294
4723F439294Q3293o831J8638M7001J65581J06542n745j9865p1568J25032J12547
$$ 6439294 6522587 6515756 6534394 6581395 6746976 6853518 6847773 6827908 6756340 6881372 6993919
4712F993919J7255O5436Q7035J1566L8159J11458J24889Q3514M4065M9124j593
$$ 6993919 7011174 7076610 7163645 7175211 7213370 7324828 7449717 7533231 7577296 7626420 7624827
4701G624827N2728N0501J24218R1959j0820R5741Q4162J6497O2214O239J65051
$$ 7624827 7677555 7728056 7852274 7944233 7933413 8029154 8113316 8129813 8192027 8198266 8363317
4690H363317R2080J03083j8696K697J90691M8709P6134L5082J68993N9727O5833
$$ 8363317 8455397 8558480 8539784 8542481 8733172 8781881 8858015 8893097 9062090 9121817 9187650
4679I187650J20873J43570O8040J40728J19141J27300L9513N1545R2006K27104
$$ 9187650 9308523 9452093 9520133 9660861 9780002 9907302 9946815 9998360 10090366 10317470
4669A0317470J04067J13583J53921N7114J94901K50052J76143K99402K13274K58775
$$ 10317470 10421537 10535120 10689041 10746155 10941056 11191108 11367251 11666653 11879927 12138702
4659A2138702L34748M17621M91483L46182N07512N74295O77511Q02984Q57333
$$ 12138702 12473450 12891071 13382554 13728736 14236248 14810543 15488054 16291038 17148371
4650A7148371J089715J271130J511909J894590K203653K630815K874779K725429
$$ 17148371 18238086 19509216 21021125 22915715 25119368 27750183 30624962 33350391
4642C3350391J956986N68680q91525j789286k144409j822838j396171q60851m12228
$$ 33350391 35307377 35876057 34984532 33195246 31050837 29227999 27831828 26970977 26558749
4633B6558749J04193N99645J235538J666931K130471K451638K253067J068672
$$ 26558749 26662942 27262587 28498125 30165056 32295527 34747165 37000232 38068904
4625C8068904l37352j667927k845921l123577k808798k318719j803362j457057
$$ 38068904 37731552 36063625 33217704 30094127 27285329 24966610 23163248 21706191
4617B1706191j339824j083666q99051n97855n59630n65686m59800k98829j77916
$$ 21706191 20366367 19282701 18383650 17785795 17226165 16660479 16200679 15901850 15723934
4608A5723934k03598j51113n6412J6084m832j1534l6185K2330J00484K47059L64640
$$ 15723934 15520336 15369223 15312811 15328895 15324063 15312529 15276344 15298674 15399158 15646217 16010857
4597A6010857K49333J74925K64287L81685L62444L94363M43521L43560M00707
$$ 16010857 16260190 16435115 16699402 17081087 17443531 17837894 18281415 18624975 19025682
4588A9025682M94633O12855O48038P13201Q63662R57034J003874J015232R15856
$$ 19025682 19520315 20133170 20781208 21494409 22358071 23315105 24318979 25334211 26250067
4579B6250067J007904J011278J000141J149248J203364J318332J708109K207344
$$ 26250067 27257971 28269249 29269390 30418638 31622002 32940334 34648443 36855787
4571C6855787K700276L519381M179089M770258M847827L780394J930352n03163
$$ 36855787 39556063 43075444 47254533 52024791 56872618 60653012 62583364 62080201
4563F2080201k405866l328901l458559k796441j945163j012507l38569L69072
$$ 62080201 59674335 56345434 52886875 50090434 48145271 47132764 46794195 47163267
4555D7163267J138955J970879K853116L540121L275960K313034K60048k299756
$$ 47163267 48302222 50273101 53126217 56666338 59942298 62255332 62515380 60215624
4547F0215624m283295n211406n093911m480962l704529l029101k668879k249725
$$ 60215624 55932329 50720923 45627012 41146050 37441521 34412420 31743541 29493816
4539B9493816j745380j462865j317837j132162q75594o96083n81641o35938m66610
$$ 29493816 27748436 26285571 24967734 23835572 22959978 22263895 21682254 21046316 20579706
4530B0579706k84359l22823l44952k56941k93630j47771r4636r1255q8547q7390
$$ 20579706 20295347 19972524 19627572 19370631 19077001 18929230 18834594 18743339 18654792 18567402
4520A8567402l04855k55693k14863l42418k86070l02145k92976j93180l19770
$$ 18567402 18262547 18006854 17791991 17449573 17163503 16861358 16568382 16375202 16055432
4511A6055432l00234j97568k22595k04512j82604k4809j27971k78446j32137L296
$$ 16055432 15755198 15557630 15335035 15130523 14947919 14923110 14795139 14516693 14384556 14387852
4501A4387852p6783K1039n2830j06837n9496k9722J57963P5397N1250k0967N899
$$ 14387852 14311069 14332108 14279278 14172441 14112945 14083223 14241186 14316583 14367833 14346866 14352765
4490A4352765J48046J14737J1443n7378J23113K76433J37485K22274J49130J49346
$$ 14352765 14500811 14615548 14626991 14569613 14692726 14969159 15106644 15328918 15478048 15627394
4480A5627394K3776j61440p4202n0467j96995k07009j66190j67158j81389k17838
$$ 15627394 15651170 15489730 15415528 15365061 15168066 14961057 14794867 14627709 14446320 14228482
4470A4228482j38168j51557k4426R4577J70979o58L4667Q7704K01903J44120k9632
$$ 14228482 14090314 13938757 13914331 14008908 14179887 14179229 14213896 14301600 14503503 14647623 14617991
4459A4617991j22825K6313r8041j05274j55122j99593j02750j95128k29066k44821
$$ 14617991 14495166 14521479 14423438 14318164 14163042 13963449 13860699 13665571 13436505 13191684
4449A3191684k64336k00223n3196r9030m3579q2575j71063o4515l4152l4622r9142
$$ 13191684 12927348 12727125 12673929 12574899 12531320 12448745 12277682 12213167 12179015 12144393 12045251
4438A2045251j39416r0800j11351k16497k28355q6699j20959k31866p7569q238
$$ 12045251 11905835 11815035 11703684 11487187 11258832 11172133 11051174 10819308 10741739 10733501
4428A0733501l2360n7567m2947J6599p6001j13314j80706j32450j08578p6888
$$ 10733501 10701141 10643574 10600627 10617226 10541225 10427911 10247205 10114755 10006177 9929289
4418I929289N3332J04299j10979j30968N3452J53386R0175m4173M1944J98794
$$ 9929289 9982621 10086920 9975941 9844973 9898425 10051811 10141986 10097813 10139757 10338551
4408A0338551L08352J0003J34392J87779J53315K95792J38186J43385J93240J36546
$$ 10338551 10646903 10656906 10791298 10979077 11132392 11428184 11566370 11709755 11902995 12039541
4398A2039541J48016J42129K30675J86240K14484K64157K20016K48148K95635
$$ 12039541 12187557 12329686 12560361 12746601 12961085 13225242 13445258 13693406 13989041
4389A3989041L46542L52631M24921N13318O36363O96284O87671O17800J014259
$$ 13989041 14335583 14688214 15113135 15626453 16262816 16959100 17646771 18264571 19278830
4380A9278830J106919J173657J355923J663210K035990K528615K883248L510023
$$ 19278830 20385749 21559406 22915329 24578539 26614529 29143144 32026392 35536415
4372C5536415M251251M801531M428782K550910k83799l003362m433203m560627
$$ 35536415 39787666 44589197 49017979 51568889 51285090 48281728 43848525 39287898
4364C9287898l876637l161149k551755k064187j656492j357009j054008p52799
$$ 39287898 35411261 32250112 29698357 27634170 25977678 24620669 23566661 22813862
4356B2813862n25292m61565k35167P1277K88724M84306N56709R24986J146247
$$ 22813862 22288570 21827005 21591838 21663115 21951839 22436145 22992854 23917840 25064087
4347B5064087J159718J567525K039713K604440L350810M075916M665980M652040
$$ 25064087 26223805 27791330 29831043 32435483 35786293 39862209 44528189 49180229
4339D9180229L504986Q16206k378852m599393n324773m823063l822578l061499
$$ 49180229 52685215 53501421 51122569 46523176 41198403 36375340 32552762 29491263
4331B9491263k508852k284409j902676j527511j301728r87458q57878p81299o02536
$$ 29491263 26982411 24698002 22795326 21267815 19966087 18978629 18120751 17339452 16736916
4322A6736916n38648n03178l41130l52971m03801l16672k23889k35447r8332j67505
$$ 16736916 16198268 15695090 15353960 15000989 14597188 14280516 14056627 13821180 13722848 13555343
4312A3555343j97635j50213o184J54479J93920J17046K03945L31353N28241N55261
$$ 13555343 13357708 13207495 13201311 13355790 13549710 13666756 13870701 14202054 14730295 15285556
4302A5285556N33909Q12597J017409J158073J419393J749907K331715K656936
$$ 15285556 15819465 16632062 17649471 18807544 20226937 21976844 24308559 26965495
4294B6965495K756679K072411N58511j146010k462160k781204k430834k019794
$$ 26965495 29722174 31794585 32353096 31207086 28744926 25963722 23532888 21513094
4286B1513094j712472j352116r83328r20392p52862m52597m04697m00093k07563
$$ 21513094 19800622 18448506 17465178 16544786 15791924 15339327 14934630 14534537 14326974
4277A4326974p4437N3115J79158K34867M67342M84672O47951P62162J066971J446331
$$ 14326974 14252537 14305652 14484810 14719677 15187019 15671691 16319642 17081804 18148775 19595106
4267A9595106J891552K318382K670439L044543K735586J467108o33637k480913
$$ 19595106 21486658 23805040 26475479 29520022 32255608 33722716 33089079 30608166
4259C0608166l464493l215854k788697k038466j665307j593760j235173j043723
$$ 30608166 27143673 23927819 21139122 19100656 17435349 15841589 14606416 13562693
4251A3562693p68941q77656o62219n88836n03621m13459m17529m61386l60568
$$ 13562693 12793752 11916096 11253877 10665041 10161420 9747961 9330432 8869046 8508478
4242H508478l03183j40357k47293k81101p6022q0790q3245j13636j25171j49716
$$ 8508478 8205295 8064938 7817645 7536544 7460522 7379732 7296487 7182851 7057680 6907964
4232F907964p5404M657j52311j30863n9708k1354k9754p4936j36238j05720j60670
$$ 6907964 6832560 6837217 6684906 6554043 6494335 6472981 6443227 6368291 6232053 6126333 5965663
4221E965663r5832j06186k16015j11663k0222P248q2775j19269j12805Q9748O6755
$$ 5965663 5869831 5763645 5547630 5435967 5415745 5422993 5340218 5220949 5108144 5197892 5264647
4210E264647l6701j76897o7041j02346k03188j92862j35j07113j4003l3433j02019
$$ 5264647 5227946 5051049 4984008 4881662 4678474 4485612 4485477 4378364 4364361 4330928 4228909
4199D228909j994o980p7197L5976k9506n9429K3274J73476M7646j15875K7748
$$ 4228909 4226915 4219935 4142738 4178714 4149208 4089779 4113053 4286529 4334175 4218300 4246048
4188D246048O455j2286l2859n6675n511k7816j56714n7225j17259K2218q7128
$$ 4246048 4252503 4240217 4207358 4150683 4145172 4117356 3960642 3903417 3786158 3808376 3721248
4177C721248q4416K0118J2432J05856n0572l0794N0216j24047j07802j82676q4697
$$ 3721248 3636832 3656950 3669382 3775238 3724666 3693872 3744088 3620041 3512239 3329563 3244866
4166C244866p1384o8638J01111m2386m9510k4127k8800J35077o3859n6401j2107
$$ 3244866 3173482 3104844 3205955 3163569 3114059 3089932 3061132 3196209 3132350 3075949 3063842
4155C063842J01836L1834n5231J4984n2491k9106r387j0588l1515j27964o0082
$$ 3063842 3165678 3197512 3142281 3157265 3104774 3075668 3066281 3055693 3024178 2896214 2836132
4144B836132M0000j10875k7190n9983K0158N6094l9327n9220N9731P6529j06661
$$ 2836132 2876132 2765257 2738067 2678084 2698242 2754336 2715009 2655789 2715520 2792049 2685388
4133B685388j3262m6843p8209M4901k3279p7454J48706N8106j23937K3196O0491
$$ 2685388 2672126 2625283 2547074 2591975 2568696 2491242 2639948 2698054 2574117 2597313 2657804
4122B657804m3349k1868m9316J20088N6623j69793j70894l4517L38m3766L3117
$$ 2657804 2614455 2592587 2543271 2663359 2719982 2550189 2379295 2344778 2345116 2301350 2334467
4111B334467j6523m0489m3658N2524J09069j20614j92834L7540P6093N6571q5854
$$ 2334467 2317944 2277455 2233797 2286321 2395390 2274776 2081942 2119482 2195575 2252146 2166292
4100B166292r0030P5978k1713Q712j3241J4448q2187p7641M1388j3474p8623k7270
$$ 2166292 2076262 2152240 2130527 2139239 2125998 2140446 2058259 1980618 2022006 2008532 1929909 1902639
4088A902639r221p8956M7572L3026K6489o5798M2134L6964l2557P0510K8521j00419
$$ 1902639 1893418 1814462 1862034 1895060 1921549 1855751 1897885 1934849 1902292 1972802 2001323 1900904
4076A900904r2230j7427Q1414j4529n6799J1141J23270o6319K2354L8647m7028
$$ 1900904 1808674 1791247 1872661 1858132 1801333 1812474 1935744 1869425 1891779 1930426 1883398
4065A883398o7571N1647J08616l5397L9291K2990J08165J26676j05709k3022J68412
$$ 1883398 1815827 1867474 1976090 1940693 1979984 2002974 2111139 2237815 2132106 2109084 2277496
4054B277496J41191P3376M4973J27872J43205J16808O8275J38047k6730R1788
$$ 2277496 2418687 2492063 2537036 2664908 2808113 2924921 2993196 3131243 3104513 3196301
4044C196301N5234M3439M7287j17901K1784O6426m9749n2053q9049K8800L2397
$$ 3196301 3251535 3294974 3342261 3224360 3246144 3312570 3262821 3210768 3121719 3150519 3182916
4033C182916J4764J09182J16741k720q6313N5880J54036J6460P412J44958J4852
$$ 3182916 3197680 3306862 3423603 3420883 3334570 3390450 3544486 3560946 3568358 3713316 3728168
4022C728168l2832J361n9555j01209o1381o2403q418p5865j03422j28489J1585
$$ 3728168 3695336 3696697 3637142 3535933 3474552 3412149 3403731 3327866 3224444 3095955 3107540
4011C107540p107n0548q4444j24358J28211l6355k5976m803J9717J29140n8217
$$ 3107540 3100433 3049885 2965441 2841083 2969294 2932939 2906963 2902160 2921877 3051017 2992800
4000B992800M5566O2m3572q432p229L4901J9608j16829o2907M1351J6252R3169
$$ 2992800 3038366 3038428 2994856 2986424 2979195 3014096 3033704 2916875 2853968 2895319 2911571 3004740
3988C004740P2R6j30095j00503p03N6337J43028l8989o350m6163J06190N8529
$$ 3004740 3004812 3004908 2874813 2774310 2773607 2829944 2972972 2933983 2927633 2881470 2987660 3046189
3976C046189k3416r3691M484J39740l0295k8978j29394n3592J08237O7906N0958
$$ 3046189 3022773 2929082 2933566 3073306 3043011 3014033 2884639 2831047 2939284 3007190 3058148
3965C058148m6077j22329L0496K1802j6628q9510P1004Q9057N5846p7023k0645
$$ 3058148 3012071 2889742 2920238 2942040 2925412 2835902 2906906 2995963 3051809 2974786 2954141
3954B954141M6470K1494P194m805n0900m9229m4632p6084m0403l7242p3504l628
$$ 2954141 3000611 3022105 3029299 3024494 2973594 2924365 2879733 2803649 2763246 2726004 2652500 2648872
3942B648872L4843n9897L2995O3409J12693p2135r9810r3997J33962j810j17136
$$ 2648872 2683715 2623818 2656813 2720222 2832915 2760780 2660970 2566973 2700935 2699125 2581989
3931B581989L2879k0114O6292K6306m9018J2710k92l1910J05791N5860o493n8705
$$ 2581989 2614868 2594754 2661046 2687352 2638334 2651044 2650752 2618842 2724633 2780493 2774000 2715295
3919B715295j43699J04086J60016K6516j957P0229q5351n7493j21528j27763p182
$$ 2715295 2571596 2675682 2835698 2862214 2860257 2930486 2845135 2787642 2666114 2538351 2531169
3908B531169j11314k5279k4902O8888P3730L0401l0364m0280j32864N2744N2828
$$ 2531169 2419855 2394576 2369674 2438562 2512292 2542693 2512329 2472049 2339185 2391929 2444757
3897B444757o3842n1712J19508P0130l8400l2652k865J6188J7206J2504j32856
$$ 2444757 2380915 2329203 2448711 2518841 2480441 2447789 2444924 2461112 2478318 2490822 2357966
3886B357966j16434J38827j7166l6749J0798l7714J2288j4205O3030l6218j13339
$$ 2357966 2241532 2380359 2363193 2326444 2337242 2299528 2311816 2297611 2360641 2324423 2211084
3875B211084P1233O7217o9331n1464j8517O83O4614p3647J879P1413j8865o3268
$$ 2211084 2282317 2349534 2280203 2228739 2210222 2210905 2275519 2201872 2203751 2275164 2256299 2193031
3863B193031k3944J4769J1574j0923m2322J3016k5018J04997O9994M4162J959
$$ 2193031 2169087 2183856 2195430 2184507 2142185 2155201 2130183 2235180 2305174 2349336 2351295
3852B351295p0747N356o122k0329K1526q403R4284l3649j0470p6812K8211K3285
$$ 2351295 2280548 2285904 2279782 2259453 2280979 2272576 2366860 2333211 2322741 2245929 2274140 2297425
3840B297425M1987L3455m4822m9213K418L3398N173J1326R856O652J38273l4002
$$ 2297425 2339412 2372867 2328045 2278832 2281250 2314648 2319821 2331147 2341003 2347655 2485928 2451926
3828B451926M8341K4901p5938n1811J28275L3185k7893M8378O0083P3175r921
$$ 2451926 2500267 2525168 2449230 2397419 2525694 2558879 2530986 2579364 2639447 2712622 2702701
3817B702701k5217j6771Q8817N9869J7412j966L3888M9876K851r5461K1259N1822
$$ 2702701 2677484 2660713 2749530 2809399 2826811 2824845 2858733 2908609 2911460 2815999 2837258 2889080
3805B889080l8942m821Q9068Q0871L2978O559J52529J35520j12120j84070J2394
$$ 2889080 2850138 2845317 2934385 3015256 3048234 3054793 3207322 3342842 3230722 3046652 3059046
3794C059046J10763J56722o8071K5774M6692O0120O4039Q887R3847J09067Q3435
$$ 3059046 3169809 3326531 3258460 3284234 3330926 3391046 3455085 3463972 3557819 3666886 3750321
3783C750321Q2222l7816K361r178J70426P3474l3042k9734J4600N4877J21381
$$ 3750321 3832543 3794727 3797088 3787910 3958336 4031810 3998768 3969034 3983634 4038511 4159892
3772D159892k3942N1680J69606J97552L3447p6680R8367J49137J3438j3251Q2598
$$ 4159892 4135950 4187630 4357236 4554788 4588235 4511555 4609922 4759059 4772497 4759246 4841844
3761D841844J69839J97319j2789K5851j1987J22887J73302K21202J17288R9925
$$ 4841844 5011683 5209002 5196213 5222064 5210077 5332964 5506266 5727468 5844756 5944681
3751E944681K33916K34020K00791J05944J20877K88925L07653J78681K94754L02391
$$ 5944681 6178597 6412617 6613408 6719352 6840229 7129154 7436807 7615488 7910242 8212633
3741H212633L40303M40367M21866M98897N81627N86538P36209R38926R33549J020094
$$ 8212633 8552936 8993303 9415169 9914066 10495693 11082231 11818440 12757366 13690915 14711009
3731A4711009J114339J336634J343806J078267M44796l9784k41414k42936j58710
$$ 14711009 15825348 17161982 18505788 19584055 20028851 19989067 19747653 19504717 19346007
3722A9346007K42137O17187Q67447J226562J565110J935355K207160K076644J556515
$$ 19346007 19588144 20205331 21072778 22299340 23864450 25799805 28006965 30083609 31640124
3713C1640124J173542J073916Q27263O26217M38146K18759k39925o51290n65234
$$ 31640124 32813666 33887582 34714845 35341062 35779208 35997967 35758042 35106752 34541518
3704C4541518j84320L75034J120801J720523K227029K185388J831807J125013
$$ 34541518 34357198 34732232 35853033 37573556 39800585 41985973 43817780 44942793
3696D4942793L15908l91979p80087q18634r39229j331578j452116j113659l70103
$$ 44942793 45258701 44866722 44086635 43268001 42328772 40997194 39545078 38431419 38061316
3687C8061316M92761J102000J255969J008394Q40488Q57532R98532O24905m2811
$$ 38061316 38554077 39656077 40912046 41920440 42760928 43618460 44616992 45241897 45199086
3678D5199086p97984j952698k837717k584162j868085j137817n87174J55421M78777
$$ 45199086 44401102 42448404 39610687 37026525 35158440 34020623 33433449 33588870 34067647
3669C4067647O62783L99692L35128M99832Q3379n01301r89100j228445j621513
$$ 34067647 34730430 35130122 35465250 35965082 36048461 35547160 34558060 33329615 31708102
3660C1708102k156195k097254j807154j385348j027721o34886l37201n8014K50007
$$ 31708102 29551907 27454653 25647499 24262151 23234430 22599544 22262343 22204329 22454336
3651B2454336K81864K67107n7439q46345j385183j486903j269732r48134q85382
$$ 22454336 22736200 23003307 22945868 22099523 20714340 19227437 17957705 17009571 16124189
3642A6124189p16409n45334m42718m32177m23126l43086k74735k57766k03965
$$ 16124189 15407780 14862446 14419728 13987551 13564425 13221339 12946604 12688838 12484873
3633A2484873k01819k23843j10129o6132j13663j15988j57261m8320o801r1653
$$ 12484873 12283054 12059211 11949082 11882950 11769287 11653299 11496038 11447718 11440917 11349264
3623A1349264j42256j26942J38439J22785j07557q5938J51199K40934J97557Q8416
$$ 11349264 11207008 11080066 11218505 11341290 11233733 11147795 11298994 11539928 11737485 11825901
3613A1825901K8666J63838K26949K50417J58698K30753L45578L51085K94060L52915
$$ 11825901 11854567 12018405 12245354 12495771 12654469 12885222 13230800 13581885 13875945 14228860
3603A4228860K86465K07107J39698n1803l1025j00577J14943K94340J68089J74593
$$ 14228860 14515325 14722432 14862130 14810327 14779302 14678725 14793668 15088008 15256097 15430690
3593A5430690K78418L24413J68361K3967L0172j5125k28322k85341k49253k28661
$$ 15430690 15709108 16033521 16201882 16225849 16256021 16240896 16012574 15727233 15477980 15249319
3583A5249319k81125j88304k323m1179q4907q7561n2011j82231k63732l46666
$$ 15249319 14968194 14779890 14777567 14736388 14651481 14563920 14511909 14329678 14065946 13719280
3573A3719280k25823k69592k98703k80148k15775o8796r8985j37774o8460r4627
$$ 13719280 13493457 13223865 12925162 12645014 12429239 12360443 12261458 12123684 12055224 11960597
3563A1960597k6778n7147J8650l8222j38637n4854j3010O5435j02177o2505L1983
$$ 11960597 11933819 11876672 11895322 11857100 11718463 11663609 11650599 11716034 11613857 11551352 11583335
3552A1583335J61516N2393Q7894J09351K03280Q0139N9556K49314L18265K25234
$$ 11583335 11744851 11797244 11885138 11994489 12197769 12277908 12337464 12586778 12905043 13130277
3542A3130277L37749L79874M17804M65565N62230P31857O21339P02925R04368
$$ 13130277 13468026 13847900 14265704 14731269 15293499 16025356 16646695 17349620 18253988
3533A8253988Q34904R98070J004573Q51944Q86764O73983M68088K39617K26583
$$ 18253988 19088892 20086962 21091535 21943479 22830243 23504226 23972314 24211931 24438514
3524B4438514K87059K32413M35689O63699P72063R36764J064509J396331J566515
$$ 24438514 24725573 24957986 25393675 26057374 26829437 27766201 28830710 30227041 31793556
3515C1793556J911273K395206K917410L781573M402850N236208O009565N311407
$$ 31793556 33704829 36100035 39017445 42799018 47201868 52438076 58447641 63759048
3507F3759048J714066k866653n281165m918073l746850k808980j922683j570614
$$ 63759048 65473114 62606461 57325296 52407223 48660373 45851393 43928710 42358096
3499D2358096j017711l53295J84980Q94533J418044K010703K867227L928353N087242
$$ 42358096 41340385 40987090 41172070 42066603 43484647 45495350 48362577 52290930 57378172
3490E7378172O427412P684239P319731M955095K327937n33258m514807p998260
$$ 57378172 63805584 71489823 78809554 83764649 86092586 85559328 81044521 73046261
3482G3046261q656909p199422n613834m336854l330560k473043j854468j280838
$$ 73046261 64389352 57189930 51576096 47239242 43908682 41435639 39581171 38300333
3474C8300333p72695j99953L46093R17487J451132K282757L254869M301158M228814
$$ 38300333 37527638 37327685 37673778 38591265 40042397 42325154 45580023 49881181 54109995
3465E4109995J619625k589717n595052n720803m423969l437849k735400k213602
$$ 54109995 55729620 53139903 47544851 41824048 37400079 33962230 31226830 29013228
3457B9013228j941266j662809j423454j170329j069295j006641r39388r01571
$$ 29013228 27071962 25409153 23985699 22815370 21746075 20739434 19800046 18898475
3449A8898475p10190o41029n52619m58032m11690m67978m07371k09109k06840
$$ 18898475 18188285 17547256 16994637 16536605 16124915 15656937 15249566 15040457 14833617
3440A4833617k71183k95900j74144j21802l53149k53430j91890j95326j48337
$$ 14833617 14562434 14266534 14092390 13970588 13617439 13364009 13172119 12976793 12828456
3431A2828456j91216j10404j48717j18678j49744j42678k6884p9881o9859n0395
$$ 12828456 12637240 12526836 12378119 12259441 12109697 11967019 11940135 11860254 11790395 11740000
3421A1740000j5229N6025j10782q7835q9043o4284q6372k64688p7095m4325l26428
$$ 11740000 11724771 11780796 11670014 11582179 11493136 11428852 11342480 11077792 11000697 10956372 10629944
3410A0629944k52419o9178p4413m6846M2666L0546p0196l4077l621n3843L5418
$$ 10629944 10377525 10308347 10233934 10187088 10229754 10260300 10190104 10156027 10152406 10098563 10133981
3399A0133981K7241m1152J52010J5724O4266j1749o7613Q3796L3068n1174k4703
$$ 10133981 10161222 10120070 10272080 10287804 10352070 10340321 10272708 10356504 10389572 10338398 10313695
3388A0313695q072j2129r87j65351j6719l0400p8022k3624j05328K1807J12895
$$ 10313695 10305623 10293494 10292507 10127156 10110437 10080037 10002015 9978391 9873063 9894870 10007765
3377A0007765K0475M1726K5959O4140J14477J15279O3105J54410J19765J26576
$$ 10007765 10028240 10069966 10095925 10160065 10274542 10389821 10452926 10607336 10727101 10853677
3367A0853677J08078J18866J89579K53959L17874K91460L53718N15286M80743
$$ 10853677 10961755 11080621 11270200 11524159 11842033 12133493 12487211 13002497 13483240
3358A3483240M49045N72805N86424N31879L35140L19908J65696j08782o3321j5089
$$ 13483240 13932285 14505090 15091514 15623393 15958533 16278441 16444137 16335355 16272034 16256945
3348A6256945L9214J57744J43661K08029J54808K02238K56355K59126J72578J57111
$$ 16256945 16296159 16453903 16597564 16805593 16960401 17162639 17418994 17678120 17850698 18007809
3338A8007809P7444j21198k40296j42932k03692l28564j85012j31778J3805K3384
$$ 18007809 18085253 17964055 17723759 17580827 17377135 17048571 16863559 16731781 16745586 16768970
3328A6768970J24326J89444J02751o4882j71108k56053m01507m67833n65884o24873
$$ 16768970 16893296 17082740 17185491 17120609 16949501 16693448 16291941 15824108 15258224 14633351
3318A4633351o00472l96153l00716k91039l02049j67112K7455j60584j36139j46706
$$ 14633351 14032879 13636726 13336010 13044971 12742922 12575810 12603265 12442681 12306542 12159836
3308A2159836o3717L1945J1724l9329j08762K3013K2473L0988R6388O3468J6025
$$ 12159836 12096119 12128064 12139788 12100459 11991697 12014710 12037183 12068171 12164559 12228027 12244052
3297A2244052J57515J4031p8260P7436J02180J10941J74707K40712P0018L02329
$$ 12244052 12401567 12415598 12337338 12414774 12516954 12627895 12802602 13043314 13113332 13415661
3287A3415661M08473K76682L76622L82443M99423N33811L18077L78975K93573
$$ 13415661 13824134 14100816 14477438 14859881 15359304 15893115 16211192 16590167 16883740
3278A6883740J49383m471j27562K0705Q0750L0744M8852N7671J119J41393J98330
$$ 16883740 17033123 17028652 16901090 16921795 17002545 17033289 17082141 17139812 17140931 17282324 17480654
3267A7480654K22982R0306J44369L04185K06137Q7329O8242J74068R8211K7504
$$ 17480654 17703636 17793942 17938311 18242496 18448633 18535962 18604204 18778272 18876483 18903987
3257A8903987l475Q6273Q9450M7469L1286j23831j45199j43464k34716j03261
$$ 18903987 18900512 18986785 19076235 19123704 19154990 19031159 18885960 18742496 18507780 18404519
3247A8404519k19376j29032q4395m3046r3166p8926N1507M4117K8896K407Q9506
$$ 18404519 18185143 18056111 17971716 17928670 17835504 17756578 17808085 17852202 17881098 17883505 17973011
3236A7973011J36550M9938P5024K63274K08719J42694J49374J68296K66609J80440
$$ 17973011 18109561 18159499 18234523 18497797 18706516 18849210 18998584 19166880 19433489 19613929
3226A9613929J93879K83142L76036L42468K81323L33899L78161L35765L96537
$$ 19613929 19807808 20090950 20466986 20809454 21090777 21424676 21802837 22138602 22535139
3217B2535139N34495O10896O58399M69669N76449O10033Q00687Q41086P69836
$$ 22535139 23069634 23680530 24338929 24808598 25385047 25995080 26795767 27636853 28406689
3208B8406689Q20475J159992J286983J314371J596477J941708K066710K460092
$$ 28406689 29227164 30387156 31674139 32988510 34584987 36526695 38593405 41053497
3200D1053497K982627L458764M143079M952760O145154O684863N173442J648150
$$ 41053497 44036124 47494888 51637967 56590727 62735881 69420744 74594186 76242336
3192G6242336k182611l692761l241247j775326j78417R40418J944757L140587
$$ 76242336 74059725 70366964 67125717 65350391 65171974 66112392 68057149 71197736
3184G1197736M228772N475600N469199L347028m47083l093689k975352j356935
$$ 71197736 75426508 80902108 86371307 89718335 89271252 86177563 83202211 81845276
3176H1845276L32195J975362L437970M842690N427407L979991O94298j597149
$$ 81845276 82177471 84152833 87590803 92433493 97860900 101840891 102535189 100938040
3168A00938040j688493l00191J158660K512966L788587N100447O327643P585360
$$ 100938040 99249547 98949356 100108016 102620982 106409569 111510016 117837659 125423019
3160A25423019Q919941R356658P698275N672289N619402Q240564J2556453J7478700
$$ 125423019 134342960 143699618 151397893 157070182 162689584 170930148 183486601 200965301
3152B00965301K2731702K9299467L7104122M3306817L7351426J5742204o48042
$$ 200965301 223697003 252996470 290100592 333407409 370758835 386501039 385852997
3145C85852997j831318k97447j5808572l6932121m5269798m0113988l1061429
$$ 385852997 384021679 383724232 367915660 330983539 285713741 245599753 214538324
3138B14538324k4135008j9255021j5745439j2821140j0579259r109601p919378
$$ 214538324 190403316 171148295 155402856 142581716 132002457 122892856 114973478
3131A14973478o816151n989328n393271m876531m342513l880821l106869k281762
$$ 114973478 108157327 102167999 96774728 91898197 87555684 83674863 80567994 78286232
3123G8286232j587650j097363n58288j56837L78976Q12641J252800J139561K80089
$$ 78286232 76698582 75601219 75042931 74886094 75265070 76077711 77330511 78470072 78750161
3114G8750161j210585k077179k199819j433182o10390k43194n16858r89932j302501
$$ 78750161 77539576 75462397 73262578 71829396 71219006 70975812 70458954 69469022 68166521
3105F8166521j313984j104366r52176p37058n11566m96362j36101J39934M02534
$$ 68166521 66852537 65748171 64795995 64058937 63547371 63051009 62914908 63054842 63457376
3096F3457376N86070J89289k86579m29655m83990q0311L47887N83856N94291K21313
$$ 63457376 64043446 64232735 63946156 63516501 63032511 62952200 63300087 63883943 64478234 64699547
3086F4699547l12309o11781q53967j339308j563013j416104j070125o08794p974
$$ 64699547 64387238 63775457 62921490 61582182 60019169 58603065 57532940 56924146 56916172
3077E6916172N26550J145186J653203K027203J873075Q37503p01583k524363l473966
$$ 56916172 57442722 58587908 60241111 62268314 64141389 64978892 64277309 61752946 58278980
3068E8278980l563480l311418k731724k434008k188649j730379j580908j283091
$$ 58278980 54715500 51404082 48672358 46238350 44049701 42319322 40738414 39455323
3060C9455323j033575p60392n60206m85780j34260J07103J05538m88197j290614
$$ 39455323 38421748 37661356 37101150 36615370 36481110 36588213 36693751 36205554 34914940
3051C4914940j400231j419265j064363q01821m80574l40984l61585j81142J18426
$$ 34914940 33514709 32095444 31031081 30229260 29748686 29407702 29046117 28864975 28983401
3042B8983401K33485J90000L73984K60627L75860N27691O80875P68238R02975
$$ 28983401 29216886 29406886 29780870 30041497 30417357 30945048 31625923 32394161 33297136
3033C3297136J102669J323257J582863J910069K277458K907614L519624M024155
$$ 33297136 34399805 35723062 37305925 39215994 41493452 44401066 47920690 51944845
3025E1944845M926462O202309P662427R629625J2016090J4621140J5930224J2112125
$$ 51944845 56871307 63073616 70736043 80365668 92381758 107002898 122933122 135045247
3017A35045247J138774j0755016j6599434j5851718j2671195r757916p687960
$$ 135045247 136184021 125429005 108829571 92977853 80306658 70548742 62860782
3010F2860782o430512n283229m409045l414008k570766k073552j816050k025546
$$ 62860782 56430270 51147041 46737996 43323988 40753222 38679670 36863620 34838074
3002C4838074k284323k184743j877394j613945j500355j361140j196723j049004
$$ 34838074 32553751 30369008 28491614 26877669 25377314 24016174 22819451 21770447
2994B1770447q95425q04665p28264n77859n32422n19531m99071l97610l67678
$$ 21770447 20875022 20070357 19342093 18764234 18231812 17712281 17213210 16815600 16447922
2985A6447922l46525k98342l08631k72807k38219k06362k67977r9490k37821l00100
$$ 16447922 16101397 15803055 15494424 15221617 14983398 14777036 14509059 14409569 14171748 13871648
2975A3871648k84348l39161k04970k40078k77272j77933j14659j45057j01993
$$ 13871648 13587300 13248139 13043169 12803091 12525819 12347886 12233227 12088170 11986177
2966A1986177j48736n1782j17806j56317j01814n1790m649n3115n6895j54223
$$ 11986177 11837441 11785659 11667853 11511536 11409722 11357932 11353283 11300168 11243273 11089050
2956A1089050j81731j57611j11721j43612j48811q7178k31648q9574r5898n6443
$$ 11089050 10907319 10749708 10637987 10494375 10345564 10258386 10026738 9937164 9841266 9784823
2946I784823o8915J8340n8555J0144R4445K3063K56461J86327K00437L06913L32834
$$ 9784823 9715908 9734248 9675693 9685837 9780282 9803345 10059806 10246133 10446570 10753483 11086317
2935A1086317L92352N36625O21693O62056M30034k48402n95014o23982o07697
$$ 11086317 11478669 12015294 12636987 13299043 13729077 13480675 12885661 12261679 11653982
2926A1653982n11547l57266k69924k65209k90451k47904j73335k65305k02491
$$ 11653982 11142435 10785169 10515245 10250036 9959585 9711681 9538346 9273041 9070550
2917I070550j41444l14226k83924k17095k90674k35743k04048k05602k15215k4353
$$ 9070550 8929106 8614880 8330956 8113861 7823187 7587444 7383396 7177794 6962579 6938226
2907F938226j05561p5038p0856q5778J09376N9249j4227q935P985j772l2661q1376
$$ 6938226 6832665 6757627 6686771 6600993 6710369 6769618 6755391 6746456 6754441 6752669 6720008 6638632
2895F638632J9063J27849Q7240O784L6762O6063j5038J1994N1171L9153J30371
$$ 6638632 6657695 6785544 6872784 6879568 6916330 6982393 6967355 6979349 7030520 7069673 7200044
2884G200044J46260j0622L4563p4071k71357p9475o6526k37392l39270j83764
$$ 7200044 7346304 7335682 7370245 7296174 7024817 6945342 6878816 6641424 6302154 6118390
2874F118390j46808j09626n7097j67689p0402k4460m9489j2735n361n0082J07472
$$ 6118390 5971582 5861956 5804859 5637170 5566768 5542308 5492819 5480084 5474723 5424641 5532113
2863E532113J28611J78517K45220K72959K59426K71858K90699J90903P4277p3059
$$ 5532113 5660724 5839241 6084461 6357420 6616846 6888704 7179403 7370306 7444583 7371524
2853G371524k66193k85910k63614j67544j31828p6386j36154l8956o7389m1799
$$ 7371524 7105331 6819421 6555807 6388263 6256435 6180049 6043895 6004939 5937550 5895751
2843E895751R7343J2890K8109k5731Q1108J11172J33947K32299K74558J98744
$$ 5895751 5993094 6005984 6034093 6008362 6089470 6200642 6334589 6566888 6841446 7040190
2833G040190J84777L5276J00829J67625P1418L7087j06732k33234l30633l04974
$$ 7040190 7224967 7260243 7361072 7528697 7600115 7637202 7530470 7297236 6966603 6661629
2823F661629m44369m54654k35390k88331j35584k59084k61627q8245k26754j16049
$$ 6661629 6217260 5762606 5527216 5238885 5103301 4844217 4582590 4494345 4267591 4151542
2813D151542n7662k0190O2224j9420j00113O1182N4571j2398L8242p054j03816
$$ 4151542 4093880 4073690 4135914 4116494 4016381 4077563 4132134 4119736 4157978 4150924 4047108
2802D047108n4170k530k1351j62349m8874J02185M7676J41829J10024J30443J39520
$$ 4047108 3992938 3990408 3969057 3806708 3757834 3860019 3907695 4049524 4159548 4289991 4429511
2791D429511K94709L42613M21553M78283O04617P97442R03651O08658n4911o90043
$$ 4429511 4724220 5066833 5488386 5966669 6571286 7368728 8272379 8881037 8826126 8136083
2781H136083q01540o35556m10407m02634n47565l62470l16444k75640j90214q9793
$$ 8136083 7334543 6698987 6288580 5885946 5338381 4975911 4659467 4383827 4193613 4103820
2771D103820j35623j01170r5274j45173k31323j20315r9245j3462p975L1117k4405
$$ 4103820 3968197 3867027 3771753 3626580 3395257 3274942 3175697 3162235 3154260 3185377 3160972
2760C160972q3434Q8533r8207k1530l0770j14344p8794q8877j13360j47503p3833
$$ 3160972 3077538 3166071 3067864 3046334 3015564 2901220 2822426 2733549 2620189 2472686 2398853
2749B398853n2117r5200K3868K0269r4876p0377j14632J5147R8846j03037Q5774
$$ 2398853 2346736 2251536 2275404 2295673 2200797 2130420 2015788 2030935 2129781 2026744 2112518
2738B112518J8430K6807K0718J16622J97356k9378j43077j71398k03q9825p7843
$$ 2112518 2130948 2157755 2178473 2295095 2492451 2463073 2319996 2148598 2148395 2058570 1980727
2727A980727R656m9332K9416R0676o524m4157l1757P6043K1989Q5478J5173n1566
$$ 1980727 1990383 1941051 1970467 2061143 2054619 2010462 1978705 2054748 2076737 2162215 2177388 2125822
2715B125822M2443L7788J09670J57714O3746M3522l1265o2636k6432j12953j49652
$$ 2125822 2168265 2206053 2315723 2473437 2537183 2580705 2549440 2486804 2460372 2347419 2197767
2704B197767l1012l014l1195L8871O8607j01494j26158j24437j00669r7676r0913
$$ 2197767 2166755 2163741 2132546 2171417 2240024 2138530 2012372 1887935 1787266 1689590 1598677
2693A598677J0495j03214l0611o6499j6258n8586l6886n2035n5336Q6960O9426
$$ 1598677 1609172 1505958 1475347 1408848 1392590 1334004 1297118 1245083 1189747 1276707 1346133
2682A346133M4484Q161J07873N5429N7576k4386r8263P4180r6265J9655k9864
$$ 1346133 1390617 1398778 1506651 1562080 1619656 1595270 1497007 1571187 1474922 1494577 1464713
2671A464713q5820l4195o0826n7326j33615k8831J4805L1725m6513j02859O960
$$ 1464713 1378893 1344698 1283872 1226546 1092931 1064100 1078905 1110630 1064117 961258 968218
2660I68218K78686L8154o1947M5787k5056l352j56188q5086l7633n5430m0679
$$ 968218 1246904 1285058 1223111 1268898 1243842 1240490 1084302 999216 961583 906153 865474
2649H65474k7850l051k6638J4489K3704m5591m0531o8811m0653O0960j5333m0652
$$ 865474 837624 834573 807935 822424 846128 800537 760006 691195 650542 711502 696169 655517
2637F55517p3117J3316O9555k9243j39319J4057M9551m130J7351o2506J7914l2204
$$ 655517 582400 595716 665271 636028 496709 510766 560317 556187 573538 511032 528946 496742
2625D96742J3811l7821m6610N4937J29162l4710o864q39j8425L8910M2452l2314
$$ 496742 510553 472732 426122 481059 610221 575511 568647 567808 549383 588293 630745 598431
2613E98431n9512J7024N1777l7415o8973j6961K545P0737J5075j2337R282K090
$$ 598431 538919 555943 607720 570305 501332 484371 486916 557653 572728 560391 569673 571763
2601E71763Q4715n6010L7757N4310n7769Q3544n3957J02770l51M0839M2453l5352
$$ 571763 656478 600468 638225 692535 634766 718310 664353 767123 766772 807611 850064 814712
2589H14712m4454j03321n3536J09571j07732o9835o6394J846M2648N1667j71N2084
$$ 814712 770258 666937 613401 722972 615240 545405 479011 480857 523505 575172 575001 627085
2577F27085Q5327k6168J8512P0507K6533L3997p8021r7082l1860p1775P4662k316
$$ 627085 712412 686244 704756 775263 801796 835793 757772 660690 628830 557055 631717 629401
2565F29401l0868M5931q5694q342k5948O020o1455L4736R7967J39131O4627n7951
$$ 629401 598533 644464 558770 550428 524480 530500 469045 503781 601748 740879 805506 747555
2553G47555l2611N140p735j38877l1354R928M9849l8492j6611j02924j10912N1037
$$ 747555 714944 720084 712349 573472 542118 552046 601895 563403 546792 443868 332956 383993
2541C83993N9306J23318o8116j24668J12540M4309J5303m6967j4023K4659M3479
$$ 383993 443299 566617 498501 373833 486373 530682 545985 499018 484995 509654 553133
2530E53133k17300Q348P1969l3190m6914M1387p766n705k0525r251k8893M1794
$$ 553133 335833 344181 416150 382960 336046 377433 369667 363962 343437 334186 305293 347087
2518C47087o3800l612m8072m6540k6826J381J52067M82m7465K9941l817J24375
$$ 347087 283287 279675 231603 185063 158237 159618 311685 312167 264702 294643 290826 415201
2506D15201n1015o2712n0315M7950J05200m0541p8542M6375N6566j6143J4370
$$ 415201 364186 301474 251159 299109 404309 363768 285226 331601 388167 372024 386394
2495C86394o6610p9672j34043O4255K6206m463n1556q894J7442L1129q1183O2330
$$ 386394 319784 240112 106069 170324 196530 192067 140511 131617 149059 180188 99005 161335
2483A61335K9300m3246p6587o771R1145O2002j9368r3019j3477j355O7419L1954
$$ 161335 190635 147389 70802 64031 155176 217178 197810 104791 91314 89959 157378 189332
2471A89332q3938J9658J675m2931l5650L0614j2294L8650M1359l2943K361j8331
$$ 189332 105394 125052 126727 83796 48146 78760 66466 105116 146475 113532 115893 97562
2459I7562K0995l5689K5772j5758k2778l700K0300N5382k8944l8232N6918m5064
$$ 97562 118557 82868 108640 92882 70104 66404 86704 142086 113142 74910 131828 86764
2447H6764j6842R4244m3709J0879J63116L7297q6221m5328p934j4462M3883p855
$$ 86764 69922 164166 120457 131336 294452 331749 245528 200200 192266 177804 221687 213832
2435B13832m6091J1229p1027J5233l0847J0964K0646k6161q727m3298P230l1920
$$ 213832 167741 178970 107943 123176 92329 103293 123939 97778 89051 45753 52983 21063
2423B1063p4521P1157L9166N5860j22256K8880N2499q7308L4628O9245J3044n1193
$$ 21063 -53458 17699 56865 112725 -9531 19349 71848 -15460 19168 88413 101457 50264
2411E0264p2879N6778l47K1956M9049l4320l8521M6080P4770O2382r6726r1063
$$ 50264 -22615 34163 33816 55772 104821 70501 31980 78060 152830 215212 118486 27423
2399B7423P8009O705P2670l2853q7486m2528J05205k5227o3671j00515O5788J52909
$$ 27423 105432 112137 184807 151954 64468 21940 127145 101918 38247 -62268 3520 156429
2387A56429k2231j50816N4737M1988P9980p2977q9384K5267j6741Q0109l5096
$$ 156429 134198 -16618 38119 80107 160087 87110 -2274 22993 6252 86361 51265
2376E1265m3433k7453J09324K0432j9545j08619M6716J39766k7712k5001j16972
$$ 51265 7832 -19621 89703 110135 90590 -18029 28687 168453 140741 115740 -1232
2365a232m3407L6144m0296J3432L1921J12318Q004m4419p284q395q121k4578N602
$$ -1232 -44639 -8495 -48791 -35359 -3438 108880 116884 72465 65181 56786 48665 24087 29689
2352B9689r2311n839L233P0179J6967j16784o8684Q6542J26651N1029J6579R062
$$ 29689 -62622 -68461 -65228 4951 21918 -94866 -163550 -77008 49643 100672 117251 126313
2340A26313J15976j26211o595N4427n4630l4502n6789M2311N1175l5956J01810
$$ 126313 242289 116078 109483 163910 109280 74778 17989 60300 111475 75519 177329
2329A77329l0801K5355o4813o3620N8759O7653m247m1070O4044N4346j04231l3786
$$ 177329 146528 171883 107070 43450 102209 169862 165615 124545 188589 242935 138704 104918
2317A04918M6814M8926m1857r5909J14150k7166m9504P958R5992J3554J7571L0009
$$ 104918 151732 200658 158801 62892 177042 149876 100372 108330 204322 217876 235447 265456
2305B65456o7611j00446O6080r2194P6146J02168l5256o6420k0237K7588r6330
$$ 265456 197845 97399 163479 71285 147431 249599 214343 147923 127686 155274 58944
2294E8944q4443J00432J00284p7907K2705O0503M3289o0571j3660M5894j9522
$$ 58944 -25499 74933 175217 97310 120015 180518 223807 163236 149576 195470 175948
2283A75948L7874p9634o5280l7893M2470j4755M5347L2963r32q5554J08660J0681
$$ 175948 213822 134188 68908 31015 73485 58730 104077 137040 136108 50554 159214 169895
2271A69895p9647J3313L3946M8765M4977O307O7844j764l4431o5245n3648n739
$$ 169895 90248 103561 137507 186272 231249 237556 305400 303636 269205 203960 150312 144573
2259A44573m073k5427J5279N7523N9983J5211K5644j113J9307P2164l431L5921
$$ 144573 140500 115073 130352 187875 247858 263069 288713 287600 306907 379071 375640 411561
2247D11561j61217k609r354P8875j660m2688K3369M2563l993R7261p6605q2572
$$ 411561 250344 247735 238381 317256 315596 272908 296277 338840 334847 432108 355503 272931
2235B72931k0562N1606J64009n838l5088J8573M4934j9789J7055l617k8728P0004
$$ 272931 252369 303975 467984 462146 427058 445631 490565 470776 487831 484214 455486 525490
2223E25490k8745n3861L1548q572J0526Q4731m721L885p684J5558J3977m4008
$$ 525490 496745 442884 474432 465860 476386 561117 556396 560281 552597 568155 582132 538124
2211E38124M3003k3815Q949J60465O2093k5720k0758R935Q6192N9366O048n4035
$$ 538124 581127 557312 566261 726726 788819 763099 742341 752276 838468 897834 903882 849847
2199H49847r6615j4282R2189J33603m7531j1228m6494J4841Q2075j8553k1335
$$ 849847 753232 738950 831139 964742 917211 905983 859489 874330 956405 937852 916517
2188I16517Q7186J02813K0854q1642O7088P0030K2562n2768Q1782J34061j645
$$ 916517 1003703 1106516 1127370 1045728 1112816 1182846 1205408 1152640 1234422 1368483 1366838
2177A366838L2274M2551L3763Q3657P2343j3712P3788R1051Q3007l945Q5328O8872
$$ 1366838 1399112 1441663 1475426 1559083 1631426 1617714 1691502 1782553 1865560 1861615 1946943 2015815
2165B015815J72365J75941J34454J00790J36844K44092J34366R0321K33789L15762
$$ 2015815 2188180 2364121 2498575 2599365 2736209 2980301 3114667 3204988 3438777 3754539
2155C754539L59715J85732J96946L41235L16422K11377K15900M0038j82137l52821
$$ 3754539 4114254 4299986 4496932 4838167 5154589 5365966 5581866 5621904 5439767 5086946
2145E086946l87323l22674l28196l02203k35774l40992l28765k16720j20247o8601
$$ 5086946 4699623 4376949 4048753 3746550 3510776 3169784 2841019 2624299 2504052 2435451
2135B435451j77476j50817q5974j07132J3086L612j75771j20873R725O8234m9205
$$ 2435451 2257975 2107158 2021184 1914052 1927138 1930750 1754979 1634106 1643831 1712065 1662860
2124A662860m3302q9582J07870r5759r5681k9169o5866l6170K3719J865j08668
$$ 1662860 1619558 1529976 1637846 1542087 1446406 1417237 1351371 1315201 1338920 1340785 1232117
2113A232117o5187R5036k9613j0255P8138N5941j0133M564M1458q4654k354m9010
$$ 1232117 1166930 1261966 1232353 1222098 1300236 1356177 1346044 1350608 1392066 1307412 1305058 1256048
2101A256048j10796j88392j7851l0280L1322n2554j04406l4950K8557Q279m3959
$$ 1256048 1145252 956860 939009 908729 940051 887497 783091 748141 776698 784977 741018
2090G41018J4377j46720Q7757J40603j00766l1950j4418P6088j2979Q739o9492
$$ 741018 755395 608675 696432 837035 736269 704319 689901 765989 753010 761749 692257
2079F92257L6430J73034K7629j5325O6270J39188J27775J86937m4072j63764j45321
$$ 692257 728687 901721 929350 914025 980295 1119483 1247258 1434195 1390123 1226359 1081038
2068A081038r2740j58910j51137L0102J8965m059j07125j28948k5345K8574Q521
$$ 1081038 988298 829388 678251 708353 727318 723259 616134 487186 461841 490415 498936
2057D98936q5082O655R8937P1076m0828j46484o939j3979P950n677l913N7616
$$ 498936 413854 420509 519446 590522 549694 403210 396271 382292 390242 384565 380652 438268
2045D38268N8167k8695R427p0535O3476J25472K16116n6831m1233q442j13982
$$ 438268 496435 467740 477167 406632 470108 595580 811696 754865 713632 705190 591208
2034E91208r9348m2717j23092j7163j014j10401P2574J3797m7674l9061J8062
$$ 591208 491860 449143 326051 308888 307874 197473 270047 283844 236170 197109 215171
2023B15171M3131Q901m7385l4582o6336l2147j3303M7736O2367p3718r3407K7301
$$ 215171 258302 267203 219818 185236 118900 86753 73450 121186 183553 109835 16428 43729
2011D3729J26987P6776r7813k8182j3573J4026m1823k1130L9327O3868J2676P260
$$ 43729 170716 247492 149679 121497 107924 121950 80127 58997 98324 162192 174868 182128
1999A82128k5770p5703k0817R6029K3407l0139m1675J7352K6891m0124j70814
$$ 182128 156358 80655 59838 155867 179274 149135 107460 124812 151703 111579 -59235
1988e9235O9348J17698k0913n5096o1099N6555R287j2523Q14p5823O4618N8652
$$ -59235 10113 127811 106898 51802 -9297 47258 56545 44022 44836 -30987 33631 92283
1976I2283L1717K7705m4935L4097P9890k8749j03446p6664K425k2617L8972j6339
$$ 92283 124000 151705 106770 140867 220757 192008 88562 11898 14323 -8294 30678 14339
1964A4339o3666L7348n88L664n1198L1352M6775m9194P6299L9369J1594o5954
$$ 14339 -49327 -11979 -12567 -8903 -60101 -28749 18026 -31168 45131 84500 96094 30140
1952C0140k8710L4021j7337j42295Q7472K09472p3861j24539l2848K2576R9788
$$ 30140 1430 35451 18114 -124181 -36709 172763 98902 -25637 -58485 -35909 63879
1941F3879k7811L8860n1249l3452M8418j6281J18819r9226k6980L3914r997K8014
$$ 63879 36068 74928 23679 -9773 38645 22364 141183 41957 14977 48891 38894 66908
1929F6908r2409L7361R6034m0954j0888o4593P3143m1678p9432m6331M298K5275
$$ 66908 -25501 11860 107894 66940 56052 -8541 64602 22924 -56508 -102839 -98541 -73266
1917g3266N530j051o4575R7006Q1315L174p323n5505j7370N1434O456p3496J2056
$$ -73266 -67736 -68787 -133362 -36356 44959 48133 40810 -14695 -32065 19369 25825 -47671 -35615
1904c5615R2237K843j03479q8918M1985J0182L9942J16o2235J79165N0760l1576
$$ -35615 56622 59465 -44014 -132932 -90947 -80765 -40823 -40707 -102942 76223 126983 95407
1892I5407j19630o3937Q1404m8835Q998Q9560p1652m2537p533J22981J07946j16398
$$ 95407 -24223 -88160 -6756 -55591 -46593 42967 -28685 -71222 -78755 44226 152172 35774
1880C5774o4725N7228J9455q0029J9907R8526r529J3980k4073k6304k3373j2597
$$ 35774 -28951 28277 47732 -32297 -12390 86136 76607 90587 66514 40210 16837 4240
1868D240M1694K6470o3493N9678M6818n1587j66092o3535K18102N8370k2313j25896
$$ 4240 45934 72404 8911 68589 115407 63820 -102272 -165807 52295 110665 88352 -37544
1856c7544L158L2806L5960L3861n3793O3528O0695j51023Q433k4239K4242J71371
$$ -37544 -34386 -1580 34380 68241 14448 77976 138671 -12352 -3919 -28158 -3916 167455
1844A67455n645l4982n5265l0986k0633K1165M9875k286q1739O3836j8296k4337
$$ 167455 161810 126828 71563 40577 19944 41109 90984 88698 6959 70795 52499 28162
1832B8162Q7127J00775J1080j48425O4331R1646j0118P7308p1933P764l3737K0053
$$ 28162 115289 216064 227144 78719 143050 234696 224578 301886 229953 237717 203980 224033
1820B24033p623J8947j10395o993P8716M0114n0295R6291l2158q5414J30260q6529
$$ 224033 216410 235357 124962 117969 196685 236799 186504 282795 250637 165223 295483 208954
1808B08954k3570j8288Q7523J2329M9204R2961j2439l7900K1979m8477m1347k0824
$$ 208954 185384 167096 254619 266948 316152 409113 396674 358774 380753 332276 290929 270105
1796B70105J1667Q8617N5519k4000R706J35073P7551j22532O680J6680M8346J786
$$ 270105 281772 370389 425908 401908 411614 546687 624238 501706 508386 525066 573412 575198
1784E75198j1002J469J4081k2079q4823o1943P127k1210L7282J612k7915P1878
$$ 575198 564196 565665 579746 557667 472844 410901 418028 396818 434100 435712 407797 479675
1772D79675m5027J9476N3139M3763j5938j8522q633j8846o0881P3282J8189r3289
$$ 479675 434648 454124 507263 551026 535088 516566 507933 489087 428206 501488 519677 426388
1760D26388N5902O5021l2963j4899k056O893m7690j61026K9780l017j7732p87
$$ 426388 482290 547311 514348 499449 497393 504286 456596 295570 325350 322333 304601 303814
1748C03814J2485N0409L0711k6761l1504o8706M4313L9217M8052J4330R59q3553
$$ 303814 316299 366708 397419 370658 339154 270448 314761 353978 402030 416360 417319 333766
1736C33766o4343J4154m8753k3043Q3169J03113o3721r7857p2836j2751P7055
$$ 333766 269423 283577 234824 211781 294950 398063 334342 236485 163649 150898 227953
1725B27953M3180p7249p5076R0253J3720n272m5382p6855M5546R1103k0199j32667
$$ 227953 271133 193884 118808 209061 222781 217509 172127 95272 140818 231921 211722 79055
1713G9055O490N0271p9363N1k2836r9587M0419Q0027J0737l4773L312m342M5606
$$ 79055 85545 135816 56453 56504 33668 -65919 -25500 54527 65264 30491 33803 29461 75067
1700G5067k3678n7390Q7668P5084l4533r4687l7539L75q9210N8089O6931O5365
$$ 75067 51389 -6001 81667 156751 122218 27531 -10008 -9633 -98843 -40754 26177 91542
1688I1542n84n4778J673m9286o8653L9179O4061O9535j07245k02J5269M7972N6557
$$ 91542 90958 36180 37853 -11433 -80086 -40907 23154 92689 -14556 -14758 511 48483 105040
1675A05040p6606J5756K8571l63n0466O1008j06868P940P2786m3698o8959j07
$$ 105040 28434 44190 72761 72398 21932 82940 -23928 -15988 56798 13100 -55859 -55966
1663e5966k917p3552P4330K1132k3243k2850M800j3630L0193J16278J6121j21512
$$ -55966 -58883 -132435 -58105 -36973 -60216 -83066 -78266 -91896 -61703 54575 70696 -50816
1651e0816M1519P1729k7326q5927p4816m682O9738m292K2813n2655j0101k1992
$$ -50816 -9297 62432 35106 -50821 -125637 -130319 -60581 -64873 -42060 -94715 -104816 -126808
1639a26808j4160K3967L305m0056K3085R8961K706j7724J26n0298L5690o0900
$$ -126808 -140968 -117001 -113696 -153752 -130667 -31706 -29000 -46724 -46598 -96896 -61206 -122106
1627a22106o4744J40379L9715K7932j36721O4844j3448M1842l0400j14946K5083
$$ -122106 -186850 -46471 -6756 21176 -115545 -50701 -64149 -22307 -52707 -167653 -142570
1616a42570Q3379K7241l6046k0282o6703M6939J8800q244l7120k2543n1314N6899
$$ -142570 -59191 -31950 -67996 -88278 -154981 -108042 -89242 -97486 -134606 -157149 -208463 -151564
1604a51564n675K3161j7523P937l1497L1815M7844j3972k2396K3311L483j446
$$ -151564 -157239 -134078 -151601 -143664 -175161 -143346 -95502 -109474 -131870 -108559 -105076 -106522
1592a06522M0991L8342K7977j17197p6724J08346m2780r1535N1396J8287M7072
$$ -106522 -65531 -27189 788 -116409 -193133 -84787 -127567 -219102 -167706 -149419 -102347
1581a02347R0404K0198o8323L3230j11784Q4248O473k437j0204m6318k8564N592
$$ -102347 -11943 8255 -60068 -26838 -138622 -54374 -47901 -50338 -60542 -106860 -135424 -129832
1569a29832J4152n0366j3734O8493o897l6796K2906R5664L3064m8093K5853N053
$$ -129832 -115680 -166046 -179780 -111287 -118184 -154980 -132074 -36410 -3346 -51439 -25586 -20533
1557b0533l711j07192m0228l7319P5115L2015o1726L9688M1161j7875L67k2377
$$ -20533 -24244 -131436 -171664 -208983 -133868 -101853 -163579 -123891 -82730 -100605 -100238 -122615
1545a22615k8335j8691j9693N3303L0662n2464J9233m7307m3087j0892J36424
$$ -122615 -150950 -169641 -189334 -136031 -105369 -157833 -138600 -185907 -228994 -239886 -103462
1534a03462M1460p4836l9712J5376Q7784M7439l8947p0801K8164n328P8276r7360
$$ -103462 -62002 -136838 -176550 -161174 -73390 -25951 -64898 -135699 -107535 -112863 -34587 -131947
1522a31947n2873j1899K3831O8291k6904p4565N5249J1006K6440K2826q5500J2518
$$ -131947 -184820 -196719 -172888 -104597 -131501 -206066 -150817 -139811 -113371 -90545 -176045 -163527
1510a63527K031P519K9141O8782j6048j4913O072q1113K5756K0054L8605J6702
$$ -163527 -161496 -153977 -124836 -56054 -72102 -87015 -80943 -162056 -136300 -116246 -77641 -60939
1498f0939p6222j8992M8181j7008q33m0756p6770N5860J29466q979r3338J6047
$$ -60939 -137161 -156153 -107972 -124980 -125813 -166569 -243339 -187479 -58013 -66992 -160330 -144283
1486a44283M3790j6546n607p1737L1374L1196K0564M6884L9161Q5806k3735o8579
$$ -144283 -100493 -117039 -122646 -194383 -163009 -131813 -111249 -64365 -25204 60602 36867 -31712
1474c1712k2503K8713r9069j441K902l7656J11763L5505K0139j3949o1442r4718
$$ -31712 -54215 -25502 -124571 -126012 -123110 -160766 -49003 -13498 6641 -7308 -68750 -163468
1462a63468k3981J10435m3738k0457N8287K0334k3777k9682L044K1420R9008k6260
$$ -163468 -187449 -77014 -120752 -141209 -82922 -62588 -86365 -116047 -113003 -91583 7425 -18835
1450a8835o0563L6321R2478p1697q8865J18674l0674k0083l6656j5382m3967K7166
$$ -18835 -79398 -43077 49401 -22296 -111161 7513 -23161 -43244 -79900 -95282 -139249 -112083
1438a12083K08J05073k1254r5053L6084O3811j29772m3250N3223Q7841l6730o3804
$$ -112083 -111875 -6802 -28056 -123109 -87025 -23214 -152986 -196236 -143013 -55172 -91902 -155706
1426a55706N0348R1686m6380r5411j3131l3255P2444l601M1973O776J2913j16213
$$ -155706 -105358 -13672 -60052 -155463 -168594 -201849 -129405 -133006 -91033 -84257 -71344 -187557
1414a87557M0394L4842M3983p2658k8011O1511L1797l6076j2160L6168N9029j5286
$$ -187557 -147163 -112321 -68338 -140996 -169007 -107496 -75699 -111775 -123935 -87767 -28738 -44024
1402d4024K696p7011k5088J4380m3793r932o4152Q671M3370O6175m775J15181
$$ -44024 -41328 -118339 -143427 -129047 -172840 -182772 -246924 -238253 -194883 -128708 -133483 -18302
1390a8302l1336O4129O663j49141N0813J1047p3662l0061j4197O9127O1553l3574
$$ -18302 -49638 14491 21154 -127987 -77174 -66127 -139789 -169850 -184047 -114920 -53367 -86941
1378h6941m7434N5870N6343K960p7112J2605M6895P5844k1390l6059j609j04472
$$ -86941 -134375 -78505 -22162 -19202 -96314 -83709 -36814 39030 17640 -18419 -20028 -124500
1366a24500M3689N0726j14807j6305Q4621o0033M0918P1130M9629O657n6774p6893
$$ -124500 -80811 -30085 -144892 -161197 -76576 -136609 -95691 -24561 25068 31725 -25049 -101942
1354a01942m6569Q6251P433o39j13368k1836J11375M9374k3450k4701o4228r422
$$ -101942 -148511 -62260 -54827 -55466 -168834 -190670 -79295 -29921 -53371 -78072 -142300 -151722
1342a51722M6111J5978k7294l2845J15233K6603j10869n7755R6243J12223n1668
$$ -151722 -105611 -89633 -116927 -149772 -34539 -7936 -118805 -176560 -80317 31906 -19762
1331a9762j02403m0954N9904Jk3650m721j0601N0883k3551j7027J18555L7313
$$ -19762 -122165 -163119 -103215 -103214 -126864 -131585 -142186 -91303 -114854 -131881 -13326 23987
1319B3987m6720p4630O6140k7241q7992M9967R6105K3443n5157O4168n3639l9406
$$ 23987 -22733 -97363 -31223 -58464 -146456 -96489 -384 23059 -32098 32070 -21569 -60975
1307f0975l8827M6360j13807J6733R4566J21813M5674p2797j61409m3709P0123
$$ -60975 -99802 -53442 -167249 -150516 -55950 65863 111537 38740 -122669 -166378 -96255
1296i6255p603p6659o3238J56354Q9512m1212q3076O8512K5322l2356j0289j03924
$$ -96255 -103858 -180517 -243755 -87401 2111 -39101 -122177 -53665 -28343 -60699 -70988 -174912
1284a74912J11113J17214j0530q0258j3235l3446K2877p8577m077Q7785r501L7251
$$ -174912 -63799 53415 42885 -37373 -50608 -84054 -61177 -139754 -143831 -56046 -65547 -28296
1272b8296P1033o5064j38813o887J18489o202J7063K7408J6107o829j04215m381
$$ -28296 42737 -22327 -161140 -168027 -49538 -55740 -38677 -11269 4838 -1991 -106206 -110587
1260a10587O5138J37293j05599n477O7791J0749p9667o3656L6984n7447m3102
$$ -110587 -45449 91844 -13755 -19232 48559 59308 -20359 -84015 -47031 -104478 -147580
1249a47580M6095O5529J4799m2769L8426O79J7685l9874k4966O3395N7984P939
$$ -147580 -101485 -35956 -21157 -63926 -25500 -24821 -7136 -47010 -71976 -8581 49403 57342
1237E7342n0065q0035L5260n8515J0203R3967q1054q4823P3781N7453J7945p9938
$$ 57342 7277 -72758 -37498 -96013 -85810 8157 -72897 -157720 -83939 -26486 -8541 -88479
1225h8479K5955R8722M9122M9618l2166M6851Q8524j7853m4285k6252n3920j1790
$$ -88479 -62524 36198 85320 134938 102772 149623 238147 220294 176009 149757 95837 84047
1213H4047l9956N3904k4057q0604J6782N489N4534n8373r3204N4492P7173M691
$$ 84047 44091 97995 73938 -6666 10116 15605 70139 11766 -81438 -26946 50227 54918
1201E4918o7625J33682l245q0402o1682j6990R5483j2639k5919O458n0398k9730
$$ 54918 -12707 120975 117730 37328 -24354 -41344 54139 41500 15581 22039 -28359 -58089
1189e8089M9886Q8146o5438q1236O0798N2212o7057o9102j7561J11540O6654l7950
$$ -58089 -8203 79943 14505 -66731 -5933 46279 -20778 -89880 -107441 4099 70753 32803
1177C2803q8310Q7362J1012r4215K0172m7618P55q612O6541l0500M7640M0186
$$ 32803 -55507 31855 42867 -51348 -31176 -78794 -78039 -86651 -20110 -50610 -2970 37216
1165C7216K723j40j67815j6499J97885M6599q5978P787n1673O8256k097r6204
$$ 37216 39939 39799 -128016 -144515 53370 99969 13991 21778 -29895 38361 36264 -59940
1153e9940M1027N3388J98919o0846o1955p7204o9029P533P9153o3136j24847O8590
$$ -59940 -18913 34475 233394 172548 110593 33389 -35640 -28107 51046 -12090 -136937 -68347
1141f8347P9339J09367M4064j21460l9349J1835K5941r732l1820K7862N1676O1475
$$ -68347 10992 120359 164423 42963 3614 15449 41390 31658 -162 27700 79376 140851
1129A40851j19870j20084J22957N0111K043M1284L216N5040j59024N1713j2364
$$ 140851 20981 -99103 23854 73965 76008 117292 120508 175548 16524 68237 55873
1118E5873j15305M7889L563j6530M5702P5502O1094L9570j22171p7373K1612k3209
$$ 55873 -59432 -11543 -7980 -24510 21192 96694 157788 197358 75187 -2186 19426 -3783
1106c783K7988L7413n0060R1523P877m2010l2335k5442J19306P9348p8850l5791
$$ -3783 24205 61618 11558 103081 110958 68948 36613 11171 130477 209825 130975 95184
1094I5184m7880L9176J18870q0513q421R3140o2912j2308l2040K3313M3857j792
$$ 95184 47304 86480 205350 124837 116416 209556 146644 134336 102296 125609 169466 167674
1082A67674j3097m1142N2041r2091j6594P4462m736n2243K9905J2302L2853K7024
$$ 167674 154577 113435 165476 73385 56791 131253 126517 74274 104179 116481 149334 176358
1070A76358L6406k7745J2346j5146l4454K0491J38004L9296j39167o7202J7709
$$ 176358 212764 185019 197365 182219 147765 168256 306260 345556 206389 139187 156896
1059A56896N1945k0858j9165J6509J6114N4219k3326R3780l3101P577O5994r0424
$$ 156896 208841 187983 168818 185327 201441 255660 232334 326114 293013 300590 366584 276160
1047B76160K8479M4619r017J0682o917o7440k6224J5776m60p2728P744R4110P5238
$$ 276160 304639 349258 340241 350923 344006 276566 250342 266118 265658 192930 200674 294784 370022
1034C70022K3446J4291J416R6601p8220q673R3816m6105n2331J7580N0650R8465
$$ 370022 393468 407759 409175 505776 427556 418883 512699 466594 414263 431843 482493 580958
1022E80958O54m9299R3808m7615j54422N405J40279P7455j31091q2318K0514N8673
$$ 580958 581612 532313 626121 578506 424084 429489 569768 647223 516132 433814 454328 513001
1010E13001J19379j9111p6153l4656N0403R1068P1001j25456j79K1181P8927o8209
$$ 513001 632380 613269 537116 502460 552863 643931 714932 589476 589297 610478 689405 621196
998F21196o3975J35227j7157l9811J7201Q7780P1969l5512j8210N1071J16125
$$ 621196 557221 692448 675291 635480 652681 740461 812430 776918 758708 809779 925904
987I25904j9255j38788J7906J52836J10848o8546o4203J13492R3722K4577k7306
$$ 925904 906649 767861 785767 938603 1049451 980905 916702 1030194 1123916 1148493 1121187
976A121187j9299K5629J29540O8418M1644R1974J44718L5804R9817q933J22622
$$ 1121187 1101888 1127517 1257057 1325475 1367119 1459093 1603811 1639615 1739432 1730499 1853121
965A853121J69257O3559M6857J43217J48262L29174J85339J66520K74683K48079
$$ 1853121 2022378 2085937 2132794 2276011 2424273 2753447 2938786 3105306 3379989 3628068
955C628068K14561K23203L25503M49499M96314L56676K58826J70027N90157O90681
$$ 3628068 3842629 4065832 4391335 4840834 5337148 5693824 5952650 6122677 6712834 7403515
945G403515P21706R19068J212729J376950J662469K213101K750193L558768M771852
$$ 7403515 8125221 9044289 10257018 11633968 13296437 15509538 18259731 21818499 26590351
936B6590351O363617O522776K94594n949062p513236n286745l301308k408655
$$ 26590351 32953968 39476744 39771338 33822276 26309040 21022295 17720987 15312332
928A5312332k178984j912724j384630j174614r92998o38992m38643m56662l23201
$$ 15312332 13133348 11220624 9835994 8661380 7668382 7029390 6590747 6134085 5810884
919E810884k31562l60933m79649m50613m14208k65690k35372j69039j37835k22486
$$ 5810884 5579322 5218389 4738740 4288127 3873919 3608229 3372857 3203818 3065983 2843497
909B843497l03070j12976j01734o5810j15848k09140r3791r9057K4822P8113j31121
$$ 2843497 2540427 2427451 2325717 2259907 2144059 1934919 1841128 1742071 1766893 1845006 1713885
898A713885j36573m2836P5502j58598r8504J5430q5682J8997r2669j35542l0030
$$ 1713885 1577312 1534476 1609978 1451380 1352876 1368306 1282624 1301621 1208952 1073410 1043380
887A043380K3033o2578k3317Q7771N64j12006j37984l4142r188P1194q9912q0368
$$ 1043380 1066413 1003835 980518 1068289 1068853 956847 818863 784721 775533 846727 756815 676447
875F76447N32N6224o6482M458o2475n6396M1476N1924j22083J07454M745J4782
$$ 676447 676979 733203 666721 671179 608704 552308 593784 645708 523625 631079 635824 650606
863F50606q7358m0434L5541p4122k1919O3725n5047m8855k4767M9583M6174j08571
$$ 650606 563248 522814 558355 484233 462314 526039 470992 422137 397370 446953 493127 384556
851C84556k8797P679j21994J39696L1022j07391q221k4156M4991M7073j59365
$$ 384556 355759 363438 241444 381140 412162 304771 296550 272394 317385 364458 205093
840B05093J5905L3882J48567o5464n0566J0719q1856N5160O8028j05289N3076
$$ 205093 220998 254880 403447 337983 287417 298136 216280 271440 339468 234179 287255
829B87255J25722j21762M119M756o6249p5029L3700K4281n7658N3964K2902o0879
$$ 287255 412977 291215 295334 300090 233841 158812 192512 216793 159135 213099 236001 175122
817A75122j11915j2708J11294k949m6883l2849N6756k5419L2658J4170m021N168
$$ 175122 63207 50499 161793 158844 111961 79112 135868 110449 143107 157277 153256 158424
805A58424J34225k3604k2573q4281j807o3506M1271N0130n5754J0751L5995j00622
$$ 158424 292649 269045 246472 162191 160384 96878 138149 188279 132525 143276 179271 78649
793G8649l1601k5420p6469N1056J14230r240m9041k9864M549M1877N9515l2285
$$ 78649 47048 21628 -54841 -3785 110445 101205 52164 22300 26849 68726 128241 95956
781I5956J8854o6237n3517J70656O1556m9883j48051J8467M5511p2537K1211K8
$$ 95956 114810 48573 -4944 165712 227268 177385 29334 47801 93312 20775 41986 42014
769D2014m492k5377q491K6896O3853j17418L0133k7081J3347M4890J7503l9146
$$ 42014 37522 12145 3654 30550 94403 -23015 7118 -19963 -6616 38274 55777 16631
757A6631j17559M2144Q1299M8285K9261n9377L1689K7968K4623q9796q9966J09081
$$ 16631 -100928 -58784 22515 70800 100061 40684 72373 100341 124964 35168 -54798 54283
745E4283m421n3720J4212M750l8409M1757o097m8396l6563n2951R8929J42917
$$ 54283 49862 -3858 10354 15104 -23305 18452 12355 -36041 -72604 -125555 -26626 116291
733A16291r3781K5977o0284M3001j4864N3604l4776n1809J65154p3031k7204r344
$$ 116291 22510 48487 -11797 31204 16340 69944 35168 -16641 148513 75482 48278 38934
721C8934l9537q8395P3669P2011K3448k1789l1263j1142m1420l6482n083j9223
$$ 38934 -603 -88998 -15329 56682 80130 58341 27078 15936 -25484 -61966 -67049 -86272
709h6272N6223P0496k9681j00948J15729M932p2378n1743M4182Q4942o0688J33744
$$ -86272 -30049 40447 10766 -90182 25547 30479 -41899 -93642 -49460 35482 -25206 108538
697A08538O8825r7232p8983K6462N2378L6629p8614j9131K3739j2558L5265P8764
$$ 108538 177363 80131 1148 27610 79988 116617 38003 18872 42611 30053 65318 144082
685A44082j24928j5914L1618o1315j6984J51262p2841M0857Q252k5375j44981
$$ 144082 19154 3240 34858 -26457 -43441 107821 34980 75837 84089 58714 -86267
674h6267M6613J36679k9484p0419k5074L0272j263n2764L2570J7874J3624m728
$$ -86267 -39654 97025 67541 -2878 -27952 2320 1057 -51707 -19137 -1263 12361 7633
662G633K3382J4466l2420J54867N3542M834o1880o4679J0816l5969K0218P6652
$$ 7633 31015 45481 13061 167928 221470 226304 164424 99745 110561 74592 94810 171462
650A71462o686R8869Q578j20604j9135n9045m6508L4384j2621P6052o6749J130
$$ 171462 164776 263645 272223 151619 132484 73439 26931 61315 48694 124746 57997 59127
638E9127j8513j04804P3622O8242N8370M9955n6296k9821n6907m6377j0345j7596
$$ 59127 40614 -64190 9432 77674 136044 185999 129703 99882 42975 -3402 -13747 -31343
626c1343M866M2177P0130K8265j3125P1781k2237j12716J5859O2775p5360m5127
$$ -31343 -26477 15700 85830 114095 100970 172751 150514 37798 53657 116432 41072 -4055
614d055j7201m4252J9420m314Q4375P5996n5599r2921K2398J28954o1999j53028
$$ -4055 -21256 -65508 -46088 -50402 33973 109969 54370 -38551 -16153 112801 50802 -102226
602a02226n9060J32450J05903r548j14702m9399L0715J3262M3163J7236N7188
$$ -102226 -161286 -28836 77067 67519 -47183 -96582 -65867 -52605 -9442 7794 64982
591F4982j5185j12478L705M4357M1764K5957l7913m7714m3341J2280Q0608M5648
$$ 64982 49797 -62681 -58976 -14619 27145 53102 15189 -32525 -75866 -63586 17022 62670
579F2670l5320q0811j8883M3466L4465p6684J0986J01540q5737r1783N1269p881
$$ 62670 27350 -53461 -72344 -28878 5587 -71097 -60111 41429 -44308 -136091 -84822 -92703
567i2703R364K0763m578N6481L8272m7007m0466J10195J8431n9988n7892J04394
$$ -92703 -83339 -62576 -67154 -10673 27599 -19408 -59874 50321 68752 8764 -49128 55266
555E5266k8180j01005J6039J18081J4325o0621m940J9763k7238j4897M4819o8556
$$ 55266 27086 -73919 -57880 60201 74526 13905 8965 28728 1490 -13407 31412 -37144
543c7144O1138K6261r9693j0064M6749J6772j1047M8309q2436n3081J3972J3333
$$ -37144 23994 50255 -49438 -59502 -12753 4019 -7028 41281 -41155 -94236 -80264 -66931
531f6931L5688l1230J8276J51120n1341n5375j3556L7285P5594L912o1673l0785
$$ -66931 -31243 -62473 -44197 106923 55582 207 -13349 23936 99530 103442 41769 10984
519A0984o546j10830O7450K3948L6026q375K1121o0396r637j4458k4108k2622
$$ 10984 4438 -106392 -38942 -14994 21032 12657 33778 -26618 -36255 -50713 -74821 -97443
507i7443k2283P6264M0510l7811K0598O7526j00694n6344l8384J47304n2065m6883
$$ -97443 -119726 -43462 -2952 -40763 -20165 47361 -53333 -109677 -148061 -757 -52822 -99705
495i9705J43131M0936k8065k9967n4066l4702R6290K1519l8578o4457J074P1282
$$ -99705 43426 84362 56297 26330 -27736 -62438 33852 55371 16793 -47664 -46590 24692
483B4692P6936N0284l2348l2858J02403k9232k10124j2947J38706q0942p2149
$$ 24692 101628 151912 119564 86706 189109 159877 -50247 -63194 75512 -5430 -77579
472g7579O7496R0061l6529m7329m5562k5549K7664J27178m2607j1658q6845l3276
$$ -77579 -10083 79978 43449 -3880 -49442 -74991 -47327 79851 37244 25586 -61259 -94535
460i4535R3726J9373o0273R2767O6486r354j06301m6753J3490J27693P6031j40818
$$ -94535 -809 18564 -41709 51058 117544 108190 1889 -44864 -31374 96319 172350 31532
448C1532m2780q1659j0203J49095J1412M5818k7315j62967L9235r554l0553k0492
$$ 31532 -11248 -92907 -103110 45985 57397 103215 75900 -87067 -47832 -57386 -87939 -108431
436a08431O0073N4731L2064m6968Q8166L4766n5096o7634L4575K2450N2882j3087
$$ -108431 -48358 6373 38437 -8531 79635 114401 59305 -8329 26246 48696 101578 88491
424H8491j1724r044n7256O7126L8835m8852L368j36727j7064R2996M1077N4736
$$ 88491 76767 67723 10467 77593 116428 67576 70944 -65783 -82847 10149 51226 105962
412A05962L7659m2142o1442p7225L9678M4465J05054r0303j40893K8964L4044
$$ 105962 143621 101479 40037 -37188 2490 46955 152009 61706 -79187 -50223 -16179
401a6179o8495p277k3993M9150N3817J04850m280j16959l2112K8050J44829k329
$$ -16179 -84674 -91951 -115944 -66794 -12977 91873 87593 -29366 -61478 -33428 111401 109072
389A09072n6393k4643M226O5326R0084r8749J8698j09495L2462K1910j6925p2557
$$ 109072 52679 28036 32262 97588 187672 88923 107621 -1874 30588 52498 35573 -36984
377c6984n067P9876n238K7001P245L2901m9819K9012l2785K1594P316J8154o3162
$$ -36984 -42051 37825 32587 59588 66833 99734 49915 78927 46142 67736 75052 93206 30044
364C0044j00427O4657J3370k4889n9977k2327M689Q0334J5008M1437L5441n1403
$$ 30044 -70383 -5726 7644 -17245 -77222 -99549 -94860 -14526 482 41919 77360 25957
352B5957k7599N6657n5675m4150j03985J17721J02905j48643l8683J89K2366O5148
$$ 25957 -1642 55015 -660 -44810 -148795 -31074 71831 -76812 -115495 -115306 -92940 -27792
340b7792M0429j1217N1177q7663p1690Q6289P8043j14346J46648L3391k9470J8738
$$ -27792 12637 1420 52597 -35066 -106756 -20467 57576 -56770 89878 123269 93799 112537
328A12537k0663o0329l0949O8023R868l7903n1794k607n5394J05370K4120O787
$$ 112537 91874 31545 596 68619 78487 40584 -11210 -13817 -69211 36159 60279 67066
316F7066N8926n9152p5574j5253k8431p223J8169J16537l184M8194l7115n1664
$$ 67066 125992 66840 -8734 -23987 -52418 -59641 -41472 75065 71881 120075 82960 31296
304C1296O3878n5388j35407M9051M7121m3122M9267k1973p4116P1701L602j1339
$$ 31296 95174 39786 -95621 -46570 551 -42571 6696 -15277 -89393 -17692 -14090 -25429
292b5429J3379p6881J53564K2499l4279k7490j9047l5042l3655M3031j0424m0635
$$ -25429 -12050 -88931 64633 87132 52853 25363 6316 -28726 -62381 -19350 -29774 -70409
280g0409L7922k9614O7225R6418m3290p5313M8968J7168n2421l5949M5268K440
$$ -70409 -32487 -62101 5124 101542 58252 -17061 31907 49075 -3346 -39295 5973 8413
268H413M9301k7288m2316K1751p3464o722J8971N2827m8253M8835K6261k8552
$$ 8413 57714 30426 -11890 9861 -63603 -70325 -51354 1473 -46780 2055 28316 -236
256b36m6515J0079P8072m6635j63945L4043J8585N6247J09230K5736n0131k6337
$$ -236 -46751 -36672 41400 -5235 -169180 -135137 -116552 -60305 48925 74661 24530 -1807
244a807Q033K5662K7348M5768m2885m0066o6373N7675j6638n8822k4057J45711
$$ -1807 6226 31888 59236 105004 62119 22053 -44320 13355 -3283 -62105 -86162 59549
232E9549l8425L534R9987o5807l6991J3074p770q1891M1938J676K9343L2332Q626
$$ 59549 21124 24658 124645 58838 21847 34921 27151 -54740 -12802 -11126 18217 50549 59175
219E9175m1700j5041M6931M4604j3011o2250k1574K9933M529m5552n3570P9151
$$ 59175 17475 2434 49365 93969 80958 18708 -2866 27067 31596 -13956 -67526 11625
207A1625N5276M1646l1507o6144o8679N8151K976j3538o9742j1037L5113R9938
$$ 11625 66901 108547 77040 10896 -57783 368 3344 -10194 -79936 -90973 -55860 44078
195D4078J8759r0789K5207p7467K4729K2347Q2167L819j2470k4612m2821J41327
$$ 44078 62837 -27952 -2745 -80212 -55483 -33136 49031 52850 40380 15768 -27053 114274
183A14274l2234k6677k4950r169m9652R2026J2881j04759p9988N9697L8871J0706
$$ 114274 82040 55363 30413 21244 -28408 63618 76499 -28260 -108248 -48551 -9680 1026
171A026l4805J3603j0130L0477k5635k6460J0766j5538n7815J25222Q4538L0366
$$ 1026 -33779 -20176 -30306 171 -25464 -51924 -41158 -56696 -114511 10711 95249 125615
159A25615n3344q8279Q049J4739o1357M3219J03052N357l587m9498o6904l0120
$$ 125615 72271 -16008 -7959 6780 -54577 -11358 91694 97051 93464 43966 -22938 -53058
147e3058N7917O674j418O962j5178l4206Q0533m3055l874l3694J8575K4859K7826
$$ -53058 4859 11533 10115 17077 1899 -32307 48226 5171 1297 -32397 -13822 11037 38863
134C8863M3563p314j6977r8162o5793M1329K6240R4449L5196j05572L5127O1070
$$ 38863 82426 75112 58135 -40027 -105820 -64491 -38251 56198 91394 -14178 20949 82019
122H2019n6546o031J4246J4409m2924p4620k3800J14608r4722j8433M2001P4522
$$ 82019 25473 19442 33688 48097 5173 -69447 -93247 21361 -73361 -91794 -49793 24729
110B4729K041k7253j6376L5716j968m9716o3542M994L23p131k2041k0950K0965
$$ 24729 26770 -483 -16859 18857 16889 -32827 -96369 -91375 -91052 -98183 -120224 -141174 -120209
97a20209M8511P1289m7918n7884L1433L4721l769l6586k6632O6070R1591j6902
$$ -120209 -71698 -409 -48327 -106211 -74778 -40057 -43826 -80412 -107044 -40974 50617 33715
85C3715m7032R085M3474j0791j1556m1987M061O3212K4138l1806L147l3384l5839
$$ 33715 -13317 -4232 39242 28451 16895 -25092 -21031 42181 66319 34513 37660 4276 -31563
72c1563L7366O1467m5801k5646N0612J6414k1934r265l4461k4635m0709K1274
$$ -31563 5803 67270 21469 -4177 46435 62849 40915 31650 -2811 -27446 -68155 -46881
60d6881M521M7857M6069m7754J380r1604M5027M9275p614J11R904o2104N5861
$$ -46881 -42360 5497 51566 3812 5192 -86412 -41385 7890 276 387 10291 -51813 4048
47D048n2310n1855L2794J01165l3466L1903P7929l5168k0013j0068K4980M0414
$$ 4048 -48262 -100117 -67323 33842 376 32279 110208 75040 55027 44959 69939 110353
35A10353o6489n3059J9815N665o9447O3293l2128j1104R614j2234K2296N5578
$$ 110353 43864 -9195 10620 16285 -53162 10131 -21997 -33101 -23487 -35721 -13425 42153
23D2153o579l6044l2197K8436J5147P499n4806j1856K2357K7283K1983R550L946
$$ 42153 35574 -470 -32667 -4231 10916 18415 -36391 -48247 -25890 1393 23376 32926 36872
10C6872l8867O2940p7429m359j615l9349L7897l5973o4352J3767
$$ 36872 -1995 60945 -16484 -20843 -22458 -61807 -23910 -59883 -124235 -110468
0a10468
$$ -110468
$$ Imaginary data points
##PAGE= N=2
##DATA TABLE= (X++(I..I)), XYDATA
16383a638597o3491P813R4812N7127J5961R143K6465N8584q071Q8651L8744l0563
$$ -1638597 -1702088 -1694275 -1599463 -1542336 -1526375 -1517232 -1490767 -1432183 -1440254 -1351603 -1312859 -1343422
16371a343422n4528M9349K0167N7769J10685K5826L3097N3143q1236Q190N4724
$$ -1343422 -1397950 -1348601 -1328434 -1270665 -1159980 -1134154 -1101057 -1047914 -1129150 -1120960 -1066236
16360a066236k670K5056P4148M1940K3236K1912j1057N7773M9807n650K4492J05929
$$ -1066236 -1068906 -1043850 -969702 -927762 -904526 -882614 -893671 -835898 -786091 -791741 -767249 -661320
16348f61320p129K1033M1936J3005k9254N613N3453O3201R6986J0513m5101J6709
$$ -661320 -668449 -647416 -605480 -592475 -621729 -616116 -562663 -499462 -402476 -391963 -437064 -420355
16336d20355J4866L3380K1668k662L6603J02487O7957Q621l4780Q9971L3254L3711
$$ -420355 -405489 -372109 -350441 -353103 -316500 -214013 -146056 -137435 -172215 -82244 -48990 -15279
16324a5279N5283M4391q4672k7519Q9059J03358J9083O860L31k6883M909M8544
$$ -15279 40004 84395 -277 -27796 61263 164621 183704 190564 190895 164012 168921 217465
16312B17465L3312o8749J0793Q9345J09907P5099j12981n5355R7344J14994J4198
$$ 217465 250777 182028 192821 282166 392073 467172 354191 298836 396180 511174 525372
$$ [...]
##END NTUPLES=NMR SPECTRUM
##END=
